FAQ
To whom it may engage...

This is an automated request, but not an unsolicited one. For
more information please visit http://gump.apache.org/nagged.html,
and/or contact the folk at general@gump.apache.org.

Project turbine-core has an issue affecting its community integration.
This issue affects 2 projects,
and has been outstanding for 369 runs.
The current state of this project is 'Failed', with reason 'Build Failed'.
For reference only, the following projects are affected by this:
- turbine-core : A servlet based framework.
- turbine-core-test : A servlet based framework.


Full details are available at:
http://vmgump.apache.org/gump/public/turbine-core/turbine-core/index.html

That said, some information snippets are provided here.

The following annotations (debug/informational/warning/error messages) were provided:
-INFO- Optional dependency commons-fileupload prerequisite failed with reason build failed
-INFO- Optional dependency httpunit failed with reason build failed
-DEBUG- (Apache Gump generated) Apache Maven Settings in: /srv/gump/public/workspace/turbine-core/gump_mvn_settings.xml
-INFO- Failed with reason build failed
-DEBUG- Maven POM in: /srv/gump/public/workspace/turbine-core/pom.xml
-INFO- Failed to extract fallback artifacts from Gump Repository



The following work was performed:
http://vmgump.apache.org/gump/public/turbine-core/turbine-core/gump_work/build_turbine-core_turbine-core.html
Work Name: build_turbine-core_turbine-core (Type: Build)
Work ended in a state of : Failed
Elapsed: 19 secs
Command Line: /opt/maven2/bin/mvn --batch-mode -DskipTests=true --settings /srv/gump/public/workspace/turbine-core/gump_mvn_settings.xml package
[Working Directory: /srv/gump/public/workspace/turbine-core]
M2_HOME: /opt/maven2
---------------------------------------------
urls[19] = file:/srv/gump/public/workspace/mvnlocalrepo/shared/xml-apis/xml-apis/1.0.b2/xml-apis-1.0.b2.jar
urls[20] = file:/srv/gump/public/workspace/mvnlocalrepo/shared/commons-configuration/commons-configuration/1.4/commons-configuration-1.4.jar
urls[21] = file:/srv/gump/public/workspace/mvnlocalrepo/shared/commons-logging/commons-logging-api/1.0.4/commons-logging-api-1.0.4.jar
urls[22] = file:/srv/gump/public/workspace/mvnlocalrepo/shared/commons-digester/commons-digester/1.8/commons-digester-1.8.jar
urls[23] = file:/srv/gump/public/workspace/mvnlocalrepo/shared/commons-beanutils/commons-beanutils/1.7.0/commons-beanutils-1.7.0.jar
urls[24] = file:/srv/gump/public/workspace/mvnlocalrepo/shared/commons-beanutils/commons-beanutils-core/1.7.0/commons-beanutils-core-1.7.0.jar
urls[25] = file:/srv/gump/public/workspace/mvnlocalrepo/shared/commons-codec/commons-codec/1.3/commons-codec-1.3.jar
urls[26] = file:/srv/gump/public/workspace/mvnlocalrepo/shared/commons-jxpath/commons-jxpath/1.2/commons-jxpath-1.2.jar
urls[27] = file:/srv/gump/public/workspace/mvnlocalrepo/shared/xerces/xerces/1.2.3/xerces-1.2.3.jar
urls[28] = file:/srv/gump/public/workspace/mvnlocalrepo/shared/ant/ant-optional/1.5.1/ant-optional-1.5.1.jar
urls[29] = file:/srv/gump/public/workspace/mvnlocalrepo/shared/jdom/jdom/b9/jdom-b9.jar
Number of imports: 10
import: org.codehaus.classworlds.Entry@a6c57a42
import: org.codehaus.classworlds.Entry@12f43f3b
import: org.codehaus.classworlds.Entry@20025374
import: org.codehaus.classworlds.Entry@f8e44ca4
import: org.codehaus.classworlds.Entry@92758522
import: org.codehaus.classworlds.Entry@ebf2705b
import: org.codehaus.classworlds.Entry@bb25e54
import: org.codehaus.classworlds.Entry@bece5185
import: org.codehaus.classworlds.Entry@3fee8e37
import: org.codehaus.classworlds.Entry@3fee19d8


this realm = plexus.core
urls[0] = file:/opt/maven2/lib/maven-2.2.1-uber.jar
Number of imports: 10
import: org.codehaus.classworlds.Entry@a6c57a42
import: org.codehaus.classworlds.Entry@12f43f3b
import: org.codehaus.classworlds.Entry@20025374
import: org.codehaus.classworlds.Entry@f8e44ca4
import: org.codehaus.classworlds.Entry@92758522
import: org.codehaus.classworlds.Entry@ebf2705b
import: org.codehaus.classworlds.Entry@bb25e54
import: org.codehaus.classworlds.Entry@bece5185
import: org.codehaus.classworlds.Entry@3fee8e37
import: org.codehaus.classworlds.Entry@3fee19d8
-----------------------------------------------------
[INFO] ------------------------------------------------------------------------
[ERROR] BUILD ERROR
[INFO] ------------------------------------------------------------------------
[INFO] Internal error in the plugin manager executing goal 'org.apache.torque:torque-maven-plugin:3.3:om': Unable to load the mojo 'org.apache.torque:torque-maven-plugin:3.3:om' in the plugin 'org.apache.torque:torque-maven-plugin'. A required class is missing: org/apache/torque/task/TorqueDataModelTask
org.apache.torque.task.TorqueDataModelTask
[INFO] ------------------------------------------------------------------------
[INFO] For more information, run Maven with the -e switch
[INFO] ------------------------------------------------------------------------
[INFO] Total time: 18 seconds
[INFO] Finished at: Thu Sep 01 11:34:08 UTC 2011
[INFO] Final Memory: 30M/72M
[INFO] ------------------------------------------------------------------------
---------------------------------------------

To subscribe to this information via syndicated feeds:
- RSS: http://vmgump.apache.org/gump/public/turbine-core/turbine-core/rss.xml
- Atom: http://vmgump.apache.org/gump/public/turbine-core/turbine-core/atom.xml

============================== Gump Tracking Only ===
Produced by Apache Gump(TM) version 2.3.
Gump Run 04000601092011, vmgump.apache.org:vmgump:04000601092011
Gump E-mail Identifier (unique within run) #44.

--
Apache Gump
http://gump.apache.org/ [Instance: vmgump]

---------------------------------------------------------------------
To unsubscribe, e-mail: dev-unsubscribe@turbine.apache.org
For additional commands, e-mail: dev-help@turbine.apache.org

Search Discussions

  • Anonymous at Sep 2, 2011 at 11:26 am
    To whom it may engage...

    This is an automated request, but not an unsolicited one. For
    more information please visit http://gump.apache.org/nagged.html,
    and/or contact the folk at general@gump.apache.org.

    Project turbine-core has an issue affecting its community integration.
    This issue affects 2 projects,
    and has been outstanding for 371 runs.
    The current state of this project is 'Failed', with reason 'Build Failed'.
    For reference only, the following projects are affected by this:
    - turbine-core : A servlet based framework.
    - turbine-core-test : A servlet based framework.


    Full details are available at:
    http://vmgump.apache.org/gump/public/turbine-core/turbine-core/index.html

    That said, some information snippets are provided here.

    The following annotations (debug/informational/warning/error messages) were provided:
    -INFO- Optional dependency commons-fileupload prerequisite failed with reason build failed
    -INFO- Optional dependency httpunit failed with reason build failed
    -DEBUG- (Apache Gump generated) Apache Maven Settings in: /srv/gump/public/workspace/turbine-core/gump_mvn_settings.xml
    -INFO- Failed with reason build failed
    -DEBUG- Maven POM in: /srv/gump/public/workspace/turbine-core/pom.xml
    -INFO- Failed to extract fallback artifacts from Gump Repository



    The following work was performed:
    http://vmgump.apache.org/gump/public/turbine-core/turbine-core/gump_work/build_turbine-core_turbine-core.html
    Work Name: build_turbine-core_turbine-core (Type: Build)
    Work ended in a state of : Failed
    Elapsed: 20 secs
    Command Line: /opt/maven2/bin/mvn --batch-mode -DskipTests=true --settings /srv/gump/public/workspace/turbine-core/gump_mvn_settings.xml package
    [Working Directory: /srv/gump/public/workspace/turbine-core]
    M2_HOME: /opt/maven2
    ---------------------------------------------
    urls[19] = file:/srv/gump/public/workspace/mvnlocalrepo/shared/xml-apis/xml-apis/1.0.b2/xml-apis-1.0.b2.jar
    urls[20] = file:/srv/gump/public/workspace/mvnlocalrepo/shared/commons-configuration/commons-configuration/1.4/commons-configuration-1.4.jar
    urls[21] = file:/srv/gump/public/workspace/mvnlocalrepo/shared/commons-logging/commons-logging-api/1.0.4/commons-logging-api-1.0.4.jar
    urls[22] = file:/srv/gump/public/workspace/mvnlocalrepo/shared/commons-digester/commons-digester/1.8/commons-digester-1.8.jar
    urls[23] = file:/srv/gump/public/workspace/mvnlocalrepo/shared/commons-beanutils/commons-beanutils/1.7.0/commons-beanutils-1.7.0.jar
    urls[24] = file:/srv/gump/public/workspace/mvnlocalrepo/shared/commons-beanutils/commons-beanutils-core/1.7.0/commons-beanutils-core-1.7.0.jar
    urls[25] = file:/srv/gump/public/workspace/mvnlocalrepo/shared/commons-codec/commons-codec/1.3/commons-codec-1.3.jar
    urls[26] = file:/srv/gump/public/workspace/mvnlocalrepo/shared/commons-jxpath/commons-jxpath/1.2/commons-jxpath-1.2.jar
    urls[27] = file:/srv/gump/public/workspace/mvnlocalrepo/shared/xerces/xerces/1.2.3/xerces-1.2.3.jar
    urls[28] = file:/srv/gump/public/workspace/mvnlocalrepo/shared/ant/ant-optional/1.5.1/ant-optional-1.5.1.jar
    urls[29] = file:/srv/gump/public/workspace/mvnlocalrepo/shared/jdom/jdom/b9/jdom-b9.jar
    Number of imports: 10
    import: org.codehaus.classworlds.Entry@a6c57a42
    import: org.codehaus.classworlds.Entry@12f43f3b
    import: org.codehaus.classworlds.Entry@20025374
    import: org.codehaus.classworlds.Entry@f8e44ca4
    import: org.codehaus.classworlds.Entry@92758522
    import: org.codehaus.classworlds.Entry@ebf2705b
    import: org.codehaus.classworlds.Entry@bb25e54
    import: org.codehaus.classworlds.Entry@bece5185
    import: org.codehaus.classworlds.Entry@3fee8e37
    import: org.codehaus.classworlds.Entry@3fee19d8


    this realm = plexus.core
    urls[0] = file:/opt/maven2/lib/maven-2.2.1-uber.jar
    Number of imports: 10
    import: org.codehaus.classworlds.Entry@a6c57a42
    import: org.codehaus.classworlds.Entry@12f43f3b
    import: org.codehaus.classworlds.Entry@20025374
    import: org.codehaus.classworlds.Entry@f8e44ca4
    import: org.codehaus.classworlds.Entry@92758522
    import: org.codehaus.classworlds.Entry@ebf2705b
    import: org.codehaus.classworlds.Entry@bb25e54
    import: org.codehaus.classworlds.Entry@bece5185
    import: org.codehaus.classworlds.Entry@3fee8e37
    import: org.codehaus.classworlds.Entry@3fee19d8
    -----------------------------------------------------
    [INFO] ------------------------------------------------------------------------
    [ERROR] BUILD ERROR
    [INFO] ------------------------------------------------------------------------
    [INFO] Internal error in the plugin manager executing goal 'org.apache.torque:torque-maven-plugin:3.3:om': Unable to load the mojo 'org.apache.torque:torque-maven-plugin:3.3:om' in the plugin 'org.apache.torque:torque-maven-plugin'. A required class is missing: org/apache/torque/task/TorqueDataModelTask
    org.apache.torque.task.TorqueDataModelTask
    [INFO] ------------------------------------------------------------------------
    [INFO] For more information, run Maven with the -e switch
    [INFO] ------------------------------------------------------------------------
    [INFO] Total time: 19 seconds
    [INFO] Finished at: Fri Sep 02 11:25:34 UTC 2011
    [INFO] Final Memory: 30M/71M
    [INFO] ------------------------------------------------------------------------
    ---------------------------------------------

    To subscribe to this information via syndicated feeds:
    - RSS: http://vmgump.apache.org/gump/public/turbine-core/turbine-core/rss.xml
    - Atom: http://vmgump.apache.org/gump/public/turbine-core/turbine-core/atom.xml

    ============================== Gump Tracking Only ===
    Produced by Apache Gump(TM) version 2.3.
    Gump Run 05000602092011, vmgump.apache.org:vmgump:05000602092011
    Gump E-mail Identifier (unique within run) #44.

    --
    Apache Gump
    http://gump.apache.org/ [Instance: vmgump]

    ---------------------------------------------------------------------
    To unsubscribe, e-mail: dev-unsubscribe@turbine.apache.org
    For additional commands, e-mail: dev-help@turbine.apache.org
  • Anonymous at Sep 3, 2011 at 11:23 am
    To whom it may engage...

    This is an automated request, but not an unsolicited one. For
    more information please visit http://gump.apache.org/nagged.html,
    and/or contact the folk at general@gump.apache.org.

    Project turbine-core has an issue affecting its community integration.
    This issue affects 2 projects,
    and has been outstanding for 373 runs.
    The current state of this project is 'Failed', with reason 'Build Failed'.
    For reference only, the following projects are affected by this:
    - turbine-core : A servlet based framework.
    - turbine-core-test : A servlet based framework.


    Full details are available at:
    http://vmgump.apache.org/gump/public/turbine-core/turbine-core/index.html

    That said, some information snippets are provided here.

    The following annotations (debug/informational/warning/error messages) were provided:
    -INFO- Optional dependency commons-fileupload prerequisite failed with reason build failed
    -INFO- Optional dependency httpunit failed with reason build failed
    -DEBUG- (Apache Gump generated) Apache Maven Settings in: /srv/gump/public/workspace/turbine-core/gump_mvn_settings.xml
    -INFO- Failed with reason build failed
    -DEBUG- Maven POM in: /srv/gump/public/workspace/turbine-core/pom.xml
    -INFO- Failed to extract fallback artifacts from Gump Repository



    The following work was performed:
    http://vmgump.apache.org/gump/public/turbine-core/turbine-core/gump_work/build_turbine-core_turbine-core.html
    Work Name: build_turbine-core_turbine-core (Type: Build)
    Work ended in a state of : Failed
    Elapsed: 20 secs
    Command Line: /opt/maven2/bin/mvn --batch-mode -DskipTests=true --settings /srv/gump/public/workspace/turbine-core/gump_mvn_settings.xml package
    [Working Directory: /srv/gump/public/workspace/turbine-core]
    M2_HOME: /opt/maven2
    ---------------------------------------------
    urls[19] = file:/srv/gump/public/workspace/mvnlocalrepo/shared/xml-apis/xml-apis/1.0.b2/xml-apis-1.0.b2.jar
    urls[20] = file:/srv/gump/public/workspace/mvnlocalrepo/shared/commons-configuration/commons-configuration/1.4/commons-configuration-1.4.jar
    urls[21] = file:/srv/gump/public/workspace/mvnlocalrepo/shared/commons-logging/commons-logging-api/1.0.4/commons-logging-api-1.0.4.jar
    urls[22] = file:/srv/gump/public/workspace/mvnlocalrepo/shared/commons-digester/commons-digester/1.8/commons-digester-1.8.jar
    urls[23] = file:/srv/gump/public/workspace/mvnlocalrepo/shared/commons-beanutils/commons-beanutils/1.7.0/commons-beanutils-1.7.0.jar
    urls[24] = file:/srv/gump/public/workspace/mvnlocalrepo/shared/commons-beanutils/commons-beanutils-core/1.7.0/commons-beanutils-core-1.7.0.jar
    urls[25] = file:/srv/gump/public/workspace/mvnlocalrepo/shared/commons-codec/commons-codec/1.3/commons-codec-1.3.jar
    urls[26] = file:/srv/gump/public/workspace/mvnlocalrepo/shared/commons-jxpath/commons-jxpath/1.2/commons-jxpath-1.2.jar
    urls[27] = file:/srv/gump/public/workspace/mvnlocalrepo/shared/xerces/xerces/1.2.3/xerces-1.2.3.jar
    urls[28] = file:/srv/gump/public/workspace/mvnlocalrepo/shared/ant/ant-optional/1.5.1/ant-optional-1.5.1.jar
    urls[29] = file:/srv/gump/public/workspace/mvnlocalrepo/shared/jdom/jdom/b9/jdom-b9.jar
    Number of imports: 10
    import: org.codehaus.classworlds.Entry@a6c57a42
    import: org.codehaus.classworlds.Entry@12f43f3b
    import: org.codehaus.classworlds.Entry@20025374
    import: org.codehaus.classworlds.Entry@f8e44ca4
    import: org.codehaus.classworlds.Entry@92758522
    import: org.codehaus.classworlds.Entry@ebf2705b
    import: org.codehaus.classworlds.Entry@bb25e54
    import: org.codehaus.classworlds.Entry@bece5185
    import: org.codehaus.classworlds.Entry@3fee8e37
    import: org.codehaus.classworlds.Entry@3fee19d8


    this realm = plexus.core
    urls[0] = file:/opt/maven2/lib/maven-2.2.1-uber.jar
    Number of imports: 10
    import: org.codehaus.classworlds.Entry@a6c57a42
    import: org.codehaus.classworlds.Entry@12f43f3b
    import: org.codehaus.classworlds.Entry@20025374
    import: org.codehaus.classworlds.Entry@f8e44ca4
    import: org.codehaus.classworlds.Entry@92758522
    import: org.codehaus.classworlds.Entry@ebf2705b
    import: org.codehaus.classworlds.Entry@bb25e54
    import: org.codehaus.classworlds.Entry@bece5185
    import: org.codehaus.classworlds.Entry@3fee8e37
    import: org.codehaus.classworlds.Entry@3fee19d8
    -----------------------------------------------------
    [INFO] ------------------------------------------------------------------------
    [ERROR] BUILD ERROR
    [INFO] ------------------------------------------------------------------------
    [INFO] Internal error in the plugin manager executing goal 'org.apache.torque:torque-maven-plugin:3.3:om': Unable to load the mojo 'org.apache.torque:torque-maven-plugin:3.3:om' in the plugin 'org.apache.torque:torque-maven-plugin'. A required class is missing: org/apache/torque/task/TorqueDataModelTask
    org.apache.torque.task.TorqueDataModelTask
    [INFO] ------------------------------------------------------------------------
    [INFO] For more information, run Maven with the -e switch
    [INFO] ------------------------------------------------------------------------
    [INFO] Total time: 19 seconds
    [INFO] Finished at: Sat Sep 03 11:22:48 UTC 2011
    [INFO] Final Memory: 29M/71M
    [INFO] ------------------------------------------------------------------------
    ---------------------------------------------

    To subscribe to this information via syndicated feeds:
    - RSS: http://vmgump.apache.org/gump/public/turbine-core/turbine-core/rss.xml
    - Atom: http://vmgump.apache.org/gump/public/turbine-core/turbine-core/atom.xml

    ============================== Gump Tracking Only ===
    Produced by Apache Gump(TM) version 2.3.
    Gump Run 05000603092011, vmgump.apache.org:vmgump:05000603092011
    Gump E-mail Identifier (unique within run) #44.

    --
    Apache Gump
    http://gump.apache.org/ [Instance: vmgump]

    ---------------------------------------------------------------------
    To unsubscribe, e-mail: dev-unsubscribe@turbine.apache.org
    For additional commands, e-mail: dev-help@turbine.apache.org
  • Anonymous at Sep 4, 2011 at 11:24 am
    To whom it may engage...

    This is an automated request, but not an unsolicited one. For
    more information please visit http://gump.apache.org/nagged.html,
    and/or contact the folk at general@gump.apache.org.

    Project turbine-core has an issue affecting its community integration.
    This issue affects 2 projects,
    and has been outstanding for 375 runs.
    The current state of this project is 'Failed', with reason 'Build Failed'.
    For reference only, the following projects are affected by this:
    - turbine-core : A servlet based framework.
    - turbine-core-test : A servlet based framework.


    Full details are available at:
    http://vmgump.apache.org/gump/public/turbine-core/turbine-core/index.html

    That said, some information snippets are provided here.

    The following annotations (debug/informational/warning/error messages) were provided:
    -INFO- Optional dependency commons-fileupload prerequisite failed with reason build failed
    -INFO- Optional dependency httpunit failed with reason build failed
    -DEBUG- (Apache Gump generated) Apache Maven Settings in: /srv/gump/public/workspace/turbine-core/gump_mvn_settings.xml
    -INFO- Failed with reason build failed
    -DEBUG- Maven POM in: /srv/gump/public/workspace/turbine-core/pom.xml
    -INFO- Failed to extract fallback artifacts from Gump Repository



    The following work was performed:
    http://vmgump.apache.org/gump/public/turbine-core/turbine-core/gump_work/build_turbine-core_turbine-core.html
    Work Name: build_turbine-core_turbine-core (Type: Build)
    Work ended in a state of : Failed
    Elapsed: 19 secs
    Command Line: /opt/maven2/bin/mvn --batch-mode -DskipTests=true --settings /srv/gump/public/workspace/turbine-core/gump_mvn_settings.xml package
    [Working Directory: /srv/gump/public/workspace/turbine-core]
    M2_HOME: /opt/maven2
    ---------------------------------------------
    urls[19] = file:/srv/gump/public/workspace/mvnlocalrepo/shared/xml-apis/xml-apis/1.0.b2/xml-apis-1.0.b2.jar
    urls[20] = file:/srv/gump/public/workspace/mvnlocalrepo/shared/commons-configuration/commons-configuration/1.4/commons-configuration-1.4.jar
    urls[21] = file:/srv/gump/public/workspace/mvnlocalrepo/shared/commons-logging/commons-logging-api/1.0.4/commons-logging-api-1.0.4.jar
    urls[22] = file:/srv/gump/public/workspace/mvnlocalrepo/shared/commons-digester/commons-digester/1.8/commons-digester-1.8.jar
    urls[23] = file:/srv/gump/public/workspace/mvnlocalrepo/shared/commons-beanutils/commons-beanutils/1.7.0/commons-beanutils-1.7.0.jar
    urls[24] = file:/srv/gump/public/workspace/mvnlocalrepo/shared/commons-beanutils/commons-beanutils-core/1.7.0/commons-beanutils-core-1.7.0.jar
    urls[25] = file:/srv/gump/public/workspace/mvnlocalrepo/shared/commons-codec/commons-codec/1.3/commons-codec-1.3.jar
    urls[26] = file:/srv/gump/public/workspace/mvnlocalrepo/shared/commons-jxpath/commons-jxpath/1.2/commons-jxpath-1.2.jar
    urls[27] = file:/srv/gump/public/workspace/mvnlocalrepo/shared/xerces/xerces/1.2.3/xerces-1.2.3.jar
    urls[28] = file:/srv/gump/public/workspace/mvnlocalrepo/shared/ant/ant-optional/1.5.1/ant-optional-1.5.1.jar
    urls[29] = file:/srv/gump/public/workspace/mvnlocalrepo/shared/jdom/jdom/b9/jdom-b9.jar
    Number of imports: 10
    import: org.codehaus.classworlds.Entry@a6c57a42
    import: org.codehaus.classworlds.Entry@12f43f3b
    import: org.codehaus.classworlds.Entry@20025374
    import: org.codehaus.classworlds.Entry@f8e44ca4
    import: org.codehaus.classworlds.Entry@92758522
    import: org.codehaus.classworlds.Entry@ebf2705b
    import: org.codehaus.classworlds.Entry@bb25e54
    import: org.codehaus.classworlds.Entry@bece5185
    import: org.codehaus.classworlds.Entry@3fee8e37
    import: org.codehaus.classworlds.Entry@3fee19d8


    this realm = plexus.core
    urls[0] = file:/opt/maven2/lib/maven-2.2.1-uber.jar
    Number of imports: 10
    import: org.codehaus.classworlds.Entry@a6c57a42
    import: org.codehaus.classworlds.Entry@12f43f3b
    import: org.codehaus.classworlds.Entry@20025374
    import: org.codehaus.classworlds.Entry@f8e44ca4
    import: org.codehaus.classworlds.Entry@92758522
    import: org.codehaus.classworlds.Entry@ebf2705b
    import: org.codehaus.classworlds.Entry@bb25e54
    import: org.codehaus.classworlds.Entry@bece5185
    import: org.codehaus.classworlds.Entry@3fee8e37
    import: org.codehaus.classworlds.Entry@3fee19d8
    -----------------------------------------------------
    [INFO] ------------------------------------------------------------------------
    [ERROR] BUILD ERROR
    [INFO] ------------------------------------------------------------------------
    [INFO] Internal error in the plugin manager executing goal 'org.apache.torque:torque-maven-plugin:3.3:om': Unable to load the mojo 'org.apache.torque:torque-maven-plugin:3.3:om' in the plugin 'org.apache.torque:torque-maven-plugin'. A required class is missing: org/apache/torque/task/TorqueDataModelTask
    org.apache.torque.task.TorqueDataModelTask
    [INFO] ------------------------------------------------------------------------
    [INFO] For more information, run Maven with the -e switch
    [INFO] ------------------------------------------------------------------------
    [INFO] Total time: 18 seconds
    [INFO] Finished at: Sun Sep 04 11:23:41 UTC 2011
    [INFO] Final Memory: 29M/71M
    [INFO] ------------------------------------------------------------------------
    ---------------------------------------------

    To subscribe to this information via syndicated feeds:
    - RSS: http://vmgump.apache.org/gump/public/turbine-core/turbine-core/rss.xml
    - Atom: http://vmgump.apache.org/gump/public/turbine-core/turbine-core/atom.xml

    ============================== Gump Tracking Only ===
    Produced by Apache Gump(TM) version 2.3.
    Gump Run 05000604092011, vmgump.apache.org:vmgump:05000604092011
    Gump E-mail Identifier (unique within run) #45.

    --
    Apache Gump
    http://gump.apache.org/ [Instance: vmgump]

    ---------------------------------------------------------------------
    To unsubscribe, e-mail: dev-unsubscribe@turbine.apache.org
    For additional commands, e-mail: dev-help@turbine.apache.org
  • Anonymous at Sep 5, 2011 at 11:17 am
    To whom it may engage...

    This is an automated request, but not an unsolicited one. For
    more information please visit http://gump.apache.org/nagged.html,
    and/or contact the folk at general@gump.apache.org.

    Project turbine-core has an issue affecting its community integration.
    This issue affects 2 projects,
    and has been outstanding for 377 runs.
    The current state of this project is 'Failed', with reason 'Build Failed'.
    For reference only, the following projects are affected by this:
    - turbine-core : A servlet based framework.
    - turbine-core-test : A servlet based framework.


    Full details are available at:
    http://vmgump.apache.org/gump/public/turbine-core/turbine-core/index.html

    That said, some information snippets are provided here.

    The following annotations (debug/informational/warning/error messages) were provided:
    -INFO- Optional dependency commons-fileupload prerequisite failed with reason build failed
    -INFO- Optional dependency httpunit failed with reason build failed
    -DEBUG- (Apache Gump generated) Apache Maven Settings in: /srv/gump/public/workspace/turbine-core/gump_mvn_settings.xml
    -INFO- Failed with reason build failed
    -DEBUG- Maven POM in: /srv/gump/public/workspace/turbine-core/pom.xml
    -INFO- Failed to extract fallback artifacts from Gump Repository



    The following work was performed:
    http://vmgump.apache.org/gump/public/turbine-core/turbine-core/gump_work/build_turbine-core_turbine-core.html
    Work Name: build_turbine-core_turbine-core (Type: Build)
    Work ended in a state of : Failed
    Elapsed: 20 secs
    Command Line: /opt/maven2/bin/mvn --batch-mode -DskipTests=true --settings /srv/gump/public/workspace/turbine-core/gump_mvn_settings.xml package
    [Working Directory: /srv/gump/public/workspace/turbine-core]
    M2_HOME: /opt/maven2
    ---------------------------------------------
    urls[19] = file:/srv/gump/public/workspace/mvnlocalrepo/shared/xml-apis/xml-apis/1.0.b2/xml-apis-1.0.b2.jar
    urls[20] = file:/srv/gump/public/workspace/mvnlocalrepo/shared/commons-configuration/commons-configuration/1.4/commons-configuration-1.4.jar
    urls[21] = file:/srv/gump/public/workspace/mvnlocalrepo/shared/commons-logging/commons-logging-api/1.0.4/commons-logging-api-1.0.4.jar
    urls[22] = file:/srv/gump/public/workspace/mvnlocalrepo/shared/commons-digester/commons-digester/1.8/commons-digester-1.8.jar
    urls[23] = file:/srv/gump/public/workspace/mvnlocalrepo/shared/commons-beanutils/commons-beanutils/1.7.0/commons-beanutils-1.7.0.jar
    urls[24] = file:/srv/gump/public/workspace/mvnlocalrepo/shared/commons-beanutils/commons-beanutils-core/1.7.0/commons-beanutils-core-1.7.0.jar
    urls[25] = file:/srv/gump/public/workspace/mvnlocalrepo/shared/commons-codec/commons-codec/1.3/commons-codec-1.3.jar
    urls[26] = file:/srv/gump/public/workspace/mvnlocalrepo/shared/commons-jxpath/commons-jxpath/1.2/commons-jxpath-1.2.jar
    urls[27] = file:/srv/gump/public/workspace/mvnlocalrepo/shared/xerces/xerces/1.2.3/xerces-1.2.3.jar
    urls[28] = file:/srv/gump/public/workspace/mvnlocalrepo/shared/ant/ant-optional/1.5.1/ant-optional-1.5.1.jar
    urls[29] = file:/srv/gump/public/workspace/mvnlocalrepo/shared/jdom/jdom/b9/jdom-b9.jar
    Number of imports: 10
    import: org.codehaus.classworlds.Entry@a6c57a42
    import: org.codehaus.classworlds.Entry@12f43f3b
    import: org.codehaus.classworlds.Entry@20025374
    import: org.codehaus.classworlds.Entry@f8e44ca4
    import: org.codehaus.classworlds.Entry@92758522
    import: org.codehaus.classworlds.Entry@ebf2705b
    import: org.codehaus.classworlds.Entry@bb25e54
    import: org.codehaus.classworlds.Entry@bece5185
    import: org.codehaus.classworlds.Entry@3fee8e37
    import: org.codehaus.classworlds.Entry@3fee19d8


    this realm = plexus.core
    urls[0] = file:/opt/maven2/lib/maven-2.2.1-uber.jar
    Number of imports: 10
    import: org.codehaus.classworlds.Entry@a6c57a42
    import: org.codehaus.classworlds.Entry@12f43f3b
    import: org.codehaus.classworlds.Entry@20025374
    import: org.codehaus.classworlds.Entry@f8e44ca4
    import: org.codehaus.classworlds.Entry@92758522
    import: org.codehaus.classworlds.Entry@ebf2705b
    import: org.codehaus.classworlds.Entry@bb25e54
    import: org.codehaus.classworlds.Entry@bece5185
    import: org.codehaus.classworlds.Entry@3fee8e37
    import: org.codehaus.classworlds.Entry@3fee19d8
    -----------------------------------------------------
    [INFO] ------------------------------------------------------------------------
    [ERROR] BUILD ERROR
    [INFO] ------------------------------------------------------------------------
    [INFO] Internal error in the plugin manager executing goal 'org.apache.torque:torque-maven-plugin:3.3:om': Unable to load the mojo 'org.apache.torque:torque-maven-plugin:3.3:om' in the plugin 'org.apache.torque:torque-maven-plugin'. A required class is missing: org/apache/torque/task/TorqueDataModelTask
    org.apache.torque.task.TorqueDataModelTask
    [INFO] ------------------------------------------------------------------------
    [INFO] For more information, run Maven with the -e switch
    [INFO] ------------------------------------------------------------------------
    [INFO] Total time: 19 seconds
    [INFO] Finished at: Mon Sep 05 11:17:13 UTC 2011
    [INFO] Final Memory: 29M/71M
    [INFO] ------------------------------------------------------------------------
    ---------------------------------------------

    To subscribe to this information via syndicated feeds:
    - RSS: http://vmgump.apache.org/gump/public/turbine-core/turbine-core/rss.xml
    - Atom: http://vmgump.apache.org/gump/public/turbine-core/turbine-core/atom.xml

    ============================== Gump Tracking Only ===
    Produced by Apache Gump(TM) version 2.3.
    Gump Run 05000605092011, vmgump.apache.org:vmgump:05000605092011
    Gump E-mail Identifier (unique within run) #47.

    --
    Apache Gump
    http://gump.apache.org/ [Instance: vmgump]

    ---------------------------------------------------------------------
    To unsubscribe, e-mail: dev-unsubscribe@turbine.apache.org
    For additional commands, e-mail: dev-help@turbine.apache.org
  • Anonymous at Sep 6, 2011 at 11:28 am
    To whom it may engage...

    This is an automated request, but not an unsolicited one. For
    more information please visit http://gump.apache.org/nagged.html,
    and/or contact the folk at general@gump.apache.org.

    Project turbine-core has an issue affecting its community integration.
    This issue affects 2 projects,
    and has been outstanding for 379 runs.
    The current state of this project is 'Failed', with reason 'Build Failed'.
    For reference only, the following projects are affected by this:
    - turbine-core : A servlet based framework.
    - turbine-core-test : A servlet based framework.


    Full details are available at:
    http://vmgump.apache.org/gump/public/turbine-core/turbine-core/index.html

    That said, some information snippets are provided here.

    The following annotations (debug/informational/warning/error messages) were provided:
    -INFO- Optional dependency commons-fileupload prerequisite failed with reason build failed
    -INFO- Optional dependency httpunit failed with reason build failed
    -DEBUG- (Apache Gump generated) Apache Maven Settings in: /srv/gump/public/workspace/turbine-core/gump_mvn_settings.xml
    -INFO- Failed with reason build failed
    -DEBUG- Maven POM in: /srv/gump/public/workspace/turbine-core/pom.xml
    -INFO- Failed to extract fallback artifacts from Gump Repository



    The following work was performed:
    http://vmgump.apache.org/gump/public/turbine-core/turbine-core/gump_work/build_turbine-core_turbine-core.html
    Work Name: build_turbine-core_turbine-core (Type: Build)
    Work ended in a state of : Failed
    Elapsed: 19 secs
    Command Line: /opt/maven2/bin/mvn --batch-mode -DskipTests=true --settings /srv/gump/public/workspace/turbine-core/gump_mvn_settings.xml package
    [Working Directory: /srv/gump/public/workspace/turbine-core]
    M2_HOME: /opt/maven2
    ---------------------------------------------
    urls[19] = file:/srv/gump/public/workspace/mvnlocalrepo/shared/xml-apis/xml-apis/1.0.b2/xml-apis-1.0.b2.jar
    urls[20] = file:/srv/gump/public/workspace/mvnlocalrepo/shared/commons-configuration/commons-configuration/1.4/commons-configuration-1.4.jar
    urls[21] = file:/srv/gump/public/workspace/mvnlocalrepo/shared/commons-logging/commons-logging-api/1.0.4/commons-logging-api-1.0.4.jar
    urls[22] = file:/srv/gump/public/workspace/mvnlocalrepo/shared/commons-digester/commons-digester/1.8/commons-digester-1.8.jar
    urls[23] = file:/srv/gump/public/workspace/mvnlocalrepo/shared/commons-beanutils/commons-beanutils/1.7.0/commons-beanutils-1.7.0.jar
    urls[24] = file:/srv/gump/public/workspace/mvnlocalrepo/shared/commons-beanutils/commons-beanutils-core/1.7.0/commons-beanutils-core-1.7.0.jar
    urls[25] = file:/srv/gump/public/workspace/mvnlocalrepo/shared/commons-codec/commons-codec/1.3/commons-codec-1.3.jar
    urls[26] = file:/srv/gump/public/workspace/mvnlocalrepo/shared/commons-jxpath/commons-jxpath/1.2/commons-jxpath-1.2.jar
    urls[27] = file:/srv/gump/public/workspace/mvnlocalrepo/shared/xerces/xerces/1.2.3/xerces-1.2.3.jar
    urls[28] = file:/srv/gump/public/workspace/mvnlocalrepo/shared/ant/ant-optional/1.5.1/ant-optional-1.5.1.jar
    urls[29] = file:/srv/gump/public/workspace/mvnlocalrepo/shared/jdom/jdom/b9/jdom-b9.jar
    Number of imports: 10
    import: org.codehaus.classworlds.Entry@a6c57a42
    import: org.codehaus.classworlds.Entry@12f43f3b
    import: org.codehaus.classworlds.Entry@20025374
    import: org.codehaus.classworlds.Entry@f8e44ca4
    import: org.codehaus.classworlds.Entry@92758522
    import: org.codehaus.classworlds.Entry@ebf2705b
    import: org.codehaus.classworlds.Entry@bb25e54
    import: org.codehaus.classworlds.Entry@bece5185
    import: org.codehaus.classworlds.Entry@3fee8e37
    import: org.codehaus.classworlds.Entry@3fee19d8


    this realm = plexus.core
    urls[0] = file:/opt/maven2/lib/maven-2.2.1-uber.jar
    Number of imports: 10
    import: org.codehaus.classworlds.Entry@a6c57a42
    import: org.codehaus.classworlds.Entry@12f43f3b
    import: org.codehaus.classworlds.Entry@20025374
    import: org.codehaus.classworlds.Entry@f8e44ca4
    import: org.codehaus.classworlds.Entry@92758522
    import: org.codehaus.classworlds.Entry@ebf2705b
    import: org.codehaus.classworlds.Entry@bb25e54
    import: org.codehaus.classworlds.Entry@bece5185
    import: org.codehaus.classworlds.Entry@3fee8e37
    import: org.codehaus.classworlds.Entry@3fee19d8
    -----------------------------------------------------
    [INFO] ------------------------------------------------------------------------
    [ERROR] BUILD ERROR
    [INFO] ------------------------------------------------------------------------
    [INFO] Internal error in the plugin manager executing goal 'org.apache.torque:torque-maven-plugin:3.3:om': Unable to load the mojo 'org.apache.torque:torque-maven-plugin:3.3:om' in the plugin 'org.apache.torque:torque-maven-plugin'. A required class is missing: org/apache/torque/task/TorqueDataModelTask
    org.apache.torque.task.TorqueDataModelTask
    [INFO] ------------------------------------------------------------------------
    [INFO] For more information, run Maven with the -e switch
    [INFO] ------------------------------------------------------------------------
    [INFO] Total time: 18 seconds
    [INFO] Finished at: Tue Sep 06 11:27:35 UTC 2011
    [INFO] Final Memory: 30M/71M
    [INFO] ------------------------------------------------------------------------
    ---------------------------------------------

    To subscribe to this information via syndicated feeds:
    - RSS: http://vmgump.apache.org/gump/public/turbine-core/turbine-core/rss.xml
    - Atom: http://vmgump.apache.org/gump/public/turbine-core/turbine-core/atom.xml

    ============================== Gump Tracking Only ===
    Produced by Apache Gump(TM) version 2.3.
    Gump Run 05000606092011, vmgump.apache.org:vmgump:05000606092011
    Gump E-mail Identifier (unique within run) #46.

    --
    Apache Gump
    http://gump.apache.org/ [Instance: vmgump]

    ---------------------------------------------------------------------
    To unsubscribe, e-mail: dev-unsubscribe@turbine.apache.org
    For additional commands, e-mail: dev-help@turbine.apache.org
  • Anonymous at Sep 7, 2011 at 11:31 am
    To whom it may engage...

    This is an automated request, but not an unsolicited one. For
    more information please visit http://gump.apache.org/nagged.html,
    and/or contact the folk at general@gump.apache.org.

    Project turbine-core has an issue affecting its community integration.
    This issue affects 2 projects,
    and has been outstanding for 381 runs.
    The current state of this project is 'Failed', with reason 'Build Failed'.
    For reference only, the following projects are affected by this:
    - turbine-core : A servlet based framework.
    - turbine-core-test : A servlet based framework.


    Full details are available at:
    http://vmgump.apache.org/gump/public/turbine-core/turbine-core/index.html

    That said, some information snippets are provided here.

    The following annotations (debug/informational/warning/error messages) were provided:
    -INFO- Optional dependency commons-fileupload prerequisite failed with reason build failed
    -INFO- Optional dependency httpunit failed with reason build failed
    -DEBUG- (Apache Gump generated) Apache Maven Settings in: /srv/gump/public/workspace/turbine-core/gump_mvn_settings.xml
    -INFO- Failed with reason build failed
    -DEBUG- Maven POM in: /srv/gump/public/workspace/turbine-core/pom.xml
    -INFO- Failed to extract fallback artifacts from Gump Repository



    The following work was performed:
    http://vmgump.apache.org/gump/public/turbine-core/turbine-core/gump_work/build_turbine-core_turbine-core.html
    Work Name: build_turbine-core_turbine-core (Type: Build)
    Work ended in a state of : Failed
    Elapsed: 21 secs
    Command Line: /opt/maven2/bin/mvn --batch-mode -DskipTests=true --settings /srv/gump/public/workspace/turbine-core/gump_mvn_settings.xml package
    [Working Directory: /srv/gump/public/workspace/turbine-core]
    M2_HOME: /opt/maven2
    ---------------------------------------------
    urls[19] = file:/srv/gump/public/workspace/mvnlocalrepo/shared/xml-apis/xml-apis/1.0.b2/xml-apis-1.0.b2.jar
    urls[20] = file:/srv/gump/public/workspace/mvnlocalrepo/shared/commons-configuration/commons-configuration/1.4/commons-configuration-1.4.jar
    urls[21] = file:/srv/gump/public/workspace/mvnlocalrepo/shared/commons-logging/commons-logging-api/1.0.4/commons-logging-api-1.0.4.jar
    urls[22] = file:/srv/gump/public/workspace/mvnlocalrepo/shared/commons-digester/commons-digester/1.8/commons-digester-1.8.jar
    urls[23] = file:/srv/gump/public/workspace/mvnlocalrepo/shared/commons-beanutils/commons-beanutils/1.7.0/commons-beanutils-1.7.0.jar
    urls[24] = file:/srv/gump/public/workspace/mvnlocalrepo/shared/commons-beanutils/commons-beanutils-core/1.7.0/commons-beanutils-core-1.7.0.jar
    urls[25] = file:/srv/gump/public/workspace/mvnlocalrepo/shared/commons-codec/commons-codec/1.3/commons-codec-1.3.jar
    urls[26] = file:/srv/gump/public/workspace/mvnlocalrepo/shared/commons-jxpath/commons-jxpath/1.2/commons-jxpath-1.2.jar
    urls[27] = file:/srv/gump/public/workspace/mvnlocalrepo/shared/xerces/xerces/1.2.3/xerces-1.2.3.jar
    urls[28] = file:/srv/gump/public/workspace/mvnlocalrepo/shared/ant/ant-optional/1.5.1/ant-optional-1.5.1.jar
    urls[29] = file:/srv/gump/public/workspace/mvnlocalrepo/shared/jdom/jdom/b9/jdom-b9.jar
    Number of imports: 10
    import: org.codehaus.classworlds.Entry@a6c57a42
    import: org.codehaus.classworlds.Entry@12f43f3b
    import: org.codehaus.classworlds.Entry@20025374
    import: org.codehaus.classworlds.Entry@f8e44ca4
    import: org.codehaus.classworlds.Entry@92758522
    import: org.codehaus.classworlds.Entry@ebf2705b
    import: org.codehaus.classworlds.Entry@bb25e54
    import: org.codehaus.classworlds.Entry@bece5185
    import: org.codehaus.classworlds.Entry@3fee8e37
    import: org.codehaus.classworlds.Entry@3fee19d8


    this realm = plexus.core
    urls[0] = file:/opt/maven2/lib/maven-2.2.1-uber.jar
    Number of imports: 10
    import: org.codehaus.classworlds.Entry@a6c57a42
    import: org.codehaus.classworlds.Entry@12f43f3b
    import: org.codehaus.classworlds.Entry@20025374
    import: org.codehaus.classworlds.Entry@f8e44ca4
    import: org.codehaus.classworlds.Entry@92758522
    import: org.codehaus.classworlds.Entry@ebf2705b
    import: org.codehaus.classworlds.Entry@bb25e54
    import: org.codehaus.classworlds.Entry@bece5185
    import: org.codehaus.classworlds.Entry@3fee8e37
    import: org.codehaus.classworlds.Entry@3fee19d8
    -----------------------------------------------------
    [INFO] ------------------------------------------------------------------------
    [ERROR] BUILD ERROR
    [INFO] ------------------------------------------------------------------------
    [INFO] Internal error in the plugin manager executing goal 'org.apache.torque:torque-maven-plugin:3.3:om': Unable to load the mojo 'org.apache.torque:torque-maven-plugin:3.3:om' in the plugin 'org.apache.torque:torque-maven-plugin'. A required class is missing: org/apache/torque/task/TorqueDataModelTask
    org.apache.torque.task.TorqueDataModelTask
    [INFO] ------------------------------------------------------------------------
    [INFO] For more information, run Maven with the -e switch
    [INFO] ------------------------------------------------------------------------
    [INFO] Total time: 20 seconds
    [INFO] Finished at: Wed Sep 07 11:30:49 UTC 2011
    [INFO] Final Memory: 30M/71M
    [INFO] ------------------------------------------------------------------------
    ---------------------------------------------

    To subscribe to this information via syndicated feeds:
    - RSS: http://vmgump.apache.org/gump/public/turbine-core/turbine-core/rss.xml
    - Atom: http://vmgump.apache.org/gump/public/turbine-core/turbine-core/atom.xml

    ============================== Gump Tracking Only ===
    Produced by Apache Gump(TM) version 2.3.
    Gump Run 05000607092011, vmgump.apache.org:vmgump:05000607092011
    Gump E-mail Identifier (unique within run) #45.

    --
    Apache Gump
    http://gump.apache.org/ [Instance: vmgump]

    ---------------------------------------------------------------------
    To unsubscribe, e-mail: dev-unsubscribe@turbine.apache.org
    For additional commands, e-mail: dev-help@turbine.apache.org
  • Anonymous at Sep 8, 2011 at 11:27 am
    To whom it may engage...

    This is an automated request, but not an unsolicited one. For
    more information please visit http://gump.apache.org/nagged.html,
    and/or contact the folk at general@gump.apache.org.

    Project turbine-core has an issue affecting its community integration.
    This issue affects 2 projects,
    and has been outstanding for 383 runs.
    The current state of this project is 'Failed', with reason 'Build Failed'.
    For reference only, the following projects are affected by this:
    - turbine-core : A servlet based framework.
    - turbine-core-test : A servlet based framework.


    Full details are available at:
    http://vmgump.apache.org/gump/public/turbine-core/turbine-core/index.html

    That said, some information snippets are provided here.

    The following annotations (debug/informational/warning/error messages) were provided:
    -INFO- Optional dependency commons-fileupload prerequisite failed with reason build failed
    -INFO- Optional dependency commons-configuration failed with reason missing build outputs
    -INFO- Optional dependency httpunit failed with reason build failed
    -DEBUG- (Apache Gump generated) Apache Maven Settings in: /srv/gump/public/workspace/turbine-core/gump_mvn_settings.xml
    -INFO- Failed with reason build failed
    -DEBUG- Maven POM in: /srv/gump/public/workspace/turbine-core/pom.xml
    -INFO- Failed to extract fallback artifacts from Gump Repository



    The following work was performed:
    http://vmgump.apache.org/gump/public/turbine-core/turbine-core/gump_work/build_turbine-core_turbine-core.html
    Work Name: build_turbine-core_turbine-core (Type: Build)
    Work ended in a state of : Failed
    Elapsed: 22 secs
    Command Line: /opt/maven2/bin/mvn --batch-mode -DskipTests=true --settings /srv/gump/public/workspace/turbine-core/gump_mvn_settings.xml package
    [Working Directory: /srv/gump/public/workspace/turbine-core]
    M2_HOME: /opt/maven2
    ---------------------------------------------
    urls[19] = file:/srv/gump/public/workspace/mvnlocalrepo/shared/xml-apis/xml-apis/1.0.b2/xml-apis-1.0.b2.jar
    urls[20] = file:/srv/gump/public/workspace/mvnlocalrepo/shared/commons-configuration/commons-configuration/1.4/commons-configuration-1.4.jar
    urls[21] = file:/srv/gump/public/workspace/mvnlocalrepo/shared/commons-logging/commons-logging-api/1.0.4/commons-logging-api-1.0.4.jar
    urls[22] = file:/srv/gump/public/workspace/mvnlocalrepo/shared/commons-digester/commons-digester/1.8/commons-digester-1.8.jar
    urls[23] = file:/srv/gump/public/workspace/mvnlocalrepo/shared/commons-beanutils/commons-beanutils/1.7.0/commons-beanutils-1.7.0.jar
    urls[24] = file:/srv/gump/public/workspace/mvnlocalrepo/shared/commons-beanutils/commons-beanutils-core/1.7.0/commons-beanutils-core-1.7.0.jar
    urls[25] = file:/srv/gump/public/workspace/mvnlocalrepo/shared/commons-codec/commons-codec/1.3/commons-codec-1.3.jar
    urls[26] = file:/srv/gump/public/workspace/mvnlocalrepo/shared/commons-jxpath/commons-jxpath/1.2/commons-jxpath-1.2.jar
    urls[27] = file:/srv/gump/public/workspace/mvnlocalrepo/shared/xerces/xerces/1.2.3/xerces-1.2.3.jar
    urls[28] = file:/srv/gump/public/workspace/mvnlocalrepo/shared/ant/ant-optional/1.5.1/ant-optional-1.5.1.jar
    urls[29] = file:/srv/gump/public/workspace/mvnlocalrepo/shared/jdom/jdom/b9/jdom-b9.jar
    Number of imports: 10
    import: org.codehaus.classworlds.Entry@a6c57a42
    import: org.codehaus.classworlds.Entry@12f43f3b
    import: org.codehaus.classworlds.Entry@20025374
    import: org.codehaus.classworlds.Entry@f8e44ca4
    import: org.codehaus.classworlds.Entry@92758522
    import: org.codehaus.classworlds.Entry@ebf2705b
    import: org.codehaus.classworlds.Entry@bb25e54
    import: org.codehaus.classworlds.Entry@bece5185
    import: org.codehaus.classworlds.Entry@3fee8e37
    import: org.codehaus.classworlds.Entry@3fee19d8


    this realm = plexus.core
    urls[0] = file:/opt/maven2/lib/maven-2.2.1-uber.jar
    Number of imports: 10
    import: org.codehaus.classworlds.Entry@a6c57a42
    import: org.codehaus.classworlds.Entry@12f43f3b
    import: org.codehaus.classworlds.Entry@20025374
    import: org.codehaus.classworlds.Entry@f8e44ca4
    import: org.codehaus.classworlds.Entry@92758522
    import: org.codehaus.classworlds.Entry@ebf2705b
    import: org.codehaus.classworlds.Entry@bb25e54
    import: org.codehaus.classworlds.Entry@bece5185
    import: org.codehaus.classworlds.Entry@3fee8e37
    import: org.codehaus.classworlds.Entry@3fee19d8
    -----------------------------------------------------
    [INFO] ------------------------------------------------------------------------
    [ERROR] BUILD ERROR
    [INFO] ------------------------------------------------------------------------
    [INFO] Internal error in the plugin manager executing goal 'org.apache.torque:torque-maven-plugin:3.3:om': Unable to load the mojo 'org.apache.torque:torque-maven-plugin:3.3:om' in the plugin 'org.apache.torque:torque-maven-plugin'. A required class is missing: org/apache/torque/task/TorqueDataModelTask
    org.apache.torque.task.TorqueDataModelTask
    [INFO] ------------------------------------------------------------------------
    [INFO] For more information, run Maven with the -e switch
    [INFO] ------------------------------------------------------------------------
    [INFO] Total time: 21 seconds
    [INFO] Finished at: Thu Sep 08 11:26:18 UTC 2011
    [INFO] Final Memory: 29M/71M
    [INFO] ------------------------------------------------------------------------
    ---------------------------------------------

    To subscribe to this information via syndicated feeds:
    - RSS: http://vmgump.apache.org/gump/public/turbine-core/turbine-core/rss.xml
    - Atom: http://vmgump.apache.org/gump/public/turbine-core/turbine-core/atom.xml

    ============================== Gump Tracking Only ===
    Produced by Apache Gump(TM) version 2.3.
    Gump Run 05000608092011, vmgump.apache.org:vmgump:05000608092011
    Gump E-mail Identifier (unique within run) #44.

    --
    Apache Gump
    http://gump.apache.org/ [Instance: vmgump]

    ---------------------------------------------------------------------
    To unsubscribe, e-mail: dev-unsubscribe@turbine.apache.org
    For additional commands, e-mail: dev-help@turbine.apache.org
  • Anonymous at Sep 9, 2011 at 11:36 am
    To whom it may engage...

    This is an automated request, but not an unsolicited one. For
    more information please visit http://gump.apache.org/nagged.html,
    and/or contact the folk at general@gump.apache.org.

    Project turbine-core has an issue affecting its community integration.
    This issue affects 2 projects,
    and has been outstanding for 385 runs.
    The current state of this project is 'Failed', with reason 'Build Failed'.
    For reference only, the following projects are affected by this:
    - turbine-core : A servlet based framework.
    - turbine-core-test : A servlet based framework.


    Full details are available at:
    http://vmgump.apache.org/gump/public/turbine-core/turbine-core/index.html

    That said, some information snippets are provided here.

    The following annotations (debug/informational/warning/error messages) were provided:
    -INFO- Optional dependency commons-fileupload prerequisite failed with reason build failed
    -INFO- Optional dependency commons-configuration failed with reason missing build outputs
    -INFO- Optional dependency httpunit failed with reason build failed
    -DEBUG- (Apache Gump generated) Apache Maven Settings in: /srv/gump/public/workspace/turbine-core/gump_mvn_settings.xml
    -INFO- Failed with reason build failed
    -DEBUG- Maven POM in: /srv/gump/public/workspace/turbine-core/pom.xml
    -INFO- Failed to extract fallback artifacts from Gump Repository



    The following work was performed:
    http://vmgump.apache.org/gump/public/turbine-core/turbine-core/gump_work/build_turbine-core_turbine-core.html
    Work Name: build_turbine-core_turbine-core (Type: Build)
    Work ended in a state of : Failed
    Elapsed: 22 secs
    Command Line: /opt/maven2/bin/mvn --batch-mode -DskipTests=true --settings /srv/gump/public/workspace/turbine-core/gump_mvn_settings.xml package
    [Working Directory: /srv/gump/public/workspace/turbine-core]
    M2_HOME: /opt/maven2
    ---------------------------------------------
    urls[19] = file:/srv/gump/public/workspace/mvnlocalrepo/shared/xml-apis/xml-apis/1.0.b2/xml-apis-1.0.b2.jar
    urls[20] = file:/srv/gump/public/workspace/mvnlocalrepo/shared/commons-configuration/commons-configuration/1.4/commons-configuration-1.4.jar
    urls[21] = file:/srv/gump/public/workspace/mvnlocalrepo/shared/commons-logging/commons-logging-api/1.0.4/commons-logging-api-1.0.4.jar
    urls[22] = file:/srv/gump/public/workspace/mvnlocalrepo/shared/commons-digester/commons-digester/1.8/commons-digester-1.8.jar
    urls[23] = file:/srv/gump/public/workspace/mvnlocalrepo/shared/commons-beanutils/commons-beanutils/1.7.0/commons-beanutils-1.7.0.jar
    urls[24] = file:/srv/gump/public/workspace/mvnlocalrepo/shared/commons-beanutils/commons-beanutils-core/1.7.0/commons-beanutils-core-1.7.0.jar
    urls[25] = file:/srv/gump/public/workspace/mvnlocalrepo/shared/commons-codec/commons-codec/1.3/commons-codec-1.3.jar
    urls[26] = file:/srv/gump/public/workspace/mvnlocalrepo/shared/commons-jxpath/commons-jxpath/1.2/commons-jxpath-1.2.jar
    urls[27] = file:/srv/gump/public/workspace/mvnlocalrepo/shared/xerces/xerces/1.2.3/xerces-1.2.3.jar
    urls[28] = file:/srv/gump/public/workspace/mvnlocalrepo/shared/ant/ant-optional/1.5.1/ant-optional-1.5.1.jar
    urls[29] = file:/srv/gump/public/workspace/mvnlocalrepo/shared/jdom/jdom/b9/jdom-b9.jar
    Number of imports: 10
    import: org.codehaus.classworlds.Entry@a6c57a42
    import: org.codehaus.classworlds.Entry@12f43f3b
    import: org.codehaus.classworlds.Entry@20025374
    import: org.codehaus.classworlds.Entry@f8e44ca4
    import: org.codehaus.classworlds.Entry@92758522
    import: org.codehaus.classworlds.Entry@ebf2705b
    import: org.codehaus.classworlds.Entry@bb25e54
    import: org.codehaus.classworlds.Entry@bece5185
    import: org.codehaus.classworlds.Entry@3fee8e37
    import: org.codehaus.classworlds.Entry@3fee19d8


    this realm = plexus.core
    urls[0] = file:/opt/maven2/lib/maven-2.2.1-uber.jar
    Number of imports: 10
    import: org.codehaus.classworlds.Entry@a6c57a42
    import: org.codehaus.classworlds.Entry@12f43f3b
    import: org.codehaus.classworlds.Entry@20025374
    import: org.codehaus.classworlds.Entry@f8e44ca4
    import: org.codehaus.classworlds.Entry@92758522
    import: org.codehaus.classworlds.Entry@ebf2705b
    import: org.codehaus.classworlds.Entry@bb25e54
    import: org.codehaus.classworlds.Entry@bece5185
    import: org.codehaus.classworlds.Entry@3fee8e37
    import: org.codehaus.classworlds.Entry@3fee19d8
    -----------------------------------------------------
    [INFO] ------------------------------------------------------------------------
    [ERROR] BUILD ERROR
    [INFO] ------------------------------------------------------------------------
    [INFO] Internal error in the plugin manager executing goal 'org.apache.torque:torque-maven-plugin:3.3:om': Unable to load the mojo 'org.apache.torque:torque-maven-plugin:3.3:om' in the plugin 'org.apache.torque:torque-maven-plugin'. A required class is missing: org/apache/torque/task/TorqueDataModelTask
    org.apache.torque.task.TorqueDataModelTask
    [INFO] ------------------------------------------------------------------------
    [INFO] For more information, run Maven with the -e switch
    [INFO] ------------------------------------------------------------------------
    [INFO] Total time: 21 seconds
    [INFO] Finished at: Fri Sep 09 11:35:55 UTC 2011
    [INFO] Final Memory: 29M/71M
    [INFO] ------------------------------------------------------------------------
    ---------------------------------------------

    To subscribe to this information via syndicated feeds:
    - RSS: http://vmgump.apache.org/gump/public/turbine-core/turbine-core/rss.xml
    - Atom: http://vmgump.apache.org/gump/public/turbine-core/turbine-core/atom.xml

    ============================== Gump Tracking Only ===
    Produced by Apache Gump(TM) version 2.3.
    Gump Run 05000609092011, vmgump.apache.org:vmgump:05000609092011
    Gump E-mail Identifier (unique within run) #43.

    --
    Apache Gump
    http://gump.apache.org/ [Instance: vmgump]

    ---------------------------------------------------------------------
    To unsubscribe, e-mail: dev-unsubscribe@turbine.apache.org
    For additional commands, e-mail: dev-help@turbine.apache.org
  • Anonymous at Sep 10, 2011 at 11:29 am
    To whom it may engage...

    This is an automated request, but not an unsolicited one. For
    more information please visit http://gump.apache.org/nagged.html,
    and/or contact the folk at general@gump.apache.org.

    Project turbine-core has an issue affecting its community integration.
    This issue affects 2 projects,
    and has been outstanding for 387 runs.
    The current state of this project is 'Failed', with reason 'Build Failed'.
    For reference only, the following projects are affected by this:
    - turbine-core : A servlet based framework.
    - turbine-core-test : A servlet based framework.


    Full details are available at:
    http://vmgump.apache.org/gump/public/turbine-core/turbine-core/index.html

    That said, some information snippets are provided here.

    The following annotations (debug/informational/warning/error messages) were provided:
    -INFO- Optional dependency commons-fileupload prerequisite failed with reason build failed
    -INFO- Optional dependency httpunit failed with reason build failed
    -DEBUG- (Apache Gump generated) Apache Maven Settings in: /srv/gump/public/workspace/turbine-core/gump_mvn_settings.xml
    -INFO- Failed with reason build failed
    -DEBUG- Maven POM in: /srv/gump/public/workspace/turbine-core/pom.xml
    -INFO- Failed to extract fallback artifacts from Gump Repository



    The following work was performed:
    http://vmgump.apache.org/gump/public/turbine-core/turbine-core/gump_work/build_turbine-core_turbine-core.html
    Work Name: build_turbine-core_turbine-core (Type: Build)
    Work ended in a state of : Failed
    Elapsed: 19 secs
    Command Line: /opt/maven2/bin/mvn --batch-mode -DskipTests=true --settings /srv/gump/public/workspace/turbine-core/gump_mvn_settings.xml package
    [Working Directory: /srv/gump/public/workspace/turbine-core]
    M2_HOME: /opt/maven2
    ---------------------------------------------
    urls[19] = file:/srv/gump/public/workspace/mvnlocalrepo/shared/xml-apis/xml-apis/1.0.b2/xml-apis-1.0.b2.jar
    urls[20] = file:/srv/gump/public/workspace/mvnlocalrepo/shared/commons-configuration/commons-configuration/1.4/commons-configuration-1.4.jar
    urls[21] = file:/srv/gump/public/workspace/mvnlocalrepo/shared/commons-logging/commons-logging-api/1.0.4/commons-logging-api-1.0.4.jar
    urls[22] = file:/srv/gump/public/workspace/mvnlocalrepo/shared/commons-digester/commons-digester/1.8/commons-digester-1.8.jar
    urls[23] = file:/srv/gump/public/workspace/mvnlocalrepo/shared/commons-beanutils/commons-beanutils/1.7.0/commons-beanutils-1.7.0.jar
    urls[24] = file:/srv/gump/public/workspace/mvnlocalrepo/shared/commons-beanutils/commons-beanutils-core/1.7.0/commons-beanutils-core-1.7.0.jar
    urls[25] = file:/srv/gump/public/workspace/mvnlocalrepo/shared/commons-codec/commons-codec/1.3/commons-codec-1.3.jar
    urls[26] = file:/srv/gump/public/workspace/mvnlocalrepo/shared/commons-jxpath/commons-jxpath/1.2/commons-jxpath-1.2.jar
    urls[27] = file:/srv/gump/public/workspace/mvnlocalrepo/shared/xerces/xerces/1.2.3/xerces-1.2.3.jar
    urls[28] = file:/srv/gump/public/workspace/mvnlocalrepo/shared/ant/ant-optional/1.5.1/ant-optional-1.5.1.jar
    urls[29] = file:/srv/gump/public/workspace/mvnlocalrepo/shared/jdom/jdom/b9/jdom-b9.jar
    Number of imports: 10
    import: org.codehaus.classworlds.Entry@a6c57a42
    import: org.codehaus.classworlds.Entry@12f43f3b
    import: org.codehaus.classworlds.Entry@20025374
    import: org.codehaus.classworlds.Entry@f8e44ca4
    import: org.codehaus.classworlds.Entry@92758522
    import: org.codehaus.classworlds.Entry@ebf2705b
    import: org.codehaus.classworlds.Entry@bb25e54
    import: org.codehaus.classworlds.Entry@bece5185
    import: org.codehaus.classworlds.Entry@3fee8e37
    import: org.codehaus.classworlds.Entry@3fee19d8


    this realm = plexus.core
    urls[0] = file:/opt/maven2/lib/maven-2.2.1-uber.jar
    Number of imports: 10
    import: org.codehaus.classworlds.Entry@a6c57a42
    import: org.codehaus.classworlds.Entry@12f43f3b
    import: org.codehaus.classworlds.Entry@20025374
    import: org.codehaus.classworlds.Entry@f8e44ca4
    import: org.codehaus.classworlds.Entry@92758522
    import: org.codehaus.classworlds.Entry@ebf2705b
    import: org.codehaus.classworlds.Entry@bb25e54
    import: org.codehaus.classworlds.Entry@bece5185
    import: org.codehaus.classworlds.Entry@3fee8e37
    import: org.codehaus.classworlds.Entry@3fee19d8
    -----------------------------------------------------
    [INFO] ------------------------------------------------------------------------
    [ERROR] BUILD ERROR
    [INFO] ------------------------------------------------------------------------
    [INFO] Internal error in the plugin manager executing goal 'org.apache.torque:torque-maven-plugin:3.3:om': Unable to load the mojo 'org.apache.torque:torque-maven-plugin:3.3:om' in the plugin 'org.apache.torque:torque-maven-plugin'. A required class is missing: org/apache/torque/task/TorqueDataModelTask
    org.apache.torque.task.TorqueDataModelTask
    [INFO] ------------------------------------------------------------------------
    [INFO] For more information, run Maven with the -e switch
    [INFO] ------------------------------------------------------------------------
    [INFO] Total time: 18 seconds
    [INFO] Finished at: Sat Sep 10 11:29:17 UTC 2011
    [INFO] Final Memory: 30M/71M
    [INFO] ------------------------------------------------------------------------
    ---------------------------------------------

    To subscribe to this information via syndicated feeds:
    - RSS: http://vmgump.apache.org/gump/public/turbine-core/turbine-core/rss.xml
    - Atom: http://vmgump.apache.org/gump/public/turbine-core/turbine-core/atom.xml

    ============================== Gump Tracking Only ===
    Produced by Apache Gump(TM) version 2.3.
    Gump Run 04000610092011, vmgump.apache.org:vmgump:04000610092011
    Gump E-mail Identifier (unique within run) #49.

    --
    Apache Gump
    http://gump.apache.org/ [Instance: vmgump]

    ---------------------------------------------------------------------
    To unsubscribe, e-mail: dev-unsubscribe@turbine.apache.org
    For additional commands, e-mail: dev-help@turbine.apache.org
  • Anonymous at Sep 11, 2011 at 11:59 am
    To whom it may engage...

    This is an automated request, but not an unsolicited one. For
    more information please visit http://gump.apache.org/nagged.html,
    and/or contact the folk at general@gump.apache.org.

    Project turbine-core has an issue affecting its community integration.
    This issue affects 2 projects,
    and has been outstanding for 389 runs.
    The current state of this project is 'Failed', with reason 'Build Failed'.
    For reference only, the following projects are affected by this:
    - turbine-core : A servlet based framework.
    - turbine-core-test : A servlet based framework.


    Full details are available at:
    http://vmgump.apache.org/gump/public/turbine-core/turbine-core/index.html

    That said, some information snippets are provided here.

    The following annotations (debug/informational/warning/error messages) were provided:
    -INFO- Optional dependency commons-fileupload prerequisite failed with reason build failed
    -INFO- Optional dependency httpunit failed with reason build failed
    -DEBUG- (Apache Gump generated) Apache Maven Settings in: /srv/gump/public/workspace/turbine-core/gump_mvn_settings.xml
    -INFO- Failed with reason build failed
    -DEBUG- Maven POM in: /srv/gump/public/workspace/turbine-core/pom.xml
    -INFO- Failed to extract fallback artifacts from Gump Repository



    The following work was performed:
    http://vmgump.apache.org/gump/public/turbine-core/turbine-core/gump_work/build_turbine-core_turbine-core.html
    Work Name: build_turbine-core_turbine-core (Type: Build)
    Work ended in a state of : Failed
    Elapsed: 21 secs
    Command Line: /opt/maven2/bin/mvn --batch-mode -DskipTests=true --settings /srv/gump/public/workspace/turbine-core/gump_mvn_settings.xml package
    [Working Directory: /srv/gump/public/workspace/turbine-core]
    M2_HOME: /opt/maven2
    ---------------------------------------------
    urls[19] = file:/srv/gump/public/workspace/mvnlocalrepo/shared/xml-apis/xml-apis/1.0.b2/xml-apis-1.0.b2.jar
    urls[20] = file:/srv/gump/public/workspace/mvnlocalrepo/shared/commons-configuration/commons-configuration/1.4/commons-configuration-1.4.jar
    urls[21] = file:/srv/gump/public/workspace/mvnlocalrepo/shared/commons-logging/commons-logging-api/1.0.4/commons-logging-api-1.0.4.jar
    urls[22] = file:/srv/gump/public/workspace/mvnlocalrepo/shared/commons-digester/commons-digester/1.8/commons-digester-1.8.jar
    urls[23] = file:/srv/gump/public/workspace/mvnlocalrepo/shared/commons-beanutils/commons-beanutils/1.7.0/commons-beanutils-1.7.0.jar
    urls[24] = file:/srv/gump/public/workspace/mvnlocalrepo/shared/commons-beanutils/commons-beanutils-core/1.7.0/commons-beanutils-core-1.7.0.jar
    urls[25] = file:/srv/gump/public/workspace/mvnlocalrepo/shared/commons-codec/commons-codec/1.3/commons-codec-1.3.jar
    urls[26] = file:/srv/gump/public/workspace/mvnlocalrepo/shared/commons-jxpath/commons-jxpath/1.2/commons-jxpath-1.2.jar
    urls[27] = file:/srv/gump/public/workspace/mvnlocalrepo/shared/xerces/xerces/1.2.3/xerces-1.2.3.jar
    urls[28] = file:/srv/gump/public/workspace/mvnlocalrepo/shared/ant/ant-optional/1.5.1/ant-optional-1.5.1.jar
    urls[29] = file:/srv/gump/public/workspace/mvnlocalrepo/shared/jdom/jdom/b9/jdom-b9.jar
    Number of imports: 10
    import: org.codehaus.classworlds.Entry@a6c57a42
    import: org.codehaus.classworlds.Entry@12f43f3b
    import: org.codehaus.classworlds.Entry@20025374
    import: org.codehaus.classworlds.Entry@f8e44ca4
    import: org.codehaus.classworlds.Entry@92758522
    import: org.codehaus.classworlds.Entry@ebf2705b
    import: org.codehaus.classworlds.Entry@bb25e54
    import: org.codehaus.classworlds.Entry@bece5185
    import: org.codehaus.classworlds.Entry@3fee8e37
    import: org.codehaus.classworlds.Entry@3fee19d8


    this realm = plexus.core
    urls[0] = file:/opt/maven2/lib/maven-2.2.1-uber.jar
    Number of imports: 10
    import: org.codehaus.classworlds.Entry@a6c57a42
    import: org.codehaus.classworlds.Entry@12f43f3b
    import: org.codehaus.classworlds.Entry@20025374
    import: org.codehaus.classworlds.Entry@f8e44ca4
    import: org.codehaus.classworlds.Entry@92758522
    import: org.codehaus.classworlds.Entry@ebf2705b
    import: org.codehaus.classworlds.Entry@bb25e54
    import: org.codehaus.classworlds.Entry@bece5185
    import: org.codehaus.classworlds.Entry@3fee8e37
    import: org.codehaus.classworlds.Entry@3fee19d8
    -----------------------------------------------------
    [INFO] ------------------------------------------------------------------------
    [ERROR] BUILD ERROR
    [INFO] ------------------------------------------------------------------------
    [INFO] Internal error in the plugin manager executing goal 'org.apache.torque:torque-maven-plugin:3.3:om': Unable to load the mojo 'org.apache.torque:torque-maven-plugin:3.3:om' in the plugin 'org.apache.torque:torque-maven-plugin'. A required class is missing: org/apache/torque/task/TorqueDataModelTask
    org.apache.torque.task.TorqueDataModelTask
    [INFO] ------------------------------------------------------------------------
    [INFO] For more information, run Maven with the -e switch
    [INFO] ------------------------------------------------------------------------
    [INFO] Total time: 20 seconds
    [INFO] Finished at: Sun Sep 11 11:58:30 UTC 2011
    [INFO] Final Memory: 30M/71M
    [INFO] ------------------------------------------------------------------------
    ---------------------------------------------

    To subscribe to this information via syndicated feeds:
    - RSS: http://vmgump.apache.org/gump/public/turbine-core/turbine-core/rss.xml
    - Atom: http://vmgump.apache.org/gump/public/turbine-core/turbine-core/atom.xml

    ============================== Gump Tracking Only ===
    Produced by Apache Gump(TM) version 2.3.
    Gump Run 05000611092011, vmgump.apache.org:vmgump:05000611092011
    Gump E-mail Identifier (unique within run) #44.

    --
    Apache Gump
    http://gump.apache.org/ [Instance: vmgump]

    ---------------------------------------------------------------------
    To unsubscribe, e-mail: dev-unsubscribe@turbine.apache.org
    For additional commands, e-mail: dev-help@turbine.apache.org
  • Anonymous at Sep 12, 2011 at 1:10 pm
    To whom it may engage...

    This is an automated request, but not an unsolicited one. For
    more information please visit http://gump.apache.org/nagged.html,
    and/or contact the folk at general@gump.apache.org.

    Project turbine-core has an issue affecting its community integration.
    This issue affects 2 projects,
    and has been outstanding for 391 runs.
    The current state of this project is 'Failed', with reason 'Build Failed'.
    For reference only, the following projects are affected by this:
    - turbine-core : A servlet based framework.
    - turbine-core-test : A servlet based framework.


    Full details are available at:
    http://vmgump.apache.org/gump/public/turbine-core/turbine-core/index.html

    That said, some information snippets are provided here.

    The following annotations (debug/informational/warning/error messages) were provided:
    -INFO- Optional dependency dom4j prerequisite failed with reason build timed out
    -INFO- Optional dependency commons-fileupload prerequisite failed with reason build failed
    -INFO- Optional dependency httpunit failed with reason build failed
    -DEBUG- (Apache Gump generated) Apache Maven Settings in: /srv/gump/public/workspace/turbine-core/gump_mvn_settings.xml
    -INFO- Failed with reason build failed
    -DEBUG- Maven POM in: /srv/gump/public/workspace/turbine-core/pom.xml
    -INFO- Failed to extract fallback artifacts from Gump Repository



    The following work was performed:
    http://vmgump.apache.org/gump/public/turbine-core/turbine-core/gump_work/build_turbine-core_turbine-core.html
    Work Name: build_turbine-core_turbine-core (Type: Build)
    Work ended in a state of : Failed
    Elapsed: 21 secs
    Command Line: /opt/maven2/bin/mvn --batch-mode -DskipTests=true --settings /srv/gump/public/workspace/turbine-core/gump_mvn_settings.xml package
    [Working Directory: /srv/gump/public/workspace/turbine-core]
    M2_HOME: /opt/maven2
    ---------------------------------------------
    urls[19] = file:/srv/gump/public/workspace/mvnlocalrepo/shared/xml-apis/xml-apis/1.0.b2/xml-apis-1.0.b2.jar
    urls[20] = file:/srv/gump/public/workspace/mvnlocalrepo/shared/commons-configuration/commons-configuration/1.4/commons-configuration-1.4.jar
    urls[21] = file:/srv/gump/public/workspace/mvnlocalrepo/shared/commons-logging/commons-logging-api/1.0.4/commons-logging-api-1.0.4.jar
    urls[22] = file:/srv/gump/public/workspace/mvnlocalrepo/shared/commons-digester/commons-digester/1.8/commons-digester-1.8.jar
    urls[23] = file:/srv/gump/public/workspace/mvnlocalrepo/shared/commons-beanutils/commons-beanutils/1.7.0/commons-beanutils-1.7.0.jar
    urls[24] = file:/srv/gump/public/workspace/mvnlocalrepo/shared/commons-beanutils/commons-beanutils-core/1.7.0/commons-beanutils-core-1.7.0.jar
    urls[25] = file:/srv/gump/public/workspace/mvnlocalrepo/shared/commons-codec/commons-codec/1.3/commons-codec-1.3.jar
    urls[26] = file:/srv/gump/public/workspace/mvnlocalrepo/shared/commons-jxpath/commons-jxpath/1.2/commons-jxpath-1.2.jar
    urls[27] = file:/srv/gump/public/workspace/mvnlocalrepo/shared/xerces/xerces/1.2.3/xerces-1.2.3.jar
    urls[28] = file:/srv/gump/public/workspace/mvnlocalrepo/shared/ant/ant-optional/1.5.1/ant-optional-1.5.1.jar
    urls[29] = file:/srv/gump/public/workspace/mvnlocalrepo/shared/jdom/jdom/b9/jdom-b9.jar
    Number of imports: 10
    import: org.codehaus.classworlds.Entry@a6c57a42
    import: org.codehaus.classworlds.Entry@12f43f3b
    import: org.codehaus.classworlds.Entry@20025374
    import: org.codehaus.classworlds.Entry@f8e44ca4
    import: org.codehaus.classworlds.Entry@92758522
    import: org.codehaus.classworlds.Entry@ebf2705b
    import: org.codehaus.classworlds.Entry@bb25e54
    import: org.codehaus.classworlds.Entry@bece5185
    import: org.codehaus.classworlds.Entry@3fee8e37
    import: org.codehaus.classworlds.Entry@3fee19d8


    this realm = plexus.core
    urls[0] = file:/opt/maven2/lib/maven-2.2.1-uber.jar
    Number of imports: 10
    import: org.codehaus.classworlds.Entry@a6c57a42
    import: org.codehaus.classworlds.Entry@12f43f3b
    import: org.codehaus.classworlds.Entry@20025374
    import: org.codehaus.classworlds.Entry@f8e44ca4
    import: org.codehaus.classworlds.Entry@92758522
    import: org.codehaus.classworlds.Entry@ebf2705b
    import: org.codehaus.classworlds.Entry@bb25e54
    import: org.codehaus.classworlds.Entry@bece5185
    import: org.codehaus.classworlds.Entry@3fee8e37
    import: org.codehaus.classworlds.Entry@3fee19d8
    -----------------------------------------------------
    [INFO] ------------------------------------------------------------------------
    [ERROR] BUILD ERROR
    [INFO] ------------------------------------------------------------------------
    [INFO] Internal error in the plugin manager executing goal 'org.apache.torque:torque-maven-plugin:3.3:om': Unable to load the mojo 'org.apache.torque:torque-maven-plugin:3.3:om' in the plugin 'org.apache.torque:torque-maven-plugin'. A required class is missing: org/apache/torque/task/TorqueDataModelTask
    org.apache.torque.task.TorqueDataModelTask
    [INFO] ------------------------------------------------------------------------
    [INFO] For more information, run Maven with the -e switch
    [INFO] ------------------------------------------------------------------------
    [INFO] Total time: 19 seconds
    [INFO] Finished at: Mon Sep 12 13:10:03 UTC 2011
    [INFO] Final Memory: 30M/71M
    [INFO] ------------------------------------------------------------------------
    ---------------------------------------------

    To subscribe to this information via syndicated feeds:
    - RSS: http://vmgump.apache.org/gump/public/turbine-core/turbine-core/rss.xml
    - Atom: http://vmgump.apache.org/gump/public/turbine-core/turbine-core/atom.xml

    ============================== Gump Tracking Only ===
    Produced by Apache Gump(TM) version 2.3.
    Gump Run 05000612092011, vmgump.apache.org:vmgump:05000612092011
    Gump E-mail Identifier (unique within run) #43.

    --
    Apache Gump
    http://gump.apache.org/ [Instance: vmgump]

    ---------------------------------------------------------------------
    To unsubscribe, e-mail: dev-unsubscribe@turbine.apache.org
    For additional commands, e-mail: dev-help@turbine.apache.org
  • Anonymous at Sep 13, 2011 at 12:35 pm
    To whom it may engage...

    This is an automated request, but not an unsolicited one. For
    more information please visit http://gump.apache.org/nagged.html,
    and/or contact the folk at general@gump.apache.org.

    Project turbine-core has an issue affecting its community integration.
    This issue affects 2 projects,
    and has been outstanding for 393 runs.
    The current state of this project is 'Failed', with reason 'Build Failed'.
    For reference only, the following projects are affected by this:
    - turbine-core : A servlet based framework.
    - turbine-core-test : A servlet based framework.


    Full details are available at:
    http://vmgump.apache.org/gump/public/turbine-core/turbine-core/index.html

    That said, some information snippets are provided here.

    The following annotations (debug/informational/warning/error messages) were provided:
    -INFO- Optional dependency commons-fileupload prerequisite failed with reason build failed
    -INFO- Optional dependency httpunit failed with reason build failed
    -DEBUG- (Apache Gump generated) Apache Maven Settings in: /srv/gump/public/workspace/turbine-core/gump_mvn_settings.xml
    -INFO- Failed with reason build failed
    -DEBUG- Maven POM in: /srv/gump/public/workspace/turbine-core/pom.xml
    -INFO- Failed to extract fallback artifacts from Gump Repository



    The following work was performed:
    http://vmgump.apache.org/gump/public/turbine-core/turbine-core/gump_work/build_turbine-core_turbine-core.html
    Work Name: build_turbine-core_turbine-core (Type: Build)
    Work ended in a state of : Failed
    Elapsed: 22 secs
    Command Line: /opt/maven2/bin/mvn --batch-mode -DskipTests=true --settings /srv/gump/public/workspace/turbine-core/gump_mvn_settings.xml package
    [Working Directory: /srv/gump/public/workspace/turbine-core]
    M2_HOME: /opt/maven2
    ---------------------------------------------
    urls[19] = file:/srv/gump/public/workspace/mvnlocalrepo/shared/xml-apis/xml-apis/1.0.b2/xml-apis-1.0.b2.jar
    urls[20] = file:/srv/gump/public/workspace/mvnlocalrepo/shared/commons-configuration/commons-configuration/1.4/commons-configuration-1.4.jar
    urls[21] = file:/srv/gump/public/workspace/mvnlocalrepo/shared/commons-logging/commons-logging-api/1.0.4/commons-logging-api-1.0.4.jar
    urls[22] = file:/srv/gump/public/workspace/mvnlocalrepo/shared/commons-digester/commons-digester/1.8/commons-digester-1.8.jar
    urls[23] = file:/srv/gump/public/workspace/mvnlocalrepo/shared/commons-beanutils/commons-beanutils/1.7.0/commons-beanutils-1.7.0.jar
    urls[24] = file:/srv/gump/public/workspace/mvnlocalrepo/shared/commons-beanutils/commons-beanutils-core/1.7.0/commons-beanutils-core-1.7.0.jar
    urls[25] = file:/srv/gump/public/workspace/mvnlocalrepo/shared/commons-codec/commons-codec/1.3/commons-codec-1.3.jar
    urls[26] = file:/srv/gump/public/workspace/mvnlocalrepo/shared/commons-jxpath/commons-jxpath/1.2/commons-jxpath-1.2.jar
    urls[27] = file:/srv/gump/public/workspace/mvnlocalrepo/shared/xerces/xerces/1.2.3/xerces-1.2.3.jar
    urls[28] = file:/srv/gump/public/workspace/mvnlocalrepo/shared/ant/ant-optional/1.5.1/ant-optional-1.5.1.jar
    urls[29] = file:/srv/gump/public/workspace/mvnlocalrepo/shared/jdom/jdom/b9/jdom-b9.jar
    Number of imports: 10
    import: org.codehaus.classworlds.Entry@a6c57a42
    import: org.codehaus.classworlds.Entry@12f43f3b
    import: org.codehaus.classworlds.Entry@20025374
    import: org.codehaus.classworlds.Entry@f8e44ca4
    import: org.codehaus.classworlds.Entry@92758522
    import: org.codehaus.classworlds.Entry@ebf2705b
    import: org.codehaus.classworlds.Entry@bb25e54
    import: org.codehaus.classworlds.Entry@bece5185
    import: org.codehaus.classworlds.Entry@3fee8e37
    import: org.codehaus.classworlds.Entry@3fee19d8


    this realm = plexus.core
    urls[0] = file:/opt/maven2/lib/maven-2.2.1-uber.jar
    Number of imports: 10
    import: org.codehaus.classworlds.Entry@a6c57a42
    import: org.codehaus.classworlds.Entry@12f43f3b
    import: org.codehaus.classworlds.Entry@20025374
    import: org.codehaus.classworlds.Entry@f8e44ca4
    import: org.codehaus.classworlds.Entry@92758522
    import: org.codehaus.classworlds.Entry@ebf2705b
    import: org.codehaus.classworlds.Entry@bb25e54
    import: org.codehaus.classworlds.Entry@bece5185
    import: org.codehaus.classworlds.Entry@3fee8e37
    import: org.codehaus.classworlds.Entry@3fee19d8
    -----------------------------------------------------
    [INFO] ------------------------------------------------------------------------
    [ERROR] BUILD ERROR
    [INFO] ------------------------------------------------------------------------
    [INFO] Internal error in the plugin manager executing goal 'org.apache.torque:torque-maven-plugin:3.3:om': Unable to load the mojo 'org.apache.torque:torque-maven-plugin:3.3:om' in the plugin 'org.apache.torque:torque-maven-plugin'. A required class is missing: org/apache/torque/task/TorqueDataModelTask
    org.apache.torque.task.TorqueDataModelTask
    [INFO] ------------------------------------------------------------------------
    [INFO] For more information, run Maven with the -e switch
    [INFO] ------------------------------------------------------------------------
    [INFO] Total time: 21 seconds
    [INFO] Finished at: Tue Sep 13 12:34:31 UTC 2011
    [INFO] Final Memory: 30M/71M
    [INFO] ------------------------------------------------------------------------
    ---------------------------------------------

    To subscribe to this information via syndicated feeds:
    - RSS: http://vmgump.apache.org/gump/public/turbine-core/turbine-core/rss.xml
    - Atom: http://vmgump.apache.org/gump/public/turbine-core/turbine-core/atom.xml

    ============================== Gump Tracking Only ===
    Produced by Apache Gump(TM) version 2.3.
    Gump Run 06000613092011, vmgump.apache.org:vmgump:06000613092011
    Gump E-mail Identifier (unique within run) #42.

    --
    Apache Gump
    http://gump.apache.org/ [Instance: vmgump]

    ---------------------------------------------------------------------
    To unsubscribe, e-mail: dev-unsubscribe@turbine.apache.org
    For additional commands, e-mail: dev-help@turbine.apache.org
  • Anonymous at Sep 14, 2011 at 12:36 pm
    To whom it may engage...

    This is an automated request, but not an unsolicited one. For
    more information please visit http://gump.apache.org/nagged.html,
    and/or contact the folk at general@gump.apache.org.

    Project turbine-core has an issue affecting its community integration.
    This issue affects 2 projects,
    and has been outstanding for 395 runs.
    The current state of this project is 'Failed', with reason 'Build Failed'.
    For reference only, the following projects are affected by this:
    - turbine-core : A servlet based framework.
    - turbine-core-test : A servlet based framework.


    Full details are available at:
    http://vmgump.apache.org/gump/public/turbine-core/turbine-core/index.html

    That said, some information snippets are provided here.

    The following annotations (debug/informational/warning/error messages) were provided:
    -INFO- Optional dependency commons-fileupload prerequisite failed with reason build failed
    -INFO- Optional dependency httpunit failed with reason build failed
    -DEBUG- (Apache Gump generated) Apache Maven Settings in: /srv/gump/public/workspace/turbine-core/gump_mvn_settings.xml
    -INFO- Failed with reason build failed
    -DEBUG- Maven POM in: /srv/gump/public/workspace/turbine-core/pom.xml
    -INFO- Failed to extract fallback artifacts from Gump Repository



    The following work was performed:
    http://vmgump.apache.org/gump/public/turbine-core/turbine-core/gump_work/build_turbine-core_turbine-core.html
    Work Name: build_turbine-core_turbine-core (Type: Build)
    Work ended in a state of : Failed
    Elapsed: 19 secs
    Command Line: /opt/maven2/bin/mvn --batch-mode -DskipTests=true --settings /srv/gump/public/workspace/turbine-core/gump_mvn_settings.xml package
    [Working Directory: /srv/gump/public/workspace/turbine-core]
    M2_HOME: /opt/maven2
    ---------------------------------------------
    urls[19] = file:/srv/gump/public/workspace/mvnlocalrepo/shared/xml-apis/xml-apis/1.0.b2/xml-apis-1.0.b2.jar
    urls[20] = file:/srv/gump/public/workspace/mvnlocalrepo/shared/commons-configuration/commons-configuration/1.4/commons-configuration-1.4.jar
    urls[21] = file:/srv/gump/public/workspace/mvnlocalrepo/shared/commons-logging/commons-logging-api/1.0.4/commons-logging-api-1.0.4.jar
    urls[22] = file:/srv/gump/public/workspace/mvnlocalrepo/shared/commons-digester/commons-digester/1.8/commons-digester-1.8.jar
    urls[23] = file:/srv/gump/public/workspace/mvnlocalrepo/shared/commons-beanutils/commons-beanutils/1.7.0/commons-beanutils-1.7.0.jar
    urls[24] = file:/srv/gump/public/workspace/mvnlocalrepo/shared/commons-beanutils/commons-beanutils-core/1.7.0/commons-beanutils-core-1.7.0.jar
    urls[25] = file:/srv/gump/public/workspace/mvnlocalrepo/shared/commons-codec/commons-codec/1.3/commons-codec-1.3.jar
    urls[26] = file:/srv/gump/public/workspace/mvnlocalrepo/shared/commons-jxpath/commons-jxpath/1.2/commons-jxpath-1.2.jar
    urls[27] = file:/srv/gump/public/workspace/mvnlocalrepo/shared/xerces/xerces/1.2.3/xerces-1.2.3.jar
    urls[28] = file:/srv/gump/public/workspace/mvnlocalrepo/shared/ant/ant-optional/1.5.1/ant-optional-1.5.1.jar
    urls[29] = file:/srv/gump/public/workspace/mvnlocalrepo/shared/jdom/jdom/b9/jdom-b9.jar
    Number of imports: 10
    import: org.codehaus.classworlds.Entry@a6c57a42
    import: org.codehaus.classworlds.Entry@12f43f3b
    import: org.codehaus.classworlds.Entry@20025374
    import: org.codehaus.classworlds.Entry@f8e44ca4
    import: org.codehaus.classworlds.Entry@92758522
    import: org.codehaus.classworlds.Entry@ebf2705b
    import: org.codehaus.classworlds.Entry@bb25e54
    import: org.codehaus.classworlds.Entry@bece5185
    import: org.codehaus.classworlds.Entry@3fee8e37
    import: org.codehaus.classworlds.Entry@3fee19d8


    this realm = plexus.core
    urls[0] = file:/opt/maven2/lib/maven-2.2.1-uber.jar
    Number of imports: 10
    import: org.codehaus.classworlds.Entry@a6c57a42
    import: org.codehaus.classworlds.Entry@12f43f3b
    import: org.codehaus.classworlds.Entry@20025374
    import: org.codehaus.classworlds.Entry@f8e44ca4
    import: org.codehaus.classworlds.Entry@92758522
    import: org.codehaus.classworlds.Entry@ebf2705b
    import: org.codehaus.classworlds.Entry@bb25e54
    import: org.codehaus.classworlds.Entry@bece5185
    import: org.codehaus.classworlds.Entry@3fee8e37
    import: org.codehaus.classworlds.Entry@3fee19d8
    -----------------------------------------------------
    [INFO] ------------------------------------------------------------------------
    [ERROR] BUILD ERROR
    [INFO] ------------------------------------------------------------------------
    [INFO] Internal error in the plugin manager executing goal 'org.apache.torque:torque-maven-plugin:3.3:om': Unable to load the mojo 'org.apache.torque:torque-maven-plugin:3.3:om' in the plugin 'org.apache.torque:torque-maven-plugin'. A required class is missing: org/apache/torque/task/TorqueDataModelTask
    org.apache.torque.task.TorqueDataModelTask
    [INFO] ------------------------------------------------------------------------
    [INFO] For more information, run Maven with the -e switch
    [INFO] ------------------------------------------------------------------------
    [INFO] Total time: 18 seconds
    [INFO] Finished at: Wed Sep 14 12:36:13 UTC 2011
    [INFO] Final Memory: 29M/71M
    [INFO] ------------------------------------------------------------------------
    ---------------------------------------------

    To subscribe to this information via syndicated feeds:
    - RSS: http://vmgump.apache.org/gump/public/turbine-core/turbine-core/rss.xml
    - Atom: http://vmgump.apache.org/gump/public/turbine-core/turbine-core/atom.xml

    ============================== Gump Tracking Only ===
    Produced by Apache Gump(TM) version 2.3.
    Gump Run 05000614092011, vmgump.apache.org:vmgump:05000614092011
    Gump E-mail Identifier (unique within run) #42.

    --
    Apache Gump
    http://gump.apache.org/ [Instance: vmgump]

    ---------------------------------------------------------------------
    To unsubscribe, e-mail: dev-unsubscribe@turbine.apache.org
    For additional commands, e-mail: dev-help@turbine.apache.org
  • Anonymous at Sep 15, 2011 at 12:37 pm
    To whom it may engage...

    This is an automated request, but not an unsolicited one. For
    more information please visit http://gump.apache.org/nagged.html,
    and/or contact the folk at general@gump.apache.org.

    Project turbine-core has an issue affecting its community integration.
    This issue affects 2 projects,
    and has been outstanding for 397 runs.
    The current state of this project is 'Failed', with reason 'Build Failed'.
    For reference only, the following projects are affected by this:
    - turbine-core : A servlet based framework.
    - turbine-core-test : A servlet based framework.


    Full details are available at:
    http://vmgump.apache.org/gump/public/turbine-core/turbine-core/index.html

    That said, some information snippets are provided here.

    The following annotations (debug/informational/warning/error messages) were provided:
    -INFO- Optional dependency commons-fileupload prerequisite failed with reason build failed
    -INFO- Optional dependency httpunit failed with reason build failed
    -DEBUG- (Apache Gump generated) Apache Maven Settings in: /srv/gump/public/workspace/turbine-core/gump_mvn_settings.xml
    -INFO- Failed with reason build failed
    -DEBUG- Maven POM in: /srv/gump/public/workspace/turbine-core/pom.xml
    -INFO- Failed to extract fallback artifacts from Gump Repository



    The following work was performed:
    http://vmgump.apache.org/gump/public/turbine-core/turbine-core/gump_work/build_turbine-core_turbine-core.html
    Work Name: build_turbine-core_turbine-core (Type: Build)
    Work ended in a state of : Failed
    Elapsed: 20 secs
    Command Line: /opt/maven2/bin/mvn --batch-mode -DskipTests=true --settings /srv/gump/public/workspace/turbine-core/gump_mvn_settings.xml package
    [Working Directory: /srv/gump/public/workspace/turbine-core]
    M2_HOME: /opt/maven2
    ---------------------------------------------
    urls[19] = file:/srv/gump/public/workspace/mvnlocalrepo/shared/xml-apis/xml-apis/1.0.b2/xml-apis-1.0.b2.jar
    urls[20] = file:/srv/gump/public/workspace/mvnlocalrepo/shared/commons-configuration/commons-configuration/1.4/commons-configuration-1.4.jar
    urls[21] = file:/srv/gump/public/workspace/mvnlocalrepo/shared/commons-logging/commons-logging-api/1.0.4/commons-logging-api-1.0.4.jar
    urls[22] = file:/srv/gump/public/workspace/mvnlocalrepo/shared/commons-digester/commons-digester/1.8/commons-digester-1.8.jar
    urls[23] = file:/srv/gump/public/workspace/mvnlocalrepo/shared/commons-beanutils/commons-beanutils/1.7.0/commons-beanutils-1.7.0.jar
    urls[24] = file:/srv/gump/public/workspace/mvnlocalrepo/shared/commons-beanutils/commons-beanutils-core/1.7.0/commons-beanutils-core-1.7.0.jar
    urls[25] = file:/srv/gump/public/workspace/mvnlocalrepo/shared/commons-codec/commons-codec/1.3/commons-codec-1.3.jar
    urls[26] = file:/srv/gump/public/workspace/mvnlocalrepo/shared/commons-jxpath/commons-jxpath/1.2/commons-jxpath-1.2.jar
    urls[27] = file:/srv/gump/public/workspace/mvnlocalrepo/shared/xerces/xerces/1.2.3/xerces-1.2.3.jar
    urls[28] = file:/srv/gump/public/workspace/mvnlocalrepo/shared/ant/ant-optional/1.5.1/ant-optional-1.5.1.jar
    urls[29] = file:/srv/gump/public/workspace/mvnlocalrepo/shared/jdom/jdom/b9/jdom-b9.jar
    Number of imports: 10
    import: org.codehaus.classworlds.Entry@a6c57a42
    import: org.codehaus.classworlds.Entry@12f43f3b
    import: org.codehaus.classworlds.Entry@20025374
    import: org.codehaus.classworlds.Entry@f8e44ca4
    import: org.codehaus.classworlds.Entry@92758522
    import: org.codehaus.classworlds.Entry@ebf2705b
    import: org.codehaus.classworlds.Entry@bb25e54
    import: org.codehaus.classworlds.Entry@bece5185
    import: org.codehaus.classworlds.Entry@3fee8e37
    import: org.codehaus.classworlds.Entry@3fee19d8


    this realm = plexus.core
    urls[0] = file:/opt/maven2/lib/maven-2.2.1-uber.jar
    Number of imports: 10
    import: org.codehaus.classworlds.Entry@a6c57a42
    import: org.codehaus.classworlds.Entry@12f43f3b
    import: org.codehaus.classworlds.Entry@20025374
    import: org.codehaus.classworlds.Entry@f8e44ca4
    import: org.codehaus.classworlds.Entry@92758522
    import: org.codehaus.classworlds.Entry@ebf2705b
    import: org.codehaus.classworlds.Entry@bb25e54
    import: org.codehaus.classworlds.Entry@bece5185
    import: org.codehaus.classworlds.Entry@3fee8e37
    import: org.codehaus.classworlds.Entry@3fee19d8
    -----------------------------------------------------
    [INFO] ------------------------------------------------------------------------
    [ERROR] BUILD ERROR
    [INFO] ------------------------------------------------------------------------
    [INFO] Internal error in the plugin manager executing goal 'org.apache.torque:torque-maven-plugin:3.3:om': Unable to load the mojo 'org.apache.torque:torque-maven-plugin:3.3:om' in the plugin 'org.apache.torque:torque-maven-plugin'. A required class is missing: org/apache/torque/task/TorqueDataModelTask
    org.apache.torque.task.TorqueDataModelTask
    [INFO] ------------------------------------------------------------------------
    [INFO] For more information, run Maven with the -e switch
    [INFO] ------------------------------------------------------------------------
    [INFO] Total time: 19 seconds
    [INFO] Finished at: Thu Sep 15 12:37:28 UTC 2011
    [INFO] Final Memory: 30M/71M
    [INFO] ------------------------------------------------------------------------
    ---------------------------------------------

    To subscribe to this information via syndicated feeds:
    - RSS: http://vmgump.apache.org/gump/public/turbine-core/turbine-core/rss.xml
    - Atom: http://vmgump.apache.org/gump/public/turbine-core/turbine-core/atom.xml

    ============================== Gump Tracking Only ===
    Produced by Apache Gump(TM) version 2.3.
    Gump Run 05000615092011, vmgump.apache.org:vmgump:05000615092011
    Gump E-mail Identifier (unique within run) #43.

    --
    Apache Gump
    http://gump.apache.org/ [Instance: vmgump]

    ---------------------------------------------------------------------
    To unsubscribe, e-mail: dev-unsubscribe@turbine.apache.org
    For additional commands, e-mail: dev-help@turbine.apache.org
  • Anonymous at Sep 16, 2011 at 12:39 pm
    To whom it may engage...

    This is an automated request, but not an unsolicited one. For
    more information please visit http://gump.apache.org/nagged.html,
    and/or contact the folk at general@gump.apache.org.

    Project turbine-core has an issue affecting its community integration.
    This issue affects 2 projects,
    and has been outstanding for 399 runs.
    The current state of this project is 'Failed', with reason 'Build Failed'.
    For reference only, the following projects are affected by this:
    - turbine-core : A servlet based framework.
    - turbine-core-test : A servlet based framework.


    Full details are available at:
    http://vmgump.apache.org/gump/public/turbine-core/turbine-core/index.html

    That said, some information snippets are provided here.

    The following annotations (debug/informational/warning/error messages) were provided:
    -INFO- Optional dependency commons-fileupload prerequisite failed with reason build failed
    -INFO- Optional dependency httpunit failed with reason build failed
    -DEBUG- (Apache Gump generated) Apache Maven Settings in: /srv/gump/public/workspace/turbine-core/gump_mvn_settings.xml
    -INFO- Failed with reason build failed
    -DEBUG- Maven POM in: /srv/gump/public/workspace/turbine-core/pom.xml
    -INFO- Failed to extract fallback artifacts from Gump Repository



    The following work was performed:
    http://vmgump.apache.org/gump/public/turbine-core/turbine-core/gump_work/build_turbine-core_turbine-core.html
    Work Name: build_turbine-core_turbine-core (Type: Build)
    Work ended in a state of : Failed
    Elapsed: 21 secs
    Command Line: /opt/maven2/bin/mvn --batch-mode -DskipTests=true --settings /srv/gump/public/workspace/turbine-core/gump_mvn_settings.xml package
    [Working Directory: /srv/gump/public/workspace/turbine-core]
    M2_HOME: /opt/maven2
    ---------------------------------------------
    urls[19] = file:/srv/gump/public/workspace/mvnlocalrepo/shared/xml-apis/xml-apis/1.0.b2/xml-apis-1.0.b2.jar
    urls[20] = file:/srv/gump/public/workspace/mvnlocalrepo/shared/commons-configuration/commons-configuration/1.4/commons-configuration-1.4.jar
    urls[21] = file:/srv/gump/public/workspace/mvnlocalrepo/shared/commons-logging/commons-logging-api/1.0.4/commons-logging-api-1.0.4.jar
    urls[22] = file:/srv/gump/public/workspace/mvnlocalrepo/shared/commons-digester/commons-digester/1.8/commons-digester-1.8.jar
    urls[23] = file:/srv/gump/public/workspace/mvnlocalrepo/shared/commons-beanutils/commons-beanutils/1.7.0/commons-beanutils-1.7.0.jar
    urls[24] = file:/srv/gump/public/workspace/mvnlocalrepo/shared/commons-beanutils/commons-beanutils-core/1.7.0/commons-beanutils-core-1.7.0.jar
    urls[25] = file:/srv/gump/public/workspace/mvnlocalrepo/shared/commons-codec/commons-codec/1.3/commons-codec-1.3.jar
    urls[26] = file:/srv/gump/public/workspace/mvnlocalrepo/shared/commons-jxpath/commons-jxpath/1.2/commons-jxpath-1.2.jar
    urls[27] = file:/srv/gump/public/workspace/mvnlocalrepo/shared/xerces/xerces/1.2.3/xerces-1.2.3.jar
    urls[28] = file:/srv/gump/public/workspace/mvnlocalrepo/shared/ant/ant-optional/1.5.1/ant-optional-1.5.1.jar
    urls[29] = file:/srv/gump/public/workspace/mvnlocalrepo/shared/jdom/jdom/b9/jdom-b9.jar
    Number of imports: 10
    import: org.codehaus.classworlds.Entry@a6c57a42
    import: org.codehaus.classworlds.Entry@12f43f3b
    import: org.codehaus.classworlds.Entry@20025374
    import: org.codehaus.classworlds.Entry@f8e44ca4
    import: org.codehaus.classworlds.Entry@92758522
    import: org.codehaus.classworlds.Entry@ebf2705b
    import: org.codehaus.classworlds.Entry@bb25e54
    import: org.codehaus.classworlds.Entry@bece5185
    import: org.codehaus.classworlds.Entry@3fee8e37
    import: org.codehaus.classworlds.Entry@3fee19d8


    this realm = plexus.core
    urls[0] = file:/opt/maven2/lib/maven-2.2.1-uber.jar
    Number of imports: 10
    import: org.codehaus.classworlds.Entry@a6c57a42
    import: org.codehaus.classworlds.Entry@12f43f3b
    import: org.codehaus.classworlds.Entry@20025374
    import: org.codehaus.classworlds.Entry@f8e44ca4
    import: org.codehaus.classworlds.Entry@92758522
    import: org.codehaus.classworlds.Entry@ebf2705b
    import: org.codehaus.classworlds.Entry@bb25e54
    import: org.codehaus.classworlds.Entry@bece5185
    import: org.codehaus.classworlds.Entry@3fee8e37
    import: org.codehaus.classworlds.Entry@3fee19d8
    -----------------------------------------------------
    [INFO] ------------------------------------------------------------------------
    [ERROR] BUILD ERROR
    [INFO] ------------------------------------------------------------------------
    [INFO] Internal error in the plugin manager executing goal 'org.apache.torque:torque-maven-plugin:3.3:om': Unable to load the mojo 'org.apache.torque:torque-maven-plugin:3.3:om' in the plugin 'org.apache.torque:torque-maven-plugin'. A required class is missing: org/apache/torque/task/TorqueDataModelTask
    org.apache.torque.task.TorqueDataModelTask
    [INFO] ------------------------------------------------------------------------
    [INFO] For more information, run Maven with the -e switch
    [INFO] ------------------------------------------------------------------------
    [INFO] Total time: 20 seconds
    [INFO] Finished at: Fri Sep 16 12:39:23 UTC 2011
    [INFO] Final Memory: 30M/71M
    [INFO] ------------------------------------------------------------------------
    ---------------------------------------------

    To subscribe to this information via syndicated feeds:
    - RSS: http://vmgump.apache.org/gump/public/turbine-core/turbine-core/rss.xml
    - Atom: http://vmgump.apache.org/gump/public/turbine-core/turbine-core/atom.xml

    ============================== Gump Tracking Only ===
    Produced by Apache Gump(TM) version 2.3.
    Gump Run 05000616092011, vmgump.apache.org:vmgump:05000616092011
    Gump E-mail Identifier (unique within run) #43.

    --
    Apache Gump
    http://gump.apache.org/ [Instance: vmgump]

    ---------------------------------------------------------------------
    To unsubscribe, e-mail: dev-unsubscribe@turbine.apache.org
    For additional commands, e-mail: dev-help@turbine.apache.org
  • Anonymous at Sep 17, 2011 at 12:34 pm
    To whom it may engage...

    This is an automated request, but not an unsolicited one. For
    more information please visit http://gump.apache.org/nagged.html,
    and/or contact the folk at general@gump.apache.org.

    Project turbine-core has an issue affecting its community integration.
    This issue affects 2 projects,
    and has been outstanding for 401 runs.
    The current state of this project is 'Failed', with reason 'Build Failed'.
    For reference only, the following projects are affected by this:
    - turbine-core : A servlet based framework.
    - turbine-core-test : A servlet based framework.


    Full details are available at:
    http://vmgump.apache.org/gump/public/turbine-core/turbine-core/index.html

    That said, some information snippets are provided here.

    The following annotations (debug/informational/warning/error messages) were provided:
    -INFO- Optional dependency commons-fileupload prerequisite failed with reason build failed
    -INFO- Optional dependency httpunit failed with reason build failed
    -DEBUG- (Apache Gump generated) Apache Maven Settings in: /srv/gump/public/workspace/turbine-core/gump_mvn_settings.xml
    -INFO- Failed with reason build failed
    -DEBUG- Maven POM in: /srv/gump/public/workspace/turbine-core/pom.xml
    -INFO- Failed to extract fallback artifacts from Gump Repository



    The following work was performed:
    http://vmgump.apache.org/gump/public/turbine-core/turbine-core/gump_work/build_turbine-core_turbine-core.html
    Work Name: build_turbine-core_turbine-core (Type: Build)
    Work ended in a state of : Failed
    Elapsed: 19 secs
    Command Line: /opt/maven2/bin/mvn --batch-mode -DskipTests=true --settings /srv/gump/public/workspace/turbine-core/gump_mvn_settings.xml package
    [Working Directory: /srv/gump/public/workspace/turbine-core]
    M2_HOME: /opt/maven2
    ---------------------------------------------
    urls[19] = file:/srv/gump/public/workspace/mvnlocalrepo/shared/xml-apis/xml-apis/1.0.b2/xml-apis-1.0.b2.jar
    urls[20] = file:/srv/gump/public/workspace/mvnlocalrepo/shared/commons-configuration/commons-configuration/1.4/commons-configuration-1.4.jar
    urls[21] = file:/srv/gump/public/workspace/mvnlocalrepo/shared/commons-logging/commons-logging-api/1.0.4/commons-logging-api-1.0.4.jar
    urls[22] = file:/srv/gump/public/workspace/mvnlocalrepo/shared/commons-digester/commons-digester/1.8/commons-digester-1.8.jar
    urls[23] = file:/srv/gump/public/workspace/mvnlocalrepo/shared/commons-beanutils/commons-beanutils/1.7.0/commons-beanutils-1.7.0.jar
    urls[24] = file:/srv/gump/public/workspace/mvnlocalrepo/shared/commons-beanutils/commons-beanutils-core/1.7.0/commons-beanutils-core-1.7.0.jar
    urls[25] = file:/srv/gump/public/workspace/mvnlocalrepo/shared/commons-codec/commons-codec/1.3/commons-codec-1.3.jar
    urls[26] = file:/srv/gump/public/workspace/mvnlocalrepo/shared/commons-jxpath/commons-jxpath/1.2/commons-jxpath-1.2.jar
    urls[27] = file:/srv/gump/public/workspace/mvnlocalrepo/shared/xerces/xerces/1.2.3/xerces-1.2.3.jar
    urls[28] = file:/srv/gump/public/workspace/mvnlocalrepo/shared/ant/ant-optional/1.5.1/ant-optional-1.5.1.jar
    urls[29] = file:/srv/gump/public/workspace/mvnlocalrepo/shared/jdom/jdom/b9/jdom-b9.jar
    Number of imports: 10
    import: org.codehaus.classworlds.Entry@a6c57a42
    import: org.codehaus.classworlds.Entry@12f43f3b
    import: org.codehaus.classworlds.Entry@20025374
    import: org.codehaus.classworlds.Entry@f8e44ca4
    import: org.codehaus.classworlds.Entry@92758522
    import: org.codehaus.classworlds.Entry@ebf2705b
    import: org.codehaus.classworlds.Entry@bb25e54
    import: org.codehaus.classworlds.Entry@bece5185
    import: org.codehaus.classworlds.Entry@3fee8e37
    import: org.codehaus.classworlds.Entry@3fee19d8


    this realm = plexus.core
    urls[0] = file:/opt/maven2/lib/maven-2.2.1-uber.jar
    Number of imports: 10
    import: org.codehaus.classworlds.Entry@a6c57a42
    import: org.codehaus.classworlds.Entry@12f43f3b
    import: org.codehaus.classworlds.Entry@20025374
    import: org.codehaus.classworlds.Entry@f8e44ca4
    import: org.codehaus.classworlds.Entry@92758522
    import: org.codehaus.classworlds.Entry@ebf2705b
    import: org.codehaus.classworlds.Entry@bb25e54
    import: org.codehaus.classworlds.Entry@bece5185
    import: org.codehaus.classworlds.Entry@3fee8e37
    import: org.codehaus.classworlds.Entry@3fee19d8
    -----------------------------------------------------
    [INFO] ------------------------------------------------------------------------
    [ERROR] BUILD ERROR
    [INFO] ------------------------------------------------------------------------
    [INFO] Internal error in the plugin manager executing goal 'org.apache.torque:torque-maven-plugin:3.3:om': Unable to load the mojo 'org.apache.torque:torque-maven-plugin:3.3:om' in the plugin 'org.apache.torque:torque-maven-plugin'. A required class is missing: org/apache/torque/task/TorqueDataModelTask
    org.apache.torque.task.TorqueDataModelTask
    [INFO] ------------------------------------------------------------------------
    [INFO] For more information, run Maven with the -e switch
    [INFO] ------------------------------------------------------------------------
    [INFO] Total time: 18 seconds
    [INFO] Finished at: Sat Sep 17 12:34:00 UTC 2011
    [INFO] Final Memory: 30M/71M
    [INFO] ------------------------------------------------------------------------
    ---------------------------------------------

    To subscribe to this information via syndicated feeds:
    - RSS: http://vmgump.apache.org/gump/public/turbine-core/turbine-core/rss.xml
    - Atom: http://vmgump.apache.org/gump/public/turbine-core/turbine-core/atom.xml

    ============================== Gump Tracking Only ===
    Produced by Apache Gump(TM) version 2.3.
    Gump Run 06000617092011, vmgump.apache.org:vmgump:06000617092011
    Gump E-mail Identifier (unique within run) #43.

    --
    Apache Gump
    http://gump.apache.org/ [Instance: vmgump]

    ---------------------------------------------------------------------
    To unsubscribe, e-mail: dev-unsubscribe@turbine.apache.org
    For additional commands, e-mail: dev-help@turbine.apache.org
  • Anonymous at Sep 18, 2011 at 1:31 pm
    To whom it may engage...

    This is an automated request, but not an unsolicited one. For
    more information please visit http://gump.apache.org/nagged.html,
    and/or contact the folk at general@gump.apache.org.

    Project turbine-core has an issue affecting its community integration.
    This issue affects 2 projects,
    and has been outstanding for 403 runs.
    The current state of this project is 'Failed', with reason 'Build Failed'.
    For reference only, the following projects are affected by this:
    - turbine-core : A servlet based framework.
    - turbine-core-test : A servlet based framework.


    Full details are available at:
    http://vmgump.apache.org/gump/public/turbine-core/turbine-core/index.html

    That said, some information snippets are provided here.

    The following annotations (debug/informational/warning/error messages) were provided:
    -INFO- Optional dependency commons-fileupload prerequisite failed with reason build failed
    -INFO- Optional dependency httpunit failed with reason build failed
    -DEBUG- (Apache Gump generated) Apache Maven Settings in: /srv/gump/public/workspace/turbine-core/gump_mvn_settings.xml
    -INFO- Failed with reason build failed
    -DEBUG- Maven POM in: /srv/gump/public/workspace/turbine-core/pom.xml
    -INFO- Failed to extract fallback artifacts from Gump Repository



    The following work was performed:
    http://vmgump.apache.org/gump/public/turbine-core/turbine-core/gump_work/build_turbine-core_turbine-core.html
    Work Name: build_turbine-core_turbine-core (Type: Build)
    Work ended in a state of : Failed
    Elapsed: 20 secs
    Command Line: /opt/maven2/bin/mvn --batch-mode -DskipTests=true --settings /srv/gump/public/workspace/turbine-core/gump_mvn_settings.xml package
    [Working Directory: /srv/gump/public/workspace/turbine-core]
    M2_HOME: /opt/maven2
    ---------------------------------------------
    urls[19] = file:/srv/gump/public/workspace/mvnlocalrepo/shared/xml-apis/xml-apis/1.0.b2/xml-apis-1.0.b2.jar
    urls[20] = file:/srv/gump/public/workspace/mvnlocalrepo/shared/commons-configuration/commons-configuration/1.4/commons-configuration-1.4.jar
    urls[21] = file:/srv/gump/public/workspace/mvnlocalrepo/shared/commons-logging/commons-logging-api/1.0.4/commons-logging-api-1.0.4.jar
    urls[22] = file:/srv/gump/public/workspace/mvnlocalrepo/shared/commons-digester/commons-digester/1.8/commons-digester-1.8.jar
    urls[23] = file:/srv/gump/public/workspace/mvnlocalrepo/shared/commons-beanutils/commons-beanutils/1.7.0/commons-beanutils-1.7.0.jar
    urls[24] = file:/srv/gump/public/workspace/mvnlocalrepo/shared/commons-beanutils/commons-beanutils-core/1.7.0/commons-beanutils-core-1.7.0.jar
    urls[25] = file:/srv/gump/public/workspace/mvnlocalrepo/shared/commons-codec/commons-codec/1.3/commons-codec-1.3.jar
    urls[26] = file:/srv/gump/public/workspace/mvnlocalrepo/shared/commons-jxpath/commons-jxpath/1.2/commons-jxpath-1.2.jar
    urls[27] = file:/srv/gump/public/workspace/mvnlocalrepo/shared/xerces/xerces/1.2.3/xerces-1.2.3.jar
    urls[28] = file:/srv/gump/public/workspace/mvnlocalrepo/shared/ant/ant-optional/1.5.1/ant-optional-1.5.1.jar
    urls[29] = file:/srv/gump/public/workspace/mvnlocalrepo/shared/jdom/jdom/b9/jdom-b9.jar
    Number of imports: 10
    import: org.codehaus.classworlds.Entry@a6c57a42
    import: org.codehaus.classworlds.Entry@12f43f3b
    import: org.codehaus.classworlds.Entry@20025374
    import: org.codehaus.classworlds.Entry@f8e44ca4
    import: org.codehaus.classworlds.Entry@92758522
    import: org.codehaus.classworlds.Entry@ebf2705b
    import: org.codehaus.classworlds.Entry@bb25e54
    import: org.codehaus.classworlds.Entry@bece5185
    import: org.codehaus.classworlds.Entry@3fee8e37
    import: org.codehaus.classworlds.Entry@3fee19d8


    this realm = plexus.core
    urls[0] = file:/opt/maven2/lib/maven-2.2.1-uber.jar
    Number of imports: 10
    import: org.codehaus.classworlds.Entry@a6c57a42
    import: org.codehaus.classworlds.Entry@12f43f3b
    import: org.codehaus.classworlds.Entry@20025374
    import: org.codehaus.classworlds.Entry@f8e44ca4
    import: org.codehaus.classworlds.Entry@92758522
    import: org.codehaus.classworlds.Entry@ebf2705b
    import: org.codehaus.classworlds.Entry@bb25e54
    import: org.codehaus.classworlds.Entry@bece5185
    import: org.codehaus.classworlds.Entry@3fee8e37
    import: org.codehaus.classworlds.Entry@3fee19d8
    -----------------------------------------------------
    [INFO] ------------------------------------------------------------------------
    [ERROR] BUILD ERROR
    [INFO] ------------------------------------------------------------------------
    [INFO] Internal error in the plugin manager executing goal 'org.apache.torque:torque-maven-plugin:3.3:om': Unable to load the mojo 'org.apache.torque:torque-maven-plugin:3.3:om' in the plugin 'org.apache.torque:torque-maven-plugin'. A required class is missing: org/apache/torque/task/TorqueDataModelTask
    org.apache.torque.task.TorqueDataModelTask
    [INFO] ------------------------------------------------------------------------
    [INFO] For more information, run Maven with the -e switch
    [INFO] ------------------------------------------------------------------------
    [INFO] Total time: 19 seconds
    [INFO] Finished at: Sun Sep 18 13:30:48 UTC 2011
    [INFO] Final Memory: 29M/71M
    [INFO] ------------------------------------------------------------------------
    ---------------------------------------------

    To subscribe to this information via syndicated feeds:
    - RSS: http://vmgump.apache.org/gump/public/turbine-core/turbine-core/rss.xml
    - Atom: http://vmgump.apache.org/gump/public/turbine-core/turbine-core/atom.xml

    ============================== Gump Tracking Only ===
    Produced by Apache Gump(TM) version 2.3.
    Gump Run 05000618092011, vmgump.apache.org:vmgump:05000618092011
    Gump E-mail Identifier (unique within run) #43.

    --
    Apache Gump
    http://gump.apache.org/ [Instance: vmgump]

    ---------------------------------------------------------------------
    To unsubscribe, e-mail: dev-unsubscribe@turbine.apache.org
    For additional commands, e-mail: dev-help@turbine.apache.org
  • Anonymous at Sep 19, 2011 at 12:35 pm
    To whom it may engage...

    This is an automated request, but not an unsolicited one. For
    more information please visit http://gump.apache.org/nagged.html,
    and/or contact the folk at general@gump.apache.org.

    Project turbine-core has an issue affecting its community integration.
    This issue affects 2 projects,
    and has been outstanding for 405 runs.
    The current state of this project is 'Failed', with reason 'Build Failed'.
    For reference only, the following projects are affected by this:
    - turbine-core : A servlet based framework.
    - turbine-core-test : A servlet based framework.


    Full details are available at:
    http://vmgump.apache.org/gump/public/turbine-core/turbine-core/index.html

    That said, some information snippets are provided here.

    The following annotations (debug/informational/warning/error messages) were provided:
    -INFO- Optional dependency commons-fileupload prerequisite failed with reason build failed
    -INFO- Optional dependency httpunit failed with reason build failed
    -DEBUG- (Apache Gump generated) Apache Maven Settings in: /srv/gump/public/workspace/turbine-core/gump_mvn_settings.xml
    -INFO- Failed with reason build failed
    -DEBUG- Maven POM in: /srv/gump/public/workspace/turbine-core/pom.xml
    -INFO- Failed to extract fallback artifacts from Gump Repository



    The following work was performed:
    http://vmgump.apache.org/gump/public/turbine-core/turbine-core/gump_work/build_turbine-core_turbine-core.html
    Work Name: build_turbine-core_turbine-core (Type: Build)
    Work ended in a state of : Failed
    Elapsed: 20 secs
    Command Line: /opt/maven2/bin/mvn --batch-mode -DskipTests=true --settings /srv/gump/public/workspace/turbine-core/gump_mvn_settings.xml package
    [Working Directory: /srv/gump/public/workspace/turbine-core]
    M2_HOME: /opt/maven2
    ---------------------------------------------
    urls[19] = file:/srv/gump/public/workspace/mvnlocalrepo/shared/xml-apis/xml-apis/1.0.b2/xml-apis-1.0.b2.jar
    urls[20] = file:/srv/gump/public/workspace/mvnlocalrepo/shared/commons-configuration/commons-configuration/1.4/commons-configuration-1.4.jar
    urls[21] = file:/srv/gump/public/workspace/mvnlocalrepo/shared/commons-logging/commons-logging-api/1.0.4/commons-logging-api-1.0.4.jar
    urls[22] = file:/srv/gump/public/workspace/mvnlocalrepo/shared/commons-digester/commons-digester/1.8/commons-digester-1.8.jar
    urls[23] = file:/srv/gump/public/workspace/mvnlocalrepo/shared/commons-beanutils/commons-beanutils/1.7.0/commons-beanutils-1.7.0.jar
    urls[24] = file:/srv/gump/public/workspace/mvnlocalrepo/shared/commons-beanutils/commons-beanutils-core/1.7.0/commons-beanutils-core-1.7.0.jar
    urls[25] = file:/srv/gump/public/workspace/mvnlocalrepo/shared/commons-codec/commons-codec/1.3/commons-codec-1.3.jar
    urls[26] = file:/srv/gump/public/workspace/mvnlocalrepo/shared/commons-jxpath/commons-jxpath/1.2/commons-jxpath-1.2.jar
    urls[27] = file:/srv/gump/public/workspace/mvnlocalrepo/shared/xerces/xerces/1.2.3/xerces-1.2.3.jar
    urls[28] = file:/srv/gump/public/workspace/mvnlocalrepo/shared/ant/ant-optional/1.5.1/ant-optional-1.5.1.jar
    urls[29] = file:/srv/gump/public/workspace/mvnlocalrepo/shared/jdom/jdom/b9/jdom-b9.jar
    Number of imports: 10
    import: org.codehaus.classworlds.Entry@a6c57a42
    import: org.codehaus.classworlds.Entry@12f43f3b
    import: org.codehaus.classworlds.Entry@20025374
    import: org.codehaus.classworlds.Entry@f8e44ca4
    import: org.codehaus.classworlds.Entry@92758522
    import: org.codehaus.classworlds.Entry@ebf2705b
    import: org.codehaus.classworlds.Entry@bb25e54
    import: org.codehaus.classworlds.Entry@bece5185
    import: org.codehaus.classworlds.Entry@3fee8e37
    import: org.codehaus.classworlds.Entry@3fee19d8


    this realm = plexus.core
    urls[0] = file:/opt/maven2/lib/maven-2.2.1-uber.jar
    Number of imports: 10
    import: org.codehaus.classworlds.Entry@a6c57a42
    import: org.codehaus.classworlds.Entry@12f43f3b
    import: org.codehaus.classworlds.Entry@20025374
    import: org.codehaus.classworlds.Entry@f8e44ca4
    import: org.codehaus.classworlds.Entry@92758522
    import: org.codehaus.classworlds.Entry@ebf2705b
    import: org.codehaus.classworlds.Entry@bb25e54
    import: org.codehaus.classworlds.Entry@bece5185
    import: org.codehaus.classworlds.Entry@3fee8e37
    import: org.codehaus.classworlds.Entry@3fee19d8
    -----------------------------------------------------
    [INFO] ------------------------------------------------------------------------
    [ERROR] BUILD ERROR
    [INFO] ------------------------------------------------------------------------
    [INFO] Internal error in the plugin manager executing goal 'org.apache.torque:torque-maven-plugin:3.3:om': Unable to load the mojo 'org.apache.torque:torque-maven-plugin:3.3:om' in the plugin 'org.apache.torque:torque-maven-plugin'. A required class is missing: org/apache/torque/task/TorqueDataModelTask
    org.apache.torque.task.TorqueDataModelTask
    [INFO] ------------------------------------------------------------------------
    [INFO] For more information, run Maven with the -e switch
    [INFO] ------------------------------------------------------------------------
    [INFO] Total time: 19 seconds
    [INFO] Finished at: Mon Sep 19 12:35:26 UTC 2011
    [INFO] Final Memory: 29M/71M
    [INFO] ------------------------------------------------------------------------
    ---------------------------------------------

    To subscribe to this information via syndicated feeds:
    - RSS: http://vmgump.apache.org/gump/public/turbine-core/turbine-core/rss.xml
    - Atom: http://vmgump.apache.org/gump/public/turbine-core/turbine-core/atom.xml

    ============================== Gump Tracking Only ===
    Produced by Apache Gump(TM) version 2.3.
    Gump Run 05000619092011, vmgump.apache.org:vmgump:05000619092011
    Gump E-mail Identifier (unique within run) #42.

    --
    Apache Gump
    http://gump.apache.org/ [Instance: vmgump]

    ---------------------------------------------------------------------
    To unsubscribe, e-mail: dev-unsubscribe@turbine.apache.org
    For additional commands, e-mail: dev-help@turbine.apache.org
  • Anonymous at Sep 20, 2011 at 12:37 pm
    To whom it may engage...

    This is an automated request, but not an unsolicited one. For
    more information please visit http://gump.apache.org/nagged.html,
    and/or contact the folk at general@gump.apache.org.

    Project turbine-core has an issue affecting its community integration.
    This issue affects 2 projects,
    and has been outstanding for 407 runs.
    The current state of this project is 'Failed', with reason 'Build Failed'.
    For reference only, the following projects are affected by this:
    - turbine-core : A servlet based framework.
    - turbine-core-test : A servlet based framework.


    Full details are available at:
    http://vmgump.apache.org/gump/public/turbine-core/turbine-core/index.html

    That said, some information snippets are provided here.

    The following annotations (debug/informational/warning/error messages) were provided:
    -INFO- Optional dependency commons-fileupload prerequisite failed with reason build failed
    -INFO- Optional dependency httpunit failed with reason build failed
    -DEBUG- (Apache Gump generated) Apache Maven Settings in: /srv/gump/public/workspace/turbine-core/gump_mvn_settings.xml
    -INFO- Failed with reason build failed
    -DEBUG- Maven POM in: /srv/gump/public/workspace/turbine-core/pom.xml
    -INFO- Failed to extract fallback artifacts from Gump Repository



    The following work was performed:
    http://vmgump.apache.org/gump/public/turbine-core/turbine-core/gump_work/build_turbine-core_turbine-core.html
    Work Name: build_turbine-core_turbine-core (Type: Build)
    Work ended in a state of : Failed
    Elapsed: 22 secs
    Command Line: /opt/maven2/bin/mvn --batch-mode -DskipTests=true --settings /srv/gump/public/workspace/turbine-core/gump_mvn_settings.xml package
    [Working Directory: /srv/gump/public/workspace/turbine-core]
    M2_HOME: /opt/maven2
    ---------------------------------------------
    urls[19] = file:/srv/gump/public/workspace/mvnlocalrepo/shared/xml-apis/xml-apis/1.0.b2/xml-apis-1.0.b2.jar
    urls[20] = file:/srv/gump/public/workspace/mvnlocalrepo/shared/commons-configuration/commons-configuration/1.4/commons-configuration-1.4.jar
    urls[21] = file:/srv/gump/public/workspace/mvnlocalrepo/shared/commons-logging/commons-logging-api/1.0.4/commons-logging-api-1.0.4.jar
    urls[22] = file:/srv/gump/public/workspace/mvnlocalrepo/shared/commons-digester/commons-digester/1.8/commons-digester-1.8.jar
    urls[23] = file:/srv/gump/public/workspace/mvnlocalrepo/shared/commons-beanutils/commons-beanutils/1.7.0/commons-beanutils-1.7.0.jar
    urls[24] = file:/srv/gump/public/workspace/mvnlocalrepo/shared/commons-beanutils/commons-beanutils-core/1.7.0/commons-beanutils-core-1.7.0.jar
    urls[25] = file:/srv/gump/public/workspace/mvnlocalrepo/shared/commons-codec/commons-codec/1.3/commons-codec-1.3.jar
    urls[26] = file:/srv/gump/public/workspace/mvnlocalrepo/shared/commons-jxpath/commons-jxpath/1.2/commons-jxpath-1.2.jar
    urls[27] = file:/srv/gump/public/workspace/mvnlocalrepo/shared/xerces/xerces/1.2.3/xerces-1.2.3.jar
    urls[28] = file:/srv/gump/public/workspace/mvnlocalrepo/shared/ant/ant-optional/1.5.1/ant-optional-1.5.1.jar
    urls[29] = file:/srv/gump/public/workspace/mvnlocalrepo/shared/jdom/jdom/b9/jdom-b9.jar
    Number of imports: 10
    import: org.codehaus.classworlds.Entry@a6c57a42
    import: org.codehaus.classworlds.Entry@12f43f3b
    import: org.codehaus.classworlds.Entry@20025374
    import: org.codehaus.classworlds.Entry@f8e44ca4
    import: org.codehaus.classworlds.Entry@92758522
    import: org.codehaus.classworlds.Entry@ebf2705b
    import: org.codehaus.classworlds.Entry@bb25e54
    import: org.codehaus.classworlds.Entry@bece5185
    import: org.codehaus.classworlds.Entry@3fee8e37
    import: org.codehaus.classworlds.Entry@3fee19d8


    this realm = plexus.core
    urls[0] = file:/opt/maven2/lib/maven-2.2.1-uber.jar
    Number of imports: 10
    import: org.codehaus.classworlds.Entry@a6c57a42
    import: org.codehaus.classworlds.Entry@12f43f3b
    import: org.codehaus.classworlds.Entry@20025374
    import: org.codehaus.classworlds.Entry@f8e44ca4
    import: org.codehaus.classworlds.Entry@92758522
    import: org.codehaus.classworlds.Entry@ebf2705b
    import: org.codehaus.classworlds.Entry@bb25e54
    import: org.codehaus.classworlds.Entry@bece5185
    import: org.codehaus.classworlds.Entry@3fee8e37
    import: org.codehaus.classworlds.Entry@3fee19d8
    -----------------------------------------------------
    [INFO] ------------------------------------------------------------------------
    [ERROR] BUILD ERROR
    [INFO] ------------------------------------------------------------------------
    [INFO] Internal error in the plugin manager executing goal 'org.apache.torque:torque-maven-plugin:3.3:om': Unable to load the mojo 'org.apache.torque:torque-maven-plugin:3.3:om' in the plugin 'org.apache.torque:torque-maven-plugin'. A required class is missing: org/apache/torque/task/TorqueDataModelTask
    org.apache.torque.task.TorqueDataModelTask
    [INFO] ------------------------------------------------------------------------
    [INFO] For more information, run Maven with the -e switch
    [INFO] ------------------------------------------------------------------------
    [INFO] Total time: 21 seconds
    [INFO] Finished at: Tue Sep 20 12:37:32 UTC 2011
    [INFO] Final Memory: 29M/71M
    [INFO] ------------------------------------------------------------------------
    ---------------------------------------------

    To subscribe to this information via syndicated feeds:
    - RSS: http://vmgump.apache.org/gump/public/turbine-core/turbine-core/rss.xml
    - Atom: http://vmgump.apache.org/gump/public/turbine-core/turbine-core/atom.xml

    ============================== Gump Tracking Only ===
    Produced by Apache Gump(TM) version 2.3.
    Gump Run 05000620092011, vmgump.apache.org:vmgump:05000620092011
    Gump E-mail Identifier (unique within run) #43.

    --
    Apache Gump
    http://gump.apache.org/ [Instance: vmgump]

    ---------------------------------------------------------------------
    To unsubscribe, e-mail: dev-unsubscribe@turbine.apache.org
    For additional commands, e-mail: dev-help@turbine.apache.org
  • Anonymous at Sep 21, 2011 at 12:31 pm
    To whom it may engage...

    This is an automated request, but not an unsolicited one. For
    more information please visit http://gump.apache.org/nagged.html,
    and/or contact the folk at general@gump.apache.org.

    Project turbine-core has an issue affecting its community integration.
    This issue affects 2 projects,
    and has been outstanding for 409 runs.
    The current state of this project is 'Failed', with reason 'Build Failed'.
    For reference only, the following projects are affected by this:
    - turbine-core : A servlet based framework.
    - turbine-core-test : A servlet based framework.


    Full details are available at:
    http://vmgump.apache.org/gump/public/turbine-core/turbine-core/index.html

    That said, some information snippets are provided here.

    The following annotations (debug/informational/warning/error messages) were provided:
    -INFO- Optional dependency mx4j-tools prerequisite failed with reason build failed
    -INFO- Optional dependency mx4j prerequisite failed with reason build failed
    -INFO- Optional dependency commons-fileupload prerequisite failed with reason build failed
    -INFO- Optional dependency httpunit failed with reason build failed
    -DEBUG- (Apache Gump generated) Apache Maven Settings in: /srv/gump/public/workspace/turbine-core/gump_mvn_settings.xml
    -INFO- Failed with reason build failed
    -DEBUG- Maven POM in: /srv/gump/public/workspace/turbine-core/pom.xml
    -INFO- Failed to extract fallback artifacts from Gump Repository



    The following work was performed:
    http://vmgump.apache.org/gump/public/turbine-core/turbine-core/gump_work/build_turbine-core_turbine-core.html
    Work Name: build_turbine-core_turbine-core (Type: Build)
    Work ended in a state of : Failed
    Elapsed: 22 secs
    Command Line: /opt/maven2/bin/mvn --batch-mode -DskipTests=true --settings /srv/gump/public/workspace/turbine-core/gump_mvn_settings.xml package
    [Working Directory: /srv/gump/public/workspace/turbine-core]
    M2_HOME: /opt/maven2
    ---------------------------------------------
    urls[19] = file:/srv/gump/public/workspace/mvnlocalrepo/shared/xml-apis/xml-apis/1.0.b2/xml-apis-1.0.b2.jar
    urls[20] = file:/srv/gump/public/workspace/mvnlocalrepo/shared/commons-configuration/commons-configuration/1.4/commons-configuration-1.4.jar
    urls[21] = file:/srv/gump/public/workspace/mvnlocalrepo/shared/commons-logging/commons-logging-api/1.0.4/commons-logging-api-1.0.4.jar
    urls[22] = file:/srv/gump/public/workspace/mvnlocalrepo/shared/commons-digester/commons-digester/1.8/commons-digester-1.8.jar
    urls[23] = file:/srv/gump/public/workspace/mvnlocalrepo/shared/commons-beanutils/commons-beanutils/1.7.0/commons-beanutils-1.7.0.jar
    urls[24] = file:/srv/gump/public/workspace/mvnlocalrepo/shared/commons-beanutils/commons-beanutils-core/1.7.0/commons-beanutils-core-1.7.0.jar
    urls[25] = file:/srv/gump/public/workspace/mvnlocalrepo/shared/commons-codec/commons-codec/1.3/commons-codec-1.3.jar
    urls[26] = file:/srv/gump/public/workspace/mvnlocalrepo/shared/commons-jxpath/commons-jxpath/1.2/commons-jxpath-1.2.jar
    urls[27] = file:/srv/gump/public/workspace/mvnlocalrepo/shared/xerces/xerces/1.2.3/xerces-1.2.3.jar
    urls[28] = file:/srv/gump/public/workspace/mvnlocalrepo/shared/ant/ant-optional/1.5.1/ant-optional-1.5.1.jar
    urls[29] = file:/srv/gump/public/workspace/mvnlocalrepo/shared/jdom/jdom/b9/jdom-b9.jar
    Number of imports: 10
    import: org.codehaus.classworlds.Entry@a6c57a42
    import: org.codehaus.classworlds.Entry@12f43f3b
    import: org.codehaus.classworlds.Entry@20025374
    import: org.codehaus.classworlds.Entry@f8e44ca4
    import: org.codehaus.classworlds.Entry@92758522
    import: org.codehaus.classworlds.Entry@ebf2705b
    import: org.codehaus.classworlds.Entry@bb25e54
    import: org.codehaus.classworlds.Entry@bece5185
    import: org.codehaus.classworlds.Entry@3fee8e37
    import: org.codehaus.classworlds.Entry@3fee19d8


    this realm = plexus.core
    urls[0] = file:/opt/maven2/lib/maven-2.2.1-uber.jar
    Number of imports: 10
    import: org.codehaus.classworlds.Entry@a6c57a42
    import: org.codehaus.classworlds.Entry@12f43f3b
    import: org.codehaus.classworlds.Entry@20025374
    import: org.codehaus.classworlds.Entry@f8e44ca4
    import: org.codehaus.classworlds.Entry@92758522
    import: org.codehaus.classworlds.Entry@ebf2705b
    import: org.codehaus.classworlds.Entry@bb25e54
    import: org.codehaus.classworlds.Entry@bece5185
    import: org.codehaus.classworlds.Entry@3fee8e37
    import: org.codehaus.classworlds.Entry@3fee19d8
    -----------------------------------------------------
    [INFO] ------------------------------------------------------------------------
    [ERROR] BUILD ERROR
    [INFO] ------------------------------------------------------------------------
    [INFO] Internal error in the plugin manager executing goal 'org.apache.torque:torque-maven-plugin:3.3:om': Unable to load the mojo 'org.apache.torque:torque-maven-plugin:3.3:om' in the plugin 'org.apache.torque:torque-maven-plugin'. A required class is missing: org/apache/torque/task/TorqueDataModelTask
    org.apache.torque.task.TorqueDataModelTask
    [INFO] ------------------------------------------------------------------------
    [INFO] For more information, run Maven with the -e switch
    [INFO] ------------------------------------------------------------------------
    [INFO] Total time: 21 seconds
    [INFO] Finished at: Wed Sep 21 12:31:05 UTC 2011
    [INFO] Final Memory: 30M/71M
    [INFO] ------------------------------------------------------------------------
    ---------------------------------------------

    To subscribe to this information via syndicated feeds:
    - RSS: http://vmgump.apache.org/gump/public/turbine-core/turbine-core/rss.xml
    - Atom: http://vmgump.apache.org/gump/public/turbine-core/turbine-core/atom.xml

    ============================== Gump Tracking Only ===
    Produced by Apache Gump(TM) version 2.3.
    Gump Run 05000621092011, vmgump.apache.org:vmgump:05000621092011
    Gump E-mail Identifier (unique within run) #41.

    --
    Apache Gump
    http://gump.apache.org/ [Instance: vmgump]

    ---------------------------------------------------------------------
    To unsubscribe, e-mail: dev-unsubscribe@turbine.apache.org
    For additional commands, e-mail: dev-help@turbine.apache.org
  • Anonymous at Sep 22, 2011 at 12:41 pm
    To whom it may engage...

    This is an automated request, but not an unsolicited one. For
    more information please visit http://gump.apache.org/nagged.html,
    and/or contact the folk at general@gump.apache.org.

    Project turbine-core has an issue affecting its community integration.
    This issue affects 2 projects,
    and has been outstanding for 411 runs.
    The current state of this project is 'Failed', with reason 'Build Failed'.
    For reference only, the following projects are affected by this:
    - turbine-core : A servlet based framework.
    - turbine-core-test : A servlet based framework.


    Full details are available at:
    http://vmgump.apache.org/gump/public/turbine-core/turbine-core/index.html

    That said, some information snippets are provided here.

    The following annotations (debug/informational/warning/error messages) were provided:
    -INFO- Optional dependency commons-fileupload prerequisite failed with reason build failed
    -INFO- Optional dependency httpunit failed with reason build failed
    -DEBUG- (Apache Gump generated) Apache Maven Settings in: /srv/gump/public/workspace/turbine-core/gump_mvn_settings.xml
    -INFO- Failed with reason build failed
    -DEBUG- Maven POM in: /srv/gump/public/workspace/turbine-core/pom.xml
    -INFO- Failed to extract fallback artifacts from Gump Repository



    The following work was performed:
    http://vmgump.apache.org/gump/public/turbine-core/turbine-core/gump_work/build_turbine-core_turbine-core.html
    Work Name: build_turbine-core_turbine-core (Type: Build)
    Work ended in a state of : Failed
    Elapsed: 20 secs
    Command Line: /opt/maven2/bin/mvn --batch-mode -DskipTests=true --settings /srv/gump/public/workspace/turbine-core/gump_mvn_settings.xml package
    [Working Directory: /srv/gump/public/workspace/turbine-core]
    M2_HOME: /opt/maven2
    ---------------------------------------------
    urls[19] = file:/srv/gump/public/workspace/mvnlocalrepo/shared/xml-apis/xml-apis/1.0.b2/xml-apis-1.0.b2.jar
    urls[20] = file:/srv/gump/public/workspace/mvnlocalrepo/shared/commons-configuration/commons-configuration/1.4/commons-configuration-1.4.jar
    urls[21] = file:/srv/gump/public/workspace/mvnlocalrepo/shared/commons-logging/commons-logging-api/1.0.4/commons-logging-api-1.0.4.jar
    urls[22] = file:/srv/gump/public/workspace/mvnlocalrepo/shared/commons-digester/commons-digester/1.8/commons-digester-1.8.jar
    urls[23] = file:/srv/gump/public/workspace/mvnlocalrepo/shared/commons-beanutils/commons-beanutils/1.7.0/commons-beanutils-1.7.0.jar
    urls[24] = file:/srv/gump/public/workspace/mvnlocalrepo/shared/commons-beanutils/commons-beanutils-core/1.7.0/commons-beanutils-core-1.7.0.jar
    urls[25] = file:/srv/gump/public/workspace/mvnlocalrepo/shared/commons-codec/commons-codec/1.3/commons-codec-1.3.jar
    urls[26] = file:/srv/gump/public/workspace/mvnlocalrepo/shared/commons-jxpath/commons-jxpath/1.2/commons-jxpath-1.2.jar
    urls[27] = file:/srv/gump/public/workspace/mvnlocalrepo/shared/xerces/xerces/1.2.3/xerces-1.2.3.jar
    urls[28] = file:/srv/gump/public/workspace/mvnlocalrepo/shared/ant/ant-optional/1.5.1/ant-optional-1.5.1.jar
    urls[29] = file:/srv/gump/public/workspace/mvnlocalrepo/shared/jdom/jdom/b9/jdom-b9.jar
    Number of imports: 10
    import: org.codehaus.classworlds.Entry@a6c57a42
    import: org.codehaus.classworlds.Entry@12f43f3b
    import: org.codehaus.classworlds.Entry@20025374
    import: org.codehaus.classworlds.Entry@f8e44ca4
    import: org.codehaus.classworlds.Entry@92758522
    import: org.codehaus.classworlds.Entry@ebf2705b
    import: org.codehaus.classworlds.Entry@bb25e54
    import: org.codehaus.classworlds.Entry@bece5185
    import: org.codehaus.classworlds.Entry@3fee8e37
    import: org.codehaus.classworlds.Entry@3fee19d8


    this realm = plexus.core
    urls[0] = file:/opt/maven2/lib/maven-2.2.1-uber.jar
    Number of imports: 10
    import: org.codehaus.classworlds.Entry@a6c57a42
    import: org.codehaus.classworlds.Entry@12f43f3b
    import: org.codehaus.classworlds.Entry@20025374
    import: org.codehaus.classworlds.Entry@f8e44ca4
    import: org.codehaus.classworlds.Entry@92758522
    import: org.codehaus.classworlds.Entry@ebf2705b
    import: org.codehaus.classworlds.Entry@bb25e54
    import: org.codehaus.classworlds.Entry@bece5185
    import: org.codehaus.classworlds.Entry@3fee8e37
    import: org.codehaus.classworlds.Entry@3fee19d8
    -----------------------------------------------------
    [INFO] ------------------------------------------------------------------------
    [ERROR] BUILD ERROR
    [INFO] ------------------------------------------------------------------------
    [INFO] Internal error in the plugin manager executing goal 'org.apache.torque:torque-maven-plugin:3.3:om': Unable to load the mojo 'org.apache.torque:torque-maven-plugin:3.3:om' in the plugin 'org.apache.torque:torque-maven-plugin'. A required class is missing: org/apache/torque/task/TorqueDataModelTask
    org.apache.torque.task.TorqueDataModelTask
    [INFO] ------------------------------------------------------------------------
    [INFO] For more information, run Maven with the -e switch
    [INFO] ------------------------------------------------------------------------
    [INFO] Total time: 19 seconds
    [INFO] Finished at: Thu Sep 22 12:41:06 UTC 2011
    [INFO] Final Memory: 29M/71M
    [INFO] ------------------------------------------------------------------------
    ---------------------------------------------

    To subscribe to this information via syndicated feeds:
    - RSS: http://vmgump.apache.org/gump/public/turbine-core/turbine-core/rss.xml
    - Atom: http://vmgump.apache.org/gump/public/turbine-core/turbine-core/atom.xml

    ============================== Gump Tracking Only ===
    Produced by Apache Gump(TM) version 2.3.
    Gump Run 05000622092011, vmgump.apache.org:vmgump:05000622092011
    Gump E-mail Identifier (unique within run) #42.

    --
    Apache Gump
    http://gump.apache.org/ [Instance: vmgump]

    ---------------------------------------------------------------------
    To unsubscribe, e-mail: dev-unsubscribe@turbine.apache.org
    For additional commands, e-mail: dev-help@turbine.apache.org
  • Anonymous at Sep 23, 2011 at 1:18 pm
    To whom it may engage...

    This is an automated request, but not an unsolicited one. For
    more information please visit http://gump.apache.org/nagged.html,
    and/or contact the folk at general@gump.apache.org.

    Project turbine-core has an issue affecting its community integration.
    This issue affects 2 projects,
    and has been outstanding for 413 runs.
    The current state of this project is 'Failed', with reason 'Build Failed'.
    For reference only, the following projects are affected by this:
    - turbine-core : A servlet based framework.
    - turbine-core-test : A servlet based framework.


    Full details are available at:
    http://vmgump.apache.org/gump/public/turbine-core/turbine-core/index.html

    That said, some information snippets are provided here.

    The following annotations (debug/informational/warning/error messages) were provided:
    -INFO- Optional dependency dom4j prerequisite failed with reason build timed out
    -INFO- Optional dependency commons-fileupload prerequisite failed with reason build failed
    -INFO- Optional dependency httpunit failed with reason build failed
    -DEBUG- (Apache Gump generated) Apache Maven Settings in: /srv/gump/public/workspace/turbine-core/gump_mvn_settings.xml
    -INFO- Failed with reason build failed
    -DEBUG- Maven POM in: /srv/gump/public/workspace/turbine-core/pom.xml
    -INFO- Failed to extract fallback artifacts from Gump Repository



    The following work was performed:
    http://vmgump.apache.org/gump/public/turbine-core/turbine-core/gump_work/build_turbine-core_turbine-core.html
    Work Name: build_turbine-core_turbine-core (Type: Build)
    Work ended in a state of : Failed
    Elapsed: 21 secs
    Command Line: /opt/maven2/bin/mvn --batch-mode -DskipTests=true --settings /srv/gump/public/workspace/turbine-core/gump_mvn_settings.xml package
    [Working Directory: /srv/gump/public/workspace/turbine-core]
    M2_HOME: /opt/maven2
    ---------------------------------------------
    urls[19] = file:/srv/gump/public/workspace/mvnlocalrepo/shared/xml-apis/xml-apis/1.0.b2/xml-apis-1.0.b2.jar
    urls[20] = file:/srv/gump/public/workspace/mvnlocalrepo/shared/commons-configuration/commons-configuration/1.4/commons-configuration-1.4.jar
    urls[21] = file:/srv/gump/public/workspace/mvnlocalrepo/shared/commons-logging/commons-logging-api/1.0.4/commons-logging-api-1.0.4.jar
    urls[22] = file:/srv/gump/public/workspace/mvnlocalrepo/shared/commons-digester/commons-digester/1.8/commons-digester-1.8.jar
    urls[23] = file:/srv/gump/public/workspace/mvnlocalrepo/shared/commons-beanutils/commons-beanutils/1.7.0/commons-beanutils-1.7.0.jar
    urls[24] = file:/srv/gump/public/workspace/mvnlocalrepo/shared/commons-beanutils/commons-beanutils-core/1.7.0/commons-beanutils-core-1.7.0.jar
    urls[25] = file:/srv/gump/public/workspace/mvnlocalrepo/shared/commons-codec/commons-codec/1.3/commons-codec-1.3.jar
    urls[26] = file:/srv/gump/public/workspace/mvnlocalrepo/shared/commons-jxpath/commons-jxpath/1.2/commons-jxpath-1.2.jar
    urls[27] = file:/srv/gump/public/workspace/mvnlocalrepo/shared/xerces/xerces/1.2.3/xerces-1.2.3.jar
    urls[28] = file:/srv/gump/public/workspace/mvnlocalrepo/shared/ant/ant-optional/1.5.1/ant-optional-1.5.1.jar
    urls[29] = file:/srv/gump/public/workspace/mvnlocalrepo/shared/jdom/jdom/b9/jdom-b9.jar
    Number of imports: 10
    import: org.codehaus.classworlds.Entry@a6c57a42
    import: org.codehaus.classworlds.Entry@12f43f3b
    import: org.codehaus.classworlds.Entry@20025374
    import: org.codehaus.classworlds.Entry@f8e44ca4
    import: org.codehaus.classworlds.Entry@92758522
    import: org.codehaus.classworlds.Entry@ebf2705b
    import: org.codehaus.classworlds.Entry@bb25e54
    import: org.codehaus.classworlds.Entry@bece5185
    import: org.codehaus.classworlds.Entry@3fee8e37
    import: org.codehaus.classworlds.Entry@3fee19d8


    this realm = plexus.core
    urls[0] = file:/opt/maven2/lib/maven-2.2.1-uber.jar
    Number of imports: 10
    import: org.codehaus.classworlds.Entry@a6c57a42
    import: org.codehaus.classworlds.Entry@12f43f3b
    import: org.codehaus.classworlds.Entry@20025374
    import: org.codehaus.classworlds.Entry@f8e44ca4
    import: org.codehaus.classworlds.Entry@92758522
    import: org.codehaus.classworlds.Entry@ebf2705b
    import: org.codehaus.classworlds.Entry@bb25e54
    import: org.codehaus.classworlds.Entry@bece5185
    import: org.codehaus.classworlds.Entry@3fee8e37
    import: org.codehaus.classworlds.Entry@3fee19d8
    -----------------------------------------------------
    [INFO] ------------------------------------------------------------------------
    [ERROR] BUILD ERROR
    [INFO] ------------------------------------------------------------------------
    [INFO] Internal error in the plugin manager executing goal 'org.apache.torque:torque-maven-plugin:3.3:om': Unable to load the mojo 'org.apache.torque:torque-maven-plugin:3.3:om' in the plugin 'org.apache.torque:torque-maven-plugin'. A required class is missing: org/apache/torque/task/TorqueDataModelTask
    org.apache.torque.task.TorqueDataModelTask
    [INFO] ------------------------------------------------------------------------
    [INFO] For more information, run Maven with the -e switch
    [INFO] ------------------------------------------------------------------------
    [INFO] Total time: 20 seconds
    [INFO] Finished at: Fri Sep 23 13:18:15 UTC 2011
    [INFO] Final Memory: 29M/71M
    [INFO] ------------------------------------------------------------------------
    ---------------------------------------------

    To subscribe to this information via syndicated feeds:
    - RSS: http://vmgump.apache.org/gump/public/turbine-core/turbine-core/rss.xml
    - Atom: http://vmgump.apache.org/gump/public/turbine-core/turbine-core/atom.xml

    ============================== Gump Tracking Only ===
    Produced by Apache Gump(TM) version 2.3.
    Gump Run 05000623092011, vmgump.apache.org:vmgump:05000623092011
    Gump E-mail Identifier (unique within run) #41.

    --
    Apache Gump
    http://gump.apache.org/ [Instance: vmgump]

    ---------------------------------------------------------------------
    To unsubscribe, e-mail: dev-unsubscribe@turbine.apache.org
    For additional commands, e-mail: dev-help@turbine.apache.org
  • Anonymous at Sep 24, 2011 at 12:43 pm
    To whom it may engage...

    This is an automated request, but not an unsolicited one. For
    more information please visit http://gump.apache.org/nagged.html,
    and/or contact the folk at general@gump.apache.org.

    Project turbine-core has an issue affecting its community integration.
    This issue affects 2 projects,
    and has been outstanding for 415 runs.
    The current state of this project is 'Failed', with reason 'Build Failed'.
    For reference only, the following projects are affected by this:
    - turbine-core : A servlet based framework.
    - turbine-core-test : A servlet based framework.


    Full details are available at:
    http://vmgump.apache.org/gump/public/turbine-core/turbine-core/index.html

    That said, some information snippets are provided here.

    The following annotations (debug/informational/warning/error messages) were provided:
    -INFO- Optional dependency commons-fileupload prerequisite failed with reason build failed
    -INFO- Optional dependency httpunit failed with reason build failed
    -DEBUG- (Apache Gump generated) Apache Maven Settings in: /srv/gump/public/workspace/turbine-core/gump_mvn_settings.xml
    -INFO- Failed with reason build failed
    -DEBUG- Maven POM in: /srv/gump/public/workspace/turbine-core/pom.xml
    -INFO- Failed to extract fallback artifacts from Gump Repository



    The following work was performed:
    http://vmgump.apache.org/gump/public/turbine-core/turbine-core/gump_work/build_turbine-core_turbine-core.html
    Work Name: build_turbine-core_turbine-core (Type: Build)
    Work ended in a state of : Failed
    Elapsed: 21 secs
    Command Line: /opt/maven2/bin/mvn --batch-mode -DskipTests=true --settings /srv/gump/public/workspace/turbine-core/gump_mvn_settings.xml package
    [Working Directory: /srv/gump/public/workspace/turbine-core]
    M2_HOME: /opt/maven2
    ---------------------------------------------
    urls[19] = file:/srv/gump/public/workspace/mvnlocalrepo/shared/xml-apis/xml-apis/1.0.b2/xml-apis-1.0.b2.jar
    urls[20] = file:/srv/gump/public/workspace/mvnlocalrepo/shared/commons-configuration/commons-configuration/1.4/commons-configuration-1.4.jar
    urls[21] = file:/srv/gump/public/workspace/mvnlocalrepo/shared/commons-logging/commons-logging-api/1.0.4/commons-logging-api-1.0.4.jar
    urls[22] = file:/srv/gump/public/workspace/mvnlocalrepo/shared/commons-digester/commons-digester/1.8/commons-digester-1.8.jar
    urls[23] = file:/srv/gump/public/workspace/mvnlocalrepo/shared/commons-beanutils/commons-beanutils/1.7.0/commons-beanutils-1.7.0.jar
    urls[24] = file:/srv/gump/public/workspace/mvnlocalrepo/shared/commons-beanutils/commons-beanutils-core/1.7.0/commons-beanutils-core-1.7.0.jar
    urls[25] = file:/srv/gump/public/workspace/mvnlocalrepo/shared/commons-codec/commons-codec/1.3/commons-codec-1.3.jar
    urls[26] = file:/srv/gump/public/workspace/mvnlocalrepo/shared/commons-jxpath/commons-jxpath/1.2/commons-jxpath-1.2.jar
    urls[27] = file:/srv/gump/public/workspace/mvnlocalrepo/shared/xerces/xerces/1.2.3/xerces-1.2.3.jar
    urls[28] = file:/srv/gump/public/workspace/mvnlocalrepo/shared/ant/ant-optional/1.5.1/ant-optional-1.5.1.jar
    urls[29] = file:/srv/gump/public/workspace/mvnlocalrepo/shared/jdom/jdom/b9/jdom-b9.jar
    Number of imports: 10
    import: org.codehaus.classworlds.Entry@a6c57a42
    import: org.codehaus.classworlds.Entry@12f43f3b
    import: org.codehaus.classworlds.Entry@20025374
    import: org.codehaus.classworlds.Entry@f8e44ca4
    import: org.codehaus.classworlds.Entry@92758522
    import: org.codehaus.classworlds.Entry@ebf2705b
    import: org.codehaus.classworlds.Entry@bb25e54
    import: org.codehaus.classworlds.Entry@bece5185
    import: org.codehaus.classworlds.Entry@3fee8e37
    import: org.codehaus.classworlds.Entry@3fee19d8


    this realm = plexus.core
    urls[0] = file:/opt/maven2/lib/maven-2.2.1-uber.jar
    Number of imports: 10
    import: org.codehaus.classworlds.Entry@a6c57a42
    import: org.codehaus.classworlds.Entry@12f43f3b
    import: org.codehaus.classworlds.Entry@20025374
    import: org.codehaus.classworlds.Entry@f8e44ca4
    import: org.codehaus.classworlds.Entry@92758522
    import: org.codehaus.classworlds.Entry@ebf2705b
    import: org.codehaus.classworlds.Entry@bb25e54
    import: org.codehaus.classworlds.Entry@bece5185
    import: org.codehaus.classworlds.Entry@3fee8e37
    import: org.codehaus.classworlds.Entry@3fee19d8
    -----------------------------------------------------
    [INFO] ------------------------------------------------------------------------
    [ERROR] BUILD ERROR
    [INFO] ------------------------------------------------------------------------
    [INFO] Internal error in the plugin manager executing goal 'org.apache.torque:torque-maven-plugin:3.3:om': Unable to load the mojo 'org.apache.torque:torque-maven-plugin:3.3:om' in the plugin 'org.apache.torque:torque-maven-plugin'. A required class is missing: org/apache/torque/task/TorqueDataModelTask
    org.apache.torque.task.TorqueDataModelTask
    [INFO] ------------------------------------------------------------------------
    [INFO] For more information, run Maven with the -e switch
    [INFO] ------------------------------------------------------------------------
    [INFO] Total time: 19 seconds
    [INFO] Finished at: Sat Sep 24 12:43:16 UTC 2011
    [INFO] Final Memory: 29M/71M
    [INFO] ------------------------------------------------------------------------
    ---------------------------------------------

    To subscribe to this information via syndicated feeds:
    - RSS: http://vmgump.apache.org/gump/public/turbine-core/turbine-core/rss.xml
    - Atom: http://vmgump.apache.org/gump/public/turbine-core/turbine-core/atom.xml

    ============================== Gump Tracking Only ===
    Produced by Apache Gump(TM) version 2.3.
    Gump Run 06000624092011, vmgump.apache.org:vmgump:06000624092011
    Gump E-mail Identifier (unique within run) #40.

    --
    Apache Gump
    http://gump.apache.org/ [Instance: vmgump]

    ---------------------------------------------------------------------
    To unsubscribe, e-mail: dev-unsubscribe@turbine.apache.org
    For additional commands, e-mail: dev-help@turbine.apache.org
  • Anonymous at Sep 25, 2011 at 12:37 pm
    To whom it may engage...

    This is an automated request, but not an unsolicited one. For
    more information please visit http://gump.apache.org/nagged.html,
    and/or contact the folk at general@gump.apache.org.

    Project turbine-core has an issue affecting its community integration.
    This issue affects 2 projects,
    and has been outstanding for 417 runs.
    The current state of this project is 'Failed', with reason 'Build Failed'.
    For reference only, the following projects are affected by this:
    - turbine-core : A servlet based framework.
    - turbine-core-test : A servlet based framework.


    Full details are available at:
    http://vmgump.apache.org/gump/public/turbine-core/turbine-core/index.html

    That said, some information snippets are provided here.

    The following annotations (debug/informational/warning/error messages) were provided:
    -INFO- Optional dependency commons-fileupload prerequisite failed with reason build failed
    -INFO- Optional dependency httpunit failed with reason build failed
    -DEBUG- (Apache Gump generated) Apache Maven Settings in: /srv/gump/public/workspace/turbine-core/gump_mvn_settings.xml
    -INFO- Failed with reason build failed
    -DEBUG- Maven POM in: /srv/gump/public/workspace/turbine-core/pom.xml
    -INFO- Failed to extract fallback artifacts from Gump Repository



    The following work was performed:
    http://vmgump.apache.org/gump/public/turbine-core/turbine-core/gump_work/build_turbine-core_turbine-core.html
    Work Name: build_turbine-core_turbine-core (Type: Build)
    Work ended in a state of : Failed
    Elapsed: 19 secs
    Command Line: /opt/maven2/bin/mvn --batch-mode -DskipTests=true --settings /srv/gump/public/workspace/turbine-core/gump_mvn_settings.xml package
    [Working Directory: /srv/gump/public/workspace/turbine-core]
    M2_HOME: /opt/maven2
    ---------------------------------------------
    urls[19] = file:/srv/gump/public/workspace/mvnlocalrepo/shared/xml-apis/xml-apis/1.0.b2/xml-apis-1.0.b2.jar
    urls[20] = file:/srv/gump/public/workspace/mvnlocalrepo/shared/commons-configuration/commons-configuration/1.4/commons-configuration-1.4.jar
    urls[21] = file:/srv/gump/public/workspace/mvnlocalrepo/shared/commons-logging/commons-logging-api/1.0.4/commons-logging-api-1.0.4.jar
    urls[22] = file:/srv/gump/public/workspace/mvnlocalrepo/shared/commons-digester/commons-digester/1.8/commons-digester-1.8.jar
    urls[23] = file:/srv/gump/public/workspace/mvnlocalrepo/shared/commons-beanutils/commons-beanutils/1.7.0/commons-beanutils-1.7.0.jar
    urls[24] = file:/srv/gump/public/workspace/mvnlocalrepo/shared/commons-beanutils/commons-beanutils-core/1.7.0/commons-beanutils-core-1.7.0.jar
    urls[25] = file:/srv/gump/public/workspace/mvnlocalrepo/shared/commons-codec/commons-codec/1.3/commons-codec-1.3.jar
    urls[26] = file:/srv/gump/public/workspace/mvnlocalrepo/shared/commons-jxpath/commons-jxpath/1.2/commons-jxpath-1.2.jar
    urls[27] = file:/srv/gump/public/workspace/mvnlocalrepo/shared/xerces/xerces/1.2.3/xerces-1.2.3.jar
    urls[28] = file:/srv/gump/public/workspace/mvnlocalrepo/shared/ant/ant-optional/1.5.1/ant-optional-1.5.1.jar
    urls[29] = file:/srv/gump/public/workspace/mvnlocalrepo/shared/jdom/jdom/b9/jdom-b9.jar
    Number of imports: 10
    import: org.codehaus.classworlds.Entry@a6c57a42
    import: org.codehaus.classworlds.Entry@12f43f3b
    import: org.codehaus.classworlds.Entry@20025374
    import: org.codehaus.classworlds.Entry@f8e44ca4
    import: org.codehaus.classworlds.Entry@92758522
    import: org.codehaus.classworlds.Entry@ebf2705b
    import: org.codehaus.classworlds.Entry@bb25e54
    import: org.codehaus.classworlds.Entry@bece5185
    import: org.codehaus.classworlds.Entry@3fee8e37
    import: org.codehaus.classworlds.Entry@3fee19d8


    this realm = plexus.core
    urls[0] = file:/opt/maven2/lib/maven-2.2.1-uber.jar
    Number of imports: 10
    import: org.codehaus.classworlds.Entry@a6c57a42
    import: org.codehaus.classworlds.Entry@12f43f3b
    import: org.codehaus.classworlds.Entry@20025374
    import: org.codehaus.classworlds.Entry@f8e44ca4
    import: org.codehaus.classworlds.Entry@92758522
    import: org.codehaus.classworlds.Entry@ebf2705b
    import: org.codehaus.classworlds.Entry@bb25e54
    import: org.codehaus.classworlds.Entry@bece5185
    import: org.codehaus.classworlds.Entry@3fee8e37
    import: org.codehaus.classworlds.Entry@3fee19d8
    -----------------------------------------------------
    [INFO] ------------------------------------------------------------------------
    [ERROR] BUILD ERROR
    [INFO] ------------------------------------------------------------------------
    [INFO] Internal error in the plugin manager executing goal 'org.apache.torque:torque-maven-plugin:3.3:om': Unable to load the mojo 'org.apache.torque:torque-maven-plugin:3.3:om' in the plugin 'org.apache.torque:torque-maven-plugin'. A required class is missing: org/apache/torque/task/TorqueDataModelTask
    org.apache.torque.task.TorqueDataModelTask
    [INFO] ------------------------------------------------------------------------
    [INFO] For more information, run Maven with the -e switch
    [INFO] ------------------------------------------------------------------------
    [INFO] Total time: 18 seconds
    [INFO] Finished at: Sun Sep 25 12:37:35 UTC 2011
    [INFO] Final Memory: 30M/71M
    [INFO] ------------------------------------------------------------------------
    ---------------------------------------------

    To subscribe to this information via syndicated feeds:
    - RSS: http://vmgump.apache.org/gump/public/turbine-core/turbine-core/rss.xml
    - Atom: http://vmgump.apache.org/gump/public/turbine-core/turbine-core/atom.xml

    ============================== Gump Tracking Only ===
    Produced by Apache Gump(TM) version 2.3.
    Gump Run 05000625092011, vmgump.apache.org:vmgump:05000625092011
    Gump E-mail Identifier (unique within run) #40.

    --
    Apache Gump
    http://gump.apache.org/ [Instance: vmgump]

    ---------------------------------------------------------------------
    To unsubscribe, e-mail: dev-unsubscribe@turbine.apache.org
    For additional commands, e-mail: dev-help@turbine.apache.org
  • Anonymous at Sep 26, 2011 at 12:44 pm
    To whom it may engage...

    This is an automated request, but not an unsolicited one. For
    more information please visit http://gump.apache.org/nagged.html,
    and/or contact the folk at general@gump.apache.org.

    Project turbine-core has an issue affecting its community integration.
    This issue affects 2 projects,
    and has been outstanding for 419 runs.
    The current state of this project is 'Failed', with reason 'Build Failed'.
    For reference only, the following projects are affected by this:
    - turbine-core : A servlet based framework.
    - turbine-core-test : A servlet based framework.


    Full details are available at:
    http://vmgump.apache.org/gump/public/turbine-core/turbine-core/index.html

    That said, some information snippets are provided here.

    The following annotations (debug/informational/warning/error messages) were provided:
    -INFO- Optional dependency commons-fileupload prerequisite failed with reason build failed
    -INFO- Optional dependency httpunit failed with reason build failed
    -DEBUG- (Apache Gump generated) Apache Maven Settings in: /srv/gump/public/workspace/turbine-core/gump_mvn_settings.xml
    -INFO- Failed with reason build failed
    -DEBUG- Maven POM in: /srv/gump/public/workspace/turbine-core/pom.xml
    -INFO- Failed to extract fallback artifacts from Gump Repository



    The following work was performed:
    http://vmgump.apache.org/gump/public/turbine-core/turbine-core/gump_work/build_turbine-core_turbine-core.html
    Work Name: build_turbine-core_turbine-core (Type: Build)
    Work ended in a state of : Failed
    Elapsed: 23 secs
    Command Line: /opt/maven2/bin/mvn --batch-mode -DskipTests=true --settings /srv/gump/public/workspace/turbine-core/gump_mvn_settings.xml package
    [Working Directory: /srv/gump/public/workspace/turbine-core]
    M2_HOME: /opt/maven2
    ---------------------------------------------
    urls[19] = file:/srv/gump/public/workspace/mvnlocalrepo/shared/xml-apis/xml-apis/1.0.b2/xml-apis-1.0.b2.jar
    urls[20] = file:/srv/gump/public/workspace/mvnlocalrepo/shared/commons-configuration/commons-configuration/1.4/commons-configuration-1.4.jar
    urls[21] = file:/srv/gump/public/workspace/mvnlocalrepo/shared/commons-logging/commons-logging-api/1.0.4/commons-logging-api-1.0.4.jar
    urls[22] = file:/srv/gump/public/workspace/mvnlocalrepo/shared/commons-digester/commons-digester/1.8/commons-digester-1.8.jar
    urls[23] = file:/srv/gump/public/workspace/mvnlocalrepo/shared/commons-beanutils/commons-beanutils/1.7.0/commons-beanutils-1.7.0.jar
    urls[24] = file:/srv/gump/public/workspace/mvnlocalrepo/shared/commons-beanutils/commons-beanutils-core/1.7.0/commons-beanutils-core-1.7.0.jar
    urls[25] = file:/srv/gump/public/workspace/mvnlocalrepo/shared/commons-codec/commons-codec/1.3/commons-codec-1.3.jar
    urls[26] = file:/srv/gump/public/workspace/mvnlocalrepo/shared/commons-jxpath/commons-jxpath/1.2/commons-jxpath-1.2.jar
    urls[27] = file:/srv/gump/public/workspace/mvnlocalrepo/shared/xerces/xerces/1.2.3/xerces-1.2.3.jar
    urls[28] = file:/srv/gump/public/workspace/mvnlocalrepo/shared/ant/ant-optional/1.5.1/ant-optional-1.5.1.jar
    urls[29] = file:/srv/gump/public/workspace/mvnlocalrepo/shared/jdom/jdom/b9/jdom-b9.jar
    Number of imports: 10
    import: org.codehaus.classworlds.Entry@a6c57a42
    import: org.codehaus.classworlds.Entry@12f43f3b
    import: org.codehaus.classworlds.Entry@20025374
    import: org.codehaus.classworlds.Entry@f8e44ca4
    import: org.codehaus.classworlds.Entry@92758522
    import: org.codehaus.classworlds.Entry@ebf2705b
    import: org.codehaus.classworlds.Entry@bb25e54
    import: org.codehaus.classworlds.Entry@bece5185
    import: org.codehaus.classworlds.Entry@3fee8e37
    import: org.codehaus.classworlds.Entry@3fee19d8


    this realm = plexus.core
    urls[0] = file:/opt/maven2/lib/maven-2.2.1-uber.jar
    Number of imports: 10
    import: org.codehaus.classworlds.Entry@a6c57a42
    import: org.codehaus.classworlds.Entry@12f43f3b
    import: org.codehaus.classworlds.Entry@20025374
    import: org.codehaus.classworlds.Entry@f8e44ca4
    import: org.codehaus.classworlds.Entry@92758522
    import: org.codehaus.classworlds.Entry@ebf2705b
    import: org.codehaus.classworlds.Entry@bb25e54
    import: org.codehaus.classworlds.Entry@bece5185
    import: org.codehaus.classworlds.Entry@3fee8e37
    import: org.codehaus.classworlds.Entry@3fee19d8
    -----------------------------------------------------
    [INFO] ------------------------------------------------------------------------
    [ERROR] BUILD ERROR
    [INFO] ------------------------------------------------------------------------
    [INFO] Internal error in the plugin manager executing goal 'org.apache.torque:torque-maven-plugin:3.3:om': Unable to load the mojo 'org.apache.torque:torque-maven-plugin:3.3:om' in the plugin 'org.apache.torque:torque-maven-plugin'. A required class is missing: org/apache/torque/task/TorqueDataModelTask
    org.apache.torque.task.TorqueDataModelTask
    [INFO] ------------------------------------------------------------------------
    [INFO] For more information, run Maven with the -e switch
    [INFO] ------------------------------------------------------------------------
    [INFO] Total time: 22 seconds
    [INFO] Finished at: Mon Sep 26 12:43:43 UTC 2011
    [INFO] Final Memory: 30M/71M
    [INFO] ------------------------------------------------------------------------
    ---------------------------------------------

    To subscribe to this information via syndicated feeds:
    - RSS: http://vmgump.apache.org/gump/public/turbine-core/turbine-core/rss.xml
    - Atom: http://vmgump.apache.org/gump/public/turbine-core/turbine-core/atom.xml

    ============================== Gump Tracking Only ===
    Produced by Apache Gump(TM) version 2.3.
    Gump Run 05000626092011, vmgump.apache.org:vmgump:05000626092011
    Gump E-mail Identifier (unique within run) #42.

    --
    Apache Gump
    http://gump.apache.org/ [Instance: vmgump]

    ---------------------------------------------------------------------
    To unsubscribe, e-mail: dev-unsubscribe@turbine.apache.org
    For additional commands, e-mail: dev-help@turbine.apache.org
  • Anonymous at Sep 27, 2011 at 12:44 pm
    To whom it may engage...

    This is an automated request, but not an unsolicited one. For
    more information please visit http://gump.apache.org/nagged.html,
    and/or contact the folk at general@gump.apache.org.

    Project turbine-core has an issue affecting its community integration.
    This issue affects 2 projects,
    and has been outstanding for 421 runs.
    The current state of this project is 'Failed', with reason 'Build Failed'.
    For reference only, the following projects are affected by this:
    - turbine-core : A servlet based framework.
    - turbine-core-test : A servlet based framework.


    Full details are available at:
    http://vmgump.apache.org/gump/public/turbine-core/turbine-core/index.html

    That said, some information snippets are provided here.

    The following annotations (debug/informational/warning/error messages) were provided:
    -INFO- Optional dependency commons-fileupload prerequisite failed with reason build failed
    -INFO- Optional dependency httpunit failed with reason build failed
    -DEBUG- (Apache Gump generated) Apache Maven Settings in: /srv/gump/public/workspace/turbine-core/gump_mvn_settings.xml
    -INFO- Failed with reason build failed
    -DEBUG- Maven POM in: /srv/gump/public/workspace/turbine-core/pom.xml
    -INFO- Failed to extract fallback artifacts from Gump Repository



    The following work was performed:
    http://vmgump.apache.org/gump/public/turbine-core/turbine-core/gump_work/build_turbine-core_turbine-core.html
    Work Name: build_turbine-core_turbine-core (Type: Build)
    Work ended in a state of : Failed
    Elapsed: 22 secs
    Command Line: /opt/maven2/bin/mvn --batch-mode -DskipTests=true --settings /srv/gump/public/workspace/turbine-core/gump_mvn_settings.xml package
    [Working Directory: /srv/gump/public/workspace/turbine-core]
    M2_HOME: /opt/maven2
    ---------------------------------------------
    urls[19] = file:/srv/gump/public/workspace/mvnlocalrepo/shared/xml-apis/xml-apis/1.0.b2/xml-apis-1.0.b2.jar
    urls[20] = file:/srv/gump/public/workspace/mvnlocalrepo/shared/commons-configuration/commons-configuration/1.4/commons-configuration-1.4.jar
    urls[21] = file:/srv/gump/public/workspace/mvnlocalrepo/shared/commons-logging/commons-logging-api/1.0.4/commons-logging-api-1.0.4.jar
    urls[22] = file:/srv/gump/public/workspace/mvnlocalrepo/shared/commons-digester/commons-digester/1.8/commons-digester-1.8.jar
    urls[23] = file:/srv/gump/public/workspace/mvnlocalrepo/shared/commons-beanutils/commons-beanutils/1.7.0/commons-beanutils-1.7.0.jar
    urls[24] = file:/srv/gump/public/workspace/mvnlocalrepo/shared/commons-beanutils/commons-beanutils-core/1.7.0/commons-beanutils-core-1.7.0.jar
    urls[25] = file:/srv/gump/public/workspace/mvnlocalrepo/shared/commons-codec/commons-codec/1.3/commons-codec-1.3.jar
    urls[26] = file:/srv/gump/public/workspace/mvnlocalrepo/shared/commons-jxpath/commons-jxpath/1.2/commons-jxpath-1.2.jar
    urls[27] = file:/srv/gump/public/workspace/mvnlocalrepo/shared/xerces/xerces/1.2.3/xerces-1.2.3.jar
    urls[28] = file:/srv/gump/public/workspace/mvnlocalrepo/shared/ant/ant-optional/1.5.1/ant-optional-1.5.1.jar
    urls[29] = file:/srv/gump/public/workspace/mvnlocalrepo/shared/jdom/jdom/b9/jdom-b9.jar
    Number of imports: 10
    import: org.codehaus.classworlds.Entry@a6c57a42
    import: org.codehaus.classworlds.Entry@12f43f3b
    import: org.codehaus.classworlds.Entry@20025374
    import: org.codehaus.classworlds.Entry@f8e44ca4
    import: org.codehaus.classworlds.Entry@92758522
    import: org.codehaus.classworlds.Entry@ebf2705b
    import: org.codehaus.classworlds.Entry@bb25e54
    import: org.codehaus.classworlds.Entry@bece5185
    import: org.codehaus.classworlds.Entry@3fee8e37
    import: org.codehaus.classworlds.Entry@3fee19d8


    this realm = plexus.core
    urls[0] = file:/opt/maven2/lib/maven-2.2.1-uber.jar
    Number of imports: 10
    import: org.codehaus.classworlds.Entry@a6c57a42
    import: org.codehaus.classworlds.Entry@12f43f3b
    import: org.codehaus.classworlds.Entry@20025374
    import: org.codehaus.classworlds.Entry@f8e44ca4
    import: org.codehaus.classworlds.Entry@92758522
    import: org.codehaus.classworlds.Entry@ebf2705b
    import: org.codehaus.classworlds.Entry@bb25e54
    import: org.codehaus.classworlds.Entry@bece5185
    import: org.codehaus.classworlds.Entry@3fee8e37
    import: org.codehaus.classworlds.Entry@3fee19d8
    -----------------------------------------------------
    [INFO] ------------------------------------------------------------------------
    [ERROR] BUILD ERROR
    [INFO] ------------------------------------------------------------------------
    [INFO] Internal error in the plugin manager executing goal 'org.apache.torque:torque-maven-plugin:3.3:om': Unable to load the mojo 'org.apache.torque:torque-maven-plugin:3.3:om' in the plugin 'org.apache.torque:torque-maven-plugin'. A required class is missing: org/apache/torque/task/TorqueDataModelTask
    org.apache.torque.task.TorqueDataModelTask
    [INFO] ------------------------------------------------------------------------
    [INFO] For more information, run Maven with the -e switch
    [INFO] ------------------------------------------------------------------------
    [INFO] Total time: 21 seconds
    [INFO] Finished at: Tue Sep 27 12:43:56 UTC 2011
    [INFO] Final Memory: 30M/71M
    [INFO] ------------------------------------------------------------------------
    ---------------------------------------------

    To subscribe to this information via syndicated feeds:
    - RSS: http://vmgump.apache.org/gump/public/turbine-core/turbine-core/rss.xml
    - Atom: http://vmgump.apache.org/gump/public/turbine-core/turbine-core/atom.xml

    ============================== Gump Tracking Only ===
    Produced by Apache Gump(TM) version 2.3.
    Gump Run 05000627092011, vmgump.apache.org:vmgump:05000627092011
    Gump E-mail Identifier (unique within run) #43.

    --
    Apache Gump
    http://gump.apache.org/ [Instance: vmgump]

    ---------------------------------------------------------------------
    To unsubscribe, e-mail: dev-unsubscribe@turbine.apache.org
    For additional commands, e-mail: dev-help@turbine.apache.org
  • Anonymous at Sep 28, 2011 at 12:52 pm
    To whom it may engage...

    This is an automated request, but not an unsolicited one. For
    more information please visit http://gump.apache.org/nagged.html,
    and/or contact the folk at general@gump.apache.org.

    Project turbine-core has an issue affecting its community integration.
    This issue affects 2 projects,
    and has been outstanding for 423 runs.
    The current state of this project is 'Failed', with reason 'Build Failed'.
    For reference only, the following projects are affected by this:
    - turbine-core : A servlet based framework.
    - turbine-core-test : A servlet based framework.


    Full details are available at:
    http://vmgump.apache.org/gump/public/turbine-core/turbine-core/index.html

    That said, some information snippets are provided here.

    The following annotations (debug/informational/warning/error messages) were provided:
    -INFO- Optional dependency commons-fileupload prerequisite failed with reason build failed
    -INFO- Optional dependency httpunit failed with reason build failed
    -DEBUG- (Apache Gump generated) Apache Maven Settings in: /srv/gump/public/workspace/turbine-core/gump_mvn_settings.xml
    -INFO- Failed with reason build failed
    -DEBUG- Maven POM in: /srv/gump/public/workspace/turbine-core/pom.xml
    -INFO- Failed to extract fallback artifacts from Gump Repository



    The following work was performed:
    http://vmgump.apache.org/gump/public/turbine-core/turbine-core/gump_work/build_turbine-core_turbine-core.html
    Work Name: build_turbine-core_turbine-core (Type: Build)
    Work ended in a state of : Failed
    Elapsed: 21 secs
    Command Line: /opt/maven2/bin/mvn --batch-mode -DskipTests=true --settings /srv/gump/public/workspace/turbine-core/gump_mvn_settings.xml package
    [Working Directory: /srv/gump/public/workspace/turbine-core]
    M2_HOME: /opt/maven2
    ---------------------------------------------
    urls[19] = file:/srv/gump/public/workspace/mvnlocalrepo/shared/xml-apis/xml-apis/1.0.b2/xml-apis-1.0.b2.jar
    urls[20] = file:/srv/gump/public/workspace/mvnlocalrepo/shared/commons-configuration/commons-configuration/1.4/commons-configuration-1.4.jar
    urls[21] = file:/srv/gump/public/workspace/mvnlocalrepo/shared/commons-logging/commons-logging-api/1.0.4/commons-logging-api-1.0.4.jar
    urls[22] = file:/srv/gump/public/workspace/mvnlocalrepo/shared/commons-digester/commons-digester/1.8/commons-digester-1.8.jar
    urls[23] = file:/srv/gump/public/workspace/mvnlocalrepo/shared/commons-beanutils/commons-beanutils/1.7.0/commons-beanutils-1.7.0.jar
    urls[24] = file:/srv/gump/public/workspace/mvnlocalrepo/shared/commons-beanutils/commons-beanutils-core/1.7.0/commons-beanutils-core-1.7.0.jar
    urls[25] = file:/srv/gump/public/workspace/mvnlocalrepo/shared/commons-codec/commons-codec/1.3/commons-codec-1.3.jar
    urls[26] = file:/srv/gump/public/workspace/mvnlocalrepo/shared/commons-jxpath/commons-jxpath/1.2/commons-jxpath-1.2.jar
    urls[27] = file:/srv/gump/public/workspace/mvnlocalrepo/shared/xerces/xerces/1.2.3/xerces-1.2.3.jar
    urls[28] = file:/srv/gump/public/workspace/mvnlocalrepo/shared/ant/ant-optional/1.5.1/ant-optional-1.5.1.jar
    urls[29] = file:/srv/gump/public/workspace/mvnlocalrepo/shared/jdom/jdom/b9/jdom-b9.jar
    Number of imports: 10
    import: org.codehaus.classworlds.Entry@a6c57a42
    import: org.codehaus.classworlds.Entry@12f43f3b
    import: org.codehaus.classworlds.Entry@20025374
    import: org.codehaus.classworlds.Entry@f8e44ca4
    import: org.codehaus.classworlds.Entry@92758522
    import: org.codehaus.classworlds.Entry@ebf2705b
    import: org.codehaus.classworlds.Entry@bb25e54
    import: org.codehaus.classworlds.Entry@bece5185
    import: org.codehaus.classworlds.Entry@3fee8e37
    import: org.codehaus.classworlds.Entry@3fee19d8


    this realm = plexus.core
    urls[0] = file:/opt/maven2/lib/maven-2.2.1-uber.jar
    Number of imports: 10
    import: org.codehaus.classworlds.Entry@a6c57a42
    import: org.codehaus.classworlds.Entry@12f43f3b
    import: org.codehaus.classworlds.Entry@20025374
    import: org.codehaus.classworlds.Entry@f8e44ca4
    import: org.codehaus.classworlds.Entry@92758522
    import: org.codehaus.classworlds.Entry@ebf2705b
    import: org.codehaus.classworlds.Entry@bb25e54
    import: org.codehaus.classworlds.Entry@bece5185
    import: org.codehaus.classworlds.Entry@3fee8e37
    import: org.codehaus.classworlds.Entry@3fee19d8
    -----------------------------------------------------
    [INFO] ------------------------------------------------------------------------
    [ERROR] BUILD ERROR
    [INFO] ------------------------------------------------------------------------
    [INFO] Internal error in the plugin manager executing goal 'org.apache.torque:torque-maven-plugin:3.3:om': Unable to load the mojo 'org.apache.torque:torque-maven-plugin:3.3:om' in the plugin 'org.apache.torque:torque-maven-plugin'. A required class is missing: org/apache/torque/task/TorqueDataModelTask
    org.apache.torque.task.TorqueDataModelTask
    [INFO] ------------------------------------------------------------------------
    [INFO] For more information, run Maven with the -e switch
    [INFO] ------------------------------------------------------------------------
    [INFO] Total time: 20 seconds
    [INFO] Finished at: Wed Sep 28 12:52:25 UTC 2011
    [INFO] Final Memory: 29M/71M
    [INFO] ------------------------------------------------------------------------
    ---------------------------------------------

    To subscribe to this information via syndicated feeds:
    - RSS: http://vmgump.apache.org/gump/public/turbine-core/turbine-core/rss.xml
    - Atom: http://vmgump.apache.org/gump/public/turbine-core/turbine-core/atom.xml

    ============================== Gump Tracking Only ===
    Produced by Apache Gump(TM) version 2.3.
    Gump Run 05000628092011, vmgump.apache.org:vmgump:05000628092011
    Gump E-mail Identifier (unique within run) #43.

    --
    Apache Gump
    http://gump.apache.org/ [Instance: vmgump]

    ---------------------------------------------------------------------
    To unsubscribe, e-mail: dev-unsubscribe@turbine.apache.org
    For additional commands, e-mail: dev-help@turbine.apache.org
  • Anonymous at Sep 29, 2011 at 12:50 pm
    To whom it may engage...

    This is an automated request, but not an unsolicited one. For
    more information please visit http://gump.apache.org/nagged.html,
    and/or contact the folk at general@gump.apache.org.

    Project turbine-core has an issue affecting its community integration.
    This issue affects 2 projects,
    and has been outstanding for 425 runs.
    The current state of this project is 'Failed', with reason 'Build Failed'.
    For reference only, the following projects are affected by this:
    - turbine-core : A servlet based framework.
    - turbine-core-test : A servlet based framework.


    Full details are available at:
    http://vmgump.apache.org/gump/public/turbine-core/turbine-core/index.html

    That said, some information snippets are provided here.

    The following annotations (debug/informational/warning/error messages) were provided:
    -INFO- Optional dependency commons-fileupload prerequisite failed with reason build failed
    -INFO- Optional dependency httpunit failed with reason build failed
    -DEBUG- (Apache Gump generated) Apache Maven Settings in: /srv/gump/public/workspace/turbine-core/gump_mvn_settings.xml
    -INFO- Failed with reason build failed
    -DEBUG- Maven POM in: /srv/gump/public/workspace/turbine-core/pom.xml
    -INFO- Failed to extract fallback artifacts from Gump Repository



    The following work was performed:
    http://vmgump.apache.org/gump/public/turbine-core/turbine-core/gump_work/build_turbine-core_turbine-core.html
    Work Name: build_turbine-core_turbine-core (Type: Build)
    Work ended in a state of : Failed
    Elapsed: 20 secs
    Command Line: /opt/maven2/bin/mvn --batch-mode -DskipTests=true --settings /srv/gump/public/workspace/turbine-core/gump_mvn_settings.xml package
    [Working Directory: /srv/gump/public/workspace/turbine-core]
    M2_HOME: /opt/maven2
    ---------------------------------------------
    urls[19] = file:/srv/gump/public/workspace/mvnlocalrepo/shared/xml-apis/xml-apis/1.0.b2/xml-apis-1.0.b2.jar
    urls[20] = file:/srv/gump/public/workspace/mvnlocalrepo/shared/commons-configuration/commons-configuration/1.4/commons-configuration-1.4.jar
    urls[21] = file:/srv/gump/public/workspace/mvnlocalrepo/shared/commons-logging/commons-logging-api/1.0.4/commons-logging-api-1.0.4.jar
    urls[22] = file:/srv/gump/public/workspace/mvnlocalrepo/shared/commons-digester/commons-digester/1.8/commons-digester-1.8.jar
    urls[23] = file:/srv/gump/public/workspace/mvnlocalrepo/shared/commons-beanutils/commons-beanutils/1.7.0/commons-beanutils-1.7.0.jar
    urls[24] = file:/srv/gump/public/workspace/mvnlocalrepo/shared/commons-beanutils/commons-beanutils-core/1.7.0/commons-beanutils-core-1.7.0.jar
    urls[25] = file:/srv/gump/public/workspace/mvnlocalrepo/shared/commons-codec/commons-codec/1.3/commons-codec-1.3.jar
    urls[26] = file:/srv/gump/public/workspace/mvnlocalrepo/shared/commons-jxpath/commons-jxpath/1.2/commons-jxpath-1.2.jar
    urls[27] = file:/srv/gump/public/workspace/mvnlocalrepo/shared/xerces/xerces/1.2.3/xerces-1.2.3.jar
    urls[28] = file:/srv/gump/public/workspace/mvnlocalrepo/shared/ant/ant-optional/1.5.1/ant-optional-1.5.1.jar
    urls[29] = file:/srv/gump/public/workspace/mvnlocalrepo/shared/jdom/jdom/b9/jdom-b9.jar
    Number of imports: 10
    import: org.codehaus.classworlds.Entry@a6c57a42
    import: org.codehaus.classworlds.Entry@12f43f3b
    import: org.codehaus.classworlds.Entry@20025374
    import: org.codehaus.classworlds.Entry@f8e44ca4
    import: org.codehaus.classworlds.Entry@92758522
    import: org.codehaus.classworlds.Entry@ebf2705b
    import: org.codehaus.classworlds.Entry@bb25e54
    import: org.codehaus.classworlds.Entry@bece5185
    import: org.codehaus.classworlds.Entry@3fee8e37
    import: org.codehaus.classworlds.Entry@3fee19d8


    this realm = plexus.core
    urls[0] = file:/opt/maven2/lib/maven-2.2.1-uber.jar
    Number of imports: 10
    import: org.codehaus.classworlds.Entry@a6c57a42
    import: org.codehaus.classworlds.Entry@12f43f3b
    import: org.codehaus.classworlds.Entry@20025374
    import: org.codehaus.classworlds.Entry@f8e44ca4
    import: org.codehaus.classworlds.Entry@92758522
    import: org.codehaus.classworlds.Entry@ebf2705b
    import: org.codehaus.classworlds.Entry@bb25e54
    import: org.codehaus.classworlds.Entry@bece5185
    import: org.codehaus.classworlds.Entry@3fee8e37
    import: org.codehaus.classworlds.Entry@3fee19d8
    -----------------------------------------------------
    [INFO] ------------------------------------------------------------------------
    [ERROR] BUILD ERROR
    [INFO] ------------------------------------------------------------------------
    [INFO] Internal error in the plugin manager executing goal 'org.apache.torque:torque-maven-plugin:3.3:om': Unable to load the mojo 'org.apache.torque:torque-maven-plugin:3.3:om' in the plugin 'org.apache.torque:torque-maven-plugin'. A required class is missing: org/apache/torque/task/TorqueDataModelTask
    org.apache.torque.task.TorqueDataModelTask
    [INFO] ------------------------------------------------------------------------
    [INFO] For more information, run Maven with the -e switch
    [INFO] ------------------------------------------------------------------------
    [INFO] Total time: 19 seconds
    [INFO] Finished at: Thu Sep 29 12:50:18 UTC 2011
    [INFO] Final Memory: 30M/71M
    [INFO] ------------------------------------------------------------------------
    ---------------------------------------------

    To subscribe to this information via syndicated feeds:
    - RSS: http://vmgump.apache.org/gump/public/turbine-core/turbine-core/rss.xml
    - Atom: http://vmgump.apache.org/gump/public/turbine-core/turbine-core/atom.xml

    ============================== Gump Tracking Only ===
    Produced by Apache Gump(TM) version 2.3.
    Gump Run 05000629092011, vmgump.apache.org:vmgump:05000629092011
    Gump E-mail Identifier (unique within run) #43.

    --
    Apache Gump
    http://gump.apache.org/ [Instance: vmgump]

    ---------------------------------------------------------------------
    To unsubscribe, e-mail: dev-unsubscribe@turbine.apache.org
    For additional commands, e-mail: dev-help@turbine.apache.org
  • Anonymous at Sep 30, 2011 at 2:05 pm
    To whom it may engage...

    This is an automated request, but not an unsolicited one. For
    more information please visit http://gump.apache.org/nagged.html,
    and/or contact the folk at general@gump.apache.org.

    Project turbine-core has an issue affecting its community integration.
    This issue affects 2 projects,
    and has been outstanding for 427 runs.
    The current state of this project is 'Failed', with reason 'Build Failed'.
    For reference only, the following projects are affected by this:
    - turbine-core : A servlet based framework.
    - turbine-core-test : A servlet based framework.


    Full details are available at:
    http://vmgump.apache.org/gump/public/turbine-core/turbine-core/index.html

    That said, some information snippets are provided here.

    The following annotations (debug/informational/warning/error messages) were provided:
    -INFO- Optional dependency commons-fileupload prerequisite failed with reason build failed
    -INFO- Optional dependency httpunit failed with reason build failed
    -DEBUG- (Apache Gump generated) Apache Maven Settings in: /srv/gump/public/workspace/turbine-core/gump_mvn_settings.xml
    -INFO- Failed with reason build failed
    -DEBUG- Maven POM in: /srv/gump/public/workspace/turbine-core/pom.xml
    -INFO- Failed to extract fallback artifacts from Gump Repository



    The following work was performed:
    http://vmgump.apache.org/gump/public/turbine-core/turbine-core/gump_work/build_turbine-core_turbine-core.html
    Work Name: build_turbine-core_turbine-core (Type: Build)
    Work ended in a state of : Failed
    Elapsed: 20 secs
    Command Line: /opt/maven2/bin/mvn --batch-mode -DskipTests=true --settings /srv/gump/public/workspace/turbine-core/gump_mvn_settings.xml package
    [Working Directory: /srv/gump/public/workspace/turbine-core]
    M2_HOME: /opt/maven2
    ---------------------------------------------
    urls[19] = file:/srv/gump/public/workspace/mvnlocalrepo/shared/xml-apis/xml-apis/1.0.b2/xml-apis-1.0.b2.jar
    urls[20] = file:/srv/gump/public/workspace/mvnlocalrepo/shared/commons-configuration/commons-configuration/1.4/commons-configuration-1.4.jar
    urls[21] = file:/srv/gump/public/workspace/mvnlocalrepo/shared/commons-logging/commons-logging-api/1.0.4/commons-logging-api-1.0.4.jar
    urls[22] = file:/srv/gump/public/workspace/mvnlocalrepo/shared/commons-digester/commons-digester/1.8/commons-digester-1.8.jar
    urls[23] = file:/srv/gump/public/workspace/mvnlocalrepo/shared/commons-beanutils/commons-beanutils/1.7.0/commons-beanutils-1.7.0.jar
    urls[24] = file:/srv/gump/public/workspace/mvnlocalrepo/shared/commons-beanutils/commons-beanutils-core/1.7.0/commons-beanutils-core-1.7.0.jar
    urls[25] = file:/srv/gump/public/workspace/mvnlocalrepo/shared/commons-codec/commons-codec/1.3/commons-codec-1.3.jar
    urls[26] = file:/srv/gump/public/workspace/mvnlocalrepo/shared/commons-jxpath/commons-jxpath/1.2/commons-jxpath-1.2.jar
    urls[27] = file:/srv/gump/public/workspace/mvnlocalrepo/shared/xerces/xerces/1.2.3/xerces-1.2.3.jar
    urls[28] = file:/srv/gump/public/workspace/mvnlocalrepo/shared/ant/ant-optional/1.5.1/ant-optional-1.5.1.jar
    urls[29] = file:/srv/gump/public/workspace/mvnlocalrepo/shared/jdom/jdom/b9/jdom-b9.jar
    Number of imports: 10
    import: org.codehaus.classworlds.Entry@a6c57a42
    import: org.codehaus.classworlds.Entry@12f43f3b
    import: org.codehaus.classworlds.Entry@20025374
    import: org.codehaus.classworlds.Entry@f8e44ca4
    import: org.codehaus.classworlds.Entry@92758522
    import: org.codehaus.classworlds.Entry@ebf2705b
    import: org.codehaus.classworlds.Entry@bb25e54
    import: org.codehaus.classworlds.Entry@bece5185
    import: org.codehaus.classworlds.Entry@3fee8e37
    import: org.codehaus.classworlds.Entry@3fee19d8


    this realm = plexus.core
    urls[0] = file:/opt/maven2/lib/maven-2.2.1-uber.jar
    Number of imports: 10
    import: org.codehaus.classworlds.Entry@a6c57a42
    import: org.codehaus.classworlds.Entry@12f43f3b
    import: org.codehaus.classworlds.Entry@20025374
    import: org.codehaus.classworlds.Entry@f8e44ca4
    import: org.codehaus.classworlds.Entry@92758522
    import: org.codehaus.classworlds.Entry@ebf2705b
    import: org.codehaus.classworlds.Entry@bb25e54
    import: org.codehaus.classworlds.Entry@bece5185
    import: org.codehaus.classworlds.Entry@3fee8e37
    import: org.codehaus.classworlds.Entry@3fee19d8
    -----------------------------------------------------
    [INFO] ------------------------------------------------------------------------
    [ERROR] BUILD ERROR
    [INFO] ------------------------------------------------------------------------
    [INFO] Internal error in the plugin manager executing goal 'org.apache.torque:torque-maven-plugin:3.3:om': Unable to load the mojo 'org.apache.torque:torque-maven-plugin:3.3:om' in the plugin 'org.apache.torque:torque-maven-plugin'. A required class is missing: org/apache/torque/task/TorqueDataModelTask
    org.apache.torque.task.TorqueDataModelTask
    [INFO] ------------------------------------------------------------------------
    [INFO] For more information, run Maven with the -e switch
    [INFO] ------------------------------------------------------------------------
    [INFO] Total time: 19 seconds
    [INFO] Finished at: Fri Sep 30 14:04:44 UTC 2011
    [INFO] Final Memory: 30M/71M
    [INFO] ------------------------------------------------------------------------
    ---------------------------------------------

    To subscribe to this information via syndicated feeds:
    - RSS: http://vmgump.apache.org/gump/public/turbine-core/turbine-core/rss.xml
    - Atom: http://vmgump.apache.org/gump/public/turbine-core/turbine-core/atom.xml

    ============================== Gump Tracking Only ===
    Produced by Apache Gump(TM) version 2.3.
    Gump Run 05000630092011, vmgump.apache.org:vmgump:05000630092011
    Gump E-mail Identifier (unique within run) #58.

    --
    Apache Gump
    http://gump.apache.org/ [Instance: vmgump]

    ---------------------------------------------------------------------
    To unsubscribe, e-mail: dev-unsubscribe@turbine.apache.org
    For additional commands, e-mail: dev-help@turbine.apache.org

Related Discussions

Discussion Navigation
viewthread | post
Discussion Overview
groupdev @
categoriesturbine
postedSep 1, '11 at 11:35a
activeSep 30, '11 at 2:05p
posts30
users1
websiteturbine.apache.org

1 user in discussion

Anonymous: 30 posts

People

Translate

site design / logo © 2019 Grokbase