FAQ
To whom it may engage...

This is an automated request, but not an unsolicited one. For
more information please visit http://gump.apache.org/nagged.html,
and/or contact the folk at general@gump.apache.org.

Project turbine-core has an issue affecting its community integration.
This issue affects 2 projects,
and has been outstanding for 307 runs.
The current state of this project is 'Failed', with reason 'Build Failed'.
For reference only, the following projects are affected by this:
- turbine-core : A servlet based framework.
- turbine-core-test : A servlet based framework.


Full details are available at:
http://vmgump.apache.org/gump/public/turbine-core/turbine-core/index.html

That said, some information snippets are provided here.

The following annotations (debug/informational/warning/error messages) were provided:
-INFO- Optional dependency commons-fileupload prerequisite failed with reason build failed
-INFO- Optional dependency httpunit failed with reason build failed
-DEBUG- (Apache Gump generated) Apache Maven Settings in: /srv/gump/public/workspace/turbine-core/gump_mvn_settings.xml
-INFO- Failed with reason build failed
-DEBUG- Maven POM in: /srv/gump/public/workspace/turbine-core/pom.xml
-INFO- Failed to extract fallback artifacts from Gump Repository



The following work was performed:
http://vmgump.apache.org/gump/public/turbine-core/turbine-core/gump_work/build_turbine-core_turbine-core.html
Work Name: build_turbine-core_turbine-core (Type: Build)
Work ended in a state of : Failed
Elapsed: 26 secs
Command Line: /opt/maven2/bin/mvn --batch-mode -DskipTests=true --settings /srv/gump/public/workspace/turbine-core/gump_mvn_settings.xml package
[Working Directory: /srv/gump/public/workspace/turbine-core]
M2_HOME: /opt/maven2
---------------------------------------------
urls[19] = file:/srv/gump/public/workspace/mvnlocalrepo/shared/xml-apis/xml-apis/1.0.b2/xml-apis-1.0.b2.jar
urls[20] = file:/srv/gump/public/workspace/mvnlocalrepo/shared/commons-configuration/commons-configuration/1.4/commons-configuration-1.4.jar
urls[21] = file:/srv/gump/public/workspace/mvnlocalrepo/shared/commons-logging/commons-logging-api/1.0.4/commons-logging-api-1.0.4.jar
urls[22] = file:/srv/gump/public/workspace/mvnlocalrepo/shared/commons-digester/commons-digester/1.8/commons-digester-1.8.jar
urls[23] = file:/srv/gump/public/workspace/mvnlocalrepo/shared/commons-beanutils/commons-beanutils/1.7.0/commons-beanutils-1.7.0.jar
urls[24] = file:/srv/gump/public/workspace/mvnlocalrepo/shared/commons-beanutils/commons-beanutils-core/1.7.0/commons-beanutils-core-1.7.0.jar
urls[25] = file:/srv/gump/public/workspace/mvnlocalrepo/shared/commons-codec/commons-codec/1.3/commons-codec-1.3.jar
urls[26] = file:/srv/gump/public/workspace/mvnlocalrepo/shared/commons-jxpath/commons-jxpath/1.2/commons-jxpath-1.2.jar
urls[27] = file:/srv/gump/public/workspace/mvnlocalrepo/shared/xerces/xerces/1.2.3/xerces-1.2.3.jar
urls[28] = file:/srv/gump/public/workspace/mvnlocalrepo/shared/ant/ant-optional/1.5.1/ant-optional-1.5.1.jar
urls[29] = file:/srv/gump/public/workspace/mvnlocalrepo/shared/jdom/jdom/b9/jdom-b9.jar
Number of imports: 10
import: org.codehaus.classworlds.Entry@a6c57a42
import: org.codehaus.classworlds.Entry@12f43f3b
import: org.codehaus.classworlds.Entry@20025374
import: org.codehaus.classworlds.Entry@f8e44ca4
import: org.codehaus.classworlds.Entry@92758522
import: org.codehaus.classworlds.Entry@ebf2705b
import: org.codehaus.classworlds.Entry@bb25e54
import: org.codehaus.classworlds.Entry@bece5185
import: org.codehaus.classworlds.Entry@3fee8e37
import: org.codehaus.classworlds.Entry@3fee19d8


this realm = plexus.core
urls[0] = file:/opt/maven2/lib/maven-2.2.1-uber.jar
Number of imports: 10
import: org.codehaus.classworlds.Entry@a6c57a42
import: org.codehaus.classworlds.Entry@12f43f3b
import: org.codehaus.classworlds.Entry@20025374
import: org.codehaus.classworlds.Entry@f8e44ca4
import: org.codehaus.classworlds.Entry@92758522
import: org.codehaus.classworlds.Entry@ebf2705b
import: org.codehaus.classworlds.Entry@bb25e54
import: org.codehaus.classworlds.Entry@bece5185
import: org.codehaus.classworlds.Entry@3fee8e37
import: org.codehaus.classworlds.Entry@3fee19d8
-----------------------------------------------------
[INFO] ------------------------------------------------------------------------
[ERROR] BUILD ERROR
[INFO] ------------------------------------------------------------------------
[INFO] Internal error in the plugin manager executing goal 'org.apache.torque:torque-maven-plugin:3.3:om': Unable to load the mojo 'org.apache.torque:torque-maven-plugin:3.3:om' in the plugin 'org.apache.torque:torque-maven-plugin'. A required class is missing: org/apache/torque/task/TorqueDataModelTask
org.apache.torque.task.TorqueDataModelTask
[INFO] ------------------------------------------------------------------------
[INFO] For more information, run Maven with the -e switch
[INFO] ------------------------------------------------------------------------
[INFO] Total time: 25 seconds
[INFO] Finished at: Mon Aug 01 11:53:41 UTC 2011
[INFO] Final Memory: 30M/72M
[INFO] ------------------------------------------------------------------------
---------------------------------------------

To subscribe to this information via syndicated feeds:
- RSS: http://vmgump.apache.org/gump/public/turbine-core/turbine-core/rss.xml
- Atom: http://vmgump.apache.org/gump/public/turbine-core/turbine-core/atom.xml

============================== Gump Tracking Only ===
Produced by Apache Gump(TM) version 2.3.
Gump Run 05000601082011, vmgump.apache.org:vmgump:05000601082011
Gump E-mail Identifier (unique within run) #37.

--
Apache Gump
http://gump.apache.org/ [Instance: vmgump]

---------------------------------------------------------------------
To unsubscribe, e-mail: dev-unsubscribe@turbine.apache.org
For additional commands, e-mail: dev-help@turbine.apache.org

Search Discussions

  • Anonymous at Aug 2, 2011 at 12:00 pm
    To whom it may engage...

    This is an automated request, but not an unsolicited one. For
    more information please visit http://gump.apache.org/nagged.html,
    and/or contact the folk at general@gump.apache.org.

    Project turbine-core has an issue affecting its community integration.
    This issue affects 2 projects,
    and has been outstanding for 309 runs.
    The current state of this project is 'Failed', with reason 'Build Failed'.
    For reference only, the following projects are affected by this:
    - turbine-core : A servlet based framework.
    - turbine-core-test : A servlet based framework.


    Full details are available at:
    http://vmgump.apache.org/gump/public/turbine-core/turbine-core/index.html

    That said, some information snippets are provided here.

    The following annotations (debug/informational/warning/error messages) were provided:
    -INFO- Optional dependency commons-fileupload prerequisite failed with reason build failed
    -INFO- Optional dependency httpunit failed with reason build failed
    -DEBUG- (Apache Gump generated) Apache Maven Settings in: /srv/gump/public/workspace/turbine-core/gump_mvn_settings.xml
    -INFO- Failed with reason build failed
    -DEBUG- Maven POM in: /srv/gump/public/workspace/turbine-core/pom.xml
    -INFO- Failed to extract fallback artifacts from Gump Repository



    The following work was performed:
    http://vmgump.apache.org/gump/public/turbine-core/turbine-core/gump_work/build_turbine-core_turbine-core.html
    Work Name: build_turbine-core_turbine-core (Type: Build)
    Work ended in a state of : Failed
    Elapsed: 26 secs
    Command Line: /opt/maven2/bin/mvn --batch-mode -DskipTests=true --settings /srv/gump/public/workspace/turbine-core/gump_mvn_settings.xml package
    [Working Directory: /srv/gump/public/workspace/turbine-core]
    M2_HOME: /opt/maven2
    ---------------------------------------------
    urls[19] = file:/srv/gump/public/workspace/mvnlocalrepo/shared/xml-apis/xml-apis/1.0.b2/xml-apis-1.0.b2.jar
    urls[20] = file:/srv/gump/public/workspace/mvnlocalrepo/shared/commons-configuration/commons-configuration/1.4/commons-configuration-1.4.jar
    urls[21] = file:/srv/gump/public/workspace/mvnlocalrepo/shared/commons-logging/commons-logging-api/1.0.4/commons-logging-api-1.0.4.jar
    urls[22] = file:/srv/gump/public/workspace/mvnlocalrepo/shared/commons-digester/commons-digester/1.8/commons-digester-1.8.jar
    urls[23] = file:/srv/gump/public/workspace/mvnlocalrepo/shared/commons-beanutils/commons-beanutils/1.7.0/commons-beanutils-1.7.0.jar
    urls[24] = file:/srv/gump/public/workspace/mvnlocalrepo/shared/commons-beanutils/commons-beanutils-core/1.7.0/commons-beanutils-core-1.7.0.jar
    urls[25] = file:/srv/gump/public/workspace/mvnlocalrepo/shared/commons-codec/commons-codec/1.3/commons-codec-1.3.jar
    urls[26] = file:/srv/gump/public/workspace/mvnlocalrepo/shared/commons-jxpath/commons-jxpath/1.2/commons-jxpath-1.2.jar
    urls[27] = file:/srv/gump/public/workspace/mvnlocalrepo/shared/xerces/xerces/1.2.3/xerces-1.2.3.jar
    urls[28] = file:/srv/gump/public/workspace/mvnlocalrepo/shared/ant/ant-optional/1.5.1/ant-optional-1.5.1.jar
    urls[29] = file:/srv/gump/public/workspace/mvnlocalrepo/shared/jdom/jdom/b9/jdom-b9.jar
    Number of imports: 10
    import: org.codehaus.classworlds.Entry@a6c57a42
    import: org.codehaus.classworlds.Entry@12f43f3b
    import: org.codehaus.classworlds.Entry@20025374
    import: org.codehaus.classworlds.Entry@f8e44ca4
    import: org.codehaus.classworlds.Entry@92758522
    import: org.codehaus.classworlds.Entry@ebf2705b
    import: org.codehaus.classworlds.Entry@bb25e54
    import: org.codehaus.classworlds.Entry@bece5185
    import: org.codehaus.classworlds.Entry@3fee8e37
    import: org.codehaus.classworlds.Entry@3fee19d8


    this realm = plexus.core
    urls[0] = file:/opt/maven2/lib/maven-2.2.1-uber.jar
    Number of imports: 10
    import: org.codehaus.classworlds.Entry@a6c57a42
    import: org.codehaus.classworlds.Entry@12f43f3b
    import: org.codehaus.classworlds.Entry@20025374
    import: org.codehaus.classworlds.Entry@f8e44ca4
    import: org.codehaus.classworlds.Entry@92758522
    import: org.codehaus.classworlds.Entry@ebf2705b
    import: org.codehaus.classworlds.Entry@bb25e54
    import: org.codehaus.classworlds.Entry@bece5185
    import: org.codehaus.classworlds.Entry@3fee8e37
    import: org.codehaus.classworlds.Entry@3fee19d8
    -----------------------------------------------------
    [INFO] ------------------------------------------------------------------------
    [ERROR] BUILD ERROR
    [INFO] ------------------------------------------------------------------------
    [INFO] Internal error in the plugin manager executing goal 'org.apache.torque:torque-maven-plugin:3.3:om': Unable to load the mojo 'org.apache.torque:torque-maven-plugin:3.3:om' in the plugin 'org.apache.torque:torque-maven-plugin'. A required class is missing: org/apache/torque/task/TorqueDataModelTask
    org.apache.torque.task.TorqueDataModelTask
    [INFO] ------------------------------------------------------------------------
    [INFO] For more information, run Maven with the -e switch
    [INFO] ------------------------------------------------------------------------
    [INFO] Total time: 25 seconds
    [INFO] Finished at: Tue Aug 02 12:00:06 UTC 2011
    [INFO] Final Memory: 30M/72M
    [INFO] ------------------------------------------------------------------------
    ---------------------------------------------

    To subscribe to this information via syndicated feeds:
    - RSS: http://vmgump.apache.org/gump/public/turbine-core/turbine-core/rss.xml
    - Atom: http://vmgump.apache.org/gump/public/turbine-core/turbine-core/atom.xml

    ============================== Gump Tracking Only ===
    Produced by Apache Gump(TM) version 2.3.
    Gump Run 06000602082011, vmgump.apache.org:vmgump:06000602082011
    Gump E-mail Identifier (unique within run) #34.

    --
    Apache Gump
    http://gump.apache.org/ [Instance: vmgump]

    ---------------------------------------------------------------------
    To unsubscribe, e-mail: dev-unsubscribe@turbine.apache.org
    For additional commands, e-mail: dev-help@turbine.apache.org
  • Anonymous at Aug 3, 2011 at 11:52 am
    To whom it may engage...

    This is an automated request, but not an unsolicited one. For
    more information please visit http://gump.apache.org/nagged.html,
    and/or contact the folk at general@gump.apache.org.

    Project turbine-core has an issue affecting its community integration.
    This issue affects 2 projects,
    and has been outstanding for 311 runs.
    The current state of this project is 'Failed', with reason 'Build Failed'.
    For reference only, the following projects are affected by this:
    - turbine-core : A servlet based framework.
    - turbine-core-test : A servlet based framework.


    Full details are available at:
    http://vmgump.apache.org/gump/public/turbine-core/turbine-core/index.html

    That said, some information snippets are provided here.

    The following annotations (debug/informational/warning/error messages) were provided:
    -INFO- Optional dependency commons-fileupload prerequisite failed with reason build failed
    -INFO- Optional dependency httpunit failed with reason build failed
    -DEBUG- (Apache Gump generated) Apache Maven Settings in: /srv/gump/public/workspace/turbine-core/gump_mvn_settings.xml
    -INFO- Failed with reason build failed
    -DEBUG- Maven POM in: /srv/gump/public/workspace/turbine-core/pom.xml
    -INFO- Failed to extract fallback artifacts from Gump Repository



    The following work was performed:
    http://vmgump.apache.org/gump/public/turbine-core/turbine-core/gump_work/build_turbine-core_turbine-core.html
    Work Name: build_turbine-core_turbine-core (Type: Build)
    Work ended in a state of : Failed
    Elapsed: 26 secs
    Command Line: /opt/maven2/bin/mvn --batch-mode -DskipTests=true --settings /srv/gump/public/workspace/turbine-core/gump_mvn_settings.xml package
    [Working Directory: /srv/gump/public/workspace/turbine-core]
    M2_HOME: /opt/maven2
    ---------------------------------------------
    urls[19] = file:/srv/gump/public/workspace/mvnlocalrepo/shared/xml-apis/xml-apis/1.0.b2/xml-apis-1.0.b2.jar
    urls[20] = file:/srv/gump/public/workspace/mvnlocalrepo/shared/commons-configuration/commons-configuration/1.4/commons-configuration-1.4.jar
    urls[21] = file:/srv/gump/public/workspace/mvnlocalrepo/shared/commons-logging/commons-logging-api/1.0.4/commons-logging-api-1.0.4.jar
    urls[22] = file:/srv/gump/public/workspace/mvnlocalrepo/shared/commons-digester/commons-digester/1.8/commons-digester-1.8.jar
    urls[23] = file:/srv/gump/public/workspace/mvnlocalrepo/shared/commons-beanutils/commons-beanutils/1.7.0/commons-beanutils-1.7.0.jar
    urls[24] = file:/srv/gump/public/workspace/mvnlocalrepo/shared/commons-beanutils/commons-beanutils-core/1.7.0/commons-beanutils-core-1.7.0.jar
    urls[25] = file:/srv/gump/public/workspace/mvnlocalrepo/shared/commons-codec/commons-codec/1.3/commons-codec-1.3.jar
    urls[26] = file:/srv/gump/public/workspace/mvnlocalrepo/shared/commons-jxpath/commons-jxpath/1.2/commons-jxpath-1.2.jar
    urls[27] = file:/srv/gump/public/workspace/mvnlocalrepo/shared/xerces/xerces/1.2.3/xerces-1.2.3.jar
    urls[28] = file:/srv/gump/public/workspace/mvnlocalrepo/shared/ant/ant-optional/1.5.1/ant-optional-1.5.1.jar
    urls[29] = file:/srv/gump/public/workspace/mvnlocalrepo/shared/jdom/jdom/b9/jdom-b9.jar
    Number of imports: 10
    import: org.codehaus.classworlds.Entry@a6c57a42
    import: org.codehaus.classworlds.Entry@12f43f3b
    import: org.codehaus.classworlds.Entry@20025374
    import: org.codehaus.classworlds.Entry@f8e44ca4
    import: org.codehaus.classworlds.Entry@92758522
    import: org.codehaus.classworlds.Entry@ebf2705b
    import: org.codehaus.classworlds.Entry@bb25e54
    import: org.codehaus.classworlds.Entry@bece5185
    import: org.codehaus.classworlds.Entry@3fee8e37
    import: org.codehaus.classworlds.Entry@3fee19d8


    this realm = plexus.core
    urls[0] = file:/opt/maven2/lib/maven-2.2.1-uber.jar
    Number of imports: 10
    import: org.codehaus.classworlds.Entry@a6c57a42
    import: org.codehaus.classworlds.Entry@12f43f3b
    import: org.codehaus.classworlds.Entry@20025374
    import: org.codehaus.classworlds.Entry@f8e44ca4
    import: org.codehaus.classworlds.Entry@92758522
    import: org.codehaus.classworlds.Entry@ebf2705b
    import: org.codehaus.classworlds.Entry@bb25e54
    import: org.codehaus.classworlds.Entry@bece5185
    import: org.codehaus.classworlds.Entry@3fee8e37
    import: org.codehaus.classworlds.Entry@3fee19d8
    -----------------------------------------------------
    [INFO] ------------------------------------------------------------------------
    [ERROR] BUILD ERROR
    [INFO] ------------------------------------------------------------------------
    [INFO] Internal error in the plugin manager executing goal 'org.apache.torque:torque-maven-plugin:3.3:om': Unable to load the mojo 'org.apache.torque:torque-maven-plugin:3.3:om' in the plugin 'org.apache.torque:torque-maven-plugin'. A required class is missing: org/apache/torque/task/TorqueDataModelTask
    org.apache.torque.task.TorqueDataModelTask
    [INFO] ------------------------------------------------------------------------
    [INFO] For more information, run Maven with the -e switch
    [INFO] ------------------------------------------------------------------------
    [INFO] Total time: 25 seconds
    [INFO] Finished at: Wed Aug 03 11:52:07 UTC 2011
    [INFO] Final Memory: 30M/72M
    [INFO] ------------------------------------------------------------------------
    ---------------------------------------------

    To subscribe to this information via syndicated feeds:
    - RSS: http://vmgump.apache.org/gump/public/turbine-core/turbine-core/rss.xml
    - Atom: http://vmgump.apache.org/gump/public/turbine-core/turbine-core/atom.xml

    ============================== Gump Tracking Only ===
    Produced by Apache Gump(TM) version 2.3.
    Gump Run 06000603082011, vmgump.apache.org:vmgump:06000603082011
    Gump E-mail Identifier (unique within run) #34.

    --
    Apache Gump
    http://gump.apache.org/ [Instance: vmgump]

    ---------------------------------------------------------------------
    To unsubscribe, e-mail: dev-unsubscribe@turbine.apache.org
    For additional commands, e-mail: dev-help@turbine.apache.org
  • Anonymous at Aug 4, 2011 at 11:56 am
    To whom it may engage...

    This is an automated request, but not an unsolicited one. For
    more information please visit http://gump.apache.org/nagged.html,
    and/or contact the folk at general@gump.apache.org.

    Project turbine-core has an issue affecting its community integration.
    This issue affects 2 projects,
    and has been outstanding for 313 runs.
    The current state of this project is 'Failed', with reason 'Build Failed'.
    For reference only, the following projects are affected by this:
    - turbine-core : A servlet based framework.
    - turbine-core-test : A servlet based framework.


    Full details are available at:
    http://vmgump.apache.org/gump/public/turbine-core/turbine-core/index.html

    That said, some information snippets are provided here.

    The following annotations (debug/informational/warning/error messages) were provided:
    -INFO- Optional dependency commons-fileupload prerequisite failed with reason build failed
    -INFO- Optional dependency httpunit failed with reason build failed
    -DEBUG- (Apache Gump generated) Apache Maven Settings in: /srv/gump/public/workspace/turbine-core/gump_mvn_settings.xml
    -INFO- Failed with reason build failed
    -DEBUG- Maven POM in: /srv/gump/public/workspace/turbine-core/pom.xml
    -INFO- Failed to extract fallback artifacts from Gump Repository



    The following work was performed:
    http://vmgump.apache.org/gump/public/turbine-core/turbine-core/gump_work/build_turbine-core_turbine-core.html
    Work Name: build_turbine-core_turbine-core (Type: Build)
    Work ended in a state of : Failed
    Elapsed: 28 secs
    Command Line: /opt/maven2/bin/mvn --batch-mode -DskipTests=true --settings /srv/gump/public/workspace/turbine-core/gump_mvn_settings.xml package
    [Working Directory: /srv/gump/public/workspace/turbine-core]
    M2_HOME: /opt/maven2
    ---------------------------------------------
    urls[19] = file:/srv/gump/public/workspace/mvnlocalrepo/shared/xml-apis/xml-apis/1.0.b2/xml-apis-1.0.b2.jar
    urls[20] = file:/srv/gump/public/workspace/mvnlocalrepo/shared/commons-configuration/commons-configuration/1.4/commons-configuration-1.4.jar
    urls[21] = file:/srv/gump/public/workspace/mvnlocalrepo/shared/commons-logging/commons-logging-api/1.0.4/commons-logging-api-1.0.4.jar
    urls[22] = file:/srv/gump/public/workspace/mvnlocalrepo/shared/commons-digester/commons-digester/1.8/commons-digester-1.8.jar
    urls[23] = file:/srv/gump/public/workspace/mvnlocalrepo/shared/commons-beanutils/commons-beanutils/1.7.0/commons-beanutils-1.7.0.jar
    urls[24] = file:/srv/gump/public/workspace/mvnlocalrepo/shared/commons-beanutils/commons-beanutils-core/1.7.0/commons-beanutils-core-1.7.0.jar
    urls[25] = file:/srv/gump/public/workspace/mvnlocalrepo/shared/commons-codec/commons-codec/1.3/commons-codec-1.3.jar
    urls[26] = file:/srv/gump/public/workspace/mvnlocalrepo/shared/commons-jxpath/commons-jxpath/1.2/commons-jxpath-1.2.jar
    urls[27] = file:/srv/gump/public/workspace/mvnlocalrepo/shared/xerces/xerces/1.2.3/xerces-1.2.3.jar
    urls[28] = file:/srv/gump/public/workspace/mvnlocalrepo/shared/ant/ant-optional/1.5.1/ant-optional-1.5.1.jar
    urls[29] = file:/srv/gump/public/workspace/mvnlocalrepo/shared/jdom/jdom/b9/jdom-b9.jar
    Number of imports: 10
    import: org.codehaus.classworlds.Entry@a6c57a42
    import: org.codehaus.classworlds.Entry@12f43f3b
    import: org.codehaus.classworlds.Entry@20025374
    import: org.codehaus.classworlds.Entry@f8e44ca4
    import: org.codehaus.classworlds.Entry@92758522
    import: org.codehaus.classworlds.Entry@ebf2705b
    import: org.codehaus.classworlds.Entry@bb25e54
    import: org.codehaus.classworlds.Entry@bece5185
    import: org.codehaus.classworlds.Entry@3fee8e37
    import: org.codehaus.classworlds.Entry@3fee19d8


    this realm = plexus.core
    urls[0] = file:/opt/maven2/lib/maven-2.2.1-uber.jar
    Number of imports: 10
    import: org.codehaus.classworlds.Entry@a6c57a42
    import: org.codehaus.classworlds.Entry@12f43f3b
    import: org.codehaus.classworlds.Entry@20025374
    import: org.codehaus.classworlds.Entry@f8e44ca4
    import: org.codehaus.classworlds.Entry@92758522
    import: org.codehaus.classworlds.Entry@ebf2705b
    import: org.codehaus.classworlds.Entry@bb25e54
    import: org.codehaus.classworlds.Entry@bece5185
    import: org.codehaus.classworlds.Entry@3fee8e37
    import: org.codehaus.classworlds.Entry@3fee19d8
    -----------------------------------------------------
    [INFO] ------------------------------------------------------------------------
    [ERROR] BUILD ERROR
    [INFO] ------------------------------------------------------------------------
    [INFO] Internal error in the plugin manager executing goal 'org.apache.torque:torque-maven-plugin:3.3:om': Unable to load the mojo 'org.apache.torque:torque-maven-plugin:3.3:om' in the plugin 'org.apache.torque:torque-maven-plugin'. A required class is missing: org/apache/torque/task/TorqueDataModelTask
    org.apache.torque.task.TorqueDataModelTask
    [INFO] ------------------------------------------------------------------------
    [INFO] For more information, run Maven with the -e switch
    [INFO] ------------------------------------------------------------------------
    [INFO] Total time: 27 seconds
    [INFO] Finished at: Thu Aug 04 11:55:55 UTC 2011
    [INFO] Final Memory: 30M/72M
    [INFO] ------------------------------------------------------------------------
    ---------------------------------------------

    To subscribe to this information via syndicated feeds:
    - RSS: http://vmgump.apache.org/gump/public/turbine-core/turbine-core/rss.xml
    - Atom: http://vmgump.apache.org/gump/public/turbine-core/turbine-core/atom.xml

    ============================== Gump Tracking Only ===
    Produced by Apache Gump(TM) version 2.3.
    Gump Run 05000604082011, vmgump.apache.org:vmgump:05000604082011
    Gump E-mail Identifier (unique within run) #35.

    --
    Apache Gump
    http://gump.apache.org/ [Instance: vmgump]

    ---------------------------------------------------------------------
    To unsubscribe, e-mail: dev-unsubscribe@turbine.apache.org
    For additional commands, e-mail: dev-help@turbine.apache.org
  • Anonymous at Aug 5, 2011 at 11:49 am
    To whom it may engage...

    This is an automated request, but not an unsolicited one. For
    more information please visit http://gump.apache.org/nagged.html,
    and/or contact the folk at general@gump.apache.org.

    Project turbine-core has an issue affecting its community integration.
    This issue affects 2 projects,
    and has been outstanding for 315 runs.
    The current state of this project is 'Failed', with reason 'Build Failed'.
    For reference only, the following projects are affected by this:
    - turbine-core : A servlet based framework.
    - turbine-core-test : A servlet based framework.


    Full details are available at:
    http://vmgump.apache.org/gump/public/turbine-core/turbine-core/index.html

    That said, some information snippets are provided here.

    The following annotations (debug/informational/warning/error messages) were provided:
    -INFO- Optional dependency commons-fileupload prerequisite failed with reason build failed
    -INFO- Optional dependency httpunit failed with reason build failed
    -DEBUG- (Apache Gump generated) Apache Maven Settings in: /srv/gump/public/workspace/turbine-core/gump_mvn_settings.xml
    -INFO- Failed with reason build failed
    -DEBUG- Maven POM in: /srv/gump/public/workspace/turbine-core/pom.xml
    -INFO- Failed to extract fallback artifacts from Gump Repository



    The following work was performed:
    http://vmgump.apache.org/gump/public/turbine-core/turbine-core/gump_work/build_turbine-core_turbine-core.html
    Work Name: build_turbine-core_turbine-core (Type: Build)
    Work ended in a state of : Failed
    Elapsed: 27 secs
    Command Line: /opt/maven2/bin/mvn --batch-mode -DskipTests=true --settings /srv/gump/public/workspace/turbine-core/gump_mvn_settings.xml package
    [Working Directory: /srv/gump/public/workspace/turbine-core]
    M2_HOME: /opt/maven2
    ---------------------------------------------
    urls[19] = file:/srv/gump/public/workspace/mvnlocalrepo/shared/xml-apis/xml-apis/1.0.b2/xml-apis-1.0.b2.jar
    urls[20] = file:/srv/gump/public/workspace/mvnlocalrepo/shared/commons-configuration/commons-configuration/1.4/commons-configuration-1.4.jar
    urls[21] = file:/srv/gump/public/workspace/mvnlocalrepo/shared/commons-logging/commons-logging-api/1.0.4/commons-logging-api-1.0.4.jar
    urls[22] = file:/srv/gump/public/workspace/mvnlocalrepo/shared/commons-digester/commons-digester/1.8/commons-digester-1.8.jar
    urls[23] = file:/srv/gump/public/workspace/mvnlocalrepo/shared/commons-beanutils/commons-beanutils/1.7.0/commons-beanutils-1.7.0.jar
    urls[24] = file:/srv/gump/public/workspace/mvnlocalrepo/shared/commons-beanutils/commons-beanutils-core/1.7.0/commons-beanutils-core-1.7.0.jar
    urls[25] = file:/srv/gump/public/workspace/mvnlocalrepo/shared/commons-codec/commons-codec/1.3/commons-codec-1.3.jar
    urls[26] = file:/srv/gump/public/workspace/mvnlocalrepo/shared/commons-jxpath/commons-jxpath/1.2/commons-jxpath-1.2.jar
    urls[27] = file:/srv/gump/public/workspace/mvnlocalrepo/shared/xerces/xerces/1.2.3/xerces-1.2.3.jar
    urls[28] = file:/srv/gump/public/workspace/mvnlocalrepo/shared/ant/ant-optional/1.5.1/ant-optional-1.5.1.jar
    urls[29] = file:/srv/gump/public/workspace/mvnlocalrepo/shared/jdom/jdom/b9/jdom-b9.jar
    Number of imports: 10
    import: org.codehaus.classworlds.Entry@a6c57a42
    import: org.codehaus.classworlds.Entry@12f43f3b
    import: org.codehaus.classworlds.Entry@20025374
    import: org.codehaus.classworlds.Entry@f8e44ca4
    import: org.codehaus.classworlds.Entry@92758522
    import: org.codehaus.classworlds.Entry@ebf2705b
    import: org.codehaus.classworlds.Entry@bb25e54
    import: org.codehaus.classworlds.Entry@bece5185
    import: org.codehaus.classworlds.Entry@3fee8e37
    import: org.codehaus.classworlds.Entry@3fee19d8


    this realm = plexus.core
    urls[0] = file:/opt/maven2/lib/maven-2.2.1-uber.jar
    Number of imports: 10
    import: org.codehaus.classworlds.Entry@a6c57a42
    import: org.codehaus.classworlds.Entry@12f43f3b
    import: org.codehaus.classworlds.Entry@20025374
    import: org.codehaus.classworlds.Entry@f8e44ca4
    import: org.codehaus.classworlds.Entry@92758522
    import: org.codehaus.classworlds.Entry@ebf2705b
    import: org.codehaus.classworlds.Entry@bb25e54
    import: org.codehaus.classworlds.Entry@bece5185
    import: org.codehaus.classworlds.Entry@3fee8e37
    import: org.codehaus.classworlds.Entry@3fee19d8
    -----------------------------------------------------
    [INFO] ------------------------------------------------------------------------
    [ERROR] BUILD ERROR
    [INFO] ------------------------------------------------------------------------
    [INFO] Internal error in the plugin manager executing goal 'org.apache.torque:torque-maven-plugin:3.3:om': Unable to load the mojo 'org.apache.torque:torque-maven-plugin:3.3:om' in the plugin 'org.apache.torque:torque-maven-plugin'. A required class is missing: org/apache/torque/task/TorqueDataModelTask
    org.apache.torque.task.TorqueDataModelTask
    [INFO] ------------------------------------------------------------------------
    [INFO] For more information, run Maven with the -e switch
    [INFO] ------------------------------------------------------------------------
    [INFO] Total time: 26 seconds
    [INFO] Finished at: Fri Aug 05 11:49:20 UTC 2011
    [INFO] Final Memory: 30M/72M
    [INFO] ------------------------------------------------------------------------
    ---------------------------------------------

    To subscribe to this information via syndicated feeds:
    - RSS: http://vmgump.apache.org/gump/public/turbine-core/turbine-core/rss.xml
    - Atom: http://vmgump.apache.org/gump/public/turbine-core/turbine-core/atom.xml

    ============================== Gump Tracking Only ===
    Produced by Apache Gump(TM) version 2.3.
    Gump Run 05000605082011, vmgump.apache.org:vmgump:05000605082011
    Gump E-mail Identifier (unique within run) #35.

    --
    Apache Gump
    http://gump.apache.org/ [Instance: vmgump]

    ---------------------------------------------------------------------
    To unsubscribe, e-mail: dev-unsubscribe@turbine.apache.org
    For additional commands, e-mail: dev-help@turbine.apache.org
  • Anonymous at Aug 6, 2011 at 11:57 am
    To whom it may engage...

    This is an automated request, but not an unsolicited one. For
    more information please visit http://gump.apache.org/nagged.html,
    and/or contact the folk at general@gump.apache.org.

    Project turbine-core has an issue affecting its community integration.
    This issue affects 2 projects,
    and has been outstanding for 317 runs.
    The current state of this project is 'Failed', with reason 'Build Failed'.
    For reference only, the following projects are affected by this:
    - turbine-core : A servlet based framework.
    - turbine-core-test : A servlet based framework.


    Full details are available at:
    http://vmgump.apache.org/gump/public/turbine-core/turbine-core/index.html

    That said, some information snippets are provided here.

    The following annotations (debug/informational/warning/error messages) were provided:
    -INFO- Optional dependency commons-fileupload prerequisite failed with reason build failed
    -INFO- Optional dependency xstream failed with reason missing build outputs
    -INFO- Optional dependency httpunit failed with reason build failed
    -DEBUG- (Apache Gump generated) Apache Maven Settings in: /srv/gump/public/workspace/turbine-core/gump_mvn_settings.xml
    -INFO- Failed with reason build failed
    -DEBUG- Maven POM in: /srv/gump/public/workspace/turbine-core/pom.xml
    -INFO- Failed to extract fallback artifacts from Gump Repository



    The following work was performed:
    http://vmgump.apache.org/gump/public/turbine-core/turbine-core/gump_work/build_turbine-core_turbine-core.html
    Work Name: build_turbine-core_turbine-core (Type: Build)
    Work ended in a state of : Failed
    Elapsed: 26 secs
    Command Line: /opt/maven2/bin/mvn --batch-mode -DskipTests=true --settings /srv/gump/public/workspace/turbine-core/gump_mvn_settings.xml package
    [Working Directory: /srv/gump/public/workspace/turbine-core]
    M2_HOME: /opt/maven2
    ---------------------------------------------
    urls[19] = file:/srv/gump/public/workspace/mvnlocalrepo/shared/xml-apis/xml-apis/1.0.b2/xml-apis-1.0.b2.jar
    urls[20] = file:/srv/gump/public/workspace/mvnlocalrepo/shared/commons-configuration/commons-configuration/1.4/commons-configuration-1.4.jar
    urls[21] = file:/srv/gump/public/workspace/mvnlocalrepo/shared/commons-logging/commons-logging-api/1.0.4/commons-logging-api-1.0.4.jar
    urls[22] = file:/srv/gump/public/workspace/mvnlocalrepo/shared/commons-digester/commons-digester/1.8/commons-digester-1.8.jar
    urls[23] = file:/srv/gump/public/workspace/mvnlocalrepo/shared/commons-beanutils/commons-beanutils/1.7.0/commons-beanutils-1.7.0.jar
    urls[24] = file:/srv/gump/public/workspace/mvnlocalrepo/shared/commons-beanutils/commons-beanutils-core/1.7.0/commons-beanutils-core-1.7.0.jar
    urls[25] = file:/srv/gump/public/workspace/mvnlocalrepo/shared/commons-codec/commons-codec/1.3/commons-codec-1.3.jar
    urls[26] = file:/srv/gump/public/workspace/mvnlocalrepo/shared/commons-jxpath/commons-jxpath/1.2/commons-jxpath-1.2.jar
    urls[27] = file:/srv/gump/public/workspace/mvnlocalrepo/shared/xerces/xerces/1.2.3/xerces-1.2.3.jar
    urls[28] = file:/srv/gump/public/workspace/mvnlocalrepo/shared/ant/ant-optional/1.5.1/ant-optional-1.5.1.jar
    urls[29] = file:/srv/gump/public/workspace/mvnlocalrepo/shared/jdom/jdom/b9/jdom-b9.jar
    Number of imports: 10
    import: org.codehaus.classworlds.Entry@a6c57a42
    import: org.codehaus.classworlds.Entry@12f43f3b
    import: org.codehaus.classworlds.Entry@20025374
    import: org.codehaus.classworlds.Entry@f8e44ca4
    import: org.codehaus.classworlds.Entry@92758522
    import: org.codehaus.classworlds.Entry@ebf2705b
    import: org.codehaus.classworlds.Entry@bb25e54
    import: org.codehaus.classworlds.Entry@bece5185
    import: org.codehaus.classworlds.Entry@3fee8e37
    import: org.codehaus.classworlds.Entry@3fee19d8


    this realm = plexus.core
    urls[0] = file:/opt/maven2/lib/maven-2.2.1-uber.jar
    Number of imports: 10
    import: org.codehaus.classworlds.Entry@a6c57a42
    import: org.codehaus.classworlds.Entry@12f43f3b
    import: org.codehaus.classworlds.Entry@20025374
    import: org.codehaus.classworlds.Entry@f8e44ca4
    import: org.codehaus.classworlds.Entry@92758522
    import: org.codehaus.classworlds.Entry@ebf2705b
    import: org.codehaus.classworlds.Entry@bb25e54
    import: org.codehaus.classworlds.Entry@bece5185
    import: org.codehaus.classworlds.Entry@3fee8e37
    import: org.codehaus.classworlds.Entry@3fee19d8
    -----------------------------------------------------
    [INFO] ------------------------------------------------------------------------
    [ERROR] BUILD ERROR
    [INFO] ------------------------------------------------------------------------
    [INFO] Internal error in the plugin manager executing goal 'org.apache.torque:torque-maven-plugin:3.3:om': Unable to load the mojo 'org.apache.torque:torque-maven-plugin:3.3:om' in the plugin 'org.apache.torque:torque-maven-plugin'. A required class is missing: org/apache/torque/task/TorqueDataModelTask
    org.apache.torque.task.TorqueDataModelTask
    [INFO] ------------------------------------------------------------------------
    [INFO] For more information, run Maven with the -e switch
    [INFO] ------------------------------------------------------------------------
    [INFO] Total time: 25 seconds
    [INFO] Finished at: Sat Aug 06 11:57:07 UTC 2011
    [INFO] Final Memory: 30M/72M
    [INFO] ------------------------------------------------------------------------
    ---------------------------------------------

    To subscribe to this information via syndicated feeds:
    - RSS: http://vmgump.apache.org/gump/public/turbine-core/turbine-core/rss.xml
    - Atom: http://vmgump.apache.org/gump/public/turbine-core/turbine-core/atom.xml

    ============================== Gump Tracking Only ===
    Produced by Apache Gump(TM) version 2.3.
    Gump Run 05000606082011, vmgump.apache.org:vmgump:05000606082011
    Gump E-mail Identifier (unique within run) #37.

    --
    Apache Gump
    http://gump.apache.org/ [Instance: vmgump]

    ---------------------------------------------------------------------
    To unsubscribe, e-mail: dev-unsubscribe@turbine.apache.org
    For additional commands, e-mail: dev-help@turbine.apache.org
  • Anonymous at Aug 7, 2011 at 12:26 pm
    To whom it may engage...

    This is an automated request, but not an unsolicited one. For
    more information please visit http://gump.apache.org/nagged.html,
    and/or contact the folk at general@gump.apache.org.

    Project turbine-core has an issue affecting its community integration.
    This issue affects 2 projects,
    and has been outstanding for 319 runs.
    The current state of this project is 'Failed', with reason 'Build Failed'.
    For reference only, the following projects are affected by this:
    - turbine-core : A servlet based framework.
    - turbine-core-test : A servlet based framework.


    Full details are available at:
    http://vmgump.apache.org/gump/public/turbine-core/turbine-core/index.html

    That said, some information snippets are provided here.

    The following annotations (debug/informational/warning/error messages) were provided:
    -INFO- Optional dependency commons-fileupload prerequisite failed with reason build failed
    -INFO- Optional dependency httpunit failed with reason build failed
    -DEBUG- (Apache Gump generated) Apache Maven Settings in: /srv/gump/public/workspace/turbine-core/gump_mvn_settings.xml
    -INFO- Failed with reason build failed
    -DEBUG- Maven POM in: /srv/gump/public/workspace/turbine-core/pom.xml
    -INFO- Failed to extract fallback artifacts from Gump Repository



    The following work was performed:
    http://vmgump.apache.org/gump/public/turbine-core/turbine-core/gump_work/build_turbine-core_turbine-core.html
    Work Name: build_turbine-core_turbine-core (Type: Build)
    Work ended in a state of : Failed
    Elapsed: 25 secs
    Command Line: /opt/maven2/bin/mvn --batch-mode -DskipTests=true --settings /srv/gump/public/workspace/turbine-core/gump_mvn_settings.xml package
    [Working Directory: /srv/gump/public/workspace/turbine-core]
    M2_HOME: /opt/maven2
    ---------------------------------------------
    urls[19] = file:/srv/gump/public/workspace/mvnlocalrepo/shared/xml-apis/xml-apis/1.0.b2/xml-apis-1.0.b2.jar
    urls[20] = file:/srv/gump/public/workspace/mvnlocalrepo/shared/commons-configuration/commons-configuration/1.4/commons-configuration-1.4.jar
    urls[21] = file:/srv/gump/public/workspace/mvnlocalrepo/shared/commons-logging/commons-logging-api/1.0.4/commons-logging-api-1.0.4.jar
    urls[22] = file:/srv/gump/public/workspace/mvnlocalrepo/shared/commons-digester/commons-digester/1.8/commons-digester-1.8.jar
    urls[23] = file:/srv/gump/public/workspace/mvnlocalrepo/shared/commons-beanutils/commons-beanutils/1.7.0/commons-beanutils-1.7.0.jar
    urls[24] = file:/srv/gump/public/workspace/mvnlocalrepo/shared/commons-beanutils/commons-beanutils-core/1.7.0/commons-beanutils-core-1.7.0.jar
    urls[25] = file:/srv/gump/public/workspace/mvnlocalrepo/shared/commons-codec/commons-codec/1.3/commons-codec-1.3.jar
    urls[26] = file:/srv/gump/public/workspace/mvnlocalrepo/shared/commons-jxpath/commons-jxpath/1.2/commons-jxpath-1.2.jar
    urls[27] = file:/srv/gump/public/workspace/mvnlocalrepo/shared/xerces/xerces/1.2.3/xerces-1.2.3.jar
    urls[28] = file:/srv/gump/public/workspace/mvnlocalrepo/shared/ant/ant-optional/1.5.1/ant-optional-1.5.1.jar
    urls[29] = file:/srv/gump/public/workspace/mvnlocalrepo/shared/jdom/jdom/b9/jdom-b9.jar
    Number of imports: 10
    import: org.codehaus.classworlds.Entry@a6c57a42
    import: org.codehaus.classworlds.Entry@12f43f3b
    import: org.codehaus.classworlds.Entry@20025374
    import: org.codehaus.classworlds.Entry@f8e44ca4
    import: org.codehaus.classworlds.Entry@92758522
    import: org.codehaus.classworlds.Entry@ebf2705b
    import: org.codehaus.classworlds.Entry@bb25e54
    import: org.codehaus.classworlds.Entry@bece5185
    import: org.codehaus.classworlds.Entry@3fee8e37
    import: org.codehaus.classworlds.Entry@3fee19d8


    this realm = plexus.core
    urls[0] = file:/opt/maven2/lib/maven-2.2.1-uber.jar
    Number of imports: 10
    import: org.codehaus.classworlds.Entry@a6c57a42
    import: org.codehaus.classworlds.Entry@12f43f3b
    import: org.codehaus.classworlds.Entry@20025374
    import: org.codehaus.classworlds.Entry@f8e44ca4
    import: org.codehaus.classworlds.Entry@92758522
    import: org.codehaus.classworlds.Entry@ebf2705b
    import: org.codehaus.classworlds.Entry@bb25e54
    import: org.codehaus.classworlds.Entry@bece5185
    import: org.codehaus.classworlds.Entry@3fee8e37
    import: org.codehaus.classworlds.Entry@3fee19d8
    -----------------------------------------------------
    [INFO] ------------------------------------------------------------------------
    [ERROR] BUILD ERROR
    [INFO] ------------------------------------------------------------------------
    [INFO] Internal error in the plugin manager executing goal 'org.apache.torque:torque-maven-plugin:3.3:om': Unable to load the mojo 'org.apache.torque:torque-maven-plugin:3.3:om' in the plugin 'org.apache.torque:torque-maven-plugin'. A required class is missing: org/apache/torque/task/TorqueDataModelTask
    org.apache.torque.task.TorqueDataModelTask
    [INFO] ------------------------------------------------------------------------
    [INFO] For more information, run Maven with the -e switch
    [INFO] ------------------------------------------------------------------------
    [INFO] Total time: 24 seconds
    [INFO] Finished at: Sun Aug 07 12:26:21 UTC 2011
    [INFO] Final Memory: 30M/72M
    [INFO] ------------------------------------------------------------------------
    ---------------------------------------------

    To subscribe to this information via syndicated feeds:
    - RSS: http://vmgump.apache.org/gump/public/turbine-core/turbine-core/rss.xml
    - Atom: http://vmgump.apache.org/gump/public/turbine-core/turbine-core/atom.xml

    ============================== Gump Tracking Only ===
    Produced by Apache Gump(TM) version 2.3.
    Gump Run 05000607082011, vmgump.apache.org:vmgump:05000607082011
    Gump E-mail Identifier (unique within run) #34.

    --
    Apache Gump
    http://gump.apache.org/ [Instance: vmgump]

    ---------------------------------------------------------------------
    To unsubscribe, e-mail: dev-unsubscribe@turbine.apache.org
    For additional commands, e-mail: dev-help@turbine.apache.org
  • Anonymous at Aug 8, 2011 at 11:58 am
    To whom it may engage...

    This is an automated request, but not an unsolicited one. For
    more information please visit http://gump.apache.org/nagged.html,
    and/or contact the folk at general@gump.apache.org.

    Project turbine-core has an issue affecting its community integration.
    This issue affects 2 projects,
    and has been outstanding for 321 runs.
    The current state of this project is 'Failed', with reason 'Build Failed'.
    For reference only, the following projects are affected by this:
    - turbine-core : A servlet based framework.
    - turbine-core-test : A servlet based framework.


    Full details are available at:
    http://vmgump.apache.org/gump/public/turbine-core/turbine-core/index.html

    That said, some information snippets are provided here.

    The following annotations (debug/informational/warning/error messages) were provided:
    -INFO- Optional dependency commons-fileupload prerequisite failed with reason build failed
    -INFO- Optional dependency httpunit failed with reason build failed
    -DEBUG- (Apache Gump generated) Apache Maven Settings in: /srv/gump/public/workspace/turbine-core/gump_mvn_settings.xml
    -INFO- Failed with reason build failed
    -DEBUG- Maven POM in: /srv/gump/public/workspace/turbine-core/pom.xml
    -INFO- Failed to extract fallback artifacts from Gump Repository



    The following work was performed:
    http://vmgump.apache.org/gump/public/turbine-core/turbine-core/gump_work/build_turbine-core_turbine-core.html
    Work Name: build_turbine-core_turbine-core (Type: Build)
    Work ended in a state of : Failed
    Elapsed: 27 secs
    Command Line: /opt/maven2/bin/mvn --batch-mode -DskipTests=true --settings /srv/gump/public/workspace/turbine-core/gump_mvn_settings.xml package
    [Working Directory: /srv/gump/public/workspace/turbine-core]
    M2_HOME: /opt/maven2
    ---------------------------------------------
    urls[19] = file:/srv/gump/public/workspace/mvnlocalrepo/shared/xml-apis/xml-apis/1.0.b2/xml-apis-1.0.b2.jar
    urls[20] = file:/srv/gump/public/workspace/mvnlocalrepo/shared/commons-configuration/commons-configuration/1.4/commons-configuration-1.4.jar
    urls[21] = file:/srv/gump/public/workspace/mvnlocalrepo/shared/commons-logging/commons-logging-api/1.0.4/commons-logging-api-1.0.4.jar
    urls[22] = file:/srv/gump/public/workspace/mvnlocalrepo/shared/commons-digester/commons-digester/1.8/commons-digester-1.8.jar
    urls[23] = file:/srv/gump/public/workspace/mvnlocalrepo/shared/commons-beanutils/commons-beanutils/1.7.0/commons-beanutils-1.7.0.jar
    urls[24] = file:/srv/gump/public/workspace/mvnlocalrepo/shared/commons-beanutils/commons-beanutils-core/1.7.0/commons-beanutils-core-1.7.0.jar
    urls[25] = file:/srv/gump/public/workspace/mvnlocalrepo/shared/commons-codec/commons-codec/1.3/commons-codec-1.3.jar
    urls[26] = file:/srv/gump/public/workspace/mvnlocalrepo/shared/commons-jxpath/commons-jxpath/1.2/commons-jxpath-1.2.jar
    urls[27] = file:/srv/gump/public/workspace/mvnlocalrepo/shared/xerces/xerces/1.2.3/xerces-1.2.3.jar
    urls[28] = file:/srv/gump/public/workspace/mvnlocalrepo/shared/ant/ant-optional/1.5.1/ant-optional-1.5.1.jar
    urls[29] = file:/srv/gump/public/workspace/mvnlocalrepo/shared/jdom/jdom/b9/jdom-b9.jar
    Number of imports: 10
    import: org.codehaus.classworlds.Entry@a6c57a42
    import: org.codehaus.classworlds.Entry@12f43f3b
    import: org.codehaus.classworlds.Entry@20025374
    import: org.codehaus.classworlds.Entry@f8e44ca4
    import: org.codehaus.classworlds.Entry@92758522
    import: org.codehaus.classworlds.Entry@ebf2705b
    import: org.codehaus.classworlds.Entry@bb25e54
    import: org.codehaus.classworlds.Entry@bece5185
    import: org.codehaus.classworlds.Entry@3fee8e37
    import: org.codehaus.classworlds.Entry@3fee19d8


    this realm = plexus.core
    urls[0] = file:/opt/maven2/lib/maven-2.2.1-uber.jar
    Number of imports: 10
    import: org.codehaus.classworlds.Entry@a6c57a42
    import: org.codehaus.classworlds.Entry@12f43f3b
    import: org.codehaus.classworlds.Entry@20025374
    import: org.codehaus.classworlds.Entry@f8e44ca4
    import: org.codehaus.classworlds.Entry@92758522
    import: org.codehaus.classworlds.Entry@ebf2705b
    import: org.codehaus.classworlds.Entry@bb25e54
    import: org.codehaus.classworlds.Entry@bece5185
    import: org.codehaus.classworlds.Entry@3fee8e37
    import: org.codehaus.classworlds.Entry@3fee19d8
    -----------------------------------------------------
    [INFO] ------------------------------------------------------------------------
    [ERROR] BUILD ERROR
    [INFO] ------------------------------------------------------------------------
    [INFO] Internal error in the plugin manager executing goal 'org.apache.torque:torque-maven-plugin:3.3:om': Unable to load the mojo 'org.apache.torque:torque-maven-plugin:3.3:om' in the plugin 'org.apache.torque:torque-maven-plugin'. A required class is missing: org/apache/torque/task/TorqueDataModelTask
    org.apache.torque.task.TorqueDataModelTask
    [INFO] ------------------------------------------------------------------------
    [INFO] For more information, run Maven with the -e switch
    [INFO] ------------------------------------------------------------------------
    [INFO] Total time: 26 seconds
    [INFO] Finished at: Mon Aug 08 11:58:28 UTC 2011
    [INFO] Final Memory: 30M/72M
    [INFO] ------------------------------------------------------------------------
    ---------------------------------------------

    To subscribe to this information via syndicated feeds:
    - RSS: http://vmgump.apache.org/gump/public/turbine-core/turbine-core/rss.xml
    - Atom: http://vmgump.apache.org/gump/public/turbine-core/turbine-core/atom.xml

    ============================== Gump Tracking Only ===
    Produced by Apache Gump(TM) version 2.3.
    Gump Run 05000608082011, vmgump.apache.org:vmgump:05000608082011
    Gump E-mail Identifier (unique within run) #33.

    --
    Apache Gump
    http://gump.apache.org/ [Instance: vmgump]

    ---------------------------------------------------------------------
    To unsubscribe, e-mail: dev-unsubscribe@turbine.apache.org
    For additional commands, e-mail: dev-help@turbine.apache.org
  • Anonymous at Aug 9, 2011 at 12:01 pm
    To whom it may engage...

    This is an automated request, but not an unsolicited one. For
    more information please visit http://gump.apache.org/nagged.html,
    and/or contact the folk at general@gump.apache.org.

    Project turbine-core has an issue affecting its community integration.
    This issue affects 2 projects,
    and has been outstanding for 323 runs.
    The current state of this project is 'Failed', with reason 'Build Failed'.
    For reference only, the following projects are affected by this:
    - turbine-core : A servlet based framework.
    - turbine-core-test : A servlet based framework.


    Full details are available at:
    http://vmgump.apache.org/gump/public/turbine-core/turbine-core/index.html

    That said, some information snippets are provided here.

    The following annotations (debug/informational/warning/error messages) were provided:
    -INFO- Optional dependency commons-fileupload prerequisite failed with reason build failed
    -INFO- Optional dependency httpunit failed with reason build failed
    -DEBUG- (Apache Gump generated) Apache Maven Settings in: /srv/gump/public/workspace/turbine-core/gump_mvn_settings.xml
    -INFO- Failed with reason build failed
    -DEBUG- Maven POM in: /srv/gump/public/workspace/turbine-core/pom.xml
    -INFO- Failed to extract fallback artifacts from Gump Repository



    The following work was performed:
    http://vmgump.apache.org/gump/public/turbine-core/turbine-core/gump_work/build_turbine-core_turbine-core.html
    Work Name: build_turbine-core_turbine-core (Type: Build)
    Work ended in a state of : Failed
    Elapsed: 26 secs
    Command Line: /opt/maven2/bin/mvn --batch-mode -DskipTests=true --settings /srv/gump/public/workspace/turbine-core/gump_mvn_settings.xml package
    [Working Directory: /srv/gump/public/workspace/turbine-core]
    M2_HOME: /opt/maven2
    ---------------------------------------------
    urls[19] = file:/srv/gump/public/workspace/mvnlocalrepo/shared/xml-apis/xml-apis/1.0.b2/xml-apis-1.0.b2.jar
    urls[20] = file:/srv/gump/public/workspace/mvnlocalrepo/shared/commons-configuration/commons-configuration/1.4/commons-configuration-1.4.jar
    urls[21] = file:/srv/gump/public/workspace/mvnlocalrepo/shared/commons-logging/commons-logging-api/1.0.4/commons-logging-api-1.0.4.jar
    urls[22] = file:/srv/gump/public/workspace/mvnlocalrepo/shared/commons-digester/commons-digester/1.8/commons-digester-1.8.jar
    urls[23] = file:/srv/gump/public/workspace/mvnlocalrepo/shared/commons-beanutils/commons-beanutils/1.7.0/commons-beanutils-1.7.0.jar
    urls[24] = file:/srv/gump/public/workspace/mvnlocalrepo/shared/commons-beanutils/commons-beanutils-core/1.7.0/commons-beanutils-core-1.7.0.jar
    urls[25] = file:/srv/gump/public/workspace/mvnlocalrepo/shared/commons-codec/commons-codec/1.3/commons-codec-1.3.jar
    urls[26] = file:/srv/gump/public/workspace/mvnlocalrepo/shared/commons-jxpath/commons-jxpath/1.2/commons-jxpath-1.2.jar
    urls[27] = file:/srv/gump/public/workspace/mvnlocalrepo/shared/xerces/xerces/1.2.3/xerces-1.2.3.jar
    urls[28] = file:/srv/gump/public/workspace/mvnlocalrepo/shared/ant/ant-optional/1.5.1/ant-optional-1.5.1.jar
    urls[29] = file:/srv/gump/public/workspace/mvnlocalrepo/shared/jdom/jdom/b9/jdom-b9.jar
    Number of imports: 10
    import: org.codehaus.classworlds.Entry@a6c57a42
    import: org.codehaus.classworlds.Entry@12f43f3b
    import: org.codehaus.classworlds.Entry@20025374
    import: org.codehaus.classworlds.Entry@f8e44ca4
    import: org.codehaus.classworlds.Entry@92758522
    import: org.codehaus.classworlds.Entry@ebf2705b
    import: org.codehaus.classworlds.Entry@bb25e54
    import: org.codehaus.classworlds.Entry@bece5185
    import: org.codehaus.classworlds.Entry@3fee8e37
    import: org.codehaus.classworlds.Entry@3fee19d8


    this realm = plexus.core
    urls[0] = file:/opt/maven2/lib/maven-2.2.1-uber.jar
    Number of imports: 10
    import: org.codehaus.classworlds.Entry@a6c57a42
    import: org.codehaus.classworlds.Entry@12f43f3b
    import: org.codehaus.classworlds.Entry@20025374
    import: org.codehaus.classworlds.Entry@f8e44ca4
    import: org.codehaus.classworlds.Entry@92758522
    import: org.codehaus.classworlds.Entry@ebf2705b
    import: org.codehaus.classworlds.Entry@bb25e54
    import: org.codehaus.classworlds.Entry@bece5185
    import: org.codehaus.classworlds.Entry@3fee8e37
    import: org.codehaus.classworlds.Entry@3fee19d8
    -----------------------------------------------------
    [INFO] ------------------------------------------------------------------------
    [ERROR] BUILD ERROR
    [INFO] ------------------------------------------------------------------------
    [INFO] Internal error in the plugin manager executing goal 'org.apache.torque:torque-maven-plugin:3.3:om': Unable to load the mojo 'org.apache.torque:torque-maven-plugin:3.3:om' in the plugin 'org.apache.torque:torque-maven-plugin'. A required class is missing: org/apache/torque/task/TorqueDataModelTask
    org.apache.torque.task.TorqueDataModelTask
    [INFO] ------------------------------------------------------------------------
    [INFO] For more information, run Maven with the -e switch
    [INFO] ------------------------------------------------------------------------
    [INFO] Total time: 25 seconds
    [INFO] Finished at: Tue Aug 09 12:00:56 UTC 2011
    [INFO] Final Memory: 30M/72M
    [INFO] ------------------------------------------------------------------------
    ---------------------------------------------

    To subscribe to this information via syndicated feeds:
    - RSS: http://vmgump.apache.org/gump/public/turbine-core/turbine-core/rss.xml
    - Atom: http://vmgump.apache.org/gump/public/turbine-core/turbine-core/atom.xml

    ============================== Gump Tracking Only ===
    Produced by Apache Gump(TM) version 2.3.
    Gump Run 06000609082011, vmgump.apache.org:vmgump:06000609082011
    Gump E-mail Identifier (unique within run) #37.

    --
    Apache Gump
    http://gump.apache.org/ [Instance: vmgump]

    ---------------------------------------------------------------------
    To unsubscribe, e-mail: dev-unsubscribe@turbine.apache.org
    For additional commands, e-mail: dev-help@turbine.apache.org
  • Anonymous at Aug 10, 2011 at 12:01 pm
    To whom it may engage...

    This is an automated request, but not an unsolicited one. For
    more information please visit http://gump.apache.org/nagged.html,
    and/or contact the folk at general@gump.apache.org.

    Project turbine-core has an issue affecting its community integration.
    This issue affects 2 projects,
    and has been outstanding for 325 runs.
    The current state of this project is 'Failed', with reason 'Build Failed'.
    For reference only, the following projects are affected by this:
    - turbine-core : A servlet based framework.
    - turbine-core-test : A servlet based framework.


    Full details are available at:
    http://vmgump.apache.org/gump/public/turbine-core/turbine-core/index.html

    That said, some information snippets are provided here.

    The following annotations (debug/informational/warning/error messages) were provided:
    -INFO- Optional dependency commons-fileupload prerequisite failed with reason build failed
    -INFO- Optional dependency httpunit failed with reason build failed
    -DEBUG- (Apache Gump generated) Apache Maven Settings in: /srv/gump/public/workspace/turbine-core/gump_mvn_settings.xml
    -INFO- Failed with reason build failed
    -DEBUG- Maven POM in: /srv/gump/public/workspace/turbine-core/pom.xml
    -INFO- Failed to extract fallback artifacts from Gump Repository



    The following work was performed:
    http://vmgump.apache.org/gump/public/turbine-core/turbine-core/gump_work/build_turbine-core_turbine-core.html
    Work Name: build_turbine-core_turbine-core (Type: Build)
    Work ended in a state of : Failed
    Elapsed: 27 secs
    Command Line: /opt/maven2/bin/mvn --batch-mode -DskipTests=true --settings /srv/gump/public/workspace/turbine-core/gump_mvn_settings.xml package
    [Working Directory: /srv/gump/public/workspace/turbine-core]
    M2_HOME: /opt/maven2
    ---------------------------------------------
    urls[19] = file:/srv/gump/public/workspace/mvnlocalrepo/shared/xml-apis/xml-apis/1.0.b2/xml-apis-1.0.b2.jar
    urls[20] = file:/srv/gump/public/workspace/mvnlocalrepo/shared/commons-configuration/commons-configuration/1.4/commons-configuration-1.4.jar
    urls[21] = file:/srv/gump/public/workspace/mvnlocalrepo/shared/commons-logging/commons-logging-api/1.0.4/commons-logging-api-1.0.4.jar
    urls[22] = file:/srv/gump/public/workspace/mvnlocalrepo/shared/commons-digester/commons-digester/1.8/commons-digester-1.8.jar
    urls[23] = file:/srv/gump/public/workspace/mvnlocalrepo/shared/commons-beanutils/commons-beanutils/1.7.0/commons-beanutils-1.7.0.jar
    urls[24] = file:/srv/gump/public/workspace/mvnlocalrepo/shared/commons-beanutils/commons-beanutils-core/1.7.0/commons-beanutils-core-1.7.0.jar
    urls[25] = file:/srv/gump/public/workspace/mvnlocalrepo/shared/commons-codec/commons-codec/1.3/commons-codec-1.3.jar
    urls[26] = file:/srv/gump/public/workspace/mvnlocalrepo/shared/commons-jxpath/commons-jxpath/1.2/commons-jxpath-1.2.jar
    urls[27] = file:/srv/gump/public/workspace/mvnlocalrepo/shared/xerces/xerces/1.2.3/xerces-1.2.3.jar
    urls[28] = file:/srv/gump/public/workspace/mvnlocalrepo/shared/ant/ant-optional/1.5.1/ant-optional-1.5.1.jar
    urls[29] = file:/srv/gump/public/workspace/mvnlocalrepo/shared/jdom/jdom/b9/jdom-b9.jar
    Number of imports: 10
    import: org.codehaus.classworlds.Entry@a6c57a42
    import: org.codehaus.classworlds.Entry@12f43f3b
    import: org.codehaus.classworlds.Entry@20025374
    import: org.codehaus.classworlds.Entry@f8e44ca4
    import: org.codehaus.classworlds.Entry@92758522
    import: org.codehaus.classworlds.Entry@ebf2705b
    import: org.codehaus.classworlds.Entry@bb25e54
    import: org.codehaus.classworlds.Entry@bece5185
    import: org.codehaus.classworlds.Entry@3fee8e37
    import: org.codehaus.classworlds.Entry@3fee19d8


    this realm = plexus.core
    urls[0] = file:/opt/maven2/lib/maven-2.2.1-uber.jar
    Number of imports: 10
    import: org.codehaus.classworlds.Entry@a6c57a42
    import: org.codehaus.classworlds.Entry@12f43f3b
    import: org.codehaus.classworlds.Entry@20025374
    import: org.codehaus.classworlds.Entry@f8e44ca4
    import: org.codehaus.classworlds.Entry@92758522
    import: org.codehaus.classworlds.Entry@ebf2705b
    import: org.codehaus.classworlds.Entry@bb25e54
    import: org.codehaus.classworlds.Entry@bece5185
    import: org.codehaus.classworlds.Entry@3fee8e37
    import: org.codehaus.classworlds.Entry@3fee19d8
    -----------------------------------------------------
    [INFO] ------------------------------------------------------------------------
    [ERROR] BUILD ERROR
    [INFO] ------------------------------------------------------------------------
    [INFO] Internal error in the plugin manager executing goal 'org.apache.torque:torque-maven-plugin:3.3:om': Unable to load the mojo 'org.apache.torque:torque-maven-plugin:3.3:om' in the plugin 'org.apache.torque:torque-maven-plugin'. A required class is missing: org/apache/torque/task/TorqueDataModelTask
    org.apache.torque.task.TorqueDataModelTask
    [INFO] ------------------------------------------------------------------------
    [INFO] For more information, run Maven with the -e switch
    [INFO] ------------------------------------------------------------------------
    [INFO] Total time: 26 seconds
    [INFO] Finished at: Wed Aug 10 12:01:16 UTC 2011
    [INFO] Final Memory: 30M/72M
    [INFO] ------------------------------------------------------------------------
    ---------------------------------------------

    To subscribe to this information via syndicated feeds:
    - RSS: http://vmgump.apache.org/gump/public/turbine-core/turbine-core/rss.xml
    - Atom: http://vmgump.apache.org/gump/public/turbine-core/turbine-core/atom.xml

    ============================== Gump Tracking Only ===
    Produced by Apache Gump(TM) version 2.3.
    Gump Run 06000610082011, vmgump.apache.org:vmgump:06000610082011
    Gump E-mail Identifier (unique within run) #37.

    --
    Apache Gump
    http://gump.apache.org/ [Instance: vmgump]

    ---------------------------------------------------------------------
    To unsubscribe, e-mail: dev-unsubscribe@turbine.apache.org
    For additional commands, e-mail: dev-help@turbine.apache.org
  • Anonymous at Aug 11, 2011 at 11:58 am
    To whom it may engage...

    This is an automated request, but not an unsolicited one. For
    more information please visit http://gump.apache.org/nagged.html,
    and/or contact the folk at general@gump.apache.org.

    Project turbine-core has an issue affecting its community integration.
    This issue affects 2 projects,
    and has been outstanding for 327 runs.
    The current state of this project is 'Failed', with reason 'Build Failed'.
    For reference only, the following projects are affected by this:
    - turbine-core : A servlet based framework.
    - turbine-core-test : A servlet based framework.


    Full details are available at:
    http://vmgump.apache.org/gump/public/turbine-core/turbine-core/index.html

    That said, some information snippets are provided here.

    The following annotations (debug/informational/warning/error messages) were provided:
    -INFO- Optional dependency commons-fileupload prerequisite failed with reason build failed
    -INFO- Optional dependency httpunit failed with reason build failed
    -DEBUG- (Apache Gump generated) Apache Maven Settings in: /srv/gump/public/workspace/turbine-core/gump_mvn_settings.xml
    -INFO- Failed with reason build failed
    -DEBUG- Maven POM in: /srv/gump/public/workspace/turbine-core/pom.xml
    -INFO- Failed to extract fallback artifacts from Gump Repository



    The following work was performed:
    http://vmgump.apache.org/gump/public/turbine-core/turbine-core/gump_work/build_turbine-core_turbine-core.html
    Work Name: build_turbine-core_turbine-core (Type: Build)
    Work ended in a state of : Failed
    Elapsed: 20 secs
    Command Line: /opt/maven2/bin/mvn --batch-mode -DskipTests=true --settings /srv/gump/public/workspace/turbine-core/gump_mvn_settings.xml package
    [Working Directory: /srv/gump/public/workspace/turbine-core]
    M2_HOME: /opt/maven2
    ---------------------------------------------
    urls[19] = file:/srv/gump/public/workspace/mvnlocalrepo/shared/xml-apis/xml-apis/1.0.b2/xml-apis-1.0.b2.jar
    urls[20] = file:/srv/gump/public/workspace/mvnlocalrepo/shared/commons-configuration/commons-configuration/1.4/commons-configuration-1.4.jar
    urls[21] = file:/srv/gump/public/workspace/mvnlocalrepo/shared/commons-logging/commons-logging-api/1.0.4/commons-logging-api-1.0.4.jar
    urls[22] = file:/srv/gump/public/workspace/mvnlocalrepo/shared/commons-digester/commons-digester/1.8/commons-digester-1.8.jar
    urls[23] = file:/srv/gump/public/workspace/mvnlocalrepo/shared/commons-beanutils/commons-beanutils/1.7.0/commons-beanutils-1.7.0.jar
    urls[24] = file:/srv/gump/public/workspace/mvnlocalrepo/shared/commons-beanutils/commons-beanutils-core/1.7.0/commons-beanutils-core-1.7.0.jar
    urls[25] = file:/srv/gump/public/workspace/mvnlocalrepo/shared/commons-codec/commons-codec/1.3/commons-codec-1.3.jar
    urls[26] = file:/srv/gump/public/workspace/mvnlocalrepo/shared/commons-jxpath/commons-jxpath/1.2/commons-jxpath-1.2.jar
    urls[27] = file:/srv/gump/public/workspace/mvnlocalrepo/shared/xerces/xerces/1.2.3/xerces-1.2.3.jar
    urls[28] = file:/srv/gump/public/workspace/mvnlocalrepo/shared/ant/ant-optional/1.5.1/ant-optional-1.5.1.jar
    urls[29] = file:/srv/gump/public/workspace/mvnlocalrepo/shared/jdom/jdom/b9/jdom-b9.jar
    Number of imports: 10
    import: org.codehaus.classworlds.Entry@a6c57a42
    import: org.codehaus.classworlds.Entry@12f43f3b
    import: org.codehaus.classworlds.Entry@20025374
    import: org.codehaus.classworlds.Entry@f8e44ca4
    import: org.codehaus.classworlds.Entry@92758522
    import: org.codehaus.classworlds.Entry@ebf2705b
    import: org.codehaus.classworlds.Entry@bb25e54
    import: org.codehaus.classworlds.Entry@bece5185
    import: org.codehaus.classworlds.Entry@3fee8e37
    import: org.codehaus.classworlds.Entry@3fee19d8


    this realm = plexus.core
    urls[0] = file:/opt/maven2/lib/maven-2.2.1-uber.jar
    Number of imports: 10
    import: org.codehaus.classworlds.Entry@a6c57a42
    import: org.codehaus.classworlds.Entry@12f43f3b
    import: org.codehaus.classworlds.Entry@20025374
    import: org.codehaus.classworlds.Entry@f8e44ca4
    import: org.codehaus.classworlds.Entry@92758522
    import: org.codehaus.classworlds.Entry@ebf2705b
    import: org.codehaus.classworlds.Entry@bb25e54
    import: org.codehaus.classworlds.Entry@bece5185
    import: org.codehaus.classworlds.Entry@3fee8e37
    import: org.codehaus.classworlds.Entry@3fee19d8
    -----------------------------------------------------
    [INFO] ------------------------------------------------------------------------
    [ERROR] BUILD ERROR
    [INFO] ------------------------------------------------------------------------
    [INFO] Internal error in the plugin manager executing goal 'org.apache.torque:torque-maven-plugin:3.3:om': Unable to load the mojo 'org.apache.torque:torque-maven-plugin:3.3:om' in the plugin 'org.apache.torque:torque-maven-plugin'. A required class is missing: org/apache/torque/task/TorqueDataModelTask
    org.apache.torque.task.TorqueDataModelTask
    [INFO] ------------------------------------------------------------------------
    [INFO] For more information, run Maven with the -e switch
    [INFO] ------------------------------------------------------------------------
    [INFO] Total time: 19 seconds
    [INFO] Finished at: Thu Aug 11 11:57:43 UTC 2011
    [INFO] Final Memory: 30M/71M
    [INFO] ------------------------------------------------------------------------
    ---------------------------------------------

    To subscribe to this information via syndicated feeds:
    - RSS: http://vmgump.apache.org/gump/public/turbine-core/turbine-core/rss.xml
    - Atom: http://vmgump.apache.org/gump/public/turbine-core/turbine-core/atom.xml

    ============================== Gump Tracking Only ===
    Produced by Apache Gump(TM) version 2.3.
    Gump Run 05000611082011, vmgump.apache.org:vmgump:05000611082011
    Gump E-mail Identifier (unique within run) #38.

    --
    Apache Gump
    http://gump.apache.org/ [Instance: vmgump]

    ---------------------------------------------------------------------
    To unsubscribe, e-mail: dev-unsubscribe@turbine.apache.org
    For additional commands, e-mail: dev-help@turbine.apache.org
  • Anonymous at Aug 12, 2011 at 10:57 am
    To whom it may engage...

    This is an automated request, but not an unsolicited one. For
    more information please visit http://gump.apache.org/nagged.html,
    and/or contact the folk at general@gump.apache.org.

    Project turbine-core has an issue affecting its community integration.
    This issue affects 2 projects,
    and has been outstanding for 329 runs.
    The current state of this project is 'Failed', with reason 'Build Failed'.
    For reference only, the following projects are affected by this:
    - turbine-core : A servlet based framework.
    - turbine-core-test : A servlet based framework.


    Full details are available at:
    http://vmgump.apache.org/gump/public/turbine-core/turbine-core/index.html

    That said, some information snippets are provided here.

    The following annotations (debug/informational/warning/error messages) were provided:
    -INFO- Optional dependency commons-httpclient failed with reason build failed
    -INFO- Optional dependency commons-fileupload prerequisite failed with reason build failed
    -INFO- Optional dependency xstream failed with reason build failed
    -INFO- Optional dependency commons-configuration failed with reason build failed
    -INFO- Optional dependency httpunit failed with reason build failed
    -DEBUG- (Apache Gump generated) Apache Maven Settings in: /srv/gump/public/workspace/turbine-core/gump_mvn_settings.xml
    -INFO- Failed with reason build failed
    -DEBUG- Maven POM in: /srv/gump/public/workspace/turbine-core/pom.xml
    -INFO- Failed to extract fallback artifacts from Gump Repository



    The following work was performed:
    http://vmgump.apache.org/gump/public/turbine-core/turbine-core/gump_work/build_turbine-core_turbine-core.html
    Work Name: build_turbine-core_turbine-core (Type: Build)
    Work ended in a state of : Failed
    Elapsed: 29 secs
    Command Line: /opt/maven2/bin/mvn --batch-mode -DskipTests=true --settings /srv/gump/public/workspace/turbine-core/gump_mvn_settings.xml package
    [Working Directory: /srv/gump/public/workspace/turbine-core]
    M2_HOME: /opt/maven2
    ---------------------------------------------
    urls[19] = file:/srv/gump/public/workspace/mvnlocalrepo/shared/xml-apis/xml-apis/1.0.b2/xml-apis-1.0.b2.jar
    urls[20] = file:/srv/gump/public/workspace/mvnlocalrepo/shared/commons-configuration/commons-configuration/1.4/commons-configuration-1.4.jar
    urls[21] = file:/srv/gump/public/workspace/mvnlocalrepo/shared/commons-logging/commons-logging-api/1.0.4/commons-logging-api-1.0.4.jar
    urls[22] = file:/srv/gump/public/workspace/mvnlocalrepo/shared/commons-digester/commons-digester/1.8/commons-digester-1.8.jar
    urls[23] = file:/srv/gump/public/workspace/mvnlocalrepo/shared/commons-beanutils/commons-beanutils/1.7.0/commons-beanutils-1.7.0.jar
    urls[24] = file:/srv/gump/public/workspace/mvnlocalrepo/shared/commons-beanutils/commons-beanutils-core/1.7.0/commons-beanutils-core-1.7.0.jar
    urls[25] = file:/srv/gump/public/workspace/mvnlocalrepo/shared/commons-codec/commons-codec/1.3/commons-codec-1.3.jar
    urls[26] = file:/srv/gump/public/workspace/mvnlocalrepo/shared/commons-jxpath/commons-jxpath/1.2/commons-jxpath-1.2.jar
    urls[27] = file:/srv/gump/public/workspace/mvnlocalrepo/shared/xerces/xerces/1.2.3/xerces-1.2.3.jar
    urls[28] = file:/srv/gump/public/workspace/mvnlocalrepo/shared/ant/ant-optional/1.5.1/ant-optional-1.5.1.jar
    urls[29] = file:/srv/gump/public/workspace/mvnlocalrepo/shared/jdom/jdom/b9/jdom-b9.jar
    Number of imports: 10
    import: org.codehaus.classworlds.Entry@a6c57a42
    import: org.codehaus.classworlds.Entry@12f43f3b
    import: org.codehaus.classworlds.Entry@20025374
    import: org.codehaus.classworlds.Entry@f8e44ca4
    import: org.codehaus.classworlds.Entry@92758522
    import: org.codehaus.classworlds.Entry@ebf2705b
    import: org.codehaus.classworlds.Entry@bb25e54
    import: org.codehaus.classworlds.Entry@bece5185
    import: org.codehaus.classworlds.Entry@3fee8e37
    import: org.codehaus.classworlds.Entry@3fee19d8


    this realm = plexus.core
    urls[0] = file:/opt/maven2/lib/maven-2.2.1-uber.jar
    Number of imports: 10
    import: org.codehaus.classworlds.Entry@a6c57a42
    import: org.codehaus.classworlds.Entry@12f43f3b
    import: org.codehaus.classworlds.Entry@20025374
    import: org.codehaus.classworlds.Entry@f8e44ca4
    import: org.codehaus.classworlds.Entry@92758522
    import: org.codehaus.classworlds.Entry@ebf2705b
    import: org.codehaus.classworlds.Entry@bb25e54
    import: org.codehaus.classworlds.Entry@bece5185
    import: org.codehaus.classworlds.Entry@3fee8e37
    import: org.codehaus.classworlds.Entry@3fee19d8
    -----------------------------------------------------
    [INFO] ------------------------------------------------------------------------
    [ERROR] BUILD ERROR
    [INFO] ------------------------------------------------------------------------
    [INFO] Internal error in the plugin manager executing goal 'org.apache.torque:torque-maven-plugin:3.3:om': Unable to load the mojo 'org.apache.torque:torque-maven-plugin:3.3:om' in the plugin 'org.apache.torque:torque-maven-plugin'. A required class is missing: org/apache/torque/task/TorqueDataModelTask
    org.apache.torque.task.TorqueDataModelTask
    [INFO] ------------------------------------------------------------------------
    [INFO] For more information, run Maven with the -e switch
    [INFO] ------------------------------------------------------------------------
    [INFO] Total time: 28 seconds
    [INFO] Finished at: Fri Aug 12 10:56:58 UTC 2011
    [INFO] Final Memory: 30M/72M
    [INFO] ------------------------------------------------------------------------
    ---------------------------------------------

    To subscribe to this information via syndicated feeds:
    - RSS: http://vmgump.apache.org/gump/public/turbine-core/turbine-core/rss.xml
    - Atom: http://vmgump.apache.org/gump/public/turbine-core/turbine-core/atom.xml

    ============================== Gump Tracking Only ===
    Produced by Apache Gump(TM) version 2.3.
    Gump Run 05000612082011, vmgump.apache.org:vmgump:05000612082011
    Gump E-mail Identifier (unique within run) #49.

    --
    Apache Gump
    http://gump.apache.org/ [Instance: vmgump]

    ---------------------------------------------------------------------
    To unsubscribe, e-mail: dev-unsubscribe@turbine.apache.org
    For additional commands, e-mail: dev-help@turbine.apache.org
  • Anonymous at Aug 13, 2011 at 12:13 pm
    To whom it may engage...

    This is an automated request, but not an unsolicited one. For
    more information please visit http://gump.apache.org/nagged.html,
    and/or contact the folk at general@gump.apache.org.

    Project turbine-core has an issue affecting its community integration.
    This issue affects 2 projects,
    and has been outstanding for 331 runs.
    The current state of this project is 'Failed', with reason 'Build Failed'.
    For reference only, the following projects are affected by this:
    - turbine-core : A servlet based framework.
    - turbine-core-test : A servlet based framework.


    Full details are available at:
    http://vmgump.apache.org/gump/public/turbine-core/turbine-core/index.html

    That said, some information snippets are provided here.

    The following annotations (debug/informational/warning/error messages) were provided:
    -INFO- Optional dependency commons-fileupload prerequisite failed with reason build failed
    -INFO- Optional dependency httpunit failed with reason build failed
    -DEBUG- (Apache Gump generated) Apache Maven Settings in: /srv/gump/public/workspace/turbine-core/gump_mvn_settings.xml
    -INFO- Failed with reason build failed
    -DEBUG- Maven POM in: /srv/gump/public/workspace/turbine-core/pom.xml
    -INFO- Failed to extract fallback artifacts from Gump Repository



    The following work was performed:
    http://vmgump.apache.org/gump/public/turbine-core/turbine-core/gump_work/build_turbine-core_turbine-core.html
    Work Name: build_turbine-core_turbine-core (Type: Build)
    Work ended in a state of : Failed
    Elapsed: 21 secs
    Command Line: /opt/maven2/bin/mvn --batch-mode -DskipTests=true --settings /srv/gump/public/workspace/turbine-core/gump_mvn_settings.xml package
    [Working Directory: /srv/gump/public/workspace/turbine-core]
    M2_HOME: /opt/maven2
    ---------------------------------------------
    urls[19] = file:/srv/gump/public/workspace/mvnlocalrepo/shared/xml-apis/xml-apis/1.0.b2/xml-apis-1.0.b2.jar
    urls[20] = file:/srv/gump/public/workspace/mvnlocalrepo/shared/commons-configuration/commons-configuration/1.4/commons-configuration-1.4.jar
    urls[21] = file:/srv/gump/public/workspace/mvnlocalrepo/shared/commons-logging/commons-logging-api/1.0.4/commons-logging-api-1.0.4.jar
    urls[22] = file:/srv/gump/public/workspace/mvnlocalrepo/shared/commons-digester/commons-digester/1.8/commons-digester-1.8.jar
    urls[23] = file:/srv/gump/public/workspace/mvnlocalrepo/shared/commons-beanutils/commons-beanutils/1.7.0/commons-beanutils-1.7.0.jar
    urls[24] = file:/srv/gump/public/workspace/mvnlocalrepo/shared/commons-beanutils/commons-beanutils-core/1.7.0/commons-beanutils-core-1.7.0.jar
    urls[25] = file:/srv/gump/public/workspace/mvnlocalrepo/shared/commons-codec/commons-codec/1.3/commons-codec-1.3.jar
    urls[26] = file:/srv/gump/public/workspace/mvnlocalrepo/shared/commons-jxpath/commons-jxpath/1.2/commons-jxpath-1.2.jar
    urls[27] = file:/srv/gump/public/workspace/mvnlocalrepo/shared/xerces/xerces/1.2.3/xerces-1.2.3.jar
    urls[28] = file:/srv/gump/public/workspace/mvnlocalrepo/shared/ant/ant-optional/1.5.1/ant-optional-1.5.1.jar
    urls[29] = file:/srv/gump/public/workspace/mvnlocalrepo/shared/jdom/jdom/b9/jdom-b9.jar
    Number of imports: 10
    import: org.codehaus.classworlds.Entry@a6c57a42
    import: org.codehaus.classworlds.Entry@12f43f3b
    import: org.codehaus.classworlds.Entry@20025374
    import: org.codehaus.classworlds.Entry@f8e44ca4
    import: org.codehaus.classworlds.Entry@92758522
    import: org.codehaus.classworlds.Entry@ebf2705b
    import: org.codehaus.classworlds.Entry@bb25e54
    import: org.codehaus.classworlds.Entry@bece5185
    import: org.codehaus.classworlds.Entry@3fee8e37
    import: org.codehaus.classworlds.Entry@3fee19d8


    this realm = plexus.core
    urls[0] = file:/opt/maven2/lib/maven-2.2.1-uber.jar
    Number of imports: 10
    import: org.codehaus.classworlds.Entry@a6c57a42
    import: org.codehaus.classworlds.Entry@12f43f3b
    import: org.codehaus.classworlds.Entry@20025374
    import: org.codehaus.classworlds.Entry@f8e44ca4
    import: org.codehaus.classworlds.Entry@92758522
    import: org.codehaus.classworlds.Entry@ebf2705b
    import: org.codehaus.classworlds.Entry@bb25e54
    import: org.codehaus.classworlds.Entry@bece5185
    import: org.codehaus.classworlds.Entry@3fee8e37
    import: org.codehaus.classworlds.Entry@3fee19d8
    -----------------------------------------------------
    [INFO] ------------------------------------------------------------------------
    [ERROR] BUILD ERROR
    [INFO] ------------------------------------------------------------------------
    [INFO] Internal error in the plugin manager executing goal 'org.apache.torque:torque-maven-plugin:3.3:om': Unable to load the mojo 'org.apache.torque:torque-maven-plugin:3.3:om' in the plugin 'org.apache.torque:torque-maven-plugin'. A required class is missing: org/apache/torque/task/TorqueDataModelTask
    org.apache.torque.task.TorqueDataModelTask
    [INFO] ------------------------------------------------------------------------
    [INFO] For more information, run Maven with the -e switch
    [INFO] ------------------------------------------------------------------------
    [INFO] Total time: 20 seconds
    [INFO] Finished at: Sat Aug 13 12:12:57 UTC 2011
    [INFO] Final Memory: 30M/71M
    [INFO] ------------------------------------------------------------------------
    ---------------------------------------------

    To subscribe to this information via syndicated feeds:
    - RSS: http://vmgump.apache.org/gump/public/turbine-core/turbine-core/rss.xml
    - Atom: http://vmgump.apache.org/gump/public/turbine-core/turbine-core/atom.xml

    ============================== Gump Tracking Only ===
    Produced by Apache Gump(TM) version 2.3.
    Gump Run 05000613082011, vmgump.apache.org:vmgump:05000613082011
    Gump E-mail Identifier (unique within run) #40.

    --
    Apache Gump
    http://gump.apache.org/ [Instance: vmgump]

    ---------------------------------------------------------------------
    To unsubscribe, e-mail: dev-unsubscribe@turbine.apache.org
    For additional commands, e-mail: dev-help@turbine.apache.org
  • Anonymous at Aug 14, 2011 at 12:16 pm
    To whom it may engage...

    This is an automated request, but not an unsolicited one. For
    more information please visit http://gump.apache.org/nagged.html,
    and/or contact the folk at general@gump.apache.org.

    Project turbine-core has an issue affecting its community integration.
    This issue affects 2 projects,
    and has been outstanding for 333 runs.
    The current state of this project is 'Failed', with reason 'Build Failed'.
    For reference only, the following projects are affected by this:
    - turbine-core : A servlet based framework.
    - turbine-core-test : A servlet based framework.


    Full details are available at:
    http://vmgump.apache.org/gump/public/turbine-core/turbine-core/index.html

    That said, some information snippets are provided here.

    The following annotations (debug/informational/warning/error messages) were provided:
    -INFO- Optional dependency commons-configuration prerequisite failed with reason build failed
    -INFO- Optional dependency commons-fileupload prerequisite failed with reason build failed
    -INFO- Optional dependency httpunit failed with reason build failed
    -DEBUG- (Apache Gump generated) Apache Maven Settings in: /srv/gump/public/workspace/turbine-core/gump_mvn_settings.xml
    -INFO- Failed with reason build failed
    -DEBUG- Maven POM in: /srv/gump/public/workspace/turbine-core/pom.xml
    -INFO- Failed to extract fallback artifacts from Gump Repository



    The following work was performed:
    http://vmgump.apache.org/gump/public/turbine-core/turbine-core/gump_work/build_turbine-core_turbine-core.html
    Work Name: build_turbine-core_turbine-core (Type: Build)
    Work ended in a state of : Failed
    Elapsed: 24 secs
    Command Line: /opt/maven2/bin/mvn --batch-mode -DskipTests=true --settings /srv/gump/public/workspace/turbine-core/gump_mvn_settings.xml package
    [Working Directory: /srv/gump/public/workspace/turbine-core]
    M2_HOME: /opt/maven2
    ---------------------------------------------
    urls[19] = file:/srv/gump/public/workspace/mvnlocalrepo/shared/xml-apis/xml-apis/1.0.b2/xml-apis-1.0.b2.jar
    urls[20] = file:/srv/gump/public/workspace/mvnlocalrepo/shared/commons-configuration/commons-configuration/1.4/commons-configuration-1.4.jar
    urls[21] = file:/srv/gump/public/workspace/mvnlocalrepo/shared/commons-logging/commons-logging-api/1.0.4/commons-logging-api-1.0.4.jar
    urls[22] = file:/srv/gump/public/workspace/mvnlocalrepo/shared/commons-digester/commons-digester/1.8/commons-digester-1.8.jar
    urls[23] = file:/srv/gump/public/workspace/mvnlocalrepo/shared/commons-beanutils/commons-beanutils/1.7.0/commons-beanutils-1.7.0.jar
    urls[24] = file:/srv/gump/public/workspace/mvnlocalrepo/shared/commons-beanutils/commons-beanutils-core/1.7.0/commons-beanutils-core-1.7.0.jar
    urls[25] = file:/srv/gump/public/workspace/mvnlocalrepo/shared/commons-codec/commons-codec/1.3/commons-codec-1.3.jar
    urls[26] = file:/srv/gump/public/workspace/mvnlocalrepo/shared/commons-jxpath/commons-jxpath/1.2/commons-jxpath-1.2.jar
    urls[27] = file:/srv/gump/public/workspace/mvnlocalrepo/shared/xerces/xerces/1.2.3/xerces-1.2.3.jar
    urls[28] = file:/srv/gump/public/workspace/mvnlocalrepo/shared/ant/ant-optional/1.5.1/ant-optional-1.5.1.jar
    urls[29] = file:/srv/gump/public/workspace/mvnlocalrepo/shared/jdom/jdom/b9/jdom-b9.jar
    Number of imports: 10
    import: org.codehaus.classworlds.Entry@a6c57a42
    import: org.codehaus.classworlds.Entry@12f43f3b
    import: org.codehaus.classworlds.Entry@20025374
    import: org.codehaus.classworlds.Entry@f8e44ca4
    import: org.codehaus.classworlds.Entry@92758522
    import: org.codehaus.classworlds.Entry@ebf2705b
    import: org.codehaus.classworlds.Entry@bb25e54
    import: org.codehaus.classworlds.Entry@bece5185
    import: org.codehaus.classworlds.Entry@3fee8e37
    import: org.codehaus.classworlds.Entry@3fee19d8


    this realm = plexus.core
    urls[0] = file:/opt/maven2/lib/maven-2.2.1-uber.jar
    Number of imports: 10
    import: org.codehaus.classworlds.Entry@a6c57a42
    import: org.codehaus.classworlds.Entry@12f43f3b
    import: org.codehaus.classworlds.Entry@20025374
    import: org.codehaus.classworlds.Entry@f8e44ca4
    import: org.codehaus.classworlds.Entry@92758522
    import: org.codehaus.classworlds.Entry@ebf2705b
    import: org.codehaus.classworlds.Entry@bb25e54
    import: org.codehaus.classworlds.Entry@bece5185
    import: org.codehaus.classworlds.Entry@3fee8e37
    import: org.codehaus.classworlds.Entry@3fee19d8
    -----------------------------------------------------
    [INFO] ------------------------------------------------------------------------
    [ERROR] BUILD ERROR
    [INFO] ------------------------------------------------------------------------
    [INFO] Internal error in the plugin manager executing goal 'org.apache.torque:torque-maven-plugin:3.3:om': Unable to load the mojo 'org.apache.torque:torque-maven-plugin:3.3:om' in the plugin 'org.apache.torque:torque-maven-plugin'. A required class is missing: org/apache/torque/task/TorqueDataModelTask
    org.apache.torque.task.TorqueDataModelTask
    [INFO] ------------------------------------------------------------------------
    [INFO] For more information, run Maven with the -e switch
    [INFO] ------------------------------------------------------------------------
    [INFO] Total time: 23 seconds
    [INFO] Finished at: Sun Aug 14 12:15:55 UTC 2011
    [INFO] Final Memory: 30M/71M
    [INFO] ------------------------------------------------------------------------
    ---------------------------------------------

    To subscribe to this information via syndicated feeds:
    - RSS: http://vmgump.apache.org/gump/public/turbine-core/turbine-core/rss.xml
    - Atom: http://vmgump.apache.org/gump/public/turbine-core/turbine-core/atom.xml

    ============================== Gump Tracking Only ===
    Produced by Apache Gump(TM) version 2.3.
    Gump Run 05000614082011, vmgump.apache.org:vmgump:05000614082011
    Gump E-mail Identifier (unique within run) #41.

    --
    Apache Gump
    http://gump.apache.org/ [Instance: vmgump]

    ---------------------------------------------------------------------
    To unsubscribe, e-mail: dev-unsubscribe@turbine.apache.org
    For additional commands, e-mail: dev-help@turbine.apache.org
  • Anonymous at Aug 15, 2011 at 11:58 am
    To whom it may engage...

    This is an automated request, but not an unsolicited one. For
    more information please visit http://gump.apache.org/nagged.html,
    and/or contact the folk at general@gump.apache.org.

    Project turbine-core has an issue affecting its community integration.
    This issue affects 2 projects,
    and has been outstanding for 335 runs.
    The current state of this project is 'Failed', with reason 'Build Failed'.
    For reference only, the following projects are affected by this:
    - turbine-core : A servlet based framework.
    - turbine-core-test : A servlet based framework.


    Full details are available at:
    http://vmgump.apache.org/gump/public/turbine-core/turbine-core/index.html

    That said, some information snippets are provided here.

    The following annotations (debug/informational/warning/error messages) were provided:
    -INFO- Optional dependency commons-configuration prerequisite failed with reason build failed
    -INFO- Optional dependency commons-fileupload prerequisite failed with reason build failed
    -INFO- Optional dependency httpunit failed with reason build failed
    -DEBUG- (Apache Gump generated) Apache Maven Settings in: /srv/gump/public/workspace/turbine-core/gump_mvn_settings.xml
    -INFO- Failed with reason build failed
    -DEBUG- Maven POM in: /srv/gump/public/workspace/turbine-core/pom.xml
    -INFO- Failed to extract fallback artifacts from Gump Repository



    The following work was performed:
    http://vmgump.apache.org/gump/public/turbine-core/turbine-core/gump_work/build_turbine-core_turbine-core.html
    Work Name: build_turbine-core_turbine-core (Type: Build)
    Work ended in a state of : Failed
    Elapsed: 23 secs
    Command Line: /opt/maven2/bin/mvn --batch-mode -DskipTests=true --settings /srv/gump/public/workspace/turbine-core/gump_mvn_settings.xml package
    [Working Directory: /srv/gump/public/workspace/turbine-core]
    M2_HOME: /opt/maven2
    ---------------------------------------------
    urls[19] = file:/srv/gump/public/workspace/mvnlocalrepo/shared/xml-apis/xml-apis/1.0.b2/xml-apis-1.0.b2.jar
    urls[20] = file:/srv/gump/public/workspace/mvnlocalrepo/shared/commons-configuration/commons-configuration/1.4/commons-configuration-1.4.jar
    urls[21] = file:/srv/gump/public/workspace/mvnlocalrepo/shared/commons-logging/commons-logging-api/1.0.4/commons-logging-api-1.0.4.jar
    urls[22] = file:/srv/gump/public/workspace/mvnlocalrepo/shared/commons-digester/commons-digester/1.8/commons-digester-1.8.jar
    urls[23] = file:/srv/gump/public/workspace/mvnlocalrepo/shared/commons-beanutils/commons-beanutils/1.7.0/commons-beanutils-1.7.0.jar
    urls[24] = file:/srv/gump/public/workspace/mvnlocalrepo/shared/commons-beanutils/commons-beanutils-core/1.7.0/commons-beanutils-core-1.7.0.jar
    urls[25] = file:/srv/gump/public/workspace/mvnlocalrepo/shared/commons-codec/commons-codec/1.3/commons-codec-1.3.jar
    urls[26] = file:/srv/gump/public/workspace/mvnlocalrepo/shared/commons-jxpath/commons-jxpath/1.2/commons-jxpath-1.2.jar
    urls[27] = file:/srv/gump/public/workspace/mvnlocalrepo/shared/xerces/xerces/1.2.3/xerces-1.2.3.jar
    urls[28] = file:/srv/gump/public/workspace/mvnlocalrepo/shared/ant/ant-optional/1.5.1/ant-optional-1.5.1.jar
    urls[29] = file:/srv/gump/public/workspace/mvnlocalrepo/shared/jdom/jdom/b9/jdom-b9.jar
    Number of imports: 10
    import: org.codehaus.classworlds.Entry@a6c57a42
    import: org.codehaus.classworlds.Entry@12f43f3b
    import: org.codehaus.classworlds.Entry@20025374
    import: org.codehaus.classworlds.Entry@f8e44ca4
    import: org.codehaus.classworlds.Entry@92758522
    import: org.codehaus.classworlds.Entry@ebf2705b
    import: org.codehaus.classworlds.Entry@bb25e54
    import: org.codehaus.classworlds.Entry@bece5185
    import: org.codehaus.classworlds.Entry@3fee8e37
    import: org.codehaus.classworlds.Entry@3fee19d8


    this realm = plexus.core
    urls[0] = file:/opt/maven2/lib/maven-2.2.1-uber.jar
    Number of imports: 10
    import: org.codehaus.classworlds.Entry@a6c57a42
    import: org.codehaus.classworlds.Entry@12f43f3b
    import: org.codehaus.classworlds.Entry@20025374
    import: org.codehaus.classworlds.Entry@f8e44ca4
    import: org.codehaus.classworlds.Entry@92758522
    import: org.codehaus.classworlds.Entry@ebf2705b
    import: org.codehaus.classworlds.Entry@bb25e54
    import: org.codehaus.classworlds.Entry@bece5185
    import: org.codehaus.classworlds.Entry@3fee8e37
    import: org.codehaus.classworlds.Entry@3fee19d8
    -----------------------------------------------------
    [INFO] ------------------------------------------------------------------------
    [ERROR] BUILD ERROR
    [INFO] ------------------------------------------------------------------------
    [INFO] Internal error in the plugin manager executing goal 'org.apache.torque:torque-maven-plugin:3.3:om': Unable to load the mojo 'org.apache.torque:torque-maven-plugin:3.3:om' in the plugin 'org.apache.torque:torque-maven-plugin'. A required class is missing: org/apache/torque/task/TorqueDataModelTask
    org.apache.torque.task.TorqueDataModelTask
    [INFO] ------------------------------------------------------------------------
    [INFO] For more information, run Maven with the -e switch
    [INFO] ------------------------------------------------------------------------
    [INFO] Total time: 22 seconds
    [INFO] Finished at: Mon Aug 15 11:58:25 UTC 2011
    [INFO] Final Memory: 30M/71M
    [INFO] ------------------------------------------------------------------------
    ---------------------------------------------

    To subscribe to this information via syndicated feeds:
    - RSS: http://vmgump.apache.org/gump/public/turbine-core/turbine-core/rss.xml
    - Atom: http://vmgump.apache.org/gump/public/turbine-core/turbine-core/atom.xml

    ============================== Gump Tracking Only ===
    Produced by Apache Gump(TM) version 2.3.
    Gump Run 05000615082011, vmgump.apache.org:vmgump:05000615082011
    Gump E-mail Identifier (unique within run) #41.

    --
    Apache Gump
    http://gump.apache.org/ [Instance: vmgump]

    ---------------------------------------------------------------------
    To unsubscribe, e-mail: dev-unsubscribe@turbine.apache.org
    For additional commands, e-mail: dev-help@turbine.apache.org
  • Anonymous at Aug 16, 2011 at 11:58 am
    To whom it may engage...

    This is an automated request, but not an unsolicited one. For
    more information please visit http://gump.apache.org/nagged.html,
    and/or contact the folk at general@gump.apache.org.

    Project turbine-core has an issue affecting its community integration.
    This issue affects 2 projects,
    and has been outstanding for 337 runs.
    The current state of this project is 'Failed', with reason 'Build Failed'.
    For reference only, the following projects are affected by this:
    - turbine-core : A servlet based framework.
    - turbine-core-test : A servlet based framework.


    Full details are available at:
    http://vmgump.apache.org/gump/public/turbine-core/turbine-core/index.html

    That said, some information snippets are provided here.

    The following annotations (debug/informational/warning/error messages) were provided:
    -INFO- Optional dependency commons-fileupload prerequisite failed with reason build failed
    -INFO- Optional dependency httpunit failed with reason build failed
    -DEBUG- (Apache Gump generated) Apache Maven Settings in: /srv/gump/public/workspace/turbine-core/gump_mvn_settings.xml
    -INFO- Failed with reason build failed
    -DEBUG- Maven POM in: /srv/gump/public/workspace/turbine-core/pom.xml
    -INFO- Failed to extract fallback artifacts from Gump Repository



    The following work was performed:
    http://vmgump.apache.org/gump/public/turbine-core/turbine-core/gump_work/build_turbine-core_turbine-core.html
    Work Name: build_turbine-core_turbine-core (Type: Build)
    Work ended in a state of : Failed
    Elapsed: 22 secs
    Command Line: /opt/maven2/bin/mvn --batch-mode -DskipTests=true --settings /srv/gump/public/workspace/turbine-core/gump_mvn_settings.xml package
    [Working Directory: /srv/gump/public/workspace/turbine-core]
    M2_HOME: /opt/maven2
    ---------------------------------------------
    urls[19] = file:/srv/gump/public/workspace/mvnlocalrepo/shared/xml-apis/xml-apis/1.0.b2/xml-apis-1.0.b2.jar
    urls[20] = file:/srv/gump/public/workspace/mvnlocalrepo/shared/commons-configuration/commons-configuration/1.4/commons-configuration-1.4.jar
    urls[21] = file:/srv/gump/public/workspace/mvnlocalrepo/shared/commons-logging/commons-logging-api/1.0.4/commons-logging-api-1.0.4.jar
    urls[22] = file:/srv/gump/public/workspace/mvnlocalrepo/shared/commons-digester/commons-digester/1.8/commons-digester-1.8.jar
    urls[23] = file:/srv/gump/public/workspace/mvnlocalrepo/shared/commons-beanutils/commons-beanutils/1.7.0/commons-beanutils-1.7.0.jar
    urls[24] = file:/srv/gump/public/workspace/mvnlocalrepo/shared/commons-beanutils/commons-beanutils-core/1.7.0/commons-beanutils-core-1.7.0.jar
    urls[25] = file:/srv/gump/public/workspace/mvnlocalrepo/shared/commons-codec/commons-codec/1.3/commons-codec-1.3.jar
    urls[26] = file:/srv/gump/public/workspace/mvnlocalrepo/shared/commons-jxpath/commons-jxpath/1.2/commons-jxpath-1.2.jar
    urls[27] = file:/srv/gump/public/workspace/mvnlocalrepo/shared/xerces/xerces/1.2.3/xerces-1.2.3.jar
    urls[28] = file:/srv/gump/public/workspace/mvnlocalrepo/shared/ant/ant-optional/1.5.1/ant-optional-1.5.1.jar
    urls[29] = file:/srv/gump/public/workspace/mvnlocalrepo/shared/jdom/jdom/b9/jdom-b9.jar
    Number of imports: 10
    import: org.codehaus.classworlds.Entry@a6c57a42
    import: org.codehaus.classworlds.Entry@12f43f3b
    import: org.codehaus.classworlds.Entry@20025374
    import: org.codehaus.classworlds.Entry@f8e44ca4
    import: org.codehaus.classworlds.Entry@92758522
    import: org.codehaus.classworlds.Entry@ebf2705b
    import: org.codehaus.classworlds.Entry@bb25e54
    import: org.codehaus.classworlds.Entry@bece5185
    import: org.codehaus.classworlds.Entry@3fee8e37
    import: org.codehaus.classworlds.Entry@3fee19d8


    this realm = plexus.core
    urls[0] = file:/opt/maven2/lib/maven-2.2.1-uber.jar
    Number of imports: 10
    import: org.codehaus.classworlds.Entry@a6c57a42
    import: org.codehaus.classworlds.Entry@12f43f3b
    import: org.codehaus.classworlds.Entry@20025374
    import: org.codehaus.classworlds.Entry@f8e44ca4
    import: org.codehaus.classworlds.Entry@92758522
    import: org.codehaus.classworlds.Entry@ebf2705b
    import: org.codehaus.classworlds.Entry@bb25e54
    import: org.codehaus.classworlds.Entry@bece5185
    import: org.codehaus.classworlds.Entry@3fee8e37
    import: org.codehaus.classworlds.Entry@3fee19d8
    -----------------------------------------------------
    [INFO] ------------------------------------------------------------------------
    [ERROR] BUILD ERROR
    [INFO] ------------------------------------------------------------------------
    [INFO] Internal error in the plugin manager executing goal 'org.apache.torque:torque-maven-plugin:3.3:om': Unable to load the mojo 'org.apache.torque:torque-maven-plugin:3.3:om' in the plugin 'org.apache.torque:torque-maven-plugin'. A required class is missing: org/apache/torque/task/TorqueDataModelTask
    org.apache.torque.task.TorqueDataModelTask
    [INFO] ------------------------------------------------------------------------
    [INFO] For more information, run Maven with the -e switch
    [INFO] ------------------------------------------------------------------------
    [INFO] Total time: 21 seconds
    [INFO] Finished at: Tue Aug 16 11:57:39 UTC 2011
    [INFO] Final Memory: 30M/71M
    [INFO] ------------------------------------------------------------------------
    ---------------------------------------------

    To subscribe to this information via syndicated feeds:
    - RSS: http://vmgump.apache.org/gump/public/turbine-core/turbine-core/rss.xml
    - Atom: http://vmgump.apache.org/gump/public/turbine-core/turbine-core/atom.xml

    ============================== Gump Tracking Only ===
    Produced by Apache Gump(TM) version 2.3.
    Gump Run 05000616082011, vmgump.apache.org:vmgump:05000616082011
    Gump E-mail Identifier (unique within run) #42.

    --
    Apache Gump
    http://gump.apache.org/ [Instance: vmgump]

    ---------------------------------------------------------------------
    To unsubscribe, e-mail: dev-unsubscribe@turbine.apache.org
    For additional commands, e-mail: dev-help@turbine.apache.org
  • Anonymous at Aug 17, 2011 at 12:13 pm
    To whom it may engage...

    This is an automated request, but not an unsolicited one. For
    more information please visit http://gump.apache.org/nagged.html,
    and/or contact the folk at general@gump.apache.org.

    Project turbine-core has an issue affecting its community integration.
    This issue affects 2 projects,
    and has been outstanding for 339 runs.
    The current state of this project is 'Failed', with reason 'Build Failed'.
    For reference only, the following projects are affected by this:
    - turbine-core : A servlet based framework.
    - turbine-core-test : A servlet based framework.


    Full details are available at:
    http://vmgump.apache.org/gump/public/turbine-core/turbine-core/index.html

    That said, some information snippets are provided here.

    The following annotations (debug/informational/warning/error messages) were provided:
    -INFO- Optional dependency commons-email failed with reason build failed
    -INFO- Optional dependency commons-fileupload prerequisite failed with reason build failed
    -INFO- Optional dependency httpunit failed with reason build failed
    -DEBUG- (Apache Gump generated) Apache Maven Settings in: /srv/gump/public/workspace/turbine-core/gump_mvn_settings.xml
    -INFO- Failed with reason build failed
    -DEBUG- Maven POM in: /srv/gump/public/workspace/turbine-core/pom.xml
    -INFO- Failed to extract fallback artifacts from Gump Repository



    The following work was performed:
    http://vmgump.apache.org/gump/public/turbine-core/turbine-core/gump_work/build_turbine-core_turbine-core.html
    Work Name: build_turbine-core_turbine-core (Type: Build)
    Work ended in a state of : Failed
    Elapsed: 5 mins 38 secs
    Command Line: /opt/maven2/bin/mvn --batch-mode -DskipTests=true --settings /srv/gump/public/workspace/turbine-core/gump_mvn_settings.xml package
    [Working Directory: /srv/gump/public/workspace/turbine-core]
    M2_HOME: /opt/maven2
    ---------------------------------------------
    urls[19] = file:/srv/gump/public/workspace/mvnlocalrepo/shared/xml-apis/xml-apis/1.0.b2/xml-apis-1.0.b2.jar
    urls[20] = file:/srv/gump/public/workspace/mvnlocalrepo/shared/commons-configuration/commons-configuration/1.4/commons-configuration-1.4.jar
    urls[21] = file:/srv/gump/public/workspace/mvnlocalrepo/shared/commons-logging/commons-logging-api/1.0.4/commons-logging-api-1.0.4.jar
    urls[22] = file:/srv/gump/public/workspace/mvnlocalrepo/shared/commons-digester/commons-digester/1.8/commons-digester-1.8.jar
    urls[23] = file:/srv/gump/public/workspace/mvnlocalrepo/shared/commons-beanutils/commons-beanutils/1.7.0/commons-beanutils-1.7.0.jar
    urls[24] = file:/srv/gump/public/workspace/mvnlocalrepo/shared/commons-beanutils/commons-beanutils-core/1.7.0/commons-beanutils-core-1.7.0.jar
    urls[25] = file:/srv/gump/public/workspace/mvnlocalrepo/shared/commons-codec/commons-codec/1.3/commons-codec-1.3.jar
    urls[26] = file:/srv/gump/public/workspace/mvnlocalrepo/shared/commons-jxpath/commons-jxpath/1.2/commons-jxpath-1.2.jar
    urls[27] = file:/srv/gump/public/workspace/mvnlocalrepo/shared/xerces/xerces/1.2.3/xerces-1.2.3.jar
    urls[28] = file:/srv/gump/public/workspace/mvnlocalrepo/shared/ant/ant-optional/1.5.1/ant-optional-1.5.1.jar
    urls[29] = file:/srv/gump/public/workspace/mvnlocalrepo/shared/jdom/jdom/b9/jdom-b9.jar
    Number of imports: 10
    import: org.codehaus.classworlds.Entry@a6c57a42
    import: org.codehaus.classworlds.Entry@12f43f3b
    import: org.codehaus.classworlds.Entry@20025374
    import: org.codehaus.classworlds.Entry@f8e44ca4
    import: org.codehaus.classworlds.Entry@92758522
    import: org.codehaus.classworlds.Entry@ebf2705b
    import: org.codehaus.classworlds.Entry@bb25e54
    import: org.codehaus.classworlds.Entry@bece5185
    import: org.codehaus.classworlds.Entry@3fee8e37
    import: org.codehaus.classworlds.Entry@3fee19d8


    this realm = plexus.core
    urls[0] = file:/opt/maven2/lib/maven-2.2.1-uber.jar
    Number of imports: 10
    import: org.codehaus.classworlds.Entry@a6c57a42
    import: org.codehaus.classworlds.Entry@12f43f3b
    import: org.codehaus.classworlds.Entry@20025374
    import: org.codehaus.classworlds.Entry@f8e44ca4
    import: org.codehaus.classworlds.Entry@92758522
    import: org.codehaus.classworlds.Entry@ebf2705b
    import: org.codehaus.classworlds.Entry@bb25e54
    import: org.codehaus.classworlds.Entry@bece5185
    import: org.codehaus.classworlds.Entry@3fee8e37
    import: org.codehaus.classworlds.Entry@3fee19d8
    -----------------------------------------------------
    [INFO] ------------------------------------------------------------------------
    [ERROR] BUILD ERROR
    [INFO] ------------------------------------------------------------------------
    [INFO] Internal error in the plugin manager executing goal 'org.apache.torque:torque-maven-plugin:3.3:om': Unable to load the mojo 'org.apache.torque:torque-maven-plugin:3.3:om' in the plugin 'org.apache.torque:torque-maven-plugin'. A required class is missing: org/apache/torque/task/TorqueDataModelTask
    org.apache.torque.task.TorqueDataModelTask
    [INFO] ------------------------------------------------------------------------
    [INFO] For more information, run Maven with the -e switch
    [INFO] ------------------------------------------------------------------------
    [INFO] Total time: 5 minutes 37 seconds
    [INFO] Finished at: Wed Aug 17 12:13:12 UTC 2011
    [INFO] Final Memory: 30M/72M
    [INFO] ------------------------------------------------------------------------
    ---------------------------------------------

    To subscribe to this information via syndicated feeds:
    - RSS: http://vmgump.apache.org/gump/public/turbine-core/turbine-core/rss.xml
    - Atom: http://vmgump.apache.org/gump/public/turbine-core/turbine-core/atom.xml

    ============================== Gump Tracking Only ===
    Produced by Apache Gump(TM) version 2.3.
    Gump Run 06000617082011, vmgump.apache.org:vmgump:06000617082011
    Gump E-mail Identifier (unique within run) #44.

    --
    Apache Gump
    http://gump.apache.org/ [Instance: vmgump]

    ---------------------------------------------------------------------
    To unsubscribe, e-mail: dev-unsubscribe@turbine.apache.org
    For additional commands, e-mail: dev-help@turbine.apache.org
  • Anonymous at Aug 18, 2011 at 12:02 pm
    To whom it may engage...

    This is an automated request, but not an unsolicited one. For
    more information please visit http://gump.apache.org/nagged.html,
    and/or contact the folk at general@gump.apache.org.

    Project turbine-core has an issue affecting its community integration.
    This issue affects 2 projects,
    and has been outstanding for 341 runs.
    The current state of this project is 'Failed', with reason 'Build Failed'.
    For reference only, the following projects are affected by this:
    - turbine-core : A servlet based framework.
    - turbine-core-test : A servlet based framework.


    Full details are available at:
    http://vmgump.apache.org/gump/public/turbine-core/turbine-core/index.html

    That said, some information snippets are provided here.

    The following annotations (debug/informational/warning/error messages) were provided:
    -INFO- Optional dependency commons-fileupload prerequisite failed with reason build failed
    -INFO- Optional dependency httpunit failed with reason build failed
    -DEBUG- (Apache Gump generated) Apache Maven Settings in: /srv/gump/public/workspace/turbine-core/gump_mvn_settings.xml
    -INFO- Failed with reason build failed
    -DEBUG- Maven POM in: /srv/gump/public/workspace/turbine-core/pom.xml
    -INFO- Failed to extract fallback artifacts from Gump Repository



    The following work was performed:
    http://vmgump.apache.org/gump/public/turbine-core/turbine-core/gump_work/build_turbine-core_turbine-core.html
    Work Name: build_turbine-core_turbine-core (Type: Build)
    Work ended in a state of : Failed
    Elapsed: 20 secs
    Command Line: /opt/maven2/bin/mvn --batch-mode -DskipTests=true --settings /srv/gump/public/workspace/turbine-core/gump_mvn_settings.xml package
    [Working Directory: /srv/gump/public/workspace/turbine-core]
    M2_HOME: /opt/maven2
    ---------------------------------------------
    urls[19] = file:/srv/gump/public/workspace/mvnlocalrepo/shared/xml-apis/xml-apis/1.0.b2/xml-apis-1.0.b2.jar
    urls[20] = file:/srv/gump/public/workspace/mvnlocalrepo/shared/commons-configuration/commons-configuration/1.4/commons-configuration-1.4.jar
    urls[21] = file:/srv/gump/public/workspace/mvnlocalrepo/shared/commons-logging/commons-logging-api/1.0.4/commons-logging-api-1.0.4.jar
    urls[22] = file:/srv/gump/public/workspace/mvnlocalrepo/shared/commons-digester/commons-digester/1.8/commons-digester-1.8.jar
    urls[23] = file:/srv/gump/public/workspace/mvnlocalrepo/shared/commons-beanutils/commons-beanutils/1.7.0/commons-beanutils-1.7.0.jar
    urls[24] = file:/srv/gump/public/workspace/mvnlocalrepo/shared/commons-beanutils/commons-beanutils-core/1.7.0/commons-beanutils-core-1.7.0.jar
    urls[25] = file:/srv/gump/public/workspace/mvnlocalrepo/shared/commons-codec/commons-codec/1.3/commons-codec-1.3.jar
    urls[26] = file:/srv/gump/public/workspace/mvnlocalrepo/shared/commons-jxpath/commons-jxpath/1.2/commons-jxpath-1.2.jar
    urls[27] = file:/srv/gump/public/workspace/mvnlocalrepo/shared/xerces/xerces/1.2.3/xerces-1.2.3.jar
    urls[28] = file:/srv/gump/public/workspace/mvnlocalrepo/shared/ant/ant-optional/1.5.1/ant-optional-1.5.1.jar
    urls[29] = file:/srv/gump/public/workspace/mvnlocalrepo/shared/jdom/jdom/b9/jdom-b9.jar
    Number of imports: 10
    import: org.codehaus.classworlds.Entry@a6c57a42
    import: org.codehaus.classworlds.Entry@12f43f3b
    import: org.codehaus.classworlds.Entry@20025374
    import: org.codehaus.classworlds.Entry@f8e44ca4
    import: org.codehaus.classworlds.Entry@92758522
    import: org.codehaus.classworlds.Entry@ebf2705b
    import: org.codehaus.classworlds.Entry@bb25e54
    import: org.codehaus.classworlds.Entry@bece5185
    import: org.codehaus.classworlds.Entry@3fee8e37
    import: org.codehaus.classworlds.Entry@3fee19d8


    this realm = plexus.core
    urls[0] = file:/opt/maven2/lib/maven-2.2.1-uber.jar
    Number of imports: 10
    import: org.codehaus.classworlds.Entry@a6c57a42
    import: org.codehaus.classworlds.Entry@12f43f3b
    import: org.codehaus.classworlds.Entry@20025374
    import: org.codehaus.classworlds.Entry@f8e44ca4
    import: org.codehaus.classworlds.Entry@92758522
    import: org.codehaus.classworlds.Entry@ebf2705b
    import: org.codehaus.classworlds.Entry@bb25e54
    import: org.codehaus.classworlds.Entry@bece5185
    import: org.codehaus.classworlds.Entry@3fee8e37
    import: org.codehaus.classworlds.Entry@3fee19d8
    -----------------------------------------------------
    [INFO] ------------------------------------------------------------------------
    [ERROR] BUILD ERROR
    [INFO] ------------------------------------------------------------------------
    [INFO] Internal error in the plugin manager executing goal 'org.apache.torque:torque-maven-plugin:3.3:om': Unable to load the mojo 'org.apache.torque:torque-maven-plugin:3.3:om' in the plugin 'org.apache.torque:torque-maven-plugin'. A required class is missing: org/apache/torque/task/TorqueDataModelTask
    org.apache.torque.task.TorqueDataModelTask
    [INFO] ------------------------------------------------------------------------
    [INFO] For more information, run Maven with the -e switch
    [INFO] ------------------------------------------------------------------------
    [INFO] Total time: 19 seconds
    [INFO] Finished at: Thu Aug 18 12:01:45 UTC 2011
    [INFO] Final Memory: 30M/71M
    [INFO] ------------------------------------------------------------------------
    ---------------------------------------------

    To subscribe to this information via syndicated feeds:
    - RSS: http://vmgump.apache.org/gump/public/turbine-core/turbine-core/rss.xml
    - Atom: http://vmgump.apache.org/gump/public/turbine-core/turbine-core/atom.xml

    ============================== Gump Tracking Only ===
    Produced by Apache Gump(TM) version 2.3.
    Gump Run 06000618082011, vmgump.apache.org:vmgump:06000618082011
    Gump E-mail Identifier (unique within run) #43.

    --
    Apache Gump
    http://gump.apache.org/ [Instance: vmgump]

    ---------------------------------------------------------------------
    To unsubscribe, e-mail: dev-unsubscribe@turbine.apache.org
    For additional commands, e-mail: dev-help@turbine.apache.org
  • Anonymous at Aug 19, 2011 at 11:57 am
    To whom it may engage...

    This is an automated request, but not an unsolicited one. For
    more information please visit http://gump.apache.org/nagged.html,
    and/or contact the folk at general@gump.apache.org.

    Project turbine-core has an issue affecting its community integration.
    This issue affects 2 projects,
    and has been outstanding for 343 runs.
    The current state of this project is 'Failed', with reason 'Build Failed'.
    For reference only, the following projects are affected by this:
    - turbine-core : A servlet based framework.
    - turbine-core-test : A servlet based framework.


    Full details are available at:
    http://vmgump.apache.org/gump/public/turbine-core/turbine-core/index.html

    That said, some information snippets are provided here.

    The following annotations (debug/informational/warning/error messages) were provided:
    -INFO- Optional dependency commons-fileupload prerequisite failed with reason build failed
    -INFO- Optional dependency httpunit failed with reason build failed
    -DEBUG- (Apache Gump generated) Apache Maven Settings in: /srv/gump/public/workspace/turbine-core/gump_mvn_settings.xml
    -INFO- Failed with reason build failed
    -DEBUG- Maven POM in: /srv/gump/public/workspace/turbine-core/pom.xml
    -INFO- Failed to extract fallback artifacts from Gump Repository



    The following work was performed:
    http://vmgump.apache.org/gump/public/turbine-core/turbine-core/gump_work/build_turbine-core_turbine-core.html
    Work Name: build_turbine-core_turbine-core (Type: Build)
    Work ended in a state of : Failed
    Elapsed: 22 secs
    Command Line: /opt/maven2/bin/mvn --batch-mode -DskipTests=true --settings /srv/gump/public/workspace/turbine-core/gump_mvn_settings.xml package
    [Working Directory: /srv/gump/public/workspace/turbine-core]
    M2_HOME: /opt/maven2
    ---------------------------------------------
    urls[19] = file:/srv/gump/public/workspace/mvnlocalrepo/shared/xml-apis/xml-apis/1.0.b2/xml-apis-1.0.b2.jar
    urls[20] = file:/srv/gump/public/workspace/mvnlocalrepo/shared/commons-configuration/commons-configuration/1.4/commons-configuration-1.4.jar
    urls[21] = file:/srv/gump/public/workspace/mvnlocalrepo/shared/commons-logging/commons-logging-api/1.0.4/commons-logging-api-1.0.4.jar
    urls[22] = file:/srv/gump/public/workspace/mvnlocalrepo/shared/commons-digester/commons-digester/1.8/commons-digester-1.8.jar
    urls[23] = file:/srv/gump/public/workspace/mvnlocalrepo/shared/commons-beanutils/commons-beanutils/1.7.0/commons-beanutils-1.7.0.jar
    urls[24] = file:/srv/gump/public/workspace/mvnlocalrepo/shared/commons-beanutils/commons-beanutils-core/1.7.0/commons-beanutils-core-1.7.0.jar
    urls[25] = file:/srv/gump/public/workspace/mvnlocalrepo/shared/commons-codec/commons-codec/1.3/commons-codec-1.3.jar
    urls[26] = file:/srv/gump/public/workspace/mvnlocalrepo/shared/commons-jxpath/commons-jxpath/1.2/commons-jxpath-1.2.jar
    urls[27] = file:/srv/gump/public/workspace/mvnlocalrepo/shared/xerces/xerces/1.2.3/xerces-1.2.3.jar
    urls[28] = file:/srv/gump/public/workspace/mvnlocalrepo/shared/ant/ant-optional/1.5.1/ant-optional-1.5.1.jar
    urls[29] = file:/srv/gump/public/workspace/mvnlocalrepo/shared/jdom/jdom/b9/jdom-b9.jar
    Number of imports: 10
    import: org.codehaus.classworlds.Entry@a6c57a42
    import: org.codehaus.classworlds.Entry@12f43f3b
    import: org.codehaus.classworlds.Entry@20025374
    import: org.codehaus.classworlds.Entry@f8e44ca4
    import: org.codehaus.classworlds.Entry@92758522
    import: org.codehaus.classworlds.Entry@ebf2705b
    import: org.codehaus.classworlds.Entry@bb25e54
    import: org.codehaus.classworlds.Entry@bece5185
    import: org.codehaus.classworlds.Entry@3fee8e37
    import: org.codehaus.classworlds.Entry@3fee19d8


    this realm = plexus.core
    urls[0] = file:/opt/maven2/lib/maven-2.2.1-uber.jar
    Number of imports: 10
    import: org.codehaus.classworlds.Entry@a6c57a42
    import: org.codehaus.classworlds.Entry@12f43f3b
    import: org.codehaus.classworlds.Entry@20025374
    import: org.codehaus.classworlds.Entry@f8e44ca4
    import: org.codehaus.classworlds.Entry@92758522
    import: org.codehaus.classworlds.Entry@ebf2705b
    import: org.codehaus.classworlds.Entry@bb25e54
    import: org.codehaus.classworlds.Entry@bece5185
    import: org.codehaus.classworlds.Entry@3fee8e37
    import: org.codehaus.classworlds.Entry@3fee19d8
    -----------------------------------------------------
    [INFO] ------------------------------------------------------------------------
    [ERROR] BUILD ERROR
    [INFO] ------------------------------------------------------------------------
    [INFO] Internal error in the plugin manager executing goal 'org.apache.torque:torque-maven-plugin:3.3:om': Unable to load the mojo 'org.apache.torque:torque-maven-plugin:3.3:om' in the plugin 'org.apache.torque:torque-maven-plugin'. A required class is missing: org/apache/torque/task/TorqueDataModelTask
    org.apache.torque.task.TorqueDataModelTask
    [INFO] ------------------------------------------------------------------------
    [INFO] For more information, run Maven with the -e switch
    [INFO] ------------------------------------------------------------------------
    [INFO] Total time: 21 seconds
    [INFO] Finished at: Fri Aug 19 11:56:37 UTC 2011
    [INFO] Final Memory: 30M/71M
    [INFO] ------------------------------------------------------------------------
    ---------------------------------------------

    To subscribe to this information via syndicated feeds:
    - RSS: http://vmgump.apache.org/gump/public/turbine-core/turbine-core/rss.xml
    - Atom: http://vmgump.apache.org/gump/public/turbine-core/turbine-core/atom.xml

    ============================== Gump Tracking Only ===
    Produced by Apache Gump(TM) version 2.3.
    Gump Run 05000619082011, vmgump.apache.org:vmgump:05000619082011
    Gump E-mail Identifier (unique within run) #43.

    --
    Apache Gump
    http://gump.apache.org/ [Instance: vmgump]

    ---------------------------------------------------------------------
    To unsubscribe, e-mail: dev-unsubscribe@turbine.apache.org
    For additional commands, e-mail: dev-help@turbine.apache.org
  • Anonymous at Aug 20, 2011 at 12:51 pm
    To whom it may engage...

    This is an automated request, but not an unsolicited one. For
    more information please visit http://gump.apache.org/nagged.html,
    and/or contact the folk at general@gump.apache.org.

    Project turbine-core has an issue affecting its community integration.
    This issue affects 2 projects,
    and has been outstanding for 345 runs.
    The current state of this project is 'Failed', with reason 'Build Failed'.
    For reference only, the following projects are affected by this:
    - turbine-core : A servlet based framework.
    - turbine-core-test : A servlet based framework.


    Full details are available at:
    http://vmgump.apache.org/gump/public/turbine-core/turbine-core/index.html

    That said, some information snippets are provided here.

    The following annotations (debug/informational/warning/error messages) were provided:
    -INFO- Optional dependency commons-fileupload prerequisite failed with reason build failed
    -INFO- Optional dependency httpunit failed with reason build failed
    -DEBUG- (Apache Gump generated) Apache Maven Settings in: /srv/gump/public/workspace/turbine-core/gump_mvn_settings.xml
    -INFO- Failed with reason build failed
    -DEBUG- Maven POM in: /srv/gump/public/workspace/turbine-core/pom.xml
    -INFO- Failed to extract fallback artifacts from Gump Repository



    The following work was performed:
    http://vmgump.apache.org/gump/public/turbine-core/turbine-core/gump_work/build_turbine-core_turbine-core.html
    Work Name: build_turbine-core_turbine-core (Type: Build)
    Work ended in a state of : Failed
    Elapsed: 20 secs
    Command Line: /opt/maven2/bin/mvn --batch-mode -DskipTests=true --settings /srv/gump/public/workspace/turbine-core/gump_mvn_settings.xml package
    [Working Directory: /srv/gump/public/workspace/turbine-core]
    M2_HOME: /opt/maven2
    ---------------------------------------------
    urls[19] = file:/srv/gump/public/workspace/mvnlocalrepo/shared/xml-apis/xml-apis/1.0.b2/xml-apis-1.0.b2.jar
    urls[20] = file:/srv/gump/public/workspace/mvnlocalrepo/shared/commons-configuration/commons-configuration/1.4/commons-configuration-1.4.jar
    urls[21] = file:/srv/gump/public/workspace/mvnlocalrepo/shared/commons-logging/commons-logging-api/1.0.4/commons-logging-api-1.0.4.jar
    urls[22] = file:/srv/gump/public/workspace/mvnlocalrepo/shared/commons-digester/commons-digester/1.8/commons-digester-1.8.jar
    urls[23] = file:/srv/gump/public/workspace/mvnlocalrepo/shared/commons-beanutils/commons-beanutils/1.7.0/commons-beanutils-1.7.0.jar
    urls[24] = file:/srv/gump/public/workspace/mvnlocalrepo/shared/commons-beanutils/commons-beanutils-core/1.7.0/commons-beanutils-core-1.7.0.jar
    urls[25] = file:/srv/gump/public/workspace/mvnlocalrepo/shared/commons-codec/commons-codec/1.3/commons-codec-1.3.jar
    urls[26] = file:/srv/gump/public/workspace/mvnlocalrepo/shared/commons-jxpath/commons-jxpath/1.2/commons-jxpath-1.2.jar
    urls[27] = file:/srv/gump/public/workspace/mvnlocalrepo/shared/xerces/xerces/1.2.3/xerces-1.2.3.jar
    urls[28] = file:/srv/gump/public/workspace/mvnlocalrepo/shared/ant/ant-optional/1.5.1/ant-optional-1.5.1.jar
    urls[29] = file:/srv/gump/public/workspace/mvnlocalrepo/shared/jdom/jdom/b9/jdom-b9.jar
    Number of imports: 10
    import: org.codehaus.classworlds.Entry@a6c57a42
    import: org.codehaus.classworlds.Entry@12f43f3b
    import: org.codehaus.classworlds.Entry@20025374
    import: org.codehaus.classworlds.Entry@f8e44ca4
    import: org.codehaus.classworlds.Entry@92758522
    import: org.codehaus.classworlds.Entry@ebf2705b
    import: org.codehaus.classworlds.Entry@bb25e54
    import: org.codehaus.classworlds.Entry@bece5185
    import: org.codehaus.classworlds.Entry@3fee8e37
    import: org.codehaus.classworlds.Entry@3fee19d8


    this realm = plexus.core
    urls[0] = file:/opt/maven2/lib/maven-2.2.1-uber.jar
    Number of imports: 10
    import: org.codehaus.classworlds.Entry@a6c57a42
    import: org.codehaus.classworlds.Entry@12f43f3b
    import: org.codehaus.classworlds.Entry@20025374
    import: org.codehaus.classworlds.Entry@f8e44ca4
    import: org.codehaus.classworlds.Entry@92758522
    import: org.codehaus.classworlds.Entry@ebf2705b
    import: org.codehaus.classworlds.Entry@bb25e54
    import: org.codehaus.classworlds.Entry@bece5185
    import: org.codehaus.classworlds.Entry@3fee8e37
    import: org.codehaus.classworlds.Entry@3fee19d8
    -----------------------------------------------------
    [INFO] ------------------------------------------------------------------------
    [ERROR] BUILD ERROR
    [INFO] ------------------------------------------------------------------------
    [INFO] Internal error in the plugin manager executing goal 'org.apache.torque:torque-maven-plugin:3.3:om': Unable to load the mojo 'org.apache.torque:torque-maven-plugin:3.3:om' in the plugin 'org.apache.torque:torque-maven-plugin'. A required class is missing: org/apache/torque/task/TorqueDataModelTask
    org.apache.torque.task.TorqueDataModelTask
    [INFO] ------------------------------------------------------------------------
    [INFO] For more information, run Maven with the -e switch
    [INFO] ------------------------------------------------------------------------
    [INFO] Total time: 19 seconds
    [INFO] Finished at: Sat Aug 20 12:50:34 UTC 2011
    [INFO] Final Memory: 30M/71M
    [INFO] ------------------------------------------------------------------------
    ---------------------------------------------

    To subscribe to this information via syndicated feeds:
    - RSS: http://vmgump.apache.org/gump/public/turbine-core/turbine-core/rss.xml
    - Atom: http://vmgump.apache.org/gump/public/turbine-core/turbine-core/atom.xml

    ============================== Gump Tracking Only ===
    Produced by Apache Gump(TM) version 2.3.
    Gump Run 05000620082011, vmgump.apache.org:vmgump:05000620082011
    Gump E-mail Identifier (unique within run) #44.

    --
    Apache Gump
    http://gump.apache.org/ [Instance: vmgump]

    ---------------------------------------------------------------------
    To unsubscribe, e-mail: dev-unsubscribe@turbine.apache.org
    For additional commands, e-mail: dev-help@turbine.apache.org
  • Anonymous at Aug 21, 2011 at 11:51 am
    To whom it may engage...

    This is an automated request, but not an unsolicited one. For
    more information please visit http://gump.apache.org/nagged.html,
    and/or contact the folk at general@gump.apache.org.

    Project turbine-core has an issue affecting its community integration.
    This issue affects 2 projects,
    and has been outstanding for 347 runs.
    The current state of this project is 'Failed', with reason 'Build Failed'.
    For reference only, the following projects are affected by this:
    - turbine-core : A servlet based framework.
    - turbine-core-test : A servlet based framework.


    Full details are available at:
    http://vmgump.apache.org/gump/public/turbine-core/turbine-core/index.html

    That said, some information snippets are provided here.

    The following annotations (debug/informational/warning/error messages) were provided:
    -INFO- Optional dependency commons-fileupload prerequisite failed with reason build failed
    -INFO- Optional dependency httpunit failed with reason build failed
    -DEBUG- (Apache Gump generated) Apache Maven Settings in: /srv/gump/public/workspace/turbine-core/gump_mvn_settings.xml
    -INFO- Failed with reason build failed
    -DEBUG- Maven POM in: /srv/gump/public/workspace/turbine-core/pom.xml
    -INFO- Failed to extract fallback artifacts from Gump Repository



    The following work was performed:
    http://vmgump.apache.org/gump/public/turbine-core/turbine-core/gump_work/build_turbine-core_turbine-core.html
    Work Name: build_turbine-core_turbine-core (Type: Build)
    Work ended in a state of : Failed
    Elapsed: 22 secs
    Command Line: /opt/maven2/bin/mvn --batch-mode -DskipTests=true --settings /srv/gump/public/workspace/turbine-core/gump_mvn_settings.xml package
    [Working Directory: /srv/gump/public/workspace/turbine-core]
    M2_HOME: /opt/maven2
    ---------------------------------------------
    urls[19] = file:/srv/gump/public/workspace/mvnlocalrepo/shared/xml-apis/xml-apis/1.0.b2/xml-apis-1.0.b2.jar
    urls[20] = file:/srv/gump/public/workspace/mvnlocalrepo/shared/commons-configuration/commons-configuration/1.4/commons-configuration-1.4.jar
    urls[21] = file:/srv/gump/public/workspace/mvnlocalrepo/shared/commons-logging/commons-logging-api/1.0.4/commons-logging-api-1.0.4.jar
    urls[22] = file:/srv/gump/public/workspace/mvnlocalrepo/shared/commons-digester/commons-digester/1.8/commons-digester-1.8.jar
    urls[23] = file:/srv/gump/public/workspace/mvnlocalrepo/shared/commons-beanutils/commons-beanutils/1.7.0/commons-beanutils-1.7.0.jar
    urls[24] = file:/srv/gump/public/workspace/mvnlocalrepo/shared/commons-beanutils/commons-beanutils-core/1.7.0/commons-beanutils-core-1.7.0.jar
    urls[25] = file:/srv/gump/public/workspace/mvnlocalrepo/shared/commons-codec/commons-codec/1.3/commons-codec-1.3.jar
    urls[26] = file:/srv/gump/public/workspace/mvnlocalrepo/shared/commons-jxpath/commons-jxpath/1.2/commons-jxpath-1.2.jar
    urls[27] = file:/srv/gump/public/workspace/mvnlocalrepo/shared/xerces/xerces/1.2.3/xerces-1.2.3.jar
    urls[28] = file:/srv/gump/public/workspace/mvnlocalrepo/shared/ant/ant-optional/1.5.1/ant-optional-1.5.1.jar
    urls[29] = file:/srv/gump/public/workspace/mvnlocalrepo/shared/jdom/jdom/b9/jdom-b9.jar
    Number of imports: 10
    import: org.codehaus.classworlds.Entry@a6c57a42
    import: org.codehaus.classworlds.Entry@12f43f3b
    import: org.codehaus.classworlds.Entry@20025374
    import: org.codehaus.classworlds.Entry@f8e44ca4
    import: org.codehaus.classworlds.Entry@92758522
    import: org.codehaus.classworlds.Entry@ebf2705b
    import: org.codehaus.classworlds.Entry@bb25e54
    import: org.codehaus.classworlds.Entry@bece5185
    import: org.codehaus.classworlds.Entry@3fee8e37
    import: org.codehaus.classworlds.Entry@3fee19d8


    this realm = plexus.core
    urls[0] = file:/opt/maven2/lib/maven-2.2.1-uber.jar
    Number of imports: 10
    import: org.codehaus.classworlds.Entry@a6c57a42
    import: org.codehaus.classworlds.Entry@12f43f3b
    import: org.codehaus.classworlds.Entry@20025374
    import: org.codehaus.classworlds.Entry@f8e44ca4
    import: org.codehaus.classworlds.Entry@92758522
    import: org.codehaus.classworlds.Entry@ebf2705b
    import: org.codehaus.classworlds.Entry@bb25e54
    import: org.codehaus.classworlds.Entry@bece5185
    import: org.codehaus.classworlds.Entry@3fee8e37
    import: org.codehaus.classworlds.Entry@3fee19d8
    -----------------------------------------------------
    [INFO] ------------------------------------------------------------------------
    [ERROR] BUILD ERROR
    [INFO] ------------------------------------------------------------------------
    [INFO] Internal error in the plugin manager executing goal 'org.apache.torque:torque-maven-plugin:3.3:om': Unable to load the mojo 'org.apache.torque:torque-maven-plugin:3.3:om' in the plugin 'org.apache.torque:torque-maven-plugin'. A required class is missing: org/apache/torque/task/TorqueDataModelTask
    org.apache.torque.task.TorqueDataModelTask
    [INFO] ------------------------------------------------------------------------
    [INFO] For more information, run Maven with the -e switch
    [INFO] ------------------------------------------------------------------------
    [INFO] Total time: 21 seconds
    [INFO] Finished at: Sun Aug 21 11:50:58 UTC 2011
    [INFO] Final Memory: 30M/71M
    [INFO] ------------------------------------------------------------------------
    ---------------------------------------------

    To subscribe to this information via syndicated feeds:
    - RSS: http://vmgump.apache.org/gump/public/turbine-core/turbine-core/rss.xml
    - Atom: http://vmgump.apache.org/gump/public/turbine-core/turbine-core/atom.xml

    ============================== Gump Tracking Only ===
    Produced by Apache Gump(TM) version 2.3.
    Gump Run 06000621082011, vmgump.apache.org:vmgump:06000621082011
    Gump E-mail Identifier (unique within run) #42.

    --
    Apache Gump
    http://gump.apache.org/ [Instance: vmgump]

    ---------------------------------------------------------------------
    To unsubscribe, e-mail: dev-unsubscribe@turbine.apache.org
    For additional commands, e-mail: dev-help@turbine.apache.org
  • Anonymous at Aug 22, 2011 at 12:02 pm
    To whom it may engage...

    This is an automated request, but not an unsolicited one. For
    more information please visit http://gump.apache.org/nagged.html,
    and/or contact the folk at general@gump.apache.org.

    Project turbine-core has an issue affecting its community integration.
    This issue affects 2 projects,
    and has been outstanding for 349 runs.
    The current state of this project is 'Failed', with reason 'Build Failed'.
    For reference only, the following projects are affected by this:
    - turbine-core : A servlet based framework.
    - turbine-core-test : A servlet based framework.


    Full details are available at:
    http://vmgump.apache.org/gump/public/turbine-core/turbine-core/index.html

    That said, some information snippets are provided here.

    The following annotations (debug/informational/warning/error messages) were provided:
    -INFO- Optional dependency commons-fileupload prerequisite failed with reason build failed
    -INFO- Optional dependency httpunit failed with reason build failed
    -DEBUG- (Apache Gump generated) Apache Maven Settings in: /srv/gump/public/workspace/turbine-core/gump_mvn_settings.xml
    -INFO- Failed with reason build failed
    -DEBUG- Maven POM in: /srv/gump/public/workspace/turbine-core/pom.xml
    -INFO- Failed to extract fallback artifacts from Gump Repository



    The following work was performed:
    http://vmgump.apache.org/gump/public/turbine-core/turbine-core/gump_work/build_turbine-core_turbine-core.html
    Work Name: build_turbine-core_turbine-core (Type: Build)
    Work ended in a state of : Failed
    Elapsed: 21 secs
    Command Line: /opt/maven2/bin/mvn --batch-mode -DskipTests=true --settings /srv/gump/public/workspace/turbine-core/gump_mvn_settings.xml package
    [Working Directory: /srv/gump/public/workspace/turbine-core]
    M2_HOME: /opt/maven2
    ---------------------------------------------
    urls[19] = file:/srv/gump/public/workspace/mvnlocalrepo/shared/xml-apis/xml-apis/1.0.b2/xml-apis-1.0.b2.jar
    urls[20] = file:/srv/gump/public/workspace/mvnlocalrepo/shared/commons-configuration/commons-configuration/1.4/commons-configuration-1.4.jar
    urls[21] = file:/srv/gump/public/workspace/mvnlocalrepo/shared/commons-logging/commons-logging-api/1.0.4/commons-logging-api-1.0.4.jar
    urls[22] = file:/srv/gump/public/workspace/mvnlocalrepo/shared/commons-digester/commons-digester/1.8/commons-digester-1.8.jar
    urls[23] = file:/srv/gump/public/workspace/mvnlocalrepo/shared/commons-beanutils/commons-beanutils/1.7.0/commons-beanutils-1.7.0.jar
    urls[24] = file:/srv/gump/public/workspace/mvnlocalrepo/shared/commons-beanutils/commons-beanutils-core/1.7.0/commons-beanutils-core-1.7.0.jar
    urls[25] = file:/srv/gump/public/workspace/mvnlocalrepo/shared/commons-codec/commons-codec/1.3/commons-codec-1.3.jar
    urls[26] = file:/srv/gump/public/workspace/mvnlocalrepo/shared/commons-jxpath/commons-jxpath/1.2/commons-jxpath-1.2.jar
    urls[27] = file:/srv/gump/public/workspace/mvnlocalrepo/shared/xerces/xerces/1.2.3/xerces-1.2.3.jar
    urls[28] = file:/srv/gump/public/workspace/mvnlocalrepo/shared/ant/ant-optional/1.5.1/ant-optional-1.5.1.jar
    urls[29] = file:/srv/gump/public/workspace/mvnlocalrepo/shared/jdom/jdom/b9/jdom-b9.jar
    Number of imports: 10
    import: org.codehaus.classworlds.Entry@a6c57a42
    import: org.codehaus.classworlds.Entry@12f43f3b
    import: org.codehaus.classworlds.Entry@20025374
    import: org.codehaus.classworlds.Entry@f8e44ca4
    import: org.codehaus.classworlds.Entry@92758522
    import: org.codehaus.classworlds.Entry@ebf2705b
    import: org.codehaus.classworlds.Entry@bb25e54
    import: org.codehaus.classworlds.Entry@bece5185
    import: org.codehaus.classworlds.Entry@3fee8e37
    import: org.codehaus.classworlds.Entry@3fee19d8


    this realm = plexus.core
    urls[0] = file:/opt/maven2/lib/maven-2.2.1-uber.jar
    Number of imports: 10
    import: org.codehaus.classworlds.Entry@a6c57a42
    import: org.codehaus.classworlds.Entry@12f43f3b
    import: org.codehaus.classworlds.Entry@20025374
    import: org.codehaus.classworlds.Entry@f8e44ca4
    import: org.codehaus.classworlds.Entry@92758522
    import: org.codehaus.classworlds.Entry@ebf2705b
    import: org.codehaus.classworlds.Entry@bb25e54
    import: org.codehaus.classworlds.Entry@bece5185
    import: org.codehaus.classworlds.Entry@3fee8e37
    import: org.codehaus.classworlds.Entry@3fee19d8
    -----------------------------------------------------
    [INFO] ------------------------------------------------------------------------
    [ERROR] BUILD ERROR
    [INFO] ------------------------------------------------------------------------
    [INFO] Internal error in the plugin manager executing goal 'org.apache.torque:torque-maven-plugin:3.3:om': Unable to load the mojo 'org.apache.torque:torque-maven-plugin:3.3:om' in the plugin 'org.apache.torque:torque-maven-plugin'. A required class is missing: org/apache/torque/task/TorqueDataModelTask
    org.apache.torque.task.TorqueDataModelTask
    [INFO] ------------------------------------------------------------------------
    [INFO] For more information, run Maven with the -e switch
    [INFO] ------------------------------------------------------------------------
    [INFO] Total time: 20 seconds
    [INFO] Finished at: Mon Aug 22 11:57:35 UTC 2011
    [INFO] Final Memory: 30M/71M
    [INFO] ------------------------------------------------------------------------
    ---------------------------------------------

    To subscribe to this information via syndicated feeds:
    - RSS: http://vmgump.apache.org/gump/public/turbine-core/turbine-core/rss.xml
    - Atom: http://vmgump.apache.org/gump/public/turbine-core/turbine-core/atom.xml

    ============================== Gump Tracking Only ===
    Produced by Apache Gump(TM) version 2.3.
    Gump Run 05000622082011, vmgump.apache.org:vmgump:05000622082011
    Gump E-mail Identifier (unique within run) #44.

    --
    Apache Gump
    http://gump.apache.org/ [Instance: vmgump]

    ---------------------------------------------------------------------
    To unsubscribe, e-mail: dev-unsubscribe@turbine.apache.org
    For additional commands, e-mail: dev-help@turbine.apache.org
  • Anonymous at Aug 23, 2011 at 11:59 am
    To whom it may engage...

    This is an automated request, but not an unsolicited one. For
    more information please visit http://gump.apache.org/nagged.html,
    and/or contact the folk at general@gump.apache.org.

    Project turbine-core has an issue affecting its community integration.
    This issue affects 2 projects,
    and has been outstanding for 351 runs.
    The current state of this project is 'Failed', with reason 'Build Failed'.
    For reference only, the following projects are affected by this:
    - turbine-core : A servlet based framework.
    - turbine-core-test : A servlet based framework.


    Full details are available at:
    http://vmgump.apache.org/gump/public/turbine-core/turbine-core/index.html

    That said, some information snippets are provided here.

    The following annotations (debug/informational/warning/error messages) were provided:
    -INFO- Optional dependency commons-fileupload prerequisite failed with reason build failed
    -INFO- Optional dependency httpunit failed with reason build failed
    -DEBUG- (Apache Gump generated) Apache Maven Settings in: /srv/gump/public/workspace/turbine-core/gump_mvn_settings.xml
    -INFO- Failed with reason build failed
    -DEBUG- Maven POM in: /srv/gump/public/workspace/turbine-core/pom.xml
    -INFO- Failed to extract fallback artifacts from Gump Repository



    The following work was performed:
    http://vmgump.apache.org/gump/public/turbine-core/turbine-core/gump_work/build_turbine-core_turbine-core.html
    Work Name: build_turbine-core_turbine-core (Type: Build)
    Work ended in a state of : Failed
    Elapsed: 20 secs
    Command Line: /opt/maven2/bin/mvn --batch-mode -DskipTests=true --settings /srv/gump/public/workspace/turbine-core/gump_mvn_settings.xml package
    [Working Directory: /srv/gump/public/workspace/turbine-core]
    M2_HOME: /opt/maven2
    ---------------------------------------------
    urls[19] = file:/srv/gump/public/workspace/mvnlocalrepo/shared/xml-apis/xml-apis/1.0.b2/xml-apis-1.0.b2.jar
    urls[20] = file:/srv/gump/public/workspace/mvnlocalrepo/shared/commons-configuration/commons-configuration/1.4/commons-configuration-1.4.jar
    urls[21] = file:/srv/gump/public/workspace/mvnlocalrepo/shared/commons-logging/commons-logging-api/1.0.4/commons-logging-api-1.0.4.jar
    urls[22] = file:/srv/gump/public/workspace/mvnlocalrepo/shared/commons-digester/commons-digester/1.8/commons-digester-1.8.jar
    urls[23] = file:/srv/gump/public/workspace/mvnlocalrepo/shared/commons-beanutils/commons-beanutils/1.7.0/commons-beanutils-1.7.0.jar
    urls[24] = file:/srv/gump/public/workspace/mvnlocalrepo/shared/commons-beanutils/commons-beanutils-core/1.7.0/commons-beanutils-core-1.7.0.jar
    urls[25] = file:/srv/gump/public/workspace/mvnlocalrepo/shared/commons-codec/commons-codec/1.3/commons-codec-1.3.jar
    urls[26] = file:/srv/gump/public/workspace/mvnlocalrepo/shared/commons-jxpath/commons-jxpath/1.2/commons-jxpath-1.2.jar
    urls[27] = file:/srv/gump/public/workspace/mvnlocalrepo/shared/xerces/xerces/1.2.3/xerces-1.2.3.jar
    urls[28] = file:/srv/gump/public/workspace/mvnlocalrepo/shared/ant/ant-optional/1.5.1/ant-optional-1.5.1.jar
    urls[29] = file:/srv/gump/public/workspace/mvnlocalrepo/shared/jdom/jdom/b9/jdom-b9.jar
    Number of imports: 10
    import: org.codehaus.classworlds.Entry@a6c57a42
    import: org.codehaus.classworlds.Entry@12f43f3b
    import: org.codehaus.classworlds.Entry@20025374
    import: org.codehaus.classworlds.Entry@f8e44ca4
    import: org.codehaus.classworlds.Entry@92758522
    import: org.codehaus.classworlds.Entry@ebf2705b
    import: org.codehaus.classworlds.Entry@bb25e54
    import: org.codehaus.classworlds.Entry@bece5185
    import: org.codehaus.classworlds.Entry@3fee8e37
    import: org.codehaus.classworlds.Entry@3fee19d8


    this realm = plexus.core
    urls[0] = file:/opt/maven2/lib/maven-2.2.1-uber.jar
    Number of imports: 10
    import: org.codehaus.classworlds.Entry@a6c57a42
    import: org.codehaus.classworlds.Entry@12f43f3b
    import: org.codehaus.classworlds.Entry@20025374
    import: org.codehaus.classworlds.Entry@f8e44ca4
    import: org.codehaus.classworlds.Entry@92758522
    import: org.codehaus.classworlds.Entry@ebf2705b
    import: org.codehaus.classworlds.Entry@bb25e54
    import: org.codehaus.classworlds.Entry@bece5185
    import: org.codehaus.classworlds.Entry@3fee8e37
    import: org.codehaus.classworlds.Entry@3fee19d8
    -----------------------------------------------------
    [INFO] ------------------------------------------------------------------------
    [ERROR] BUILD ERROR
    [INFO] ------------------------------------------------------------------------
    [INFO] Internal error in the plugin manager executing goal 'org.apache.torque:torque-maven-plugin:3.3:om': Unable to load the mojo 'org.apache.torque:torque-maven-plugin:3.3:om' in the plugin 'org.apache.torque:torque-maven-plugin'. A required class is missing: org/apache/torque/task/TorqueDataModelTask
    org.apache.torque.task.TorqueDataModelTask
    [INFO] ------------------------------------------------------------------------
    [INFO] For more information, run Maven with the -e switch
    [INFO] ------------------------------------------------------------------------
    [INFO] Total time: 19 seconds
    [INFO] Finished at: Tue Aug 23 11:58:32 UTC 2011
    [INFO] Final Memory: 30M/71M
    [INFO] ------------------------------------------------------------------------
    ---------------------------------------------

    To subscribe to this information via syndicated feeds:
    - RSS: http://vmgump.apache.org/gump/public/turbine-core/turbine-core/rss.xml
    - Atom: http://vmgump.apache.org/gump/public/turbine-core/turbine-core/atom.xml

    ============================== Gump Tracking Only ===
    Produced by Apache Gump(TM) version 2.3.
    Gump Run 06000623082011, vmgump.apache.org:vmgump:06000623082011
    Gump E-mail Identifier (unique within run) #43.

    --
    Apache Gump
    http://gump.apache.org/ [Instance: vmgump]

    ---------------------------------------------------------------------
    To unsubscribe, e-mail: dev-unsubscribe@turbine.apache.org
    For additional commands, e-mail: dev-help@turbine.apache.org
  • Anonymous at Aug 24, 2011 at 11:30 am
    To whom it may engage...

    This is an automated request, but not an unsolicited one. For
    more information please visit http://gump.apache.org/nagged.html,
    and/or contact the folk at general@gump.apache.org.

    Project turbine-core has an issue affecting its community integration.
    This issue affects 2 projects,
    and has been outstanding for 353 runs.
    The current state of this project is 'Failed', with reason 'Build Failed'.
    For reference only, the following projects are affected by this:
    - turbine-core : A servlet based framework.
    - turbine-core-test : A servlet based framework.


    Full details are available at:
    http://vmgump.apache.org/gump/public/turbine-core/turbine-core/index.html

    That said, some information snippets are provided here.

    The following annotations (debug/informational/warning/error messages) were provided:
    -INFO- Optional dependency commons-fileupload prerequisite failed with reason build failed
    -INFO- Optional dependency httpunit failed with reason build failed
    -DEBUG- (Apache Gump generated) Apache Maven Settings in: /srv/gump/public/workspace/turbine-core/gump_mvn_settings.xml
    -INFO- Failed with reason build failed
    -DEBUG- Maven POM in: /srv/gump/public/workspace/turbine-core/pom.xml
    -INFO- Failed to extract fallback artifacts from Gump Repository



    The following work was performed:
    http://vmgump.apache.org/gump/public/turbine-core/turbine-core/gump_work/build_turbine-core_turbine-core.html
    Work Name: build_turbine-core_turbine-core (Type: Build)
    Work ended in a state of : Failed
    Elapsed: 21 secs
    Command Line: /opt/maven2/bin/mvn --batch-mode -DskipTests=true --settings /srv/gump/public/workspace/turbine-core/gump_mvn_settings.xml package
    [Working Directory: /srv/gump/public/workspace/turbine-core]
    M2_HOME: /opt/maven2
    ---------------------------------------------
    urls[19] = file:/srv/gump/public/workspace/mvnlocalrepo/shared/xml-apis/xml-apis/1.0.b2/xml-apis-1.0.b2.jar
    urls[20] = file:/srv/gump/public/workspace/mvnlocalrepo/shared/commons-configuration/commons-configuration/1.4/commons-configuration-1.4.jar
    urls[21] = file:/srv/gump/public/workspace/mvnlocalrepo/shared/commons-logging/commons-logging-api/1.0.4/commons-logging-api-1.0.4.jar
    urls[22] = file:/srv/gump/public/workspace/mvnlocalrepo/shared/commons-digester/commons-digester/1.8/commons-digester-1.8.jar
    urls[23] = file:/srv/gump/public/workspace/mvnlocalrepo/shared/commons-beanutils/commons-beanutils/1.7.0/commons-beanutils-1.7.0.jar
    urls[24] = file:/srv/gump/public/workspace/mvnlocalrepo/shared/commons-beanutils/commons-beanutils-core/1.7.0/commons-beanutils-core-1.7.0.jar
    urls[25] = file:/srv/gump/public/workspace/mvnlocalrepo/shared/commons-codec/commons-codec/1.3/commons-codec-1.3.jar
    urls[26] = file:/srv/gump/public/workspace/mvnlocalrepo/shared/commons-jxpath/commons-jxpath/1.2/commons-jxpath-1.2.jar
    urls[27] = file:/srv/gump/public/workspace/mvnlocalrepo/shared/xerces/xerces/1.2.3/xerces-1.2.3.jar
    urls[28] = file:/srv/gump/public/workspace/mvnlocalrepo/shared/ant/ant-optional/1.5.1/ant-optional-1.5.1.jar
    urls[29] = file:/srv/gump/public/workspace/mvnlocalrepo/shared/jdom/jdom/b9/jdom-b9.jar
    Number of imports: 10
    import: org.codehaus.classworlds.Entry@a6c57a42
    import: org.codehaus.classworlds.Entry@12f43f3b
    import: org.codehaus.classworlds.Entry@20025374
    import: org.codehaus.classworlds.Entry@f8e44ca4
    import: org.codehaus.classworlds.Entry@92758522
    import: org.codehaus.classworlds.Entry@ebf2705b
    import: org.codehaus.classworlds.Entry@bb25e54
    import: org.codehaus.classworlds.Entry@bece5185
    import: org.codehaus.classworlds.Entry@3fee8e37
    import: org.codehaus.classworlds.Entry@3fee19d8


    this realm = plexus.core
    urls[0] = file:/opt/maven2/lib/maven-2.2.1-uber.jar
    Number of imports: 10
    import: org.codehaus.classworlds.Entry@a6c57a42
    import: org.codehaus.classworlds.Entry@12f43f3b
    import: org.codehaus.classworlds.Entry@20025374
    import: org.codehaus.classworlds.Entry@f8e44ca4
    import: org.codehaus.classworlds.Entry@92758522
    import: org.codehaus.classworlds.Entry@ebf2705b
    import: org.codehaus.classworlds.Entry@bb25e54
    import: org.codehaus.classworlds.Entry@bece5185
    import: org.codehaus.classworlds.Entry@3fee8e37
    import: org.codehaus.classworlds.Entry@3fee19d8
    -----------------------------------------------------
    [INFO] ------------------------------------------------------------------------
    [ERROR] BUILD ERROR
    [INFO] ------------------------------------------------------------------------
    [INFO] Internal error in the plugin manager executing goal 'org.apache.torque:torque-maven-plugin:3.3:om': Unable to load the mojo 'org.apache.torque:torque-maven-plugin:3.3:om' in the plugin 'org.apache.torque:torque-maven-plugin'. A required class is missing: org/apache/torque/task/TorqueDataModelTask
    org.apache.torque.task.TorqueDataModelTask
    [INFO] ------------------------------------------------------------------------
    [INFO] For more information, run Maven with the -e switch
    [INFO] ------------------------------------------------------------------------
    [INFO] Total time: 20 seconds
    [INFO] Finished at: Wed Aug 24 11:29:39 UTC 2011
    [INFO] Final Memory: 30M/71M
    [INFO] ------------------------------------------------------------------------
    ---------------------------------------------

    To subscribe to this information via syndicated feeds:
    - RSS: http://vmgump.apache.org/gump/public/turbine-core/turbine-core/rss.xml
    - Atom: http://vmgump.apache.org/gump/public/turbine-core/turbine-core/atom.xml

    ============================== Gump Tracking Only ===
    Produced by Apache Gump(TM) version 2.3.
    Gump Run 05000624082011, vmgump.apache.org:vmgump:05000624082011
    Gump E-mail Identifier (unique within run) #43.

    --
    Apache Gump
    http://gump.apache.org/ [Instance: vmgump]

    ---------------------------------------------------------------------
    To unsubscribe, e-mail: dev-unsubscribe@turbine.apache.org
    For additional commands, e-mail: dev-help@turbine.apache.org
  • Anonymous at Aug 25, 2011 at 11:29 am
    To whom it may engage...

    This is an automated request, but not an unsolicited one. For
    more information please visit http://gump.apache.org/nagged.html,
    and/or contact the folk at general@gump.apache.org.

    Project turbine-core has an issue affecting its community integration.
    This issue affects 2 projects,
    and has been outstanding for 355 runs.
    The current state of this project is 'Failed', with reason 'Build Failed'.
    For reference only, the following projects are affected by this:
    - turbine-core : A servlet based framework.
    - turbine-core-test : A servlet based framework.


    Full details are available at:
    http://vmgump.apache.org/gump/public/turbine-core/turbine-core/index.html

    That said, some information snippets are provided here.

    The following annotations (debug/informational/warning/error messages) were provided:
    -INFO- Optional dependency commons-fileupload prerequisite failed with reason build failed
    -INFO- Optional dependency httpunit failed with reason build failed
    -DEBUG- (Apache Gump generated) Apache Maven Settings in: /srv/gump/public/workspace/turbine-core/gump_mvn_settings.xml
    -INFO- Failed with reason build failed
    -DEBUG- Maven POM in: /srv/gump/public/workspace/turbine-core/pom.xml
    -INFO- Failed to extract fallback artifacts from Gump Repository



    The following work was performed:
    http://vmgump.apache.org/gump/public/turbine-core/turbine-core/gump_work/build_turbine-core_turbine-core.html
    Work Name: build_turbine-core_turbine-core (Type: Build)
    Work ended in a state of : Failed
    Elapsed: 20 secs
    Command Line: /opt/maven2/bin/mvn --batch-mode -DskipTests=true --settings /srv/gump/public/workspace/turbine-core/gump_mvn_settings.xml package
    [Working Directory: /srv/gump/public/workspace/turbine-core]
    M2_HOME: /opt/maven2
    ---------------------------------------------
    urls[19] = file:/srv/gump/public/workspace/mvnlocalrepo/shared/xml-apis/xml-apis/1.0.b2/xml-apis-1.0.b2.jar
    urls[20] = file:/srv/gump/public/workspace/mvnlocalrepo/shared/commons-configuration/commons-configuration/1.4/commons-configuration-1.4.jar
    urls[21] = file:/srv/gump/public/workspace/mvnlocalrepo/shared/commons-logging/commons-logging-api/1.0.4/commons-logging-api-1.0.4.jar
    urls[22] = file:/srv/gump/public/workspace/mvnlocalrepo/shared/commons-digester/commons-digester/1.8/commons-digester-1.8.jar
    urls[23] = file:/srv/gump/public/workspace/mvnlocalrepo/shared/commons-beanutils/commons-beanutils/1.7.0/commons-beanutils-1.7.0.jar
    urls[24] = file:/srv/gump/public/workspace/mvnlocalrepo/shared/commons-beanutils/commons-beanutils-core/1.7.0/commons-beanutils-core-1.7.0.jar
    urls[25] = file:/srv/gump/public/workspace/mvnlocalrepo/shared/commons-codec/commons-codec/1.3/commons-codec-1.3.jar
    urls[26] = file:/srv/gump/public/workspace/mvnlocalrepo/shared/commons-jxpath/commons-jxpath/1.2/commons-jxpath-1.2.jar
    urls[27] = file:/srv/gump/public/workspace/mvnlocalrepo/shared/xerces/xerces/1.2.3/xerces-1.2.3.jar
    urls[28] = file:/srv/gump/public/workspace/mvnlocalrepo/shared/ant/ant-optional/1.5.1/ant-optional-1.5.1.jar
    urls[29] = file:/srv/gump/public/workspace/mvnlocalrepo/shared/jdom/jdom/b9/jdom-b9.jar
    Number of imports: 10
    import: org.codehaus.classworlds.Entry@a6c57a42
    import: org.codehaus.classworlds.Entry@12f43f3b
    import: org.codehaus.classworlds.Entry@20025374
    import: org.codehaus.classworlds.Entry@f8e44ca4
    import: org.codehaus.classworlds.Entry@92758522
    import: org.codehaus.classworlds.Entry@ebf2705b
    import: org.codehaus.classworlds.Entry@bb25e54
    import: org.codehaus.classworlds.Entry@bece5185
    import: org.codehaus.classworlds.Entry@3fee8e37
    import: org.codehaus.classworlds.Entry@3fee19d8


    this realm = plexus.core
    urls[0] = file:/opt/maven2/lib/maven-2.2.1-uber.jar
    Number of imports: 10
    import: org.codehaus.classworlds.Entry@a6c57a42
    import: org.codehaus.classworlds.Entry@12f43f3b
    import: org.codehaus.classworlds.Entry@20025374
    import: org.codehaus.classworlds.Entry@f8e44ca4
    import: org.codehaus.classworlds.Entry@92758522
    import: org.codehaus.classworlds.Entry@ebf2705b
    import: org.codehaus.classworlds.Entry@bb25e54
    import: org.codehaus.classworlds.Entry@bece5185
    import: org.codehaus.classworlds.Entry@3fee8e37
    import: org.codehaus.classworlds.Entry@3fee19d8
    -----------------------------------------------------
    [INFO] ------------------------------------------------------------------------
    [ERROR] BUILD ERROR
    [INFO] ------------------------------------------------------------------------
    [INFO] Internal error in the plugin manager executing goal 'org.apache.torque:torque-maven-plugin:3.3:om': Unable to load the mojo 'org.apache.torque:torque-maven-plugin:3.3:om' in the plugin 'org.apache.torque:torque-maven-plugin'. A required class is missing: org/apache/torque/task/TorqueDataModelTask
    org.apache.torque.task.TorqueDataModelTask
    [INFO] ------------------------------------------------------------------------
    [INFO] For more information, run Maven with the -e switch
    [INFO] ------------------------------------------------------------------------
    [INFO] Total time: 19 seconds
    [INFO] Finished at: Thu Aug 25 11:28:48 UTC 2011
    [INFO] Final Memory: 30M/71M
    [INFO] ------------------------------------------------------------------------
    ---------------------------------------------

    To subscribe to this information via syndicated feeds:
    - RSS: http://vmgump.apache.org/gump/public/turbine-core/turbine-core/rss.xml
    - Atom: http://vmgump.apache.org/gump/public/turbine-core/turbine-core/atom.xml

    ============================== Gump Tracking Only ===
    Produced by Apache Gump(TM) version 2.3.
    Gump Run 05000625082011, vmgump.apache.org:vmgump:05000625082011
    Gump E-mail Identifier (unique within run) #43.

    --
    Apache Gump
    http://gump.apache.org/ [Instance: vmgump]

    ---------------------------------------------------------------------
    To unsubscribe, e-mail: dev-unsubscribe@turbine.apache.org
    For additional commands, e-mail: dev-help@turbine.apache.org
  • Anonymous at Aug 26, 2011 at 12:15 pm
    To whom it may engage...

    This is an automated request, but not an unsolicited one. For
    more information please visit http://gump.apache.org/nagged.html,
    and/or contact the folk at general@gump.apache.org.

    Project turbine-core has an issue affecting its community integration.
    This issue affects 2 projects,
    and has been outstanding for 357 runs.
    The current state of this project is 'Failed', with reason 'Build Failed'.
    For reference only, the following projects are affected by this:
    - turbine-core : A servlet based framework.
    - turbine-core-test : A servlet based framework.


    Full details are available at:
    http://vmgump.apache.org/gump/public/turbine-core/turbine-core/index.html

    That said, some information snippets are provided here.

    The following annotations (debug/informational/warning/error messages) were provided:
    -INFO- Optional dependency dom4j prerequisite failed with reason build timed out
    -INFO- Optional dependency commons-fileupload prerequisite failed with reason build failed
    -INFO- Optional dependency httpunit failed with reason build failed
    -DEBUG- (Apache Gump generated) Apache Maven Settings in: /srv/gump/public/workspace/turbine-core/gump_mvn_settings.xml
    -INFO- Failed with reason build failed
    -DEBUG- Maven POM in: /srv/gump/public/workspace/turbine-core/pom.xml
    -INFO- Failed to extract fallback artifacts from Gump Repository



    The following work was performed:
    http://vmgump.apache.org/gump/public/turbine-core/turbine-core/gump_work/build_turbine-core_turbine-core.html
    Work Name: build_turbine-core_turbine-core (Type: Build)
    Work ended in a state of : Failed
    Elapsed: 22 secs
    Command Line: /opt/maven2/bin/mvn --batch-mode -DskipTests=true --settings /srv/gump/public/workspace/turbine-core/gump_mvn_settings.xml package
    [Working Directory: /srv/gump/public/workspace/turbine-core]
    M2_HOME: /opt/maven2
    ---------------------------------------------
    urls[19] = file:/srv/gump/public/workspace/mvnlocalrepo/shared/xml-apis/xml-apis/1.0.b2/xml-apis-1.0.b2.jar
    urls[20] = file:/srv/gump/public/workspace/mvnlocalrepo/shared/commons-configuration/commons-configuration/1.4/commons-configuration-1.4.jar
    urls[21] = file:/srv/gump/public/workspace/mvnlocalrepo/shared/commons-logging/commons-logging-api/1.0.4/commons-logging-api-1.0.4.jar
    urls[22] = file:/srv/gump/public/workspace/mvnlocalrepo/shared/commons-digester/commons-digester/1.8/commons-digester-1.8.jar
    urls[23] = file:/srv/gump/public/workspace/mvnlocalrepo/shared/commons-beanutils/commons-beanutils/1.7.0/commons-beanutils-1.7.0.jar
    urls[24] = file:/srv/gump/public/workspace/mvnlocalrepo/shared/commons-beanutils/commons-beanutils-core/1.7.0/commons-beanutils-core-1.7.0.jar
    urls[25] = file:/srv/gump/public/workspace/mvnlocalrepo/shared/commons-codec/commons-codec/1.3/commons-codec-1.3.jar
    urls[26] = file:/srv/gump/public/workspace/mvnlocalrepo/shared/commons-jxpath/commons-jxpath/1.2/commons-jxpath-1.2.jar
    urls[27] = file:/srv/gump/public/workspace/mvnlocalrepo/shared/xerces/xerces/1.2.3/xerces-1.2.3.jar
    urls[28] = file:/srv/gump/public/workspace/mvnlocalrepo/shared/ant/ant-optional/1.5.1/ant-optional-1.5.1.jar
    urls[29] = file:/srv/gump/public/workspace/mvnlocalrepo/shared/jdom/jdom/b9/jdom-b9.jar
    Number of imports: 10
    import: org.codehaus.classworlds.Entry@a6c57a42
    import: org.codehaus.classworlds.Entry@12f43f3b
    import: org.codehaus.classworlds.Entry@20025374
    import: org.codehaus.classworlds.Entry@f8e44ca4
    import: org.codehaus.classworlds.Entry@92758522
    import: org.codehaus.classworlds.Entry@ebf2705b
    import: org.codehaus.classworlds.Entry@bb25e54
    import: org.codehaus.classworlds.Entry@bece5185
    import: org.codehaus.classworlds.Entry@3fee8e37
    import: org.codehaus.classworlds.Entry@3fee19d8


    this realm = plexus.core
    urls[0] = file:/opt/maven2/lib/maven-2.2.1-uber.jar
    Number of imports: 10
    import: org.codehaus.classworlds.Entry@a6c57a42
    import: org.codehaus.classworlds.Entry@12f43f3b
    import: org.codehaus.classworlds.Entry@20025374
    import: org.codehaus.classworlds.Entry@f8e44ca4
    import: org.codehaus.classworlds.Entry@92758522
    import: org.codehaus.classworlds.Entry@ebf2705b
    import: org.codehaus.classworlds.Entry@bb25e54
    import: org.codehaus.classworlds.Entry@bece5185
    import: org.codehaus.classworlds.Entry@3fee8e37
    import: org.codehaus.classworlds.Entry@3fee19d8
    -----------------------------------------------------
    [INFO] ------------------------------------------------------------------------
    [ERROR] BUILD ERROR
    [INFO] ------------------------------------------------------------------------
    [INFO] Internal error in the plugin manager executing goal 'org.apache.torque:torque-maven-plugin:3.3:om': Unable to load the mojo 'org.apache.torque:torque-maven-plugin:3.3:om' in the plugin 'org.apache.torque:torque-maven-plugin'. A required class is missing: org/apache/torque/task/TorqueDataModelTask
    org.apache.torque.task.TorqueDataModelTask
    [INFO] ------------------------------------------------------------------------
    [INFO] For more information, run Maven with the -e switch
    [INFO] ------------------------------------------------------------------------
    [INFO] Total time: 21 seconds
    [INFO] Finished at: Fri Aug 26 12:15:13 UTC 2011
    [INFO] Final Memory: 30M/71M
    [INFO] ------------------------------------------------------------------------
    ---------------------------------------------

    To subscribe to this information via syndicated feeds:
    - RSS: http://vmgump.apache.org/gump/public/turbine-core/turbine-core/rss.xml
    - Atom: http://vmgump.apache.org/gump/public/turbine-core/turbine-core/atom.xml

    ============================== Gump Tracking Only ===
    Produced by Apache Gump(TM) version 2.3.
    Gump Run 06000626082011, vmgump.apache.org:vmgump:06000626082011
    Gump E-mail Identifier (unique within run) #40.

    --
    Apache Gump
    http://gump.apache.org/ [Instance: vmgump]

    ---------------------------------------------------------------------
    To unsubscribe, e-mail: dev-unsubscribe@turbine.apache.org
    For additional commands, e-mail: dev-help@turbine.apache.org
  • Anonymous at Aug 27, 2011 at 11:20 am
    To whom it may engage...

    This is an automated request, but not an unsolicited one. For
    more information please visit http://gump.apache.org/nagged.html,
    and/or contact the folk at general@gump.apache.org.

    Project turbine-core has an issue affecting its community integration.
    This issue affects 2 projects,
    and has been outstanding for 359 runs.
    The current state of this project is 'Failed', with reason 'Build Failed'.
    For reference only, the following projects are affected by this:
    - turbine-core : A servlet based framework.
    - turbine-core-test : A servlet based framework.


    Full details are available at:
    http://vmgump.apache.org/gump/public/turbine-core/turbine-core/index.html

    That said, some information snippets are provided here.

    The following annotations (debug/informational/warning/error messages) were provided:
    -INFO- Optional dependency commons-fileupload prerequisite failed with reason build failed
    -INFO- Optional dependency httpunit failed with reason build failed
    -DEBUG- (Apache Gump generated) Apache Maven Settings in: /srv/gump/public/workspace/turbine-core/gump_mvn_settings.xml
    -INFO- Failed with reason build failed
    -DEBUG- Maven POM in: /srv/gump/public/workspace/turbine-core/pom.xml
    -INFO- Failed to extract fallback artifacts from Gump Repository



    The following work was performed:
    http://vmgump.apache.org/gump/public/turbine-core/turbine-core/gump_work/build_turbine-core_turbine-core.html
    Work Name: build_turbine-core_turbine-core (Type: Build)
    Work ended in a state of : Failed
    Elapsed: 20 secs
    Command Line: /opt/maven2/bin/mvn --batch-mode -DskipTests=true --settings /srv/gump/public/workspace/turbine-core/gump_mvn_settings.xml package
    [Working Directory: /srv/gump/public/workspace/turbine-core]
    M2_HOME: /opt/maven2
    ---------------------------------------------
    urls[19] = file:/srv/gump/public/workspace/mvnlocalrepo/shared/xml-apis/xml-apis/1.0.b2/xml-apis-1.0.b2.jar
    urls[20] = file:/srv/gump/public/workspace/mvnlocalrepo/shared/commons-configuration/commons-configuration/1.4/commons-configuration-1.4.jar
    urls[21] = file:/srv/gump/public/workspace/mvnlocalrepo/shared/commons-logging/commons-logging-api/1.0.4/commons-logging-api-1.0.4.jar
    urls[22] = file:/srv/gump/public/workspace/mvnlocalrepo/shared/commons-digester/commons-digester/1.8/commons-digester-1.8.jar
    urls[23] = file:/srv/gump/public/workspace/mvnlocalrepo/shared/commons-beanutils/commons-beanutils/1.7.0/commons-beanutils-1.7.0.jar
    urls[24] = file:/srv/gump/public/workspace/mvnlocalrepo/shared/commons-beanutils/commons-beanutils-core/1.7.0/commons-beanutils-core-1.7.0.jar
    urls[25] = file:/srv/gump/public/workspace/mvnlocalrepo/shared/commons-codec/commons-codec/1.3/commons-codec-1.3.jar
    urls[26] = file:/srv/gump/public/workspace/mvnlocalrepo/shared/commons-jxpath/commons-jxpath/1.2/commons-jxpath-1.2.jar
    urls[27] = file:/srv/gump/public/workspace/mvnlocalrepo/shared/xerces/xerces/1.2.3/xerces-1.2.3.jar
    urls[28] = file:/srv/gump/public/workspace/mvnlocalrepo/shared/ant/ant-optional/1.5.1/ant-optional-1.5.1.jar
    urls[29] = file:/srv/gump/public/workspace/mvnlocalrepo/shared/jdom/jdom/b9/jdom-b9.jar
    Number of imports: 10
    import: org.codehaus.classworlds.Entry@a6c57a42
    import: org.codehaus.classworlds.Entry@12f43f3b
    import: org.codehaus.classworlds.Entry@20025374
    import: org.codehaus.classworlds.Entry@f8e44ca4
    import: org.codehaus.classworlds.Entry@92758522
    import: org.codehaus.classworlds.Entry@ebf2705b
    import: org.codehaus.classworlds.Entry@bb25e54
    import: org.codehaus.classworlds.Entry@bece5185
    import: org.codehaus.classworlds.Entry@3fee8e37
    import: org.codehaus.classworlds.Entry@3fee19d8


    this realm = plexus.core
    urls[0] = file:/opt/maven2/lib/maven-2.2.1-uber.jar
    Number of imports: 10
    import: org.codehaus.classworlds.Entry@a6c57a42
    import: org.codehaus.classworlds.Entry@12f43f3b
    import: org.codehaus.classworlds.Entry@20025374
    import: org.codehaus.classworlds.Entry@f8e44ca4
    import: org.codehaus.classworlds.Entry@92758522
    import: org.codehaus.classworlds.Entry@ebf2705b
    import: org.codehaus.classworlds.Entry@bb25e54
    import: org.codehaus.classworlds.Entry@bece5185
    import: org.codehaus.classworlds.Entry@3fee8e37
    import: org.codehaus.classworlds.Entry@3fee19d8
    -----------------------------------------------------
    [INFO] ------------------------------------------------------------------------
    [ERROR] BUILD ERROR
    [INFO] ------------------------------------------------------------------------
    [INFO] Internal error in the plugin manager executing goal 'org.apache.torque:torque-maven-plugin:3.3:om': Unable to load the mojo 'org.apache.torque:torque-maven-plugin:3.3:om' in the plugin 'org.apache.torque:torque-maven-plugin'. A required class is missing: org/apache/torque/task/TorqueDataModelTask
    org.apache.torque.task.TorqueDataModelTask
    [INFO] ------------------------------------------------------------------------
    [INFO] For more information, run Maven with the -e switch
    [INFO] ------------------------------------------------------------------------
    [INFO] Total time: 19 seconds
    [INFO] Finished at: Sat Aug 27 11:19:50 UTC 2011
    [INFO] Final Memory: 30M/71M
    [INFO] ------------------------------------------------------------------------
    ---------------------------------------------

    To subscribe to this information via syndicated feeds:
    - RSS: http://vmgump.apache.org/gump/public/turbine-core/turbine-core/rss.xml
    - Atom: http://vmgump.apache.org/gump/public/turbine-core/turbine-core/atom.xml

    ============================== Gump Tracking Only ===
    Produced by Apache Gump(TM) version 2.3.
    Gump Run 05000627082011, vmgump.apache.org:vmgump:05000627082011
    Gump E-mail Identifier (unique within run) #43.

    --
    Apache Gump
    http://gump.apache.org/ [Instance: vmgump]

    ---------------------------------------------------------------------
    To unsubscribe, e-mail: dev-unsubscribe@turbine.apache.org
    For additional commands, e-mail: dev-help@turbine.apache.org
  • Anonymous at Aug 28, 2011 at 11:20 am
    To whom it may engage...

    This is an automated request, but not an unsolicited one. For
    more information please visit http://gump.apache.org/nagged.html,
    and/or contact the folk at general@gump.apache.org.

    Project turbine-core has an issue affecting its community integration.
    This issue affects 2 projects,
    and has been outstanding for 361 runs.
    The current state of this project is 'Failed', with reason 'Build Failed'.
    For reference only, the following projects are affected by this:
    - turbine-core : A servlet based framework.
    - turbine-core-test : A servlet based framework.


    Full details are available at:
    http://vmgump.apache.org/gump/public/turbine-core/turbine-core/index.html

    That said, some information snippets are provided here.

    The following annotations (debug/informational/warning/error messages) were provided:
    -INFO- Optional dependency commons-fileupload prerequisite failed with reason build failed
    -INFO- Optional dependency httpunit failed with reason build failed
    -DEBUG- (Apache Gump generated) Apache Maven Settings in: /srv/gump/public/workspace/turbine-core/gump_mvn_settings.xml
    -INFO- Failed with reason build failed
    -DEBUG- Maven POM in: /srv/gump/public/workspace/turbine-core/pom.xml
    -INFO- Failed to extract fallback artifacts from Gump Repository



    The following work was performed:
    http://vmgump.apache.org/gump/public/turbine-core/turbine-core/gump_work/build_turbine-core_turbine-core.html
    Work Name: build_turbine-core_turbine-core (Type: Build)
    Work ended in a state of : Failed
    Elapsed: 21 secs
    Command Line: /opt/maven2/bin/mvn --batch-mode -DskipTests=true --settings /srv/gump/public/workspace/turbine-core/gump_mvn_settings.xml package
    [Working Directory: /srv/gump/public/workspace/turbine-core]
    M2_HOME: /opt/maven2
    ---------------------------------------------
    urls[19] = file:/srv/gump/public/workspace/mvnlocalrepo/shared/xml-apis/xml-apis/1.0.b2/xml-apis-1.0.b2.jar
    urls[20] = file:/srv/gump/public/workspace/mvnlocalrepo/shared/commons-configuration/commons-configuration/1.4/commons-configuration-1.4.jar
    urls[21] = file:/srv/gump/public/workspace/mvnlocalrepo/shared/commons-logging/commons-logging-api/1.0.4/commons-logging-api-1.0.4.jar
    urls[22] = file:/srv/gump/public/workspace/mvnlocalrepo/shared/commons-digester/commons-digester/1.8/commons-digester-1.8.jar
    urls[23] = file:/srv/gump/public/workspace/mvnlocalrepo/shared/commons-beanutils/commons-beanutils/1.7.0/commons-beanutils-1.7.0.jar
    urls[24] = file:/srv/gump/public/workspace/mvnlocalrepo/shared/commons-beanutils/commons-beanutils-core/1.7.0/commons-beanutils-core-1.7.0.jar
    urls[25] = file:/srv/gump/public/workspace/mvnlocalrepo/shared/commons-codec/commons-codec/1.3/commons-codec-1.3.jar
    urls[26] = file:/srv/gump/public/workspace/mvnlocalrepo/shared/commons-jxpath/commons-jxpath/1.2/commons-jxpath-1.2.jar
    urls[27] = file:/srv/gump/public/workspace/mvnlocalrepo/shared/xerces/xerces/1.2.3/xerces-1.2.3.jar
    urls[28] = file:/srv/gump/public/workspace/mvnlocalrepo/shared/ant/ant-optional/1.5.1/ant-optional-1.5.1.jar
    urls[29] = file:/srv/gump/public/workspace/mvnlocalrepo/shared/jdom/jdom/b9/jdom-b9.jar
    Number of imports: 10
    import: org.codehaus.classworlds.Entry@a6c57a42
    import: org.codehaus.classworlds.Entry@12f43f3b
    import: org.codehaus.classworlds.Entry@20025374
    import: org.codehaus.classworlds.Entry@f8e44ca4
    import: org.codehaus.classworlds.Entry@92758522
    import: org.codehaus.classworlds.Entry@ebf2705b
    import: org.codehaus.classworlds.Entry@bb25e54
    import: org.codehaus.classworlds.Entry@bece5185
    import: org.codehaus.classworlds.Entry@3fee8e37
    import: org.codehaus.classworlds.Entry@3fee19d8


    this realm = plexus.core
    urls[0] = file:/opt/maven2/lib/maven-2.2.1-uber.jar
    Number of imports: 10
    import: org.codehaus.classworlds.Entry@a6c57a42
    import: org.codehaus.classworlds.Entry@12f43f3b
    import: org.codehaus.classworlds.Entry@20025374
    import: org.codehaus.classworlds.Entry@f8e44ca4
    import: org.codehaus.classworlds.Entry@92758522
    import: org.codehaus.classworlds.Entry@ebf2705b
    import: org.codehaus.classworlds.Entry@bb25e54
    import: org.codehaus.classworlds.Entry@bece5185
    import: org.codehaus.classworlds.Entry@3fee8e37
    import: org.codehaus.classworlds.Entry@3fee19d8
    -----------------------------------------------------
    [INFO] ------------------------------------------------------------------------
    [ERROR] BUILD ERROR
    [INFO] ------------------------------------------------------------------------
    [INFO] Internal error in the plugin manager executing goal 'org.apache.torque:torque-maven-plugin:3.3:om': Unable to load the mojo 'org.apache.torque:torque-maven-plugin:3.3:om' in the plugin 'org.apache.torque:torque-maven-plugin'. A required class is missing: org/apache/torque/task/TorqueDataModelTask
    org.apache.torque.task.TorqueDataModelTask
    [INFO] ------------------------------------------------------------------------
    [INFO] For more information, run Maven with the -e switch
    [INFO] ------------------------------------------------------------------------
    [INFO] Total time: 20 seconds
    [INFO] Finished at: Sun Aug 28 11:20:07 UTC 2011
    [INFO] Final Memory: 30M/71M
    [INFO] ------------------------------------------------------------------------
    ---------------------------------------------

    To subscribe to this information via syndicated feeds:
    - RSS: http://vmgump.apache.org/gump/public/turbine-core/turbine-core/rss.xml
    - Atom: http://vmgump.apache.org/gump/public/turbine-core/turbine-core/atom.xml

    ============================== Gump Tracking Only ===
    Produced by Apache Gump(TM) version 2.3.
    Gump Run 05000628082011, vmgump.apache.org:vmgump:05000628082011
    Gump E-mail Identifier (unique within run) #43.

    --
    Apache Gump
    http://gump.apache.org/ [Instance: vmgump]

    ---------------------------------------------------------------------
    To unsubscribe, e-mail: dev-unsubscribe@turbine.apache.org
    For additional commands, e-mail: dev-help@turbine.apache.org
  • Anonymous at Aug 29, 2011 at 12:05 pm
    To whom it may engage...

    This is an automated request, but not an unsolicited one. For
    more information please visit http://gump.apache.org/nagged.html,
    and/or contact the folk at general@gump.apache.org.

    Project turbine-core has an issue affecting its community integration.
    This issue affects 2 projects,
    and has been outstanding for 363 runs.
    The current state of this project is 'Failed', with reason 'Build Failed'.
    For reference only, the following projects are affected by this:
    - turbine-core : A servlet based framework.
    - turbine-core-test : A servlet based framework.


    Full details are available at:
    http://vmgump.apache.org/gump/public/turbine-core/turbine-core/index.html

    That said, some information snippets are provided here.

    The following annotations (debug/informational/warning/error messages) were provided:
    -INFO- Optional dependency dom4j prerequisite failed with reason build timed out
    -INFO- Optional dependency commons-fileupload prerequisite failed with reason build failed
    -INFO- Optional dependency httpunit failed with reason build failed
    -DEBUG- (Apache Gump generated) Apache Maven Settings in: /srv/gump/public/workspace/turbine-core/gump_mvn_settings.xml
    -INFO- Failed with reason build failed
    -DEBUG- Maven POM in: /srv/gump/public/workspace/turbine-core/pom.xml
    -INFO- Failed to extract fallback artifacts from Gump Repository



    The following work was performed:
    http://vmgump.apache.org/gump/public/turbine-core/turbine-core/gump_work/build_turbine-core_turbine-core.html
    Work Name: build_turbine-core_turbine-core (Type: Build)
    Work ended in a state of : Failed
    Elapsed: 21 secs
    Command Line: /opt/maven2/bin/mvn --batch-mode -DskipTests=true --settings /srv/gump/public/workspace/turbine-core/gump_mvn_settings.xml package
    [Working Directory: /srv/gump/public/workspace/turbine-core]
    M2_HOME: /opt/maven2
    ---------------------------------------------
    urls[19] = file:/srv/gump/public/workspace/mvnlocalrepo/shared/xml-apis/xml-apis/1.0.b2/xml-apis-1.0.b2.jar
    urls[20] = file:/srv/gump/public/workspace/mvnlocalrepo/shared/commons-configuration/commons-configuration/1.4/commons-configuration-1.4.jar
    urls[21] = file:/srv/gump/public/workspace/mvnlocalrepo/shared/commons-logging/commons-logging-api/1.0.4/commons-logging-api-1.0.4.jar
    urls[22] = file:/srv/gump/public/workspace/mvnlocalrepo/shared/commons-digester/commons-digester/1.8/commons-digester-1.8.jar
    urls[23] = file:/srv/gump/public/workspace/mvnlocalrepo/shared/commons-beanutils/commons-beanutils/1.7.0/commons-beanutils-1.7.0.jar
    urls[24] = file:/srv/gump/public/workspace/mvnlocalrepo/shared/commons-beanutils/commons-beanutils-core/1.7.0/commons-beanutils-core-1.7.0.jar
    urls[25] = file:/srv/gump/public/workspace/mvnlocalrepo/shared/commons-codec/commons-codec/1.3/commons-codec-1.3.jar
    urls[26] = file:/srv/gump/public/workspace/mvnlocalrepo/shared/commons-jxpath/commons-jxpath/1.2/commons-jxpath-1.2.jar
    urls[27] = file:/srv/gump/public/workspace/mvnlocalrepo/shared/xerces/xerces/1.2.3/xerces-1.2.3.jar
    urls[28] = file:/srv/gump/public/workspace/mvnlocalrepo/shared/ant/ant-optional/1.5.1/ant-optional-1.5.1.jar
    urls[29] = file:/srv/gump/public/workspace/mvnlocalrepo/shared/jdom/jdom/b9/jdom-b9.jar
    Number of imports: 10
    import: org.codehaus.classworlds.Entry@a6c57a42
    import: org.codehaus.classworlds.Entry@12f43f3b
    import: org.codehaus.classworlds.Entry@20025374
    import: org.codehaus.classworlds.Entry@f8e44ca4
    import: org.codehaus.classworlds.Entry@92758522
    import: org.codehaus.classworlds.Entry@ebf2705b
    import: org.codehaus.classworlds.Entry@bb25e54
    import: org.codehaus.classworlds.Entry@bece5185
    import: org.codehaus.classworlds.Entry@3fee8e37
    import: org.codehaus.classworlds.Entry@3fee19d8


    this realm = plexus.core
    urls[0] = file:/opt/maven2/lib/maven-2.2.1-uber.jar
    Number of imports: 10
    import: org.codehaus.classworlds.Entry@a6c57a42
    import: org.codehaus.classworlds.Entry@12f43f3b
    import: org.codehaus.classworlds.Entry@20025374
    import: org.codehaus.classworlds.Entry@f8e44ca4
    import: org.codehaus.classworlds.Entry@92758522
    import: org.codehaus.classworlds.Entry@ebf2705b
    import: org.codehaus.classworlds.Entry@bb25e54
    import: org.codehaus.classworlds.Entry@bece5185
    import: org.codehaus.classworlds.Entry@3fee8e37
    import: org.codehaus.classworlds.Entry@3fee19d8
    -----------------------------------------------------
    [INFO] ------------------------------------------------------------------------
    [ERROR] BUILD ERROR
    [INFO] ------------------------------------------------------------------------
    [INFO] Internal error in the plugin manager executing goal 'org.apache.torque:torque-maven-plugin:3.3:om': Unable to load the mojo 'org.apache.torque:torque-maven-plugin:3.3:om' in the plugin 'org.apache.torque:torque-maven-plugin'. A required class is missing: org/apache/torque/task/TorqueDataModelTask
    org.apache.torque.task.TorqueDataModelTask
    [INFO] ------------------------------------------------------------------------
    [INFO] For more information, run Maven with the -e switch
    [INFO] ------------------------------------------------------------------------
    [INFO] Total time: 20 seconds
    [INFO] Finished at: Mon Aug 29 12:04:50 UTC 2011
    [INFO] Final Memory: 30M/71M
    [INFO] ------------------------------------------------------------------------
    ---------------------------------------------

    To subscribe to this information via syndicated feeds:
    - RSS: http://vmgump.apache.org/gump/public/turbine-core/turbine-core/rss.xml
    - Atom: http://vmgump.apache.org/gump/public/turbine-core/turbine-core/atom.xml

    ============================== Gump Tracking Only ===
    Produced by Apache Gump(TM) version 2.3.
    Gump Run 06000629082011, vmgump.apache.org:vmgump:06000629082011
    Gump E-mail Identifier (unique within run) #42.

    --
    Apache Gump
    http://gump.apache.org/ [Instance: vmgump]

    ---------------------------------------------------------------------
    To unsubscribe, e-mail: dev-unsubscribe@turbine.apache.org
    For additional commands, e-mail: dev-help@turbine.apache.org
  • Anonymous at Aug 30, 2011 at 11:27 am
    To whom it may engage...

    This is an automated request, but not an unsolicited one. For
    more information please visit http://gump.apache.org/nagged.html,
    and/or contact the folk at general@gump.apache.org.

    Project turbine-core has an issue affecting its community integration.
    This issue affects 2 projects,
    and has been outstanding for 365 runs.
    The current state of this project is 'Failed', with reason 'Build Failed'.
    For reference only, the following projects are affected by this:
    - turbine-core : A servlet based framework.
    - turbine-core-test : A servlet based framework.


    Full details are available at:
    http://vmgump.apache.org/gump/public/turbine-core/turbine-core/index.html

    That said, some information snippets are provided here.

    The following annotations (debug/informational/warning/error messages) were provided:
    -INFO- Optional dependency commons-fileupload prerequisite failed with reason build failed
    -INFO- Optional dependency httpunit failed with reason build failed
    -DEBUG- (Apache Gump generated) Apache Maven Settings in: /srv/gump/public/workspace/turbine-core/gump_mvn_settings.xml
    -INFO- Failed with reason build failed
    -DEBUG- Maven POM in: /srv/gump/public/workspace/turbine-core/pom.xml
    -INFO- Failed to extract fallback artifacts from Gump Repository



    The following work was performed:
    http://vmgump.apache.org/gump/public/turbine-core/turbine-core/gump_work/build_turbine-core_turbine-core.html
    Work Name: build_turbine-core_turbine-core (Type: Build)
    Work ended in a state of : Failed
    Elapsed: 20 secs
    Command Line: /opt/maven2/bin/mvn --batch-mode -DskipTests=true --settings /srv/gump/public/workspace/turbine-core/gump_mvn_settings.xml package
    [Working Directory: /srv/gump/public/workspace/turbine-core]
    M2_HOME: /opt/maven2
    ---------------------------------------------
    urls[19] = file:/srv/gump/public/workspace/mvnlocalrepo/shared/xml-apis/xml-apis/1.0.b2/xml-apis-1.0.b2.jar
    urls[20] = file:/srv/gump/public/workspace/mvnlocalrepo/shared/commons-configuration/commons-configuration/1.4/commons-configuration-1.4.jar
    urls[21] = file:/srv/gump/public/workspace/mvnlocalrepo/shared/commons-logging/commons-logging-api/1.0.4/commons-logging-api-1.0.4.jar
    urls[22] = file:/srv/gump/public/workspace/mvnlocalrepo/shared/commons-digester/commons-digester/1.8/commons-digester-1.8.jar
    urls[23] = file:/srv/gump/public/workspace/mvnlocalrepo/shared/commons-beanutils/commons-beanutils/1.7.0/commons-beanutils-1.7.0.jar
    urls[24] = file:/srv/gump/public/workspace/mvnlocalrepo/shared/commons-beanutils/commons-beanutils-core/1.7.0/commons-beanutils-core-1.7.0.jar
    urls[25] = file:/srv/gump/public/workspace/mvnlocalrepo/shared/commons-codec/commons-codec/1.3/commons-codec-1.3.jar
    urls[26] = file:/srv/gump/public/workspace/mvnlocalrepo/shared/commons-jxpath/commons-jxpath/1.2/commons-jxpath-1.2.jar
    urls[27] = file:/srv/gump/public/workspace/mvnlocalrepo/shared/xerces/xerces/1.2.3/xerces-1.2.3.jar
    urls[28] = file:/srv/gump/public/workspace/mvnlocalrepo/shared/ant/ant-optional/1.5.1/ant-optional-1.5.1.jar
    urls[29] = file:/srv/gump/public/workspace/mvnlocalrepo/shared/jdom/jdom/b9/jdom-b9.jar
    Number of imports: 10
    import: org.codehaus.classworlds.Entry@a6c57a42
    import: org.codehaus.classworlds.Entry@12f43f3b
    import: org.codehaus.classworlds.Entry@20025374
    import: org.codehaus.classworlds.Entry@f8e44ca4
    import: org.codehaus.classworlds.Entry@92758522
    import: org.codehaus.classworlds.Entry@ebf2705b
    import: org.codehaus.classworlds.Entry@bb25e54
    import: org.codehaus.classworlds.Entry@bece5185
    import: org.codehaus.classworlds.Entry@3fee8e37
    import: org.codehaus.classworlds.Entry@3fee19d8


    this realm = plexus.core
    urls[0] = file:/opt/maven2/lib/maven-2.2.1-uber.jar
    Number of imports: 10
    import: org.codehaus.classworlds.Entry@a6c57a42
    import: org.codehaus.classworlds.Entry@12f43f3b
    import: org.codehaus.classworlds.Entry@20025374
    import: org.codehaus.classworlds.Entry@f8e44ca4
    import: org.codehaus.classworlds.Entry@92758522
    import: org.codehaus.classworlds.Entry@ebf2705b
    import: org.codehaus.classworlds.Entry@bb25e54
    import: org.codehaus.classworlds.Entry@bece5185
    import: org.codehaus.classworlds.Entry@3fee8e37
    import: org.codehaus.classworlds.Entry@3fee19d8
    -----------------------------------------------------
    [INFO] ------------------------------------------------------------------------
    [ERROR] BUILD ERROR
    [INFO] ------------------------------------------------------------------------
    [INFO] Internal error in the plugin manager executing goal 'org.apache.torque:torque-maven-plugin:3.3:om': Unable to load the mojo 'org.apache.torque:torque-maven-plugin:3.3:om' in the plugin 'org.apache.torque:torque-maven-plugin'. A required class is missing: org/apache/torque/task/TorqueDataModelTask
    org.apache.torque.task.TorqueDataModelTask
    [INFO] ------------------------------------------------------------------------
    [INFO] For more information, run Maven with the -e switch
    [INFO] ------------------------------------------------------------------------
    [INFO] Total time: 19 seconds
    [INFO] Finished at: Tue Aug 30 11:27:12 UTC 2011
    [INFO] Final Memory: 30M/71M
    [INFO] ------------------------------------------------------------------------
    ---------------------------------------------

    To subscribe to this information via syndicated feeds:
    - RSS: http://vmgump.apache.org/gump/public/turbine-core/turbine-core/rss.xml
    - Atom: http://vmgump.apache.org/gump/public/turbine-core/turbine-core/atom.xml

    ============================== Gump Tracking Only ===
    Produced by Apache Gump(TM) version 2.3.
    Gump Run 06000630082011, vmgump.apache.org:vmgump:06000630082011
    Gump E-mail Identifier (unique within run) #45.

    --
    Apache Gump
    http://gump.apache.org/ [Instance: vmgump]

    ---------------------------------------------------------------------
    To unsubscribe, e-mail: dev-unsubscribe@turbine.apache.org
    For additional commands, e-mail: dev-help@turbine.apache.org
  • Anonymous at Aug 31, 2011 at 11:18 am
    To whom it may engage...

    This is an automated request, but not an unsolicited one. For
    more information please visit http://gump.apache.org/nagged.html,
    and/or contact the folk at general@gump.apache.org.

    Project turbine-core has an issue affecting its community integration.
    This issue affects 2 projects,
    and has been outstanding for 367 runs.
    The current state of this project is 'Failed', with reason 'Build Failed'.
    For reference only, the following projects are affected by this:
    - turbine-core : A servlet based framework.
    - turbine-core-test : A servlet based framework.


    Full details are available at:
    http://vmgump.apache.org/gump/public/turbine-core/turbine-core/index.html

    That said, some information snippets are provided here.

    The following annotations (debug/informational/warning/error messages) were provided:
    -INFO- Optional dependency commons-fileupload prerequisite failed with reason build failed
    -INFO- Optional dependency httpunit failed with reason build failed
    -DEBUG- (Apache Gump generated) Apache Maven Settings in: /srv/gump/public/workspace/turbine-core/gump_mvn_settings.xml
    -INFO- Failed with reason build failed
    -DEBUG- Maven POM in: /srv/gump/public/workspace/turbine-core/pom.xml
    -INFO- Failed to extract fallback artifacts from Gump Repository



    The following work was performed:
    http://vmgump.apache.org/gump/public/turbine-core/turbine-core/gump_work/build_turbine-core_turbine-core.html
    Work Name: build_turbine-core_turbine-core (Type: Build)
    Work ended in a state of : Failed
    Elapsed: 20 secs
    Command Line: /opt/maven2/bin/mvn --batch-mode -DskipTests=true --settings /srv/gump/public/workspace/turbine-core/gump_mvn_settings.xml package
    [Working Directory: /srv/gump/public/workspace/turbine-core]
    M2_HOME: /opt/maven2
    ---------------------------------------------
    urls[19] = file:/srv/gump/public/workspace/mvnlocalrepo/shared/xml-apis/xml-apis/1.0.b2/xml-apis-1.0.b2.jar
    urls[20] = file:/srv/gump/public/workspace/mvnlocalrepo/shared/commons-configuration/commons-configuration/1.4/commons-configuration-1.4.jar
    urls[21] = file:/srv/gump/public/workspace/mvnlocalrepo/shared/commons-logging/commons-logging-api/1.0.4/commons-logging-api-1.0.4.jar
    urls[22] = file:/srv/gump/public/workspace/mvnlocalrepo/shared/commons-digester/commons-digester/1.8/commons-digester-1.8.jar
    urls[23] = file:/srv/gump/public/workspace/mvnlocalrepo/shared/commons-beanutils/commons-beanutils/1.7.0/commons-beanutils-1.7.0.jar
    urls[24] = file:/srv/gump/public/workspace/mvnlocalrepo/shared/commons-beanutils/commons-beanutils-core/1.7.0/commons-beanutils-core-1.7.0.jar
    urls[25] = file:/srv/gump/public/workspace/mvnlocalrepo/shared/commons-codec/commons-codec/1.3/commons-codec-1.3.jar
    urls[26] = file:/srv/gump/public/workspace/mvnlocalrepo/shared/commons-jxpath/commons-jxpath/1.2/commons-jxpath-1.2.jar
    urls[27] = file:/srv/gump/public/workspace/mvnlocalrepo/shared/xerces/xerces/1.2.3/xerces-1.2.3.jar
    urls[28] = file:/srv/gump/public/workspace/mvnlocalrepo/shared/ant/ant-optional/1.5.1/ant-optional-1.5.1.jar
    urls[29] = file:/srv/gump/public/workspace/mvnlocalrepo/shared/jdom/jdom/b9/jdom-b9.jar
    Number of imports: 10
    import: org.codehaus.classworlds.Entry@a6c57a42
    import: org.codehaus.classworlds.Entry@12f43f3b
    import: org.codehaus.classworlds.Entry@20025374
    import: org.codehaus.classworlds.Entry@f8e44ca4
    import: org.codehaus.classworlds.Entry@92758522
    import: org.codehaus.classworlds.Entry@ebf2705b
    import: org.codehaus.classworlds.Entry@bb25e54
    import: org.codehaus.classworlds.Entry@bece5185
    import: org.codehaus.classworlds.Entry@3fee8e37
    import: org.codehaus.classworlds.Entry@3fee19d8


    this realm = plexus.core
    urls[0] = file:/opt/maven2/lib/maven-2.2.1-uber.jar
    Number of imports: 10
    import: org.codehaus.classworlds.Entry@a6c57a42
    import: org.codehaus.classworlds.Entry@12f43f3b
    import: org.codehaus.classworlds.Entry@20025374
    import: org.codehaus.classworlds.Entry@f8e44ca4
    import: org.codehaus.classworlds.Entry@92758522
    import: org.codehaus.classworlds.Entry@ebf2705b
    import: org.codehaus.classworlds.Entry@bb25e54
    import: org.codehaus.classworlds.Entry@bece5185
    import: org.codehaus.classworlds.Entry@3fee8e37
    import: org.codehaus.classworlds.Entry@3fee19d8
    -----------------------------------------------------
    [INFO] ------------------------------------------------------------------------
    [ERROR] BUILD ERROR
    [INFO] ------------------------------------------------------------------------
    [INFO] Internal error in the plugin manager executing goal 'org.apache.torque:torque-maven-plugin:3.3:om': Unable to load the mojo 'org.apache.torque:torque-maven-plugin:3.3:om' in the plugin 'org.apache.torque:torque-maven-plugin'. A required class is missing: org/apache/torque/task/TorqueDataModelTask
    org.apache.torque.task.TorqueDataModelTask
    [INFO] ------------------------------------------------------------------------
    [INFO] For more information, run Maven with the -e switch
    [INFO] ------------------------------------------------------------------------
    [INFO] Total time: 19 seconds
    [INFO] Finished at: Wed Aug 31 11:17:59 UTC 2011
    [INFO] Final Memory: 30M/72M
    [INFO] ------------------------------------------------------------------------
    ---------------------------------------------

    To subscribe to this information via syndicated feeds:
    - RSS: http://vmgump.apache.org/gump/public/turbine-core/turbine-core/rss.xml
    - Atom: http://vmgump.apache.org/gump/public/turbine-core/turbine-core/atom.xml

    ============================== Gump Tracking Only ===
    Produced by Apache Gump(TM) version 2.3.
    Gump Run 05000631082011, vmgump.apache.org:vmgump:05000631082011
    Gump E-mail Identifier (unique within run) #44.

    --
    Apache Gump
    http://gump.apache.org/ [Instance: vmgump]

    ---------------------------------------------------------------------
    To unsubscribe, e-mail: dev-unsubscribe@turbine.apache.org
    For additional commands, e-mail: dev-help@turbine.apache.org

Related Discussions

Discussion Navigation
viewthread | post
Discussion Overview
groupdev @
categoriesturbine
postedAug 1, '11 at 11:54a
activeAug 31, '11 at 11:18a
posts31
users1
websiteturbine.apache.org

1 user in discussion

Anonymous: 31 posts

People

Translate

site design / logo © 2019 Grokbase