FAQ
To whom it may engage...

This is an automated request, but not an unsolicited one. For
more information please visit http://gump.apache.org/nagged.html,
and/or contact the folk at general@gump.apache.org.

Project turbine-core has an issue affecting its community integration.
This issue affects 2 projects,
and has been outstanding for 68 runs.
The current state of this project is 'Failed', with reason 'Build Failed'.
For reference only, the following projects are affected by this:
- turbine-core : A servlet based framework.
- turbine-core-test : A servlet based framework.


Full details are available at:
http://vmgump.apache.org/gump/public/turbine-core/turbine-core/index.html

That said, some information snippets are provided here.

The following annotations (debug/informational/warning/error messages) were provided:
-INFO- Optional dependency commons-fileupload prerequisite failed with reason build failed
-INFO- Optional dependency httpunit failed with reason build failed
-DEBUG- (Apache Gump generated) Apache Maven Settings in: /srv/gump/public/workspace/turbine-core/gump_mvn_settings.xml
-INFO- Failed with reason build failed
-DEBUG- Maven POM in: /srv/gump/public/workspace/turbine-core/pom.xml
-INFO- Failed to extract fallback artifacts from Gump Repository



The following work was performed:
http://vmgump.apache.org/gump/public/turbine-core/turbine-core/gump_work/build_turbine-core_turbine-core.html
Work Name: build_turbine-core_turbine-core (Type: Build)
Work ended in a state of : Failed
Elapsed: 39 secs
Command Line: /opt/maven2/bin/mvn --batch-mode -DskipTests=true --settings /srv/gump/public/workspace/turbine-core/gump_mvn_settings.xml package
[Working Directory: /srv/gump/public/workspace/turbine-core]
M2_HOME: /opt/maven2
---------------------------------------------
urls[19] = file:/srv/gump/public/workspace/mvnlocalrepo/shared/xml-apis/xml-apis/1.0.b2/xml-apis-1.0.b2.jar
urls[20] = file:/srv/gump/public/workspace/mvnlocalrepo/shared/commons-configuration/commons-configuration/1.4/commons-configuration-1.4.jar
urls[21] = file:/srv/gump/public/workspace/mvnlocalrepo/shared/commons-logging/commons-logging-api/1.0.4/commons-logging-api-1.0.4.jar
urls[22] = file:/srv/gump/public/workspace/mvnlocalrepo/shared/commons-digester/commons-digester/1.8/commons-digester-1.8.jar
urls[23] = file:/srv/gump/public/workspace/mvnlocalrepo/shared/commons-beanutils/commons-beanutils/1.7.0/commons-beanutils-1.7.0.jar
urls[24] = file:/srv/gump/public/workspace/mvnlocalrepo/shared/commons-beanutils/commons-beanutils-core/1.7.0/commons-beanutils-core-1.7.0.jar
urls[25] = file:/srv/gump/public/workspace/mvnlocalrepo/shared/commons-codec/commons-codec/1.3/commons-codec-1.3.jar
urls[26] = file:/srv/gump/public/workspace/mvnlocalrepo/shared/commons-jxpath/commons-jxpath/1.2/commons-jxpath-1.2.jar
urls[27] = file:/srv/gump/public/workspace/mvnlocalrepo/shared/xerces/xerces/1.2.3/xerces-1.2.3.jar
urls[28] = file:/srv/gump/public/workspace/mvnlocalrepo/shared/ant/ant-optional/1.5.1/ant-optional-1.5.1.jar
urls[29] = file:/srv/gump/public/workspace/mvnlocalrepo/shared/jdom/jdom/b9/jdom-b9.jar
Number of imports: 10
import: org.codehaus.classworlds.Entry@a6c57a42
import: org.codehaus.classworlds.Entry@12f43f3b
import: org.codehaus.classworlds.Entry@20025374
import: org.codehaus.classworlds.Entry@f8e44ca4
import: org.codehaus.classworlds.Entry@92758522
import: org.codehaus.classworlds.Entry@ebf2705b
import: org.codehaus.classworlds.Entry@bb25e54
import: org.codehaus.classworlds.Entry@bece5185
import: org.codehaus.classworlds.Entry@3fee8e37
import: org.codehaus.classworlds.Entry@3fee19d8


this realm = plexus.core
urls[0] = file:/opt/maven2/lib/maven-2.2.1-uber.jar
Number of imports: 10
import: org.codehaus.classworlds.Entry@a6c57a42
import: org.codehaus.classworlds.Entry@12f43f3b
import: org.codehaus.classworlds.Entry@20025374
import: org.codehaus.classworlds.Entry@f8e44ca4
import: org.codehaus.classworlds.Entry@92758522
import: org.codehaus.classworlds.Entry@ebf2705b
import: org.codehaus.classworlds.Entry@bb25e54
import: org.codehaus.classworlds.Entry@bece5185
import: org.codehaus.classworlds.Entry@3fee8e37
import: org.codehaus.classworlds.Entry@3fee19d8
-----------------------------------------------------
[INFO] ------------------------------------------------------------------------
[ERROR] BUILD ERROR
[INFO] ------------------------------------------------------------------------
[INFO] Internal error in the plugin manager executing goal 'org.apache.torque:torque-maven-plugin:3.3:om': Unable to load the mojo 'org.apache.torque:torque-maven-plugin:3.3:om' in the plugin 'org.apache.torque:torque-maven-plugin'. A required class is missing: org/apache/torque/task/TorqueDataModelTask
org.apache.torque.task.TorqueDataModelTask
[INFO] ------------------------------------------------------------------------
[INFO] For more information, run Maven with the -e switch
[INFO] ------------------------------------------------------------------------
[INFO] Total time: 38 seconds
[INFO] Finished at: Fri Apr 01 13:34:10 UTC 2011
[INFO] Final Memory: 22M/59M
[INFO] ------------------------------------------------------------------------
---------------------------------------------

To subscribe to this information via syndicated feeds:
- RSS: http://vmgump.apache.org/gump/public/turbine-core/turbine-core/rss.xml
- Atom: http://vmgump.apache.org/gump/public/turbine-core/turbine-core/atom.xml

============================== Gump Tracking Only ===
Produced by Apache Gump(TM) version 2.3.
Gump Run 06000601042011, vmgump.apache.org:vmgump:06000601042011
Gump E-mail Identifier (unique within run) #31.

--
Apache Gump
http://gump.apache.org/ [Instance: vmgump]

---------------------------------------------------------------------
To unsubscribe, e-mail: dev-unsubscribe@turbine.apache.org
For additional commands, e-mail: dev-help@turbine.apache.org

Search Discussions

  • Anonymous at Apr 2, 2011 at 12:57 pm
    To whom it may engage...

    This is an automated request, but not an unsolicited one. For
    more information please visit http://gump.apache.org/nagged.html,
    and/or contact the folk at general@gump.apache.org.

    Project turbine-core has an issue affecting its community integration.
    This issue affects 2 projects,
    and has been outstanding for 70 runs.
    The current state of this project is 'Failed', with reason 'Build Failed'.
    For reference only, the following projects are affected by this:
    - turbine-core : A servlet based framework.
    - turbine-core-test : A servlet based framework.


    Full details are available at:
    http://vmgump.apache.org/gump/public/turbine-core/turbine-core/index.html

    That said, some information snippets are provided here.

    The following annotations (debug/informational/warning/error messages) were provided:
    -INFO- Optional dependency commons-httpclient prerequisite failed with reason build failed
    -INFO- Optional dependency mx4j-tools prerequisite failed with reason build failed
    -INFO- Optional dependency mx4j prerequisite failed with reason build failed
    -INFO- Optional dependency commons-codec failed with reason build failed
    -INFO- Optional dependency commons-fileupload prerequisite failed with reason build failed
    -INFO- Optional dependency httpunit failed with reason build failed
    -DEBUG- (Apache Gump generated) Apache Maven Settings in: /srv/gump/public/workspace/turbine-core/gump_mvn_settings.xml
    -INFO- Failed with reason build failed
    -DEBUG- Maven POM in: /srv/gump/public/workspace/turbine-core/pom.xml
    -INFO- Failed to extract fallback artifacts from Gump Repository



    The following work was performed:
    http://vmgump.apache.org/gump/public/turbine-core/turbine-core/gump_work/build_turbine-core_turbine-core.html
    Work Name: build_turbine-core_turbine-core (Type: Build)
    Work ended in a state of : Failed
    Elapsed: 38 secs
    Command Line: /opt/maven2/bin/mvn --batch-mode -DskipTests=true --settings /srv/gump/public/workspace/turbine-core/gump_mvn_settings.xml package
    [Working Directory: /srv/gump/public/workspace/turbine-core]
    M2_HOME: /opt/maven2
    ---------------------------------------------
    urls[19] = file:/srv/gump/public/workspace/mvnlocalrepo/shared/xml-apis/xml-apis/1.0.b2/xml-apis-1.0.b2.jar
    urls[20] = file:/srv/gump/public/workspace/mvnlocalrepo/shared/commons-configuration/commons-configuration/1.4/commons-configuration-1.4.jar
    urls[21] = file:/srv/gump/public/workspace/mvnlocalrepo/shared/commons-logging/commons-logging-api/1.0.4/commons-logging-api-1.0.4.jar
    urls[22] = file:/srv/gump/public/workspace/mvnlocalrepo/shared/commons-digester/commons-digester/1.8/commons-digester-1.8.jar
    urls[23] = file:/srv/gump/public/workspace/mvnlocalrepo/shared/commons-beanutils/commons-beanutils/1.7.0/commons-beanutils-1.7.0.jar
    urls[24] = file:/srv/gump/public/workspace/mvnlocalrepo/shared/commons-beanutils/commons-beanutils-core/1.7.0/commons-beanutils-core-1.7.0.jar
    urls[25] = file:/srv/gump/public/workspace/mvnlocalrepo/shared/commons-codec/commons-codec/1.3/commons-codec-1.3.jar
    urls[26] = file:/srv/gump/public/workspace/mvnlocalrepo/shared/commons-jxpath/commons-jxpath/1.2/commons-jxpath-1.2.jar
    urls[27] = file:/srv/gump/public/workspace/mvnlocalrepo/shared/xerces/xerces/1.2.3/xerces-1.2.3.jar
    urls[28] = file:/srv/gump/public/workspace/mvnlocalrepo/shared/ant/ant-optional/1.5.1/ant-optional-1.5.1.jar
    urls[29] = file:/srv/gump/public/workspace/mvnlocalrepo/shared/jdom/jdom/b9/jdom-b9.jar
    Number of imports: 10
    import: org.codehaus.classworlds.Entry@a6c57a42
    import: org.codehaus.classworlds.Entry@12f43f3b
    import: org.codehaus.classworlds.Entry@20025374
    import: org.codehaus.classworlds.Entry@f8e44ca4
    import: org.codehaus.classworlds.Entry@92758522
    import: org.codehaus.classworlds.Entry@ebf2705b
    import: org.codehaus.classworlds.Entry@bb25e54
    import: org.codehaus.classworlds.Entry@bece5185
    import: org.codehaus.classworlds.Entry@3fee8e37
    import: org.codehaus.classworlds.Entry@3fee19d8


    this realm = plexus.core
    urls[0] = file:/opt/maven2/lib/maven-2.2.1-uber.jar
    Number of imports: 10
    import: org.codehaus.classworlds.Entry@a6c57a42
    import: org.codehaus.classworlds.Entry@12f43f3b
    import: org.codehaus.classworlds.Entry@20025374
    import: org.codehaus.classworlds.Entry@f8e44ca4
    import: org.codehaus.classworlds.Entry@92758522
    import: org.codehaus.classworlds.Entry@ebf2705b
    import: org.codehaus.classworlds.Entry@bb25e54
    import: org.codehaus.classworlds.Entry@bece5185
    import: org.codehaus.classworlds.Entry@3fee8e37
    import: org.codehaus.classworlds.Entry@3fee19d8
    -----------------------------------------------------
    [INFO] ------------------------------------------------------------------------
    [ERROR] BUILD ERROR
    [INFO] ------------------------------------------------------------------------
    [INFO] Internal error in the plugin manager executing goal 'org.apache.torque:torque-maven-plugin:3.3:om': Unable to load the mojo 'org.apache.torque:torque-maven-plugin:3.3:om' in the plugin 'org.apache.torque:torque-maven-plugin'. A required class is missing: org/apache/torque/task/TorqueDataModelTask
    org.apache.torque.task.TorqueDataModelTask
    [INFO] ------------------------------------------------------------------------
    [INFO] For more information, run Maven with the -e switch
    [INFO] ------------------------------------------------------------------------
    [INFO] Total time: 37 seconds
    [INFO] Finished at: Sat Apr 02 12:57:07 UTC 2011
    [INFO] Final Memory: 21M/57M
    [INFO] ------------------------------------------------------------------------
    ---------------------------------------------

    To subscribe to this information via syndicated feeds:
    - RSS: http://vmgump.apache.org/gump/public/turbine-core/turbine-core/rss.xml
    - Atom: http://vmgump.apache.org/gump/public/turbine-core/turbine-core/atom.xml

    ============================== Gump Tracking Only ===
    Produced by Apache Gump(TM) version 2.3.
    Gump Run 06000602042011, vmgump.apache.org:vmgump:06000602042011
    Gump E-mail Identifier (unique within run) #33.

    --
    Apache Gump
    http://gump.apache.org/ [Instance: vmgump]

    ---------------------------------------------------------------------
    To unsubscribe, e-mail: dev-unsubscribe@turbine.apache.org
    For additional commands, e-mail: dev-help@turbine.apache.org
  • Anonymous at Apr 3, 2011 at 2:15 pm
    To whom it may engage...

    This is an automated request, but not an unsolicited one. For
    more information please visit http://gump.apache.org/nagged.html,
    and/or contact the folk at general@gump.apache.org.

    Project turbine-core has an issue affecting its community integration.
    This issue affects 2 projects,
    and has been outstanding for 72 runs.
    The current state of this project is 'Failed', with reason 'Build Failed'.
    For reference only, the following projects are affected by this:
    - turbine-core : A servlet based framework.
    - turbine-core-test : A servlet based framework.


    Full details are available at:
    http://vmgump.apache.org/gump/public/turbine-core/turbine-core/index.html

    That said, some information snippets are provided here.

    The following annotations (debug/informational/warning/error messages) were provided:
    -INFO- Optional dependency dom4j prerequisite failed with reason build timed out
    -INFO- Optional dependency commons-fileupload prerequisite failed with reason build failed
    -INFO- Optional dependency httpunit failed with reason build failed
    -DEBUG- (Apache Gump generated) Apache Maven Settings in: /srv/gump/public/workspace/turbine-core/gump_mvn_settings.xml
    -INFO- Failed with reason build failed
    -DEBUG- Maven POM in: /srv/gump/public/workspace/turbine-core/pom.xml
    -INFO- Failed to extract fallback artifacts from Gump Repository



    The following work was performed:
    http://vmgump.apache.org/gump/public/turbine-core/turbine-core/gump_work/build_turbine-core_turbine-core.html
    Work Name: build_turbine-core_turbine-core (Type: Build)
    Work ended in a state of : Failed
    Elapsed: 40 secs
    Command Line: /opt/maven2/bin/mvn --batch-mode -DskipTests=true --settings /srv/gump/public/workspace/turbine-core/gump_mvn_settings.xml package
    [Working Directory: /srv/gump/public/workspace/turbine-core]
    M2_HOME: /opt/maven2
    ---------------------------------------------
    urls[19] = file:/srv/gump/public/workspace/mvnlocalrepo/shared/xml-apis/xml-apis/1.0.b2/xml-apis-1.0.b2.jar
    urls[20] = file:/srv/gump/public/workspace/mvnlocalrepo/shared/commons-configuration/commons-configuration/1.4/commons-configuration-1.4.jar
    urls[21] = file:/srv/gump/public/workspace/mvnlocalrepo/shared/commons-logging/commons-logging-api/1.0.4/commons-logging-api-1.0.4.jar
    urls[22] = file:/srv/gump/public/workspace/mvnlocalrepo/shared/commons-digester/commons-digester/1.8/commons-digester-1.8.jar
    urls[23] = file:/srv/gump/public/workspace/mvnlocalrepo/shared/commons-beanutils/commons-beanutils/1.7.0/commons-beanutils-1.7.0.jar
    urls[24] = file:/srv/gump/public/workspace/mvnlocalrepo/shared/commons-beanutils/commons-beanutils-core/1.7.0/commons-beanutils-core-1.7.0.jar
    urls[25] = file:/srv/gump/public/workspace/mvnlocalrepo/shared/commons-codec/commons-codec/1.3/commons-codec-1.3.jar
    urls[26] = file:/srv/gump/public/workspace/mvnlocalrepo/shared/commons-jxpath/commons-jxpath/1.2/commons-jxpath-1.2.jar
    urls[27] = file:/srv/gump/public/workspace/mvnlocalrepo/shared/xerces/xerces/1.2.3/xerces-1.2.3.jar
    urls[28] = file:/srv/gump/public/workspace/mvnlocalrepo/shared/ant/ant-optional/1.5.1/ant-optional-1.5.1.jar
    urls[29] = file:/srv/gump/public/workspace/mvnlocalrepo/shared/jdom/jdom/b9/jdom-b9.jar
    Number of imports: 10
    import: org.codehaus.classworlds.Entry@a6c57a42
    import: org.codehaus.classworlds.Entry@12f43f3b
    import: org.codehaus.classworlds.Entry@20025374
    import: org.codehaus.classworlds.Entry@f8e44ca4
    import: org.codehaus.classworlds.Entry@92758522
    import: org.codehaus.classworlds.Entry@ebf2705b
    import: org.codehaus.classworlds.Entry@bb25e54
    import: org.codehaus.classworlds.Entry@bece5185
    import: org.codehaus.classworlds.Entry@3fee8e37
    import: org.codehaus.classworlds.Entry@3fee19d8


    this realm = plexus.core
    urls[0] = file:/opt/maven2/lib/maven-2.2.1-uber.jar
    Number of imports: 10
    import: org.codehaus.classworlds.Entry@a6c57a42
    import: org.codehaus.classworlds.Entry@12f43f3b
    import: org.codehaus.classworlds.Entry@20025374
    import: org.codehaus.classworlds.Entry@f8e44ca4
    import: org.codehaus.classworlds.Entry@92758522
    import: org.codehaus.classworlds.Entry@ebf2705b
    import: org.codehaus.classworlds.Entry@bb25e54
    import: org.codehaus.classworlds.Entry@bece5185
    import: org.codehaus.classworlds.Entry@3fee8e37
    import: org.codehaus.classworlds.Entry@3fee19d8
    -----------------------------------------------------
    [INFO] ------------------------------------------------------------------------
    [ERROR] BUILD ERROR
    [INFO] ------------------------------------------------------------------------
    [INFO] Internal error in the plugin manager executing goal 'org.apache.torque:torque-maven-plugin:3.3:om': Unable to load the mojo 'org.apache.torque:torque-maven-plugin:3.3:om' in the plugin 'org.apache.torque:torque-maven-plugin'. A required class is missing: org/apache/torque/task/TorqueDataModelTask
    org.apache.torque.task.TorqueDataModelTask
    [INFO] ------------------------------------------------------------------------
    [INFO] For more information, run Maven with the -e switch
    [INFO] ------------------------------------------------------------------------
    [INFO] Total time: 39 seconds
    [INFO] Finished at: Sun Apr 03 14:14:42 UTC 2011
    [INFO] Final Memory: 21M/57M
    [INFO] ------------------------------------------------------------------------
    ---------------------------------------------

    To subscribe to this information via syndicated feeds:
    - RSS: http://vmgump.apache.org/gump/public/turbine-core/turbine-core/rss.xml
    - Atom: http://vmgump.apache.org/gump/public/turbine-core/turbine-core/atom.xml

    ============================== Gump Tracking Only ===
    Produced by Apache Gump(TM) version 2.3.
    Gump Run 05000603042011, vmgump.apache.org:vmgump:05000603042011
    Gump E-mail Identifier (unique within run) #30.

    --
    Apache Gump
    http://gump.apache.org/ [Instance: vmgump]

    ---------------------------------------------------------------------
    To unsubscribe, e-mail: dev-unsubscribe@turbine.apache.org
    For additional commands, e-mail: dev-help@turbine.apache.org
  • Anonymous at Apr 7, 2011 at 7:15 am
    To whom it may engage...

    This is an automated request, but not an unsolicited one. For
    more information please visit http://gump.apache.org/nagged.html,
    and/or contact the folk at general@gump.apache.org.

    Project turbine-core has an issue affecting its community integration.
    This issue affects 2 projects,
    and has been outstanding for 75 runs.
    The current state of this project is 'Failed', with reason 'Build Failed'.
    For reference only, the following projects are affected by this:
    - turbine-core : A servlet based framework.
    - turbine-core-test : A servlet based framework.


    Full details are available at:
    http://vmgump.apache.org/gump/public/turbine-core/turbine-core/index.html

    That said, some information snippets are provided here.

    The following annotations (debug/informational/warning/error messages) were provided:
    -INFO- Optional dependency commons-fileupload prerequisite failed with reason build failed
    -INFO- Optional dependency httpunit failed with reason build failed
    -DEBUG- (Apache Gump generated) Apache Maven Settings in: /srv/gump/public/workspace/turbine-core/gump_mvn_settings.xml
    -INFO- Failed with reason build failed
    -DEBUG- Maven POM in: /srv/gump/public/workspace/turbine-core/pom.xml
    -INFO- Failed to extract fallback artifacts from Gump Repository



    The following work was performed:
    http://vmgump.apache.org/gump/public/turbine-core/turbine-core/gump_work/build_turbine-core_turbine-core.html
    Work Name: build_turbine-core_turbine-core (Type: Build)
    Work ended in a state of : Failed
    Elapsed: 41 secs
    Command Line: /opt/maven2/bin/mvn --batch-mode -DskipTests=true --settings /srv/gump/public/workspace/turbine-core/gump_mvn_settings.xml package
    [Working Directory: /srv/gump/public/workspace/turbine-core]
    M2_HOME: /opt/maven2
    ---------------------------------------------
    urls[19] = file:/srv/gump/public/workspace/mvnlocalrepo/shared/xml-apis/xml-apis/1.0.b2/xml-apis-1.0.b2.jar
    urls[20] = file:/srv/gump/public/workspace/mvnlocalrepo/shared/commons-configuration/commons-configuration/1.4/commons-configuration-1.4.jar
    urls[21] = file:/srv/gump/public/workspace/mvnlocalrepo/shared/commons-logging/commons-logging-api/1.0.4/commons-logging-api-1.0.4.jar
    urls[22] = file:/srv/gump/public/workspace/mvnlocalrepo/shared/commons-digester/commons-digester/1.8/commons-digester-1.8.jar
    urls[23] = file:/srv/gump/public/workspace/mvnlocalrepo/shared/commons-beanutils/commons-beanutils/1.7.0/commons-beanutils-1.7.0.jar
    urls[24] = file:/srv/gump/public/workspace/mvnlocalrepo/shared/commons-beanutils/commons-beanutils-core/1.7.0/commons-beanutils-core-1.7.0.jar
    urls[25] = file:/srv/gump/public/workspace/mvnlocalrepo/shared/commons-codec/commons-codec/1.3/commons-codec-1.3.jar
    urls[26] = file:/srv/gump/public/workspace/mvnlocalrepo/shared/commons-jxpath/commons-jxpath/1.2/commons-jxpath-1.2.jar
    urls[27] = file:/srv/gump/public/workspace/mvnlocalrepo/shared/xerces/xerces/1.2.3/xerces-1.2.3.jar
    urls[28] = file:/srv/gump/public/workspace/mvnlocalrepo/shared/ant/ant-optional/1.5.1/ant-optional-1.5.1.jar
    urls[29] = file:/srv/gump/public/workspace/mvnlocalrepo/shared/jdom/jdom/b9/jdom-b9.jar
    Number of imports: 10
    import: org.codehaus.classworlds.Entry@a6c57a42
    import: org.codehaus.classworlds.Entry@12f43f3b
    import: org.codehaus.classworlds.Entry@20025374
    import: org.codehaus.classworlds.Entry@f8e44ca4
    import: org.codehaus.classworlds.Entry@92758522
    import: org.codehaus.classworlds.Entry@ebf2705b
    import: org.codehaus.classworlds.Entry@bb25e54
    import: org.codehaus.classworlds.Entry@bece5185
    import: org.codehaus.classworlds.Entry@3fee8e37
    import: org.codehaus.classworlds.Entry@3fee19d8


    this realm = plexus.core
    urls[0] = file:/opt/maven2/lib/maven-2.2.1-uber.jar
    Number of imports: 10
    import: org.codehaus.classworlds.Entry@a6c57a42
    import: org.codehaus.classworlds.Entry@12f43f3b
    import: org.codehaus.classworlds.Entry@20025374
    import: org.codehaus.classworlds.Entry@f8e44ca4
    import: org.codehaus.classworlds.Entry@92758522
    import: org.codehaus.classworlds.Entry@ebf2705b
    import: org.codehaus.classworlds.Entry@bb25e54
    import: org.codehaus.classworlds.Entry@bece5185
    import: org.codehaus.classworlds.Entry@3fee8e37
    import: org.codehaus.classworlds.Entry@3fee19d8
    -----------------------------------------------------
    [INFO] ------------------------------------------------------------------------
    [ERROR] BUILD ERROR
    [INFO] ------------------------------------------------------------------------
    [INFO] Internal error in the plugin manager executing goal 'org.apache.torque:torque-maven-plugin:3.3:om': Unable to load the mojo 'org.apache.torque:torque-maven-plugin:3.3:om' in the plugin 'org.apache.torque:torque-maven-plugin'. A required class is missing: org/apache/torque/task/TorqueDataModelTask
    org.apache.torque.task.TorqueDataModelTask
    [INFO] ------------------------------------------------------------------------
    [INFO] For more information, run Maven with the -e switch
    [INFO] ------------------------------------------------------------------------
    [INFO] Total time: 40 seconds
    [INFO] Finished at: Thu Apr 07 07:14:55 UTC 2011
    [INFO] Final Memory: 23M/57M
    [INFO] ------------------------------------------------------------------------
    ---------------------------------------------

    To subscribe to this information via syndicated feeds:
    - RSS: http://vmgump.apache.org/gump/public/turbine-core/turbine-core/rss.xml
    - Atom: http://vmgump.apache.org/gump/public/turbine-core/turbine-core/atom.xml

    ============================== Gump Tracking Only ===
    Produced by Apache Gump(TM) version 2.3.
    Gump Run 10000007042011, vmgump.apache.org:vmgump:10000007042011
    Gump E-mail Identifier (unique within run) #28.

    --
    Apache Gump
    http://gump.apache.org/ [Instance: vmgump]

    ---------------------------------------------------------------------
    To unsubscribe, e-mail: dev-unsubscribe@turbine.apache.org
    For additional commands, e-mail: dev-help@turbine.apache.org
  • Anonymous at Apr 8, 2011 at 7:29 am
    To whom it may engage...

    This is an automated request, but not an unsolicited one. For
    more information please visit http://gump.apache.org/nagged.html,
    and/or contact the folk at general@gump.apache.org.

    Project turbine-core has an issue affecting its community integration.
    This issue affects 2 projects,
    and has been outstanding for 77 runs.
    The current state of this project is 'Failed', with reason 'Build Failed'.
    For reference only, the following projects are affected by this:
    - turbine-core : A servlet based framework.
    - turbine-core-test : A servlet based framework.


    Full details are available at:
    http://vmgump.apache.org/gump/public/turbine-core/turbine-core/index.html

    That said, some information snippets are provided here.

    The following annotations (debug/informational/warning/error messages) were provided:
    -INFO- Optional dependency commons-fileupload prerequisite failed with reason build failed
    -INFO- Optional dependency httpunit failed with reason build failed
    -DEBUG- (Apache Gump generated) Apache Maven Settings in: /srv/gump/public/workspace/turbine-core/gump_mvn_settings.xml
    -INFO- Failed with reason build failed
    -DEBUG- Maven POM in: /srv/gump/public/workspace/turbine-core/pom.xml
    -INFO- Failed to extract fallback artifacts from Gump Repository



    The following work was performed:
    http://vmgump.apache.org/gump/public/turbine-core/turbine-core/gump_work/build_turbine-core_turbine-core.html
    Work Name: build_turbine-core_turbine-core (Type: Build)
    Work ended in a state of : Failed
    Elapsed: 44 secs
    Command Line: /opt/maven2/bin/mvn --batch-mode -DskipTests=true --settings /srv/gump/public/workspace/turbine-core/gump_mvn_settings.xml package
    [Working Directory: /srv/gump/public/workspace/turbine-core]
    M2_HOME: /opt/maven2
    ---------------------------------------------
    urls[19] = file:/srv/gump/public/workspace/mvnlocalrepo/shared/xml-apis/xml-apis/1.0.b2/xml-apis-1.0.b2.jar
    urls[20] = file:/srv/gump/public/workspace/mvnlocalrepo/shared/commons-configuration/commons-configuration/1.4/commons-configuration-1.4.jar
    urls[21] = file:/srv/gump/public/workspace/mvnlocalrepo/shared/commons-logging/commons-logging-api/1.0.4/commons-logging-api-1.0.4.jar
    urls[22] = file:/srv/gump/public/workspace/mvnlocalrepo/shared/commons-digester/commons-digester/1.8/commons-digester-1.8.jar
    urls[23] = file:/srv/gump/public/workspace/mvnlocalrepo/shared/commons-beanutils/commons-beanutils/1.7.0/commons-beanutils-1.7.0.jar
    urls[24] = file:/srv/gump/public/workspace/mvnlocalrepo/shared/commons-beanutils/commons-beanutils-core/1.7.0/commons-beanutils-core-1.7.0.jar
    urls[25] = file:/srv/gump/public/workspace/mvnlocalrepo/shared/commons-codec/commons-codec/1.3/commons-codec-1.3.jar
    urls[26] = file:/srv/gump/public/workspace/mvnlocalrepo/shared/commons-jxpath/commons-jxpath/1.2/commons-jxpath-1.2.jar
    urls[27] = file:/srv/gump/public/workspace/mvnlocalrepo/shared/xerces/xerces/1.2.3/xerces-1.2.3.jar
    urls[28] = file:/srv/gump/public/workspace/mvnlocalrepo/shared/ant/ant-optional/1.5.1/ant-optional-1.5.1.jar
    urls[29] = file:/srv/gump/public/workspace/mvnlocalrepo/shared/jdom/jdom/b9/jdom-b9.jar
    Number of imports: 10
    import: org.codehaus.classworlds.Entry@a6c57a42
    import: org.codehaus.classworlds.Entry@12f43f3b
    import: org.codehaus.classworlds.Entry@20025374
    import: org.codehaus.classworlds.Entry@f8e44ca4
    import: org.codehaus.classworlds.Entry@92758522
    import: org.codehaus.classworlds.Entry@ebf2705b
    import: org.codehaus.classworlds.Entry@bb25e54
    import: org.codehaus.classworlds.Entry@bece5185
    import: org.codehaus.classworlds.Entry@3fee8e37
    import: org.codehaus.classworlds.Entry@3fee19d8


    this realm = plexus.core
    urls[0] = file:/opt/maven2/lib/maven-2.2.1-uber.jar
    Number of imports: 10
    import: org.codehaus.classworlds.Entry@a6c57a42
    import: org.codehaus.classworlds.Entry@12f43f3b
    import: org.codehaus.classworlds.Entry@20025374
    import: org.codehaus.classworlds.Entry@f8e44ca4
    import: org.codehaus.classworlds.Entry@92758522
    import: org.codehaus.classworlds.Entry@ebf2705b
    import: org.codehaus.classworlds.Entry@bb25e54
    import: org.codehaus.classworlds.Entry@bece5185
    import: org.codehaus.classworlds.Entry@3fee8e37
    import: org.codehaus.classworlds.Entry@3fee19d8
    -----------------------------------------------------
    [INFO] ------------------------------------------------------------------------
    [ERROR] BUILD ERROR
    [INFO] ------------------------------------------------------------------------
    [INFO] Internal error in the plugin manager executing goal 'org.apache.torque:torque-maven-plugin:3.3:om': Unable to load the mojo 'org.apache.torque:torque-maven-plugin:3.3:om' in the plugin 'org.apache.torque:torque-maven-plugin'. A required class is missing: org/apache/torque/task/TorqueDataModelTask
    org.apache.torque.task.TorqueDataModelTask
    [INFO] ------------------------------------------------------------------------
    [INFO] For more information, run Maven with the -e switch
    [INFO] ------------------------------------------------------------------------
    [INFO] Total time: 43 seconds
    [INFO] Finished at: Fri Apr 08 07:28:41 UTC 2011
    [INFO] Final Memory: 29M/71M
    [INFO] ------------------------------------------------------------------------
    ---------------------------------------------

    To subscribe to this information via syndicated feeds:
    - RSS: http://vmgump.apache.org/gump/public/turbine-core/turbine-core/rss.xml
    - Atom: http://vmgump.apache.org/gump/public/turbine-core/turbine-core/atom.xml

    ============================== Gump Tracking Only ===
    Produced by Apache Gump(TM) version 2.3.
    Gump Run 15000008042011, vmgump.apache.org:vmgump:15000008042011
    Gump E-mail Identifier (unique within run) #27.

    --
    Apache Gump
    http://gump.apache.org/ [Instance: vmgump]

    ---------------------------------------------------------------------
    To unsubscribe, e-mail: dev-unsubscribe@turbine.apache.org
    For additional commands, e-mail: dev-help@turbine.apache.org
  • Anonymous at Apr 9, 2011 at 6:50 am
    To whom it may engage...

    This is an automated request, but not an unsolicited one. For
    more information please visit http://gump.apache.org/nagged.html,
    and/or contact the folk at general@gump.apache.org.

    Project turbine-core has an issue affecting its community integration.
    This issue affects 2 projects,
    and has been outstanding for 79 runs.
    The current state of this project is 'Failed', with reason 'Build Failed'.
    For reference only, the following projects are affected by this:
    - turbine-core : A servlet based framework.
    - turbine-core-test : A servlet based framework.


    Full details are available at:
    http://vmgump.apache.org/gump/public/turbine-core/turbine-core/index.html

    That said, some information snippets are provided here.

    The following annotations (debug/informational/warning/error messages) were provided:
    -INFO- Optional dependency commons-fileupload prerequisite failed with reason build failed
    -INFO- Optional dependency httpunit failed with reason build failed
    -DEBUG- (Apache Gump generated) Apache Maven Settings in: /srv/gump/public/workspace/turbine-core/gump_mvn_settings.xml
    -INFO- Failed with reason build failed
    -DEBUG- Maven POM in: /srv/gump/public/workspace/turbine-core/pom.xml
    -INFO- Failed to extract fallback artifacts from Gump Repository



    The following work was performed:
    http://vmgump.apache.org/gump/public/turbine-core/turbine-core/gump_work/build_turbine-core_turbine-core.html
    Work Name: build_turbine-core_turbine-core (Type: Build)
    Work ended in a state of : Failed
    Elapsed: 40 secs
    Command Line: /opt/maven2/bin/mvn --batch-mode -DskipTests=true --settings /srv/gump/public/workspace/turbine-core/gump_mvn_settings.xml package
    [Working Directory: /srv/gump/public/workspace/turbine-core]
    M2_HOME: /opt/maven2
    ---------------------------------------------
    urls[19] = file:/srv/gump/public/workspace/mvnlocalrepo/shared/xml-apis/xml-apis/1.0.b2/xml-apis-1.0.b2.jar
    urls[20] = file:/srv/gump/public/workspace/mvnlocalrepo/shared/commons-configuration/commons-configuration/1.4/commons-configuration-1.4.jar
    urls[21] = file:/srv/gump/public/workspace/mvnlocalrepo/shared/commons-logging/commons-logging-api/1.0.4/commons-logging-api-1.0.4.jar
    urls[22] = file:/srv/gump/public/workspace/mvnlocalrepo/shared/commons-digester/commons-digester/1.8/commons-digester-1.8.jar
    urls[23] = file:/srv/gump/public/workspace/mvnlocalrepo/shared/commons-beanutils/commons-beanutils/1.7.0/commons-beanutils-1.7.0.jar
    urls[24] = file:/srv/gump/public/workspace/mvnlocalrepo/shared/commons-beanutils/commons-beanutils-core/1.7.0/commons-beanutils-core-1.7.0.jar
    urls[25] = file:/srv/gump/public/workspace/mvnlocalrepo/shared/commons-codec/commons-codec/1.3/commons-codec-1.3.jar
    urls[26] = file:/srv/gump/public/workspace/mvnlocalrepo/shared/commons-jxpath/commons-jxpath/1.2/commons-jxpath-1.2.jar
    urls[27] = file:/srv/gump/public/workspace/mvnlocalrepo/shared/xerces/xerces/1.2.3/xerces-1.2.3.jar
    urls[28] = file:/srv/gump/public/workspace/mvnlocalrepo/shared/ant/ant-optional/1.5.1/ant-optional-1.5.1.jar
    urls[29] = file:/srv/gump/public/workspace/mvnlocalrepo/shared/jdom/jdom/b9/jdom-b9.jar
    Number of imports: 10
    import: org.codehaus.classworlds.Entry@a6c57a42
    import: org.codehaus.classworlds.Entry@12f43f3b
    import: org.codehaus.classworlds.Entry@20025374
    import: org.codehaus.classworlds.Entry@f8e44ca4
    import: org.codehaus.classworlds.Entry@92758522
    import: org.codehaus.classworlds.Entry@ebf2705b
    import: org.codehaus.classworlds.Entry@bb25e54
    import: org.codehaus.classworlds.Entry@bece5185
    import: org.codehaus.classworlds.Entry@3fee8e37
    import: org.codehaus.classworlds.Entry@3fee19d8


    this realm = plexus.core
    urls[0] = file:/opt/maven2/lib/maven-2.2.1-uber.jar
    Number of imports: 10
    import: org.codehaus.classworlds.Entry@a6c57a42
    import: org.codehaus.classworlds.Entry@12f43f3b
    import: org.codehaus.classworlds.Entry@20025374
    import: org.codehaus.classworlds.Entry@f8e44ca4
    import: org.codehaus.classworlds.Entry@92758522
    import: org.codehaus.classworlds.Entry@ebf2705b
    import: org.codehaus.classworlds.Entry@bb25e54
    import: org.codehaus.classworlds.Entry@bece5185
    import: org.codehaus.classworlds.Entry@3fee8e37
    import: org.codehaus.classworlds.Entry@3fee19d8
    -----------------------------------------------------
    [INFO] ------------------------------------------------------------------------
    [ERROR] BUILD ERROR
    [INFO] ------------------------------------------------------------------------
    [INFO] Internal error in the plugin manager executing goal 'org.apache.torque:torque-maven-plugin:3.3:om': Unable to load the mojo 'org.apache.torque:torque-maven-plugin:3.3:om' in the plugin 'org.apache.torque:torque-maven-plugin'. A required class is missing: org/apache/torque/task/TorqueDataModelTask
    org.apache.torque.task.TorqueDataModelTask
    [INFO] ------------------------------------------------------------------------
    [INFO] For more information, run Maven with the -e switch
    [INFO] ------------------------------------------------------------------------
    [INFO] Total time: 39 seconds
    [INFO] Finished at: Sat Apr 09 06:49:34 UTC 2011
    [INFO] Final Memory: 30M/72M
    [INFO] ------------------------------------------------------------------------
    ---------------------------------------------

    To subscribe to this information via syndicated feeds:
    - RSS: http://vmgump.apache.org/gump/public/turbine-core/turbine-core/rss.xml
    - Atom: http://vmgump.apache.org/gump/public/turbine-core/turbine-core/atom.xml

    ============================== Gump Tracking Only ===
    Produced by Apache Gump(TM) version 2.3.
    Gump Run 09000009042011, vmgump.apache.org:vmgump:09000009042011
    Gump E-mail Identifier (unique within run) #29.

    --
    Apache Gump
    http://gump.apache.org/ [Instance: vmgump]

    ---------------------------------------------------------------------
    To unsubscribe, e-mail: dev-unsubscribe@turbine.apache.org
    For additional commands, e-mail: dev-help@turbine.apache.org
  • Anonymous at Apr 10, 2011 at 6:57 am
    To whom it may engage...

    This is an automated request, but not an unsolicited one. For
    more information please visit http://gump.apache.org/nagged.html,
    and/or contact the folk at general@gump.apache.org.

    Project turbine-core has an issue affecting its community integration.
    This issue affects 2 projects,
    and has been outstanding for 81 runs.
    The current state of this project is 'Failed', with reason 'Build Failed'.
    For reference only, the following projects are affected by this:
    - turbine-core : A servlet based framework.
    - turbine-core-test : A servlet based framework.


    Full details are available at:
    http://vmgump.apache.org/gump/public/turbine-core/turbine-core/index.html

    That said, some information snippets are provided here.

    The following annotations (debug/informational/warning/error messages) were provided:
    -INFO- Optional dependency commons-fileupload prerequisite failed with reason build failed
    -INFO- Optional dependency httpunit failed with reason build failed
    -DEBUG- (Apache Gump generated) Apache Maven Settings in: /srv/gump/public/workspace/turbine-core/gump_mvn_settings.xml
    -INFO- Failed with reason build failed
    -DEBUG- Maven POM in: /srv/gump/public/workspace/turbine-core/pom.xml
    -INFO- Failed to extract fallback artifacts from Gump Repository



    The following work was performed:
    http://vmgump.apache.org/gump/public/turbine-core/turbine-core/gump_work/build_turbine-core_turbine-core.html
    Work Name: build_turbine-core_turbine-core (Type: Build)
    Work ended in a state of : Failed
    Elapsed: 39 secs
    Command Line: /opt/maven2/bin/mvn --batch-mode -DskipTests=true --settings /srv/gump/public/workspace/turbine-core/gump_mvn_settings.xml package
    [Working Directory: /srv/gump/public/workspace/turbine-core]
    M2_HOME: /opt/maven2
    ---------------------------------------------
    urls[19] = file:/srv/gump/public/workspace/mvnlocalrepo/shared/xml-apis/xml-apis/1.0.b2/xml-apis-1.0.b2.jar
    urls[20] = file:/srv/gump/public/workspace/mvnlocalrepo/shared/commons-configuration/commons-configuration/1.4/commons-configuration-1.4.jar
    urls[21] = file:/srv/gump/public/workspace/mvnlocalrepo/shared/commons-logging/commons-logging-api/1.0.4/commons-logging-api-1.0.4.jar
    urls[22] = file:/srv/gump/public/workspace/mvnlocalrepo/shared/commons-digester/commons-digester/1.8/commons-digester-1.8.jar
    urls[23] = file:/srv/gump/public/workspace/mvnlocalrepo/shared/commons-beanutils/commons-beanutils/1.7.0/commons-beanutils-1.7.0.jar
    urls[24] = file:/srv/gump/public/workspace/mvnlocalrepo/shared/commons-beanutils/commons-beanutils-core/1.7.0/commons-beanutils-core-1.7.0.jar
    urls[25] = file:/srv/gump/public/workspace/mvnlocalrepo/shared/commons-codec/commons-codec/1.3/commons-codec-1.3.jar
    urls[26] = file:/srv/gump/public/workspace/mvnlocalrepo/shared/commons-jxpath/commons-jxpath/1.2/commons-jxpath-1.2.jar
    urls[27] = file:/srv/gump/public/workspace/mvnlocalrepo/shared/xerces/xerces/1.2.3/xerces-1.2.3.jar
    urls[28] = file:/srv/gump/public/workspace/mvnlocalrepo/shared/ant/ant-optional/1.5.1/ant-optional-1.5.1.jar
    urls[29] = file:/srv/gump/public/workspace/mvnlocalrepo/shared/jdom/jdom/b9/jdom-b9.jar
    Number of imports: 10
    import: org.codehaus.classworlds.Entry@a6c57a42
    import: org.codehaus.classworlds.Entry@12f43f3b
    import: org.codehaus.classworlds.Entry@20025374
    import: org.codehaus.classworlds.Entry@f8e44ca4
    import: org.codehaus.classworlds.Entry@92758522
    import: org.codehaus.classworlds.Entry@ebf2705b
    import: org.codehaus.classworlds.Entry@bb25e54
    import: org.codehaus.classworlds.Entry@bece5185
    import: org.codehaus.classworlds.Entry@3fee8e37
    import: org.codehaus.classworlds.Entry@3fee19d8


    this realm = plexus.core
    urls[0] = file:/opt/maven2/lib/maven-2.2.1-uber.jar
    Number of imports: 10
    import: org.codehaus.classworlds.Entry@a6c57a42
    import: org.codehaus.classworlds.Entry@12f43f3b
    import: org.codehaus.classworlds.Entry@20025374
    import: org.codehaus.classworlds.Entry@f8e44ca4
    import: org.codehaus.classworlds.Entry@92758522
    import: org.codehaus.classworlds.Entry@ebf2705b
    import: org.codehaus.classworlds.Entry@bb25e54
    import: org.codehaus.classworlds.Entry@bece5185
    import: org.codehaus.classworlds.Entry@3fee8e37
    import: org.codehaus.classworlds.Entry@3fee19d8
    -----------------------------------------------------
    [INFO] ------------------------------------------------------------------------
    [ERROR] BUILD ERROR
    [INFO] ------------------------------------------------------------------------
    [INFO] Internal error in the plugin manager executing goal 'org.apache.torque:torque-maven-plugin:3.3:om': Unable to load the mojo 'org.apache.torque:torque-maven-plugin:3.3:om' in the plugin 'org.apache.torque:torque-maven-plugin'. A required class is missing: org/apache/torque/task/TorqueDataModelTask
    org.apache.torque.task.TorqueDataModelTask
    [INFO] ------------------------------------------------------------------------
    [INFO] For more information, run Maven with the -e switch
    [INFO] ------------------------------------------------------------------------
    [INFO] Total time: 38 seconds
    [INFO] Finished at: Sun Apr 10 06:56:49 UTC 2011
    [INFO] Final Memory: 30M/72M
    [INFO] ------------------------------------------------------------------------
    ---------------------------------------------

    To subscribe to this information via syndicated feeds:
    - RSS: http://vmgump.apache.org/gump/public/turbine-core/turbine-core/rss.xml
    - Atom: http://vmgump.apache.org/gump/public/turbine-core/turbine-core/atom.xml

    ============================== Gump Tracking Only ===
    Produced by Apache Gump(TM) version 2.3.
    Gump Run 10000010042011, vmgump.apache.org:vmgump:10000010042011
    Gump E-mail Identifier (unique within run) #28.

    --
    Apache Gump
    http://gump.apache.org/ [Instance: vmgump]

    ---------------------------------------------------------------------
    To unsubscribe, e-mail: dev-unsubscribe@turbine.apache.org
    For additional commands, e-mail: dev-help@turbine.apache.org
  • Anonymous at Apr 11, 2011 at 7:09 am
    To whom it may engage...

    This is an automated request, but not an unsolicited one. For
    more information please visit http://gump.apache.org/nagged.html,
    and/or contact the folk at general@gump.apache.org.

    Project turbine-core has an issue affecting its community integration.
    This issue affects 2 projects,
    and has been outstanding for 83 runs.
    The current state of this project is 'Failed', with reason 'Build Failed'.
    For reference only, the following projects are affected by this:
    - turbine-core : A servlet based framework.
    - turbine-core-test : A servlet based framework.


    Full details are available at:
    http://vmgump.apache.org/gump/public/turbine-core/turbine-core/index.html

    That said, some information snippets are provided here.

    The following annotations (debug/informational/warning/error messages) were provided:
    -INFO- Optional dependency dom4j prerequisite failed with reason build timed out
    -INFO- Optional dependency commons-fileupload prerequisite failed with reason build failed
    -INFO- Optional dependency httpunit failed with reason build failed
    -DEBUG- (Apache Gump generated) Apache Maven Settings in: /srv/gump/public/workspace/turbine-core/gump_mvn_settings.xml
    -INFO- Failed with reason build failed
    -DEBUG- Maven POM in: /srv/gump/public/workspace/turbine-core/pom.xml
    -INFO- Failed to extract fallback artifacts from Gump Repository



    The following work was performed:
    http://vmgump.apache.org/gump/public/turbine-core/turbine-core/gump_work/build_turbine-core_turbine-core.html
    Work Name: build_turbine-core_turbine-core (Type: Build)
    Work ended in a state of : Failed
    Elapsed: 39 secs
    Command Line: /opt/maven2/bin/mvn --batch-mode -DskipTests=true --settings /srv/gump/public/workspace/turbine-core/gump_mvn_settings.xml package
    [Working Directory: /srv/gump/public/workspace/turbine-core]
    M2_HOME: /opt/maven2
    ---------------------------------------------
    urls[19] = file:/srv/gump/public/workspace/mvnlocalrepo/shared/xml-apis/xml-apis/1.0.b2/xml-apis-1.0.b2.jar
    urls[20] = file:/srv/gump/public/workspace/mvnlocalrepo/shared/commons-configuration/commons-configuration/1.4/commons-configuration-1.4.jar
    urls[21] = file:/srv/gump/public/workspace/mvnlocalrepo/shared/commons-logging/commons-logging-api/1.0.4/commons-logging-api-1.0.4.jar
    urls[22] = file:/srv/gump/public/workspace/mvnlocalrepo/shared/commons-digester/commons-digester/1.8/commons-digester-1.8.jar
    urls[23] = file:/srv/gump/public/workspace/mvnlocalrepo/shared/commons-beanutils/commons-beanutils/1.7.0/commons-beanutils-1.7.0.jar
    urls[24] = file:/srv/gump/public/workspace/mvnlocalrepo/shared/commons-beanutils/commons-beanutils-core/1.7.0/commons-beanutils-core-1.7.0.jar
    urls[25] = file:/srv/gump/public/workspace/mvnlocalrepo/shared/commons-codec/commons-codec/1.3/commons-codec-1.3.jar
    urls[26] = file:/srv/gump/public/workspace/mvnlocalrepo/shared/commons-jxpath/commons-jxpath/1.2/commons-jxpath-1.2.jar
    urls[27] = file:/srv/gump/public/workspace/mvnlocalrepo/shared/xerces/xerces/1.2.3/xerces-1.2.3.jar
    urls[28] = file:/srv/gump/public/workspace/mvnlocalrepo/shared/ant/ant-optional/1.5.1/ant-optional-1.5.1.jar
    urls[29] = file:/srv/gump/public/workspace/mvnlocalrepo/shared/jdom/jdom/b9/jdom-b9.jar
    Number of imports: 10
    import: org.codehaus.classworlds.Entry@a6c57a42
    import: org.codehaus.classworlds.Entry@12f43f3b
    import: org.codehaus.classworlds.Entry@20025374
    import: org.codehaus.classworlds.Entry@f8e44ca4
    import: org.codehaus.classworlds.Entry@92758522
    import: org.codehaus.classworlds.Entry@ebf2705b
    import: org.codehaus.classworlds.Entry@bb25e54
    import: org.codehaus.classworlds.Entry@bece5185
    import: org.codehaus.classworlds.Entry@3fee8e37
    import: org.codehaus.classworlds.Entry@3fee19d8


    this realm = plexus.core
    urls[0] = file:/opt/maven2/lib/maven-2.2.1-uber.jar
    Number of imports: 10
    import: org.codehaus.classworlds.Entry@a6c57a42
    import: org.codehaus.classworlds.Entry@12f43f3b
    import: org.codehaus.classworlds.Entry@20025374
    import: org.codehaus.classworlds.Entry@f8e44ca4
    import: org.codehaus.classworlds.Entry@92758522
    import: org.codehaus.classworlds.Entry@ebf2705b
    import: org.codehaus.classworlds.Entry@bb25e54
    import: org.codehaus.classworlds.Entry@bece5185
    import: org.codehaus.classworlds.Entry@3fee8e37
    import: org.codehaus.classworlds.Entry@3fee19d8
    -----------------------------------------------------
    [INFO] ------------------------------------------------------------------------
    [ERROR] BUILD ERROR
    [INFO] ------------------------------------------------------------------------
    [INFO] Internal error in the plugin manager executing goal 'org.apache.torque:torque-maven-plugin:3.3:om': Unable to load the mojo 'org.apache.torque:torque-maven-plugin:3.3:om' in the plugin 'org.apache.torque:torque-maven-plugin'. A required class is missing: org/apache/torque/task/TorqueDataModelTask
    org.apache.torque.task.TorqueDataModelTask
    [INFO] ------------------------------------------------------------------------
    [INFO] For more information, run Maven with the -e switch
    [INFO] ------------------------------------------------------------------------
    [INFO] Total time: 38 seconds
    [INFO] Finished at: Mon Apr 11 07:09:23 UTC 2011
    [INFO] Final Memory: 30M/72M
    [INFO] ------------------------------------------------------------------------
    ---------------------------------------------

    To subscribe to this information via syndicated feeds:
    - RSS: http://vmgump.apache.org/gump/public/turbine-core/turbine-core/rss.xml
    - Atom: http://vmgump.apache.org/gump/public/turbine-core/turbine-core/atom.xml

    ============================== Gump Tracking Only ===
    Produced by Apache Gump(TM) version 2.3.
    Gump Run 11000011042011, vmgump.apache.org:vmgump:11000011042011
    Gump E-mail Identifier (unique within run) #30.

    --
    Apache Gump
    http://gump.apache.org/ [Instance: vmgump]

    ---------------------------------------------------------------------
    To unsubscribe, e-mail: dev-unsubscribe@turbine.apache.org
    For additional commands, e-mail: dev-help@turbine.apache.org
  • Anonymous at Apr 12, 2011 at 7:04 am
    To whom it may engage...

    This is an automated request, but not an unsolicited one. For
    more information please visit http://gump.apache.org/nagged.html,
    and/or contact the folk at general@gump.apache.org.

    Project turbine-core has an issue affecting its community integration.
    This issue affects 2 projects,
    and has been outstanding for 85 runs.
    The current state of this project is 'Failed', with reason 'Build Failed'.
    For reference only, the following projects are affected by this:
    - turbine-core : A servlet based framework.
    - turbine-core-test : A servlet based framework.


    Full details are available at:
    http://vmgump.apache.org/gump/public/turbine-core/turbine-core/index.html

    That said, some information snippets are provided here.

    The following annotations (debug/informational/warning/error messages) were provided:
    -INFO- Optional dependency commons-fileupload prerequisite failed with reason build failed
    -INFO- Optional dependency httpunit failed with reason build failed
    -DEBUG- (Apache Gump generated) Apache Maven Settings in: /srv/gump/public/workspace/turbine-core/gump_mvn_settings.xml
    -INFO- Failed with reason build failed
    -DEBUG- Maven POM in: /srv/gump/public/workspace/turbine-core/pom.xml
    -INFO- Failed to extract fallback artifacts from Gump Repository



    The following work was performed:
    http://vmgump.apache.org/gump/public/turbine-core/turbine-core/gump_work/build_turbine-core_turbine-core.html
    Work Name: build_turbine-core_turbine-core (Type: Build)
    Work ended in a state of : Failed
    Elapsed: 45 secs
    Command Line: /opt/maven2/bin/mvn --batch-mode -DskipTests=true --settings /srv/gump/public/workspace/turbine-core/gump_mvn_settings.xml package
    [Working Directory: /srv/gump/public/workspace/turbine-core]
    M2_HOME: /opt/maven2
    ---------------------------------------------
    urls[19] = file:/srv/gump/public/workspace/mvnlocalrepo/shared/xml-apis/xml-apis/1.0.b2/xml-apis-1.0.b2.jar
    urls[20] = file:/srv/gump/public/workspace/mvnlocalrepo/shared/commons-configuration/commons-configuration/1.4/commons-configuration-1.4.jar
    urls[21] = file:/srv/gump/public/workspace/mvnlocalrepo/shared/commons-logging/commons-logging-api/1.0.4/commons-logging-api-1.0.4.jar
    urls[22] = file:/srv/gump/public/workspace/mvnlocalrepo/shared/commons-digester/commons-digester/1.8/commons-digester-1.8.jar
    urls[23] = file:/srv/gump/public/workspace/mvnlocalrepo/shared/commons-beanutils/commons-beanutils/1.7.0/commons-beanutils-1.7.0.jar
    urls[24] = file:/srv/gump/public/workspace/mvnlocalrepo/shared/commons-beanutils/commons-beanutils-core/1.7.0/commons-beanutils-core-1.7.0.jar
    urls[25] = file:/srv/gump/public/workspace/mvnlocalrepo/shared/commons-codec/commons-codec/1.3/commons-codec-1.3.jar
    urls[26] = file:/srv/gump/public/workspace/mvnlocalrepo/shared/commons-jxpath/commons-jxpath/1.2/commons-jxpath-1.2.jar
    urls[27] = file:/srv/gump/public/workspace/mvnlocalrepo/shared/xerces/xerces/1.2.3/xerces-1.2.3.jar
    urls[28] = file:/srv/gump/public/workspace/mvnlocalrepo/shared/ant/ant-optional/1.5.1/ant-optional-1.5.1.jar
    urls[29] = file:/srv/gump/public/workspace/mvnlocalrepo/shared/jdom/jdom/b9/jdom-b9.jar
    Number of imports: 10
    import: org.codehaus.classworlds.Entry@a6c57a42
    import: org.codehaus.classworlds.Entry@12f43f3b
    import: org.codehaus.classworlds.Entry@20025374
    import: org.codehaus.classworlds.Entry@f8e44ca4
    import: org.codehaus.classworlds.Entry@92758522
    import: org.codehaus.classworlds.Entry@ebf2705b
    import: org.codehaus.classworlds.Entry@bb25e54
    import: org.codehaus.classworlds.Entry@bece5185
    import: org.codehaus.classworlds.Entry@3fee8e37
    import: org.codehaus.classworlds.Entry@3fee19d8


    this realm = plexus.core
    urls[0] = file:/opt/maven2/lib/maven-2.2.1-uber.jar
    Number of imports: 10
    import: org.codehaus.classworlds.Entry@a6c57a42
    import: org.codehaus.classworlds.Entry@12f43f3b
    import: org.codehaus.classworlds.Entry@20025374
    import: org.codehaus.classworlds.Entry@f8e44ca4
    import: org.codehaus.classworlds.Entry@92758522
    import: org.codehaus.classworlds.Entry@ebf2705b
    import: org.codehaus.classworlds.Entry@bb25e54
    import: org.codehaus.classworlds.Entry@bece5185
    import: org.codehaus.classworlds.Entry@3fee8e37
    import: org.codehaus.classworlds.Entry@3fee19d8
    -----------------------------------------------------
    [INFO] ------------------------------------------------------------------------
    [ERROR] BUILD ERROR
    [INFO] ------------------------------------------------------------------------
    [INFO] Internal error in the plugin manager executing goal 'org.apache.torque:torque-maven-plugin:3.3:om': Unable to load the mojo 'org.apache.torque:torque-maven-plugin:3.3:om' in the plugin 'org.apache.torque:torque-maven-plugin'. A required class is missing: org/apache/torque/task/TorqueDataModelTask
    org.apache.torque.task.TorqueDataModelTask
    [INFO] ------------------------------------------------------------------------
    [INFO] For more information, run Maven with the -e switch
    [INFO] ------------------------------------------------------------------------
    [INFO] Total time: 44 seconds
    [INFO] Finished at: Tue Apr 12 07:04:19 UTC 2011
    [INFO] Final Memory: 30M/72M
    [INFO] ------------------------------------------------------------------------
    ---------------------------------------------

    To subscribe to this information via syndicated feeds:
    - RSS: http://vmgump.apache.org/gump/public/turbine-core/turbine-core/rss.xml
    - Atom: http://vmgump.apache.org/gump/public/turbine-core/turbine-core/atom.xml

    ============================== Gump Tracking Only ===
    Produced by Apache Gump(TM) version 2.3.
    Gump Run 08000012042011, vmgump.apache.org:vmgump:08000012042011
    Gump E-mail Identifier (unique within run) #29.

    --
    Apache Gump
    http://gump.apache.org/ [Instance: vmgump]

    ---------------------------------------------------------------------
    To unsubscribe, e-mail: dev-unsubscribe@turbine.apache.org
    For additional commands, e-mail: dev-help@turbine.apache.org
  • Anonymous at Apr 13, 2011 at 7:11 am
    To whom it may engage...

    This is an automated request, but not an unsolicited one. For
    more information please visit http://gump.apache.org/nagged.html,
    and/or contact the folk at general@gump.apache.org.

    Project turbine-core has an issue affecting its community integration.
    This issue affects 2 projects,
    and has been outstanding for 87 runs.
    The current state of this project is 'Failed', with reason 'Build Failed'.
    For reference only, the following projects are affected by this:
    - turbine-core : A servlet based framework.
    - turbine-core-test : A servlet based framework.


    Full details are available at:
    http://vmgump.apache.org/gump/public/turbine-core/turbine-core/index.html

    That said, some information snippets are provided here.

    The following annotations (debug/informational/warning/error messages) were provided:
    -INFO- Optional dependency commons-fileupload prerequisite failed with reason build failed
    -INFO- Optional dependency httpunit failed with reason build failed
    -DEBUG- (Apache Gump generated) Apache Maven Settings in: /srv/gump/public/workspace/turbine-core/gump_mvn_settings.xml
    -INFO- Failed with reason build failed
    -DEBUG- Maven POM in: /srv/gump/public/workspace/turbine-core/pom.xml
    -INFO- Failed to extract fallback artifacts from Gump Repository



    The following work was performed:
    http://vmgump.apache.org/gump/public/turbine-core/turbine-core/gump_work/build_turbine-core_turbine-core.html
    Work Name: build_turbine-core_turbine-core (Type: Build)
    Work ended in a state of : Failed
    Elapsed: 38 secs
    Command Line: /opt/maven2/bin/mvn --batch-mode -DskipTests=true --settings /srv/gump/public/workspace/turbine-core/gump_mvn_settings.xml package
    [Working Directory: /srv/gump/public/workspace/turbine-core]
    M2_HOME: /opt/maven2
    ---------------------------------------------
    urls[19] = file:/srv/gump/public/workspace/mvnlocalrepo/shared/xml-apis/xml-apis/1.0.b2/xml-apis-1.0.b2.jar
    urls[20] = file:/srv/gump/public/workspace/mvnlocalrepo/shared/commons-configuration/commons-configuration/1.4/commons-configuration-1.4.jar
    urls[21] = file:/srv/gump/public/workspace/mvnlocalrepo/shared/commons-logging/commons-logging-api/1.0.4/commons-logging-api-1.0.4.jar
    urls[22] = file:/srv/gump/public/workspace/mvnlocalrepo/shared/commons-digester/commons-digester/1.8/commons-digester-1.8.jar
    urls[23] = file:/srv/gump/public/workspace/mvnlocalrepo/shared/commons-beanutils/commons-beanutils/1.7.0/commons-beanutils-1.7.0.jar
    urls[24] = file:/srv/gump/public/workspace/mvnlocalrepo/shared/commons-beanutils/commons-beanutils-core/1.7.0/commons-beanutils-core-1.7.0.jar
    urls[25] = file:/srv/gump/public/workspace/mvnlocalrepo/shared/commons-codec/commons-codec/1.3/commons-codec-1.3.jar
    urls[26] = file:/srv/gump/public/workspace/mvnlocalrepo/shared/commons-jxpath/commons-jxpath/1.2/commons-jxpath-1.2.jar
    urls[27] = file:/srv/gump/public/workspace/mvnlocalrepo/shared/xerces/xerces/1.2.3/xerces-1.2.3.jar
    urls[28] = file:/srv/gump/public/workspace/mvnlocalrepo/shared/ant/ant-optional/1.5.1/ant-optional-1.5.1.jar
    urls[29] = file:/srv/gump/public/workspace/mvnlocalrepo/shared/jdom/jdom/b9/jdom-b9.jar
    Number of imports: 10
    import: org.codehaus.classworlds.Entry@a6c57a42
    import: org.codehaus.classworlds.Entry@12f43f3b
    import: org.codehaus.classworlds.Entry@20025374
    import: org.codehaus.classworlds.Entry@f8e44ca4
    import: org.codehaus.classworlds.Entry@92758522
    import: org.codehaus.classworlds.Entry@ebf2705b
    import: org.codehaus.classworlds.Entry@bb25e54
    import: org.codehaus.classworlds.Entry@bece5185
    import: org.codehaus.classworlds.Entry@3fee8e37
    import: org.codehaus.classworlds.Entry@3fee19d8


    this realm = plexus.core
    urls[0] = file:/opt/maven2/lib/maven-2.2.1-uber.jar
    Number of imports: 10
    import: org.codehaus.classworlds.Entry@a6c57a42
    import: org.codehaus.classworlds.Entry@12f43f3b
    import: org.codehaus.classworlds.Entry@20025374
    import: org.codehaus.classworlds.Entry@f8e44ca4
    import: org.codehaus.classworlds.Entry@92758522
    import: org.codehaus.classworlds.Entry@ebf2705b
    import: org.codehaus.classworlds.Entry@bb25e54
    import: org.codehaus.classworlds.Entry@bece5185
    import: org.codehaus.classworlds.Entry@3fee8e37
    import: org.codehaus.classworlds.Entry@3fee19d8
    -----------------------------------------------------
    [INFO] ------------------------------------------------------------------------
    [ERROR] BUILD ERROR
    [INFO] ------------------------------------------------------------------------
    [INFO] Internal error in the plugin manager executing goal 'org.apache.torque:torque-maven-plugin:3.3:om': Unable to load the mojo 'org.apache.torque:torque-maven-plugin:3.3:om' in the plugin 'org.apache.torque:torque-maven-plugin'. A required class is missing: org/apache/torque/task/TorqueDataModelTask
    org.apache.torque.task.TorqueDataModelTask
    [INFO] ------------------------------------------------------------------------
    [INFO] For more information, run Maven with the -e switch
    [INFO] ------------------------------------------------------------------------
    [INFO] Total time: 37 seconds
    [INFO] Finished at: Wed Apr 13 07:11:28 UTC 2011
    [INFO] Final Memory: 30M/72M
    [INFO] ------------------------------------------------------------------------
    ---------------------------------------------

    To subscribe to this information via syndicated feeds:
    - RSS: http://vmgump.apache.org/gump/public/turbine-core/turbine-core/rss.xml
    - Atom: http://vmgump.apache.org/gump/public/turbine-core/turbine-core/atom.xml

    ============================== Gump Tracking Only ===
    Produced by Apache Gump(TM) version 2.3.
    Gump Run 10000013042011, vmgump.apache.org:vmgump:10000013042011
    Gump E-mail Identifier (unique within run) #28.

    --
    Apache Gump
    http://gump.apache.org/ [Instance: vmgump]

    ---------------------------------------------------------------------
    To unsubscribe, e-mail: dev-unsubscribe@turbine.apache.org
    For additional commands, e-mail: dev-help@turbine.apache.org
  • Anonymous at Apr 14, 2011 at 7:01 am
    To whom it may engage...

    This is an automated request, but not an unsolicited one. For
    more information please visit http://gump.apache.org/nagged.html,
    and/or contact the folk at general@gump.apache.org.

    Project turbine-core has an issue affecting its community integration.
    This issue affects 2 projects,
    and has been outstanding for 89 runs.
    The current state of this project is 'Failed', with reason 'Build Failed'.
    For reference only, the following projects are affected by this:
    - turbine-core : A servlet based framework.
    - turbine-core-test : A servlet based framework.


    Full details are available at:
    http://vmgump.apache.org/gump/public/turbine-core/turbine-core/index.html

    That said, some information snippets are provided here.

    The following annotations (debug/informational/warning/error messages) were provided:
    -INFO- Optional dependency commons-fileupload prerequisite failed with reason build failed
    -INFO- Optional dependency httpunit failed with reason build failed
    -DEBUG- (Apache Gump generated) Apache Maven Settings in: /srv/gump/public/workspace/turbine-core/gump_mvn_settings.xml
    -INFO- Failed with reason build failed
    -DEBUG- Maven POM in: /srv/gump/public/workspace/turbine-core/pom.xml
    -INFO- Failed to extract fallback artifacts from Gump Repository



    The following work was performed:
    http://vmgump.apache.org/gump/public/turbine-core/turbine-core/gump_work/build_turbine-core_turbine-core.html
    Work Name: build_turbine-core_turbine-core (Type: Build)
    Work ended in a state of : Failed
    Elapsed: 40 secs
    Command Line: /opt/maven2/bin/mvn --batch-mode -DskipTests=true --settings /srv/gump/public/workspace/turbine-core/gump_mvn_settings.xml package
    [Working Directory: /srv/gump/public/workspace/turbine-core]
    M2_HOME: /opt/maven2
    ---------------------------------------------
    urls[19] = file:/srv/gump/public/workspace/mvnlocalrepo/shared/xml-apis/xml-apis/1.0.b2/xml-apis-1.0.b2.jar
    urls[20] = file:/srv/gump/public/workspace/mvnlocalrepo/shared/commons-configuration/commons-configuration/1.4/commons-configuration-1.4.jar
    urls[21] = file:/srv/gump/public/workspace/mvnlocalrepo/shared/commons-logging/commons-logging-api/1.0.4/commons-logging-api-1.0.4.jar
    urls[22] = file:/srv/gump/public/workspace/mvnlocalrepo/shared/commons-digester/commons-digester/1.8/commons-digester-1.8.jar
    urls[23] = file:/srv/gump/public/workspace/mvnlocalrepo/shared/commons-beanutils/commons-beanutils/1.7.0/commons-beanutils-1.7.0.jar
    urls[24] = file:/srv/gump/public/workspace/mvnlocalrepo/shared/commons-beanutils/commons-beanutils-core/1.7.0/commons-beanutils-core-1.7.0.jar
    urls[25] = file:/srv/gump/public/workspace/mvnlocalrepo/shared/commons-codec/commons-codec/1.3/commons-codec-1.3.jar
    urls[26] = file:/srv/gump/public/workspace/mvnlocalrepo/shared/commons-jxpath/commons-jxpath/1.2/commons-jxpath-1.2.jar
    urls[27] = file:/srv/gump/public/workspace/mvnlocalrepo/shared/xerces/xerces/1.2.3/xerces-1.2.3.jar
    urls[28] = file:/srv/gump/public/workspace/mvnlocalrepo/shared/ant/ant-optional/1.5.1/ant-optional-1.5.1.jar
    urls[29] = file:/srv/gump/public/workspace/mvnlocalrepo/shared/jdom/jdom/b9/jdom-b9.jar
    Number of imports: 10
    import: org.codehaus.classworlds.Entry@a6c57a42
    import: org.codehaus.classworlds.Entry@12f43f3b
    import: org.codehaus.classworlds.Entry@20025374
    import: org.codehaus.classworlds.Entry@f8e44ca4
    import: org.codehaus.classworlds.Entry@92758522
    import: org.codehaus.classworlds.Entry@ebf2705b
    import: org.codehaus.classworlds.Entry@bb25e54
    import: org.codehaus.classworlds.Entry@bece5185
    import: org.codehaus.classworlds.Entry@3fee8e37
    import: org.codehaus.classworlds.Entry@3fee19d8


    this realm = plexus.core
    urls[0] = file:/opt/maven2/lib/maven-2.2.1-uber.jar
    Number of imports: 10
    import: org.codehaus.classworlds.Entry@a6c57a42
    import: org.codehaus.classworlds.Entry@12f43f3b
    import: org.codehaus.classworlds.Entry@20025374
    import: org.codehaus.classworlds.Entry@f8e44ca4
    import: org.codehaus.classworlds.Entry@92758522
    import: org.codehaus.classworlds.Entry@ebf2705b
    import: org.codehaus.classworlds.Entry@bb25e54
    import: org.codehaus.classworlds.Entry@bece5185
    import: org.codehaus.classworlds.Entry@3fee8e37
    import: org.codehaus.classworlds.Entry@3fee19d8
    -----------------------------------------------------
    [INFO] ------------------------------------------------------------------------
    [ERROR] BUILD ERROR
    [INFO] ------------------------------------------------------------------------
    [INFO] Internal error in the plugin manager executing goal 'org.apache.torque:torque-maven-plugin:3.3:om': Unable to load the mojo 'org.apache.torque:torque-maven-plugin:3.3:om' in the plugin 'org.apache.torque:torque-maven-plugin'. A required class is missing: org/apache/torque/task/TorqueDataModelTask
    org.apache.torque.task.TorqueDataModelTask
    [INFO] ------------------------------------------------------------------------
    [INFO] For more information, run Maven with the -e switch
    [INFO] ------------------------------------------------------------------------
    [INFO] Total time: 39 seconds
    [INFO] Finished at: Thu Apr 14 07:01:05 UTC 2011
    [INFO] Final Memory: 30M/72M
    [INFO] ------------------------------------------------------------------------
    ---------------------------------------------

    To subscribe to this information via syndicated feeds:
    - RSS: http://vmgump.apache.org/gump/public/turbine-core/turbine-core/rss.xml
    - Atom: http://vmgump.apache.org/gump/public/turbine-core/turbine-core/atom.xml

    ============================== Gump Tracking Only ===
    Produced by Apache Gump(TM) version 2.3.
    Gump Run 11000014042011, vmgump.apache.org:vmgump:11000014042011
    Gump E-mail Identifier (unique within run) #29.

    --
    Apache Gump
    http://gump.apache.org/ [Instance: vmgump]

    ---------------------------------------------------------------------
    To unsubscribe, e-mail: dev-unsubscribe@turbine.apache.org
    For additional commands, e-mail: dev-help@turbine.apache.org
  • Anonymous at Apr 15, 2011 at 6:35 am
    To whom it may engage...

    This is an automated request, but not an unsolicited one. For
    more information please visit http://gump.apache.org/nagged.html,
    and/or contact the folk at general@gump.apache.org.

    Project turbine-core has an issue affecting its community integration.
    This issue affects 2 projects,
    and has been outstanding for 91 runs.
    The current state of this project is 'Failed', with reason 'Build Failed'.
    For reference only, the following projects are affected by this:
    - turbine-core : A servlet based framework.
    - turbine-core-test : A servlet based framework.


    Full details are available at:
    http://vmgump.apache.org/gump/public/turbine-core/turbine-core/index.html

    That said, some information snippets are provided here.

    The following annotations (debug/informational/warning/error messages) were provided:
    -INFO- Optional dependency commons-fileupload prerequisite failed with reason build failed
    -INFO- Optional dependency httpunit failed with reason build failed
    -DEBUG- (Apache Gump generated) Apache Maven Settings in: /srv/gump/public/workspace/turbine-core/gump_mvn_settings.xml
    -INFO- Failed with reason build failed
    -DEBUG- Maven POM in: /srv/gump/public/workspace/turbine-core/pom.xml
    -INFO- Failed to extract fallback artifacts from Gump Repository



    The following work was performed:
    http://vmgump.apache.org/gump/public/turbine-core/turbine-core/gump_work/build_turbine-core_turbine-core.html
    Work Name: build_turbine-core_turbine-core (Type: Build)
    Work ended in a state of : Failed
    Elapsed: 38 secs
    Command Line: /opt/maven2/bin/mvn --batch-mode -DskipTests=true --settings /srv/gump/public/workspace/turbine-core/gump_mvn_settings.xml package
    [Working Directory: /srv/gump/public/workspace/turbine-core]
    M2_HOME: /opt/maven2
    ---------------------------------------------
    urls[19] = file:/srv/gump/public/workspace/mvnlocalrepo/shared/xml-apis/xml-apis/1.0.b2/xml-apis-1.0.b2.jar
    urls[20] = file:/srv/gump/public/workspace/mvnlocalrepo/shared/commons-configuration/commons-configuration/1.4/commons-configuration-1.4.jar
    urls[21] = file:/srv/gump/public/workspace/mvnlocalrepo/shared/commons-logging/commons-logging-api/1.0.4/commons-logging-api-1.0.4.jar
    urls[22] = file:/srv/gump/public/workspace/mvnlocalrepo/shared/commons-digester/commons-digester/1.8/commons-digester-1.8.jar
    urls[23] = file:/srv/gump/public/workspace/mvnlocalrepo/shared/commons-beanutils/commons-beanutils/1.7.0/commons-beanutils-1.7.0.jar
    urls[24] = file:/srv/gump/public/workspace/mvnlocalrepo/shared/commons-beanutils/commons-beanutils-core/1.7.0/commons-beanutils-core-1.7.0.jar
    urls[25] = file:/srv/gump/public/workspace/mvnlocalrepo/shared/commons-codec/commons-codec/1.3/commons-codec-1.3.jar
    urls[26] = file:/srv/gump/public/workspace/mvnlocalrepo/shared/commons-jxpath/commons-jxpath/1.2/commons-jxpath-1.2.jar
    urls[27] = file:/srv/gump/public/workspace/mvnlocalrepo/shared/xerces/xerces/1.2.3/xerces-1.2.3.jar
    urls[28] = file:/srv/gump/public/workspace/mvnlocalrepo/shared/ant/ant-optional/1.5.1/ant-optional-1.5.1.jar
    urls[29] = file:/srv/gump/public/workspace/mvnlocalrepo/shared/jdom/jdom/b9/jdom-b9.jar
    Number of imports: 10
    import: org.codehaus.classworlds.Entry@a6c57a42
    import: org.codehaus.classworlds.Entry@12f43f3b
    import: org.codehaus.classworlds.Entry@20025374
    import: org.codehaus.classworlds.Entry@f8e44ca4
    import: org.codehaus.classworlds.Entry@92758522
    import: org.codehaus.classworlds.Entry@ebf2705b
    import: org.codehaus.classworlds.Entry@bb25e54
    import: org.codehaus.classworlds.Entry@bece5185
    import: org.codehaus.classworlds.Entry@3fee8e37
    import: org.codehaus.classworlds.Entry@3fee19d8


    this realm = plexus.core
    urls[0] = file:/opt/maven2/lib/maven-2.2.1-uber.jar
    Number of imports: 10
    import: org.codehaus.classworlds.Entry@a6c57a42
    import: org.codehaus.classworlds.Entry@12f43f3b
    import: org.codehaus.classworlds.Entry@20025374
    import: org.codehaus.classworlds.Entry@f8e44ca4
    import: org.codehaus.classworlds.Entry@92758522
    import: org.codehaus.classworlds.Entry@ebf2705b
    import: org.codehaus.classworlds.Entry@bb25e54
    import: org.codehaus.classworlds.Entry@bece5185
    import: org.codehaus.classworlds.Entry@3fee8e37
    import: org.codehaus.classworlds.Entry@3fee19d8
    -----------------------------------------------------
    [INFO] ------------------------------------------------------------------------
    [ERROR] BUILD ERROR
    [INFO] ------------------------------------------------------------------------
    [INFO] Internal error in the plugin manager executing goal 'org.apache.torque:torque-maven-plugin:3.3:om': Unable to load the mojo 'org.apache.torque:torque-maven-plugin:3.3:om' in the plugin 'org.apache.torque:torque-maven-plugin'. A required class is missing: org/apache/torque/task/TorqueDataModelTask
    org.apache.torque.task.TorqueDataModelTask
    [INFO] ------------------------------------------------------------------------
    [INFO] For more information, run Maven with the -e switch
    [INFO] ------------------------------------------------------------------------
    [INFO] Total time: 37 seconds
    [INFO] Finished at: Fri Apr 15 06:34:58 UTC 2011
    [INFO] Final Memory: 30M/72M
    [INFO] ------------------------------------------------------------------------
    ---------------------------------------------

    To subscribe to this information via syndicated feeds:
    - RSS: http://vmgump.apache.org/gump/public/turbine-core/turbine-core/rss.xml
    - Atom: http://vmgump.apache.org/gump/public/turbine-core/turbine-core/atom.xml

    ============================== Gump Tracking Only ===
    Produced by Apache Gump(TM) version 2.3.
    Gump Run 11000015042011, vmgump.apache.org:vmgump:11000015042011
    Gump E-mail Identifier (unique within run) #30.

    --
    Apache Gump
    http://gump.apache.org/ [Instance: vmgump]

    ---------------------------------------------------------------------
    To unsubscribe, e-mail: dev-unsubscribe@turbine.apache.org
    For additional commands, e-mail: dev-help@turbine.apache.org
  • Anonymous at Apr 16, 2011 at 7:04 am
    To whom it may engage...

    This is an automated request, but not an unsolicited one. For
    more information please visit http://gump.apache.org/nagged.html,
    and/or contact the folk at general@gump.apache.org.

    Project turbine-core has an issue affecting its community integration.
    This issue affects 2 projects,
    and has been outstanding for 93 runs.
    The current state of this project is 'Failed', with reason 'Build Failed'.
    For reference only, the following projects are affected by this:
    - turbine-core : A servlet based framework.
    - turbine-core-test : A servlet based framework.


    Full details are available at:
    http://vmgump.apache.org/gump/public/turbine-core/turbine-core/index.html

    That said, some information snippets are provided here.

    The following annotations (debug/informational/warning/error messages) were provided:
    -INFO- Optional dependency commons-fileupload prerequisite failed with reason build failed
    -INFO- Optional dependency httpunit failed with reason build failed
    -DEBUG- (Apache Gump generated) Apache Maven Settings in: /srv/gump/public/workspace/turbine-core/gump_mvn_settings.xml
    -INFO- Failed with reason build failed
    -DEBUG- Maven POM in: /srv/gump/public/workspace/turbine-core/pom.xml
    -INFO- Failed to extract fallback artifacts from Gump Repository



    The following work was performed:
    http://vmgump.apache.org/gump/public/turbine-core/turbine-core/gump_work/build_turbine-core_turbine-core.html
    Work Name: build_turbine-core_turbine-core (Type: Build)
    Work ended in a state of : Failed
    Elapsed: 39 secs
    Command Line: /opt/maven2/bin/mvn --batch-mode -DskipTests=true --settings /srv/gump/public/workspace/turbine-core/gump_mvn_settings.xml package
    [Working Directory: /srv/gump/public/workspace/turbine-core]
    M2_HOME: /opt/maven2
    ---------------------------------------------
    urls[19] = file:/srv/gump/public/workspace/mvnlocalrepo/shared/xml-apis/xml-apis/1.0.b2/xml-apis-1.0.b2.jar
    urls[20] = file:/srv/gump/public/workspace/mvnlocalrepo/shared/commons-configuration/commons-configuration/1.4/commons-configuration-1.4.jar
    urls[21] = file:/srv/gump/public/workspace/mvnlocalrepo/shared/commons-logging/commons-logging-api/1.0.4/commons-logging-api-1.0.4.jar
    urls[22] = file:/srv/gump/public/workspace/mvnlocalrepo/shared/commons-digester/commons-digester/1.8/commons-digester-1.8.jar
    urls[23] = file:/srv/gump/public/workspace/mvnlocalrepo/shared/commons-beanutils/commons-beanutils/1.7.0/commons-beanutils-1.7.0.jar
    urls[24] = file:/srv/gump/public/workspace/mvnlocalrepo/shared/commons-beanutils/commons-beanutils-core/1.7.0/commons-beanutils-core-1.7.0.jar
    urls[25] = file:/srv/gump/public/workspace/mvnlocalrepo/shared/commons-codec/commons-codec/1.3/commons-codec-1.3.jar
    urls[26] = file:/srv/gump/public/workspace/mvnlocalrepo/shared/commons-jxpath/commons-jxpath/1.2/commons-jxpath-1.2.jar
    urls[27] = file:/srv/gump/public/workspace/mvnlocalrepo/shared/xerces/xerces/1.2.3/xerces-1.2.3.jar
    urls[28] = file:/srv/gump/public/workspace/mvnlocalrepo/shared/ant/ant-optional/1.5.1/ant-optional-1.5.1.jar
    urls[29] = file:/srv/gump/public/workspace/mvnlocalrepo/shared/jdom/jdom/b9/jdom-b9.jar
    Number of imports: 10
    import: org.codehaus.classworlds.Entry@a6c57a42
    import: org.codehaus.classworlds.Entry@12f43f3b
    import: org.codehaus.classworlds.Entry@20025374
    import: org.codehaus.classworlds.Entry@f8e44ca4
    import: org.codehaus.classworlds.Entry@92758522
    import: org.codehaus.classworlds.Entry@ebf2705b
    import: org.codehaus.classworlds.Entry@bb25e54
    import: org.codehaus.classworlds.Entry@bece5185
    import: org.codehaus.classworlds.Entry@3fee8e37
    import: org.codehaus.classworlds.Entry@3fee19d8


    this realm = plexus.core
    urls[0] = file:/opt/maven2/lib/maven-2.2.1-uber.jar
    Number of imports: 10
    import: org.codehaus.classworlds.Entry@a6c57a42
    import: org.codehaus.classworlds.Entry@12f43f3b
    import: org.codehaus.classworlds.Entry@20025374
    import: org.codehaus.classworlds.Entry@f8e44ca4
    import: org.codehaus.classworlds.Entry@92758522
    import: org.codehaus.classworlds.Entry@ebf2705b
    import: org.codehaus.classworlds.Entry@bb25e54
    import: org.codehaus.classworlds.Entry@bece5185
    import: org.codehaus.classworlds.Entry@3fee8e37
    import: org.codehaus.classworlds.Entry@3fee19d8
    -----------------------------------------------------
    [INFO] ------------------------------------------------------------------------
    [ERROR] BUILD ERROR
    [INFO] ------------------------------------------------------------------------
    [INFO] Internal error in the plugin manager executing goal 'org.apache.torque:torque-maven-plugin:3.3:om': Unable to load the mojo 'org.apache.torque:torque-maven-plugin:3.3:om' in the plugin 'org.apache.torque:torque-maven-plugin'. A required class is missing: org/apache/torque/task/TorqueDataModelTask
    org.apache.torque.task.TorqueDataModelTask
    [INFO] ------------------------------------------------------------------------
    [INFO] For more information, run Maven with the -e switch
    [INFO] ------------------------------------------------------------------------
    [INFO] Total time: 38 seconds
    [INFO] Finished at: Sat Apr 16 07:03:36 UTC 2011
    [INFO] Final Memory: 30M/72M
    [INFO] ------------------------------------------------------------------------
    ---------------------------------------------

    To subscribe to this information via syndicated feeds:
    - RSS: http://vmgump.apache.org/gump/public/turbine-core/turbine-core/rss.xml
    - Atom: http://vmgump.apache.org/gump/public/turbine-core/turbine-core/atom.xml

    ============================== Gump Tracking Only ===
    Produced by Apache Gump(TM) version 2.3.
    Gump Run 09000016042011, vmgump.apache.org:vmgump:09000016042011
    Gump E-mail Identifier (unique within run) #32.

    --
    Apache Gump
    http://gump.apache.org/ [Instance: vmgump]

    ---------------------------------------------------------------------
    To unsubscribe, e-mail: dev-unsubscribe@turbine.apache.org
    For additional commands, e-mail: dev-help@turbine.apache.org
  • Anonymous at Apr 17, 2011 at 6:49 am
    To whom it may engage...

    This is an automated request, but not an unsolicited one. For
    more information please visit http://gump.apache.org/nagged.html,
    and/or contact the folk at general@gump.apache.org.

    Project turbine-core has an issue affecting its community integration.
    This issue affects 2 projects,
    and has been outstanding for 95 runs.
    The current state of this project is 'Failed', with reason 'Build Failed'.
    For reference only, the following projects are affected by this:
    - turbine-core : A servlet based framework.
    - turbine-core-test : A servlet based framework.


    Full details are available at:
    http://vmgump.apache.org/gump/public/turbine-core/turbine-core/index.html

    That said, some information snippets are provided here.

    The following annotations (debug/informational/warning/error messages) were provided:
    -INFO- Optional dependency commons-fileupload prerequisite failed with reason build failed
    -INFO- Optional dependency httpunit failed with reason build failed
    -DEBUG- (Apache Gump generated) Apache Maven Settings in: /srv/gump/public/workspace/turbine-core/gump_mvn_settings.xml
    -INFO- Failed with reason build failed
    -DEBUG- Maven POM in: /srv/gump/public/workspace/turbine-core/pom.xml
    -INFO- Failed to extract fallback artifacts from Gump Repository



    The following work was performed:
    http://vmgump.apache.org/gump/public/turbine-core/turbine-core/gump_work/build_turbine-core_turbine-core.html
    Work Name: build_turbine-core_turbine-core (Type: Build)
    Work ended in a state of : Failed
    Elapsed: 38 secs
    Command Line: /opt/maven2/bin/mvn --batch-mode -DskipTests=true --settings /srv/gump/public/workspace/turbine-core/gump_mvn_settings.xml package
    [Working Directory: /srv/gump/public/workspace/turbine-core]
    M2_HOME: /opt/maven2
    ---------------------------------------------
    urls[19] = file:/srv/gump/public/workspace/mvnlocalrepo/shared/xml-apis/xml-apis/1.0.b2/xml-apis-1.0.b2.jar
    urls[20] = file:/srv/gump/public/workspace/mvnlocalrepo/shared/commons-configuration/commons-configuration/1.4/commons-configuration-1.4.jar
    urls[21] = file:/srv/gump/public/workspace/mvnlocalrepo/shared/commons-logging/commons-logging-api/1.0.4/commons-logging-api-1.0.4.jar
    urls[22] = file:/srv/gump/public/workspace/mvnlocalrepo/shared/commons-digester/commons-digester/1.8/commons-digester-1.8.jar
    urls[23] = file:/srv/gump/public/workspace/mvnlocalrepo/shared/commons-beanutils/commons-beanutils/1.7.0/commons-beanutils-1.7.0.jar
    urls[24] = file:/srv/gump/public/workspace/mvnlocalrepo/shared/commons-beanutils/commons-beanutils-core/1.7.0/commons-beanutils-core-1.7.0.jar
    urls[25] = file:/srv/gump/public/workspace/mvnlocalrepo/shared/commons-codec/commons-codec/1.3/commons-codec-1.3.jar
    urls[26] = file:/srv/gump/public/workspace/mvnlocalrepo/shared/commons-jxpath/commons-jxpath/1.2/commons-jxpath-1.2.jar
    urls[27] = file:/srv/gump/public/workspace/mvnlocalrepo/shared/xerces/xerces/1.2.3/xerces-1.2.3.jar
    urls[28] = file:/srv/gump/public/workspace/mvnlocalrepo/shared/ant/ant-optional/1.5.1/ant-optional-1.5.1.jar
    urls[29] = file:/srv/gump/public/workspace/mvnlocalrepo/shared/jdom/jdom/b9/jdom-b9.jar
    Number of imports: 10
    import: org.codehaus.classworlds.Entry@a6c57a42
    import: org.codehaus.classworlds.Entry@12f43f3b
    import: org.codehaus.classworlds.Entry@20025374
    import: org.codehaus.classworlds.Entry@f8e44ca4
    import: org.codehaus.classworlds.Entry@92758522
    import: org.codehaus.classworlds.Entry@ebf2705b
    import: org.codehaus.classworlds.Entry@bb25e54
    import: org.codehaus.classworlds.Entry@bece5185
    import: org.codehaus.classworlds.Entry@3fee8e37
    import: org.codehaus.classworlds.Entry@3fee19d8


    this realm = plexus.core
    urls[0] = file:/opt/maven2/lib/maven-2.2.1-uber.jar
    Number of imports: 10
    import: org.codehaus.classworlds.Entry@a6c57a42
    import: org.codehaus.classworlds.Entry@12f43f3b
    import: org.codehaus.classworlds.Entry@20025374
    import: org.codehaus.classworlds.Entry@f8e44ca4
    import: org.codehaus.classworlds.Entry@92758522
    import: org.codehaus.classworlds.Entry@ebf2705b
    import: org.codehaus.classworlds.Entry@bb25e54
    import: org.codehaus.classworlds.Entry@bece5185
    import: org.codehaus.classworlds.Entry@3fee8e37
    import: org.codehaus.classworlds.Entry@3fee19d8
    -----------------------------------------------------
    [INFO] ------------------------------------------------------------------------
    [ERROR] BUILD ERROR
    [INFO] ------------------------------------------------------------------------
    [INFO] Internal error in the plugin manager executing goal 'org.apache.torque:torque-maven-plugin:3.3:om': Unable to load the mojo 'org.apache.torque:torque-maven-plugin:3.3:om' in the plugin 'org.apache.torque:torque-maven-plugin'. A required class is missing: org/apache/torque/task/TorqueDataModelTask
    org.apache.torque.task.TorqueDataModelTask
    [INFO] ------------------------------------------------------------------------
    [INFO] For more information, run Maven with the -e switch
    [INFO] ------------------------------------------------------------------------
    [INFO] Total time: 37 seconds
    [INFO] Finished at: Sun Apr 17 06:49:13 UTC 2011
    [INFO] Final Memory: 30M/72M
    [INFO] ------------------------------------------------------------------------
    ---------------------------------------------

    To subscribe to this information via syndicated feeds:
    - RSS: http://vmgump.apache.org/gump/public/turbine-core/turbine-core/rss.xml
    - Atom: http://vmgump.apache.org/gump/public/turbine-core/turbine-core/atom.xml

    ============================== Gump Tracking Only ===
    Produced by Apache Gump(TM) version 2.3.
    Gump Run 10000017042011, vmgump.apache.org:vmgump:10000017042011
    Gump E-mail Identifier (unique within run) #32.

    --
    Apache Gump
    http://gump.apache.org/ [Instance: vmgump]

    ---------------------------------------------------------------------
    To unsubscribe, e-mail: dev-unsubscribe@turbine.apache.org
    For additional commands, e-mail: dev-help@turbine.apache.org
  • Anonymous at Apr 18, 2011 at 7:14 am
    To whom it may engage...

    This is an automated request, but not an unsolicited one. For
    more information please visit http://gump.apache.org/nagged.html,
    and/or contact the folk at general@gump.apache.org.

    Project turbine-core has an issue affecting its community integration.
    This issue affects 2 projects,
    and has been outstanding for 97 runs.
    The current state of this project is 'Failed', with reason 'Build Failed'.
    For reference only, the following projects are affected by this:
    - turbine-core : A servlet based framework.
    - turbine-core-test : A servlet based framework.


    Full details are available at:
    http://vmgump.apache.org/gump/public/turbine-core/turbine-core/index.html

    That said, some information snippets are provided here.

    The following annotations (debug/informational/warning/error messages) were provided:
    -INFO- Optional dependency dom4j prerequisite failed with reason build timed out
    -INFO- Optional dependency commons-fileupload prerequisite failed with reason build failed
    -INFO- Optional dependency httpunit failed with reason build failed
    -DEBUG- (Apache Gump generated) Apache Maven Settings in: /srv/gump/public/workspace/turbine-core/gump_mvn_settings.xml
    -INFO- Failed with reason build failed
    -DEBUG- Maven POM in: /srv/gump/public/workspace/turbine-core/pom.xml
    -INFO- Failed to extract fallback artifacts from Gump Repository



    The following work was performed:
    http://vmgump.apache.org/gump/public/turbine-core/turbine-core/gump_work/build_turbine-core_turbine-core.html
    Work Name: build_turbine-core_turbine-core (Type: Build)
    Work ended in a state of : Failed
    Elapsed: 37 secs
    Command Line: /opt/maven2/bin/mvn --batch-mode -DskipTests=true --settings /srv/gump/public/workspace/turbine-core/gump_mvn_settings.xml package
    [Working Directory: /srv/gump/public/workspace/turbine-core]
    M2_HOME: /opt/maven2
    ---------------------------------------------
    urls[19] = file:/srv/gump/public/workspace/mvnlocalrepo/shared/xml-apis/xml-apis/1.0.b2/xml-apis-1.0.b2.jar
    urls[20] = file:/srv/gump/public/workspace/mvnlocalrepo/shared/commons-configuration/commons-configuration/1.4/commons-configuration-1.4.jar
    urls[21] = file:/srv/gump/public/workspace/mvnlocalrepo/shared/commons-logging/commons-logging-api/1.0.4/commons-logging-api-1.0.4.jar
    urls[22] = file:/srv/gump/public/workspace/mvnlocalrepo/shared/commons-digester/commons-digester/1.8/commons-digester-1.8.jar
    urls[23] = file:/srv/gump/public/workspace/mvnlocalrepo/shared/commons-beanutils/commons-beanutils/1.7.0/commons-beanutils-1.7.0.jar
    urls[24] = file:/srv/gump/public/workspace/mvnlocalrepo/shared/commons-beanutils/commons-beanutils-core/1.7.0/commons-beanutils-core-1.7.0.jar
    urls[25] = file:/srv/gump/public/workspace/mvnlocalrepo/shared/commons-codec/commons-codec/1.3/commons-codec-1.3.jar
    urls[26] = file:/srv/gump/public/workspace/mvnlocalrepo/shared/commons-jxpath/commons-jxpath/1.2/commons-jxpath-1.2.jar
    urls[27] = file:/srv/gump/public/workspace/mvnlocalrepo/shared/xerces/xerces/1.2.3/xerces-1.2.3.jar
    urls[28] = file:/srv/gump/public/workspace/mvnlocalrepo/shared/ant/ant-optional/1.5.1/ant-optional-1.5.1.jar
    urls[29] = file:/srv/gump/public/workspace/mvnlocalrepo/shared/jdom/jdom/b9/jdom-b9.jar
    Number of imports: 10
    import: org.codehaus.classworlds.Entry@a6c57a42
    import: org.codehaus.classworlds.Entry@12f43f3b
    import: org.codehaus.classworlds.Entry@20025374
    import: org.codehaus.classworlds.Entry@f8e44ca4
    import: org.codehaus.classworlds.Entry@92758522
    import: org.codehaus.classworlds.Entry@ebf2705b
    import: org.codehaus.classworlds.Entry@bb25e54
    import: org.codehaus.classworlds.Entry@bece5185
    import: org.codehaus.classworlds.Entry@3fee8e37
    import: org.codehaus.classworlds.Entry@3fee19d8


    this realm = plexus.core
    urls[0] = file:/opt/maven2/lib/maven-2.2.1-uber.jar
    Number of imports: 10
    import: org.codehaus.classworlds.Entry@a6c57a42
    import: org.codehaus.classworlds.Entry@12f43f3b
    import: org.codehaus.classworlds.Entry@20025374
    import: org.codehaus.classworlds.Entry@f8e44ca4
    import: org.codehaus.classworlds.Entry@92758522
    import: org.codehaus.classworlds.Entry@ebf2705b
    import: org.codehaus.classworlds.Entry@bb25e54
    import: org.codehaus.classworlds.Entry@bece5185
    import: org.codehaus.classworlds.Entry@3fee8e37
    import: org.codehaus.classworlds.Entry@3fee19d8
    -----------------------------------------------------
    [INFO] ------------------------------------------------------------------------
    [ERROR] BUILD ERROR
    [INFO] ------------------------------------------------------------------------
    [INFO] Internal error in the plugin manager executing goal 'org.apache.torque:torque-maven-plugin:3.3:om': Unable to load the mojo 'org.apache.torque:torque-maven-plugin:3.3:om' in the plugin 'org.apache.torque:torque-maven-plugin'. A required class is missing: org/apache/torque/task/TorqueDataModelTask
    org.apache.torque.task.TorqueDataModelTask
    [INFO] ------------------------------------------------------------------------
    [INFO] For more information, run Maven with the -e switch
    [INFO] ------------------------------------------------------------------------
    [INFO] Total time: 36 seconds
    [INFO] Finished at: Mon Apr 18 07:13:54 UTC 2011
    [INFO] Final Memory: 30M/72M
    [INFO] ------------------------------------------------------------------------
    ---------------------------------------------

    To subscribe to this information via syndicated feeds:
    - RSS: http://vmgump.apache.org/gump/public/turbine-core/turbine-core/rss.xml
    - Atom: http://vmgump.apache.org/gump/public/turbine-core/turbine-core/atom.xml

    ============================== Gump Tracking Only ===
    Produced by Apache Gump(TM) version 2.3.
    Gump Run 09000018042011, vmgump.apache.org:vmgump:09000018042011
    Gump E-mail Identifier (unique within run) #32.

    --
    Apache Gump
    http://gump.apache.org/ [Instance: vmgump]

    ---------------------------------------------------------------------
    To unsubscribe, e-mail: dev-unsubscribe@turbine.apache.org
    For additional commands, e-mail: dev-help@turbine.apache.org
  • Anonymous at Apr 19, 2011 at 1:46 pm
    To whom it may engage...

    This is an automated request, but not an unsolicited one. For
    more information please visit http://gump.apache.org/nagged.html,
    and/or contact the folk at general@gump.apache.org.

    Project turbine-core has an issue affecting its community integration.
    This issue affects 2 projects,
    and has been outstanding for 99 runs.
    The current state of this project is 'Failed', with reason 'Build Failed'.
    For reference only, the following projects are affected by this:
    - turbine-core : A servlet based framework.
    - turbine-core-test : A servlet based framework.


    Full details are available at:
    http://vmgump.apache.org/gump/public/turbine-core/turbine-core/index.html

    That said, some information snippets are provided here.

    The following annotations (debug/informational/warning/error messages) were provided:
    -INFO- Optional dependency commons-fileupload prerequisite failed with reason build failed
    -INFO- Optional dependency httpunit failed with reason build failed
    -DEBUG- (Apache Gump generated) Apache Maven Settings in: /srv/gump/public/workspace/turbine-core/gump_mvn_settings.xml
    -INFO- Failed with reason build failed
    -DEBUG- Maven POM in: /srv/gump/public/workspace/turbine-core/pom.xml
    -INFO- Failed to extract fallback artifacts from Gump Repository



    The following work was performed:
    http://vmgump.apache.org/gump/public/turbine-core/turbine-core/gump_work/build_turbine-core_turbine-core.html
    Work Name: build_turbine-core_turbine-core (Type: Build)
    Work ended in a state of : Failed
    Elapsed: 37 secs
    Command Line: /opt/maven2/bin/mvn --batch-mode -DskipTests=true --settings /srv/gump/public/workspace/turbine-core/gump_mvn_settings.xml package
    [Working Directory: /srv/gump/public/workspace/turbine-core]
    M2_HOME: /opt/maven2
    ---------------------------------------------
    urls[19] = file:/srv/gump/public/workspace/mvnlocalrepo/shared/xml-apis/xml-apis/1.0.b2/xml-apis-1.0.b2.jar
    urls[20] = file:/srv/gump/public/workspace/mvnlocalrepo/shared/commons-configuration/commons-configuration/1.4/commons-configuration-1.4.jar
    urls[21] = file:/srv/gump/public/workspace/mvnlocalrepo/shared/commons-logging/commons-logging-api/1.0.4/commons-logging-api-1.0.4.jar
    urls[22] = file:/srv/gump/public/workspace/mvnlocalrepo/shared/commons-digester/commons-digester/1.8/commons-digester-1.8.jar
    urls[23] = file:/srv/gump/public/workspace/mvnlocalrepo/shared/commons-beanutils/commons-beanutils/1.7.0/commons-beanutils-1.7.0.jar
    urls[24] = file:/srv/gump/public/workspace/mvnlocalrepo/shared/commons-beanutils/commons-beanutils-core/1.7.0/commons-beanutils-core-1.7.0.jar
    urls[25] = file:/srv/gump/public/workspace/mvnlocalrepo/shared/commons-codec/commons-codec/1.3/commons-codec-1.3.jar
    urls[26] = file:/srv/gump/public/workspace/mvnlocalrepo/shared/commons-jxpath/commons-jxpath/1.2/commons-jxpath-1.2.jar
    urls[27] = file:/srv/gump/public/workspace/mvnlocalrepo/shared/xerces/xerces/1.2.3/xerces-1.2.3.jar
    urls[28] = file:/srv/gump/public/workspace/mvnlocalrepo/shared/ant/ant-optional/1.5.1/ant-optional-1.5.1.jar
    urls[29] = file:/srv/gump/public/workspace/mvnlocalrepo/shared/jdom/jdom/b9/jdom-b9.jar
    Number of imports: 10
    import: org.codehaus.classworlds.Entry@a6c57a42
    import: org.codehaus.classworlds.Entry@12f43f3b
    import: org.codehaus.classworlds.Entry@20025374
    import: org.codehaus.classworlds.Entry@f8e44ca4
    import: org.codehaus.classworlds.Entry@92758522
    import: org.codehaus.classworlds.Entry@ebf2705b
    import: org.codehaus.classworlds.Entry@bb25e54
    import: org.codehaus.classworlds.Entry@bece5185
    import: org.codehaus.classworlds.Entry@3fee8e37
    import: org.codehaus.classworlds.Entry@3fee19d8


    this realm = plexus.core
    urls[0] = file:/opt/maven2/lib/maven-2.2.1-uber.jar
    Number of imports: 10
    import: org.codehaus.classworlds.Entry@a6c57a42
    import: org.codehaus.classworlds.Entry@12f43f3b
    import: org.codehaus.classworlds.Entry@20025374
    import: org.codehaus.classworlds.Entry@f8e44ca4
    import: org.codehaus.classworlds.Entry@92758522
    import: org.codehaus.classworlds.Entry@ebf2705b
    import: org.codehaus.classworlds.Entry@bb25e54
    import: org.codehaus.classworlds.Entry@bece5185
    import: org.codehaus.classworlds.Entry@3fee8e37
    import: org.codehaus.classworlds.Entry@3fee19d8
    -----------------------------------------------------
    [INFO] ------------------------------------------------------------------------
    [ERROR] BUILD ERROR
    [INFO] ------------------------------------------------------------------------
    [INFO] Internal error in the plugin manager executing goal 'org.apache.torque:torque-maven-plugin:3.3:om': Unable to load the mojo 'org.apache.torque:torque-maven-plugin:3.3:om' in the plugin 'org.apache.torque:torque-maven-plugin'. A required class is missing: org/apache/torque/task/TorqueDataModelTask
    org.apache.torque.task.TorqueDataModelTask
    [INFO] ------------------------------------------------------------------------
    [INFO] For more information, run Maven with the -e switch
    [INFO] ------------------------------------------------------------------------
    [INFO] Total time: 36 seconds
    [INFO] Finished at: Tue Apr 19 06:38:52 UTC 2011
    [INFO] Final Memory: 30M/72M
    [INFO] ------------------------------------------------------------------------
    ---------------------------------------------

    To subscribe to this information via syndicated feeds:
    - RSS: http://vmgump.apache.org/gump/public/turbine-core/turbine-core/rss.xml
    - Atom: http://vmgump.apache.org/gump/public/turbine-core/turbine-core/atom.xml

    ============================== Gump Tracking Only ===
    Produced by Apache Gump(TM) version 2.3.
    Gump Run 10000019042011, vmgump.apache.org:vmgump:10000019042011
    Gump E-mail Identifier (unique within run) #30.

    --
    Apache Gump
    http://gump.apache.org/ [Instance: vmgump]

    ---------------------------------------------------------------------
    To unsubscribe, e-mail: dev-unsubscribe@turbine.apache.org
    For additional commands, e-mail: dev-help@turbine.apache.org
  • Anonymous at Apr 20, 2011 at 6:43 am
    To whom it may engage...

    This is an automated request, but not an unsolicited one. For
    more information please visit http://gump.apache.org/nagged.html,
    and/or contact the folk at general@gump.apache.org.

    Project turbine-core has an issue affecting its community integration.
    This issue affects 2 projects,
    and has been outstanding for 101 runs.
    The current state of this project is 'Failed', with reason 'Build Failed'.
    For reference only, the following projects are affected by this:
    - turbine-core : A servlet based framework.
    - turbine-core-test : A servlet based framework.


    Full details are available at:
    http://vmgump.apache.org/gump/public/turbine-core/turbine-core/index.html

    That said, some information snippets are provided here.

    The following annotations (debug/informational/warning/error messages) were provided:
    -INFO- Optional dependency commons-fileupload prerequisite failed with reason build failed
    -INFO- Optional dependency httpunit failed with reason build failed
    -DEBUG- (Apache Gump generated) Apache Maven Settings in: /srv/gump/public/workspace/turbine-core/gump_mvn_settings.xml
    -INFO- Failed with reason build failed
    -DEBUG- Maven POM in: /srv/gump/public/workspace/turbine-core/pom.xml
    -INFO- Failed to extract fallback artifacts from Gump Repository



    The following work was performed:
    http://vmgump.apache.org/gump/public/turbine-core/turbine-core/gump_work/build_turbine-core_turbine-core.html
    Work Name: build_turbine-core_turbine-core (Type: Build)
    Work ended in a state of : Failed
    Elapsed: 40 secs
    Command Line: /opt/maven2/bin/mvn --batch-mode -DskipTests=true --settings /srv/gump/public/workspace/turbine-core/gump_mvn_settings.xml package
    [Working Directory: /srv/gump/public/workspace/turbine-core]
    M2_HOME: /opt/maven2
    ---------------------------------------------
    urls[19] = file:/srv/gump/public/workspace/mvnlocalrepo/shared/xml-apis/xml-apis/1.0.b2/xml-apis-1.0.b2.jar
    urls[20] = file:/srv/gump/public/workspace/mvnlocalrepo/shared/commons-configuration/commons-configuration/1.4/commons-configuration-1.4.jar
    urls[21] = file:/srv/gump/public/workspace/mvnlocalrepo/shared/commons-logging/commons-logging-api/1.0.4/commons-logging-api-1.0.4.jar
    urls[22] = file:/srv/gump/public/workspace/mvnlocalrepo/shared/commons-digester/commons-digester/1.8/commons-digester-1.8.jar
    urls[23] = file:/srv/gump/public/workspace/mvnlocalrepo/shared/commons-beanutils/commons-beanutils/1.7.0/commons-beanutils-1.7.0.jar
    urls[24] = file:/srv/gump/public/workspace/mvnlocalrepo/shared/commons-beanutils/commons-beanutils-core/1.7.0/commons-beanutils-core-1.7.0.jar
    urls[25] = file:/srv/gump/public/workspace/mvnlocalrepo/shared/commons-codec/commons-codec/1.3/commons-codec-1.3.jar
    urls[26] = file:/srv/gump/public/workspace/mvnlocalrepo/shared/commons-jxpath/commons-jxpath/1.2/commons-jxpath-1.2.jar
    urls[27] = file:/srv/gump/public/workspace/mvnlocalrepo/shared/xerces/xerces/1.2.3/xerces-1.2.3.jar
    urls[28] = file:/srv/gump/public/workspace/mvnlocalrepo/shared/ant/ant-optional/1.5.1/ant-optional-1.5.1.jar
    urls[29] = file:/srv/gump/public/workspace/mvnlocalrepo/shared/jdom/jdom/b9/jdom-b9.jar
    Number of imports: 10
    import: org.codehaus.classworlds.Entry@a6c57a42
    import: org.codehaus.classworlds.Entry@12f43f3b
    import: org.codehaus.classworlds.Entry@20025374
    import: org.codehaus.classworlds.Entry@f8e44ca4
    import: org.codehaus.classworlds.Entry@92758522
    import: org.codehaus.classworlds.Entry@ebf2705b
    import: org.codehaus.classworlds.Entry@bb25e54
    import: org.codehaus.classworlds.Entry@bece5185
    import: org.codehaus.classworlds.Entry@3fee8e37
    import: org.codehaus.classworlds.Entry@3fee19d8


    this realm = plexus.core
    urls[0] = file:/opt/maven2/lib/maven-2.2.1-uber.jar
    Number of imports: 10
    import: org.codehaus.classworlds.Entry@a6c57a42
    import: org.codehaus.classworlds.Entry@12f43f3b
    import: org.codehaus.classworlds.Entry@20025374
    import: org.codehaus.classworlds.Entry@f8e44ca4
    import: org.codehaus.classworlds.Entry@92758522
    import: org.codehaus.classworlds.Entry@ebf2705b
    import: org.codehaus.classworlds.Entry@bb25e54
    import: org.codehaus.classworlds.Entry@bece5185
    import: org.codehaus.classworlds.Entry@3fee8e37
    import: org.codehaus.classworlds.Entry@3fee19d8
    -----------------------------------------------------
    [INFO] ------------------------------------------------------------------------
    [ERROR] BUILD ERROR
    [INFO] ------------------------------------------------------------------------
    [INFO] Internal error in the plugin manager executing goal 'org.apache.torque:torque-maven-plugin:3.3:om': Unable to load the mojo 'org.apache.torque:torque-maven-plugin:3.3:om' in the plugin 'org.apache.torque:torque-maven-plugin'. A required class is missing: org/apache/torque/task/TorqueDataModelTask
    org.apache.torque.task.TorqueDataModelTask
    [INFO] ------------------------------------------------------------------------
    [INFO] For more information, run Maven with the -e switch
    [INFO] ------------------------------------------------------------------------
    [INFO] Total time: 39 seconds
    [INFO] Finished at: Wed Apr 20 06:42:41 UTC 2011
    [INFO] Final Memory: 30M/72M
    [INFO] ------------------------------------------------------------------------
    ---------------------------------------------

    To subscribe to this information via syndicated feeds:
    - RSS: http://vmgump.apache.org/gump/public/turbine-core/turbine-core/rss.xml
    - Atom: http://vmgump.apache.org/gump/public/turbine-core/turbine-core/atom.xml

    ============================== Gump Tracking Only ===
    Produced by Apache Gump(TM) version 2.3.
    Gump Run 09000020042011, vmgump.apache.org:vmgump:09000020042011
    Gump E-mail Identifier (unique within run) #29.

    --
    Apache Gump
    http://gump.apache.org/ [Instance: vmgump]

    ---------------------------------------------------------------------
    To unsubscribe, e-mail: dev-unsubscribe@turbine.apache.org
    For additional commands, e-mail: dev-help@turbine.apache.org
  • Anonymous at Apr 21, 2011 at 6:45 am
    To whom it may engage...

    This is an automated request, but not an unsolicited one. For
    more information please visit http://gump.apache.org/nagged.html,
    and/or contact the folk at general@gump.apache.org.

    Project turbine-core has an issue affecting its community integration.
    This issue affects 2 projects,
    and has been outstanding for 103 runs.
    The current state of this project is 'Failed', with reason 'Build Failed'.
    For reference only, the following projects are affected by this:
    - turbine-core : A servlet based framework.
    - turbine-core-test : A servlet based framework.


    Full details are available at:
    http://vmgump.apache.org/gump/public/turbine-core/turbine-core/index.html

    That said, some information snippets are provided here.

    The following annotations (debug/informational/warning/error messages) were provided:
    -INFO- Optional dependency commons-fileupload prerequisite failed with reason build failed
    -INFO- Optional dependency httpunit failed with reason build failed
    -DEBUG- (Apache Gump generated) Apache Maven Settings in: /srv/gump/public/workspace/turbine-core/gump_mvn_settings.xml
    -INFO- Failed with reason build failed
    -DEBUG- Maven POM in: /srv/gump/public/workspace/turbine-core/pom.xml
    -INFO- Failed to extract fallback artifacts from Gump Repository



    The following work was performed:
    http://vmgump.apache.org/gump/public/turbine-core/turbine-core/gump_work/build_turbine-core_turbine-core.html
    Work Name: build_turbine-core_turbine-core (Type: Build)
    Work ended in a state of : Failed
    Elapsed: 41 secs
    Command Line: /opt/maven2/bin/mvn --batch-mode -DskipTests=true --settings /srv/gump/public/workspace/turbine-core/gump_mvn_settings.xml package
    [Working Directory: /srv/gump/public/workspace/turbine-core]
    M2_HOME: /opt/maven2
    ---------------------------------------------
    urls[19] = file:/srv/gump/public/workspace/mvnlocalrepo/shared/xml-apis/xml-apis/1.0.b2/xml-apis-1.0.b2.jar
    urls[20] = file:/srv/gump/public/workspace/mvnlocalrepo/shared/commons-configuration/commons-configuration/1.4/commons-configuration-1.4.jar
    urls[21] = file:/srv/gump/public/workspace/mvnlocalrepo/shared/commons-logging/commons-logging-api/1.0.4/commons-logging-api-1.0.4.jar
    urls[22] = file:/srv/gump/public/workspace/mvnlocalrepo/shared/commons-digester/commons-digester/1.8/commons-digester-1.8.jar
    urls[23] = file:/srv/gump/public/workspace/mvnlocalrepo/shared/commons-beanutils/commons-beanutils/1.7.0/commons-beanutils-1.7.0.jar
    urls[24] = file:/srv/gump/public/workspace/mvnlocalrepo/shared/commons-beanutils/commons-beanutils-core/1.7.0/commons-beanutils-core-1.7.0.jar
    urls[25] = file:/srv/gump/public/workspace/mvnlocalrepo/shared/commons-codec/commons-codec/1.3/commons-codec-1.3.jar
    urls[26] = file:/srv/gump/public/workspace/mvnlocalrepo/shared/commons-jxpath/commons-jxpath/1.2/commons-jxpath-1.2.jar
    urls[27] = file:/srv/gump/public/workspace/mvnlocalrepo/shared/xerces/xerces/1.2.3/xerces-1.2.3.jar
    urls[28] = file:/srv/gump/public/workspace/mvnlocalrepo/shared/ant/ant-optional/1.5.1/ant-optional-1.5.1.jar
    urls[29] = file:/srv/gump/public/workspace/mvnlocalrepo/shared/jdom/jdom/b9/jdom-b9.jar
    Number of imports: 10
    import: org.codehaus.classworlds.Entry@a6c57a42
    import: org.codehaus.classworlds.Entry@12f43f3b
    import: org.codehaus.classworlds.Entry@20025374
    import: org.codehaus.classworlds.Entry@f8e44ca4
    import: org.codehaus.classworlds.Entry@92758522
    import: org.codehaus.classworlds.Entry@ebf2705b
    import: org.codehaus.classworlds.Entry@bb25e54
    import: org.codehaus.classworlds.Entry@bece5185
    import: org.codehaus.classworlds.Entry@3fee8e37
    import: org.codehaus.classworlds.Entry@3fee19d8


    this realm = plexus.core
    urls[0] = file:/opt/maven2/lib/maven-2.2.1-uber.jar
    Number of imports: 10
    import: org.codehaus.classworlds.Entry@a6c57a42
    import: org.codehaus.classworlds.Entry@12f43f3b
    import: org.codehaus.classworlds.Entry@20025374
    import: org.codehaus.classworlds.Entry@f8e44ca4
    import: org.codehaus.classworlds.Entry@92758522
    import: org.codehaus.classworlds.Entry@ebf2705b
    import: org.codehaus.classworlds.Entry@bb25e54
    import: org.codehaus.classworlds.Entry@bece5185
    import: org.codehaus.classworlds.Entry@3fee8e37
    import: org.codehaus.classworlds.Entry@3fee19d8
    -----------------------------------------------------
    [INFO] ------------------------------------------------------------------------
    [ERROR] BUILD ERROR
    [INFO] ------------------------------------------------------------------------
    [INFO] Internal error in the plugin manager executing goal 'org.apache.torque:torque-maven-plugin:3.3:om': Unable to load the mojo 'org.apache.torque:torque-maven-plugin:3.3:om' in the plugin 'org.apache.torque:torque-maven-plugin'. A required class is missing: org/apache/torque/task/TorqueDataModelTask
    org.apache.torque.task.TorqueDataModelTask
    [INFO] ------------------------------------------------------------------------
    [INFO] For more information, run Maven with the -e switch
    [INFO] ------------------------------------------------------------------------
    [INFO] Total time: 40 seconds
    [INFO] Finished at: Thu Apr 21 06:44:49 UTC 2011
    [INFO] Final Memory: 30M/72M
    [INFO] ------------------------------------------------------------------------
    ---------------------------------------------

    To subscribe to this information via syndicated feeds:
    - RSS: http://vmgump.apache.org/gump/public/turbine-core/turbine-core/rss.xml
    - Atom: http://vmgump.apache.org/gump/public/turbine-core/turbine-core/atom.xml

    ============================== Gump Tracking Only ===
    Produced by Apache Gump(TM) version 2.3.
    Gump Run 10000021042011, vmgump.apache.org:vmgump:10000021042011
    Gump E-mail Identifier (unique within run) #29.

    --
    Apache Gump
    http://gump.apache.org/ [Instance: vmgump]

    ---------------------------------------------------------------------
    To unsubscribe, e-mail: dev-unsubscribe@turbine.apache.org
    For additional commands, e-mail: dev-help@turbine.apache.org
  • Anonymous at Apr 22, 2011 at 6:14 am
    To whom it may engage...

    This is an automated request, but not an unsolicited one. For
    more information please visit http://gump.apache.org/nagged.html,
    and/or contact the folk at general@gump.apache.org.

    Project turbine-core has an issue affecting its community integration.
    This issue affects 2 projects,
    and has been outstanding for 105 runs.
    The current state of this project is 'Failed', with reason 'Build Failed'.
    For reference only, the following projects are affected by this:
    - turbine-core : A servlet based framework.
    - turbine-core-test : A servlet based framework.


    Full details are available at:
    http://vmgump.apache.org/gump/public/turbine-core/turbine-core/index.html

    That said, some information snippets are provided here.

    The following annotations (debug/informational/warning/error messages) were provided:
    -INFO- Optional dependency commons-fileupload prerequisite failed with reason build failed
    -INFO- Optional dependency httpunit failed with reason build failed
    -DEBUG- (Apache Gump generated) Apache Maven Settings in: /srv/gump/public/workspace/turbine-core/gump_mvn_settings.xml
    -INFO- Failed with reason build failed
    -DEBUG- Maven POM in: /srv/gump/public/workspace/turbine-core/pom.xml
    -INFO- Failed to extract fallback artifacts from Gump Repository



    The following work was performed:
    http://vmgump.apache.org/gump/public/turbine-core/turbine-core/gump_work/build_turbine-core_turbine-core.html
    Work Name: build_turbine-core_turbine-core (Type: Build)
    Work ended in a state of : Failed
    Elapsed: 36 secs
    Command Line: /opt/maven2/bin/mvn --batch-mode -DskipTests=true --settings /srv/gump/public/workspace/turbine-core/gump_mvn_settings.xml package
    [Working Directory: /srv/gump/public/workspace/turbine-core]
    M2_HOME: /opt/maven2
    ---------------------------------------------
    urls[19] = file:/srv/gump/public/workspace/mvnlocalrepo/shared/xml-apis/xml-apis/1.0.b2/xml-apis-1.0.b2.jar
    urls[20] = file:/srv/gump/public/workspace/mvnlocalrepo/shared/commons-configuration/commons-configuration/1.4/commons-configuration-1.4.jar
    urls[21] = file:/srv/gump/public/workspace/mvnlocalrepo/shared/commons-logging/commons-logging-api/1.0.4/commons-logging-api-1.0.4.jar
    urls[22] = file:/srv/gump/public/workspace/mvnlocalrepo/shared/commons-digester/commons-digester/1.8/commons-digester-1.8.jar
    urls[23] = file:/srv/gump/public/workspace/mvnlocalrepo/shared/commons-beanutils/commons-beanutils/1.7.0/commons-beanutils-1.7.0.jar
    urls[24] = file:/srv/gump/public/workspace/mvnlocalrepo/shared/commons-beanutils/commons-beanutils-core/1.7.0/commons-beanutils-core-1.7.0.jar
    urls[25] = file:/srv/gump/public/workspace/mvnlocalrepo/shared/commons-codec/commons-codec/1.3/commons-codec-1.3.jar
    urls[26] = file:/srv/gump/public/workspace/mvnlocalrepo/shared/commons-jxpath/commons-jxpath/1.2/commons-jxpath-1.2.jar
    urls[27] = file:/srv/gump/public/workspace/mvnlocalrepo/shared/xerces/xerces/1.2.3/xerces-1.2.3.jar
    urls[28] = file:/srv/gump/public/workspace/mvnlocalrepo/shared/ant/ant-optional/1.5.1/ant-optional-1.5.1.jar
    urls[29] = file:/srv/gump/public/workspace/mvnlocalrepo/shared/jdom/jdom/b9/jdom-b9.jar
    Number of imports: 10
    import: org.codehaus.classworlds.Entry@a6c57a42
    import: org.codehaus.classworlds.Entry@12f43f3b
    import: org.codehaus.classworlds.Entry@20025374
    import: org.codehaus.classworlds.Entry@f8e44ca4
    import: org.codehaus.classworlds.Entry@92758522
    import: org.codehaus.classworlds.Entry@ebf2705b
    import: org.codehaus.classworlds.Entry@bb25e54
    import: org.codehaus.classworlds.Entry@bece5185
    import: org.codehaus.classworlds.Entry@3fee8e37
    import: org.codehaus.classworlds.Entry@3fee19d8


    this realm = plexus.core
    urls[0] = file:/opt/maven2/lib/maven-2.2.1-uber.jar
    Number of imports: 10
    import: org.codehaus.classworlds.Entry@a6c57a42
    import: org.codehaus.classworlds.Entry@12f43f3b
    import: org.codehaus.classworlds.Entry@20025374
    import: org.codehaus.classworlds.Entry@f8e44ca4
    import: org.codehaus.classworlds.Entry@92758522
    import: org.codehaus.classworlds.Entry@ebf2705b
    import: org.codehaus.classworlds.Entry@bb25e54
    import: org.codehaus.classworlds.Entry@bece5185
    import: org.codehaus.classworlds.Entry@3fee8e37
    import: org.codehaus.classworlds.Entry@3fee19d8
    -----------------------------------------------------
    [INFO] ------------------------------------------------------------------------
    [ERROR] BUILD ERROR
    [INFO] ------------------------------------------------------------------------
    [INFO] Internal error in the plugin manager executing goal 'org.apache.torque:torque-maven-plugin:3.3:om': Unable to load the mojo 'org.apache.torque:torque-maven-plugin:3.3:om' in the plugin 'org.apache.torque:torque-maven-plugin'. A required class is missing: org/apache/torque/task/TorqueDataModelTask
    org.apache.torque.task.TorqueDataModelTask
    [INFO] ------------------------------------------------------------------------
    [INFO] For more information, run Maven with the -e switch
    [INFO] ------------------------------------------------------------------------
    [INFO] Total time: 35 seconds
    [INFO] Finished at: Fri Apr 22 06:14:25 UTC 2011
    [INFO] Final Memory: 30M/72M
    [INFO] ------------------------------------------------------------------------
    ---------------------------------------------

    To subscribe to this information via syndicated feeds:
    - RSS: http://vmgump.apache.org/gump/public/turbine-core/turbine-core/rss.xml
    - Atom: http://vmgump.apache.org/gump/public/turbine-core/turbine-core/atom.xml

    ============================== Gump Tracking Only ===
    Produced by Apache Gump(TM) version 2.3.
    Gump Run 11000022042011, vmgump.apache.org:vmgump:11000022042011
    Gump E-mail Identifier (unique within run) #29.

    --
    Apache Gump
    http://gump.apache.org/ [Instance: vmgump]

    ---------------------------------------------------------------------
    To unsubscribe, e-mail: dev-unsubscribe@turbine.apache.org
    For additional commands, e-mail: dev-help@turbine.apache.org
  • Anonymous at Apr 23, 2011 at 6:56 am
    To whom it may engage...

    This is an automated request, but not an unsolicited one. For
    more information please visit http://gump.apache.org/nagged.html,
    and/or contact the folk at general@gump.apache.org.

    Project turbine-core has an issue affecting its community integration.
    This issue affects 2 projects,
    and has been outstanding for 107 runs.
    The current state of this project is 'Failed', with reason 'Build Failed'.
    For reference only, the following projects are affected by this:
    - turbine-core : A servlet based framework.
    - turbine-core-test : A servlet based framework.


    Full details are available at:
    http://vmgump.apache.org/gump/public/turbine-core/turbine-core/index.html

    That said, some information snippets are provided here.

    The following annotations (debug/informational/warning/error messages) were provided:
    -INFO- Optional dependency commons-fileupload prerequisite failed with reason build failed
    -INFO- Optional dependency httpunit failed with reason build failed
    -DEBUG- (Apache Gump generated) Apache Maven Settings in: /srv/gump/public/workspace/turbine-core/gump_mvn_settings.xml
    -INFO- Failed with reason build failed
    -DEBUG- Maven POM in: /srv/gump/public/workspace/turbine-core/pom.xml
    -INFO- Failed to extract fallback artifacts from Gump Repository



    The following work was performed:
    http://vmgump.apache.org/gump/public/turbine-core/turbine-core/gump_work/build_turbine-core_turbine-core.html
    Work Name: build_turbine-core_turbine-core (Type: Build)
    Work ended in a state of : Failed
    Elapsed: 37 secs
    Command Line: /opt/maven2/bin/mvn --batch-mode -DskipTests=true --settings /srv/gump/public/workspace/turbine-core/gump_mvn_settings.xml package
    [Working Directory: /srv/gump/public/workspace/turbine-core]
    M2_HOME: /opt/maven2
    ---------------------------------------------
    urls[19] = file:/srv/gump/public/workspace/mvnlocalrepo/shared/xml-apis/xml-apis/1.0.b2/xml-apis-1.0.b2.jar
    urls[20] = file:/srv/gump/public/workspace/mvnlocalrepo/shared/commons-configuration/commons-configuration/1.4/commons-configuration-1.4.jar
    urls[21] = file:/srv/gump/public/workspace/mvnlocalrepo/shared/commons-logging/commons-logging-api/1.0.4/commons-logging-api-1.0.4.jar
    urls[22] = file:/srv/gump/public/workspace/mvnlocalrepo/shared/commons-digester/commons-digester/1.8/commons-digester-1.8.jar
    urls[23] = file:/srv/gump/public/workspace/mvnlocalrepo/shared/commons-beanutils/commons-beanutils/1.7.0/commons-beanutils-1.7.0.jar
    urls[24] = file:/srv/gump/public/workspace/mvnlocalrepo/shared/commons-beanutils/commons-beanutils-core/1.7.0/commons-beanutils-core-1.7.0.jar
    urls[25] = file:/srv/gump/public/workspace/mvnlocalrepo/shared/commons-codec/commons-codec/1.3/commons-codec-1.3.jar
    urls[26] = file:/srv/gump/public/workspace/mvnlocalrepo/shared/commons-jxpath/commons-jxpath/1.2/commons-jxpath-1.2.jar
    urls[27] = file:/srv/gump/public/workspace/mvnlocalrepo/shared/xerces/xerces/1.2.3/xerces-1.2.3.jar
    urls[28] = file:/srv/gump/public/workspace/mvnlocalrepo/shared/ant/ant-optional/1.5.1/ant-optional-1.5.1.jar
    urls[29] = file:/srv/gump/public/workspace/mvnlocalrepo/shared/jdom/jdom/b9/jdom-b9.jar
    Number of imports: 10
    import: org.codehaus.classworlds.Entry@a6c57a42
    import: org.codehaus.classworlds.Entry@12f43f3b
    import: org.codehaus.classworlds.Entry@20025374
    import: org.codehaus.classworlds.Entry@f8e44ca4
    import: org.codehaus.classworlds.Entry@92758522
    import: org.codehaus.classworlds.Entry@ebf2705b
    import: org.codehaus.classworlds.Entry@bb25e54
    import: org.codehaus.classworlds.Entry@bece5185
    import: org.codehaus.classworlds.Entry@3fee8e37
    import: org.codehaus.classworlds.Entry@3fee19d8


    this realm = plexus.core
    urls[0] = file:/opt/maven2/lib/maven-2.2.1-uber.jar
    Number of imports: 10
    import: org.codehaus.classworlds.Entry@a6c57a42
    import: org.codehaus.classworlds.Entry@12f43f3b
    import: org.codehaus.classworlds.Entry@20025374
    import: org.codehaus.classworlds.Entry@f8e44ca4
    import: org.codehaus.classworlds.Entry@92758522
    import: org.codehaus.classworlds.Entry@ebf2705b
    import: org.codehaus.classworlds.Entry@bb25e54
    import: org.codehaus.classworlds.Entry@bece5185
    import: org.codehaus.classworlds.Entry@3fee8e37
    import: org.codehaus.classworlds.Entry@3fee19d8
    -----------------------------------------------------
    [INFO] ------------------------------------------------------------------------
    [ERROR] BUILD ERROR
    [INFO] ------------------------------------------------------------------------
    [INFO] Internal error in the plugin manager executing goal 'org.apache.torque:torque-maven-plugin:3.3:om': Unable to load the mojo 'org.apache.torque:torque-maven-plugin:3.3:om' in the plugin 'org.apache.torque:torque-maven-plugin'. A required class is missing: org/apache/torque/task/TorqueDataModelTask
    org.apache.torque.task.TorqueDataModelTask
    [INFO] ------------------------------------------------------------------------
    [INFO] For more information, run Maven with the -e switch
    [INFO] ------------------------------------------------------------------------
    [INFO] Total time: 36 seconds
    [INFO] Finished at: Sat Apr 23 06:55:33 UTC 2011
    [INFO] Final Memory: 30M/72M
    [INFO] ------------------------------------------------------------------------
    ---------------------------------------------

    To subscribe to this information via syndicated feeds:
    - RSS: http://vmgump.apache.org/gump/public/turbine-core/turbine-core/rss.xml
    - Atom: http://vmgump.apache.org/gump/public/turbine-core/turbine-core/atom.xml

    ============================== Gump Tracking Only ===
    Produced by Apache Gump(TM) version 2.3.
    Gump Run 09000023042011, vmgump.apache.org:vmgump:09000023042011
    Gump E-mail Identifier (unique within run) #29.

    --
    Apache Gump
    http://gump.apache.org/ [Instance: vmgump]

    ---------------------------------------------------------------------
    To unsubscribe, e-mail: dev-unsubscribe@turbine.apache.org
    For additional commands, e-mail: dev-help@turbine.apache.org
  • Anonymous at Apr 24, 2011 at 6:33 am
    To whom it may engage...

    This is an automated request, but not an unsolicited one. For
    more information please visit http://gump.apache.org/nagged.html,
    and/or contact the folk at general@gump.apache.org.

    Project turbine-core has an issue affecting its community integration.
    This issue affects 2 projects,
    and has been outstanding for 109 runs.
    The current state of this project is 'Failed', with reason 'Build Failed'.
    For reference only, the following projects are affected by this:
    - turbine-core : A servlet based framework.
    - turbine-core-test : A servlet based framework.


    Full details are available at:
    http://vmgump.apache.org/gump/public/turbine-core/turbine-core/index.html

    That said, some information snippets are provided here.

    The following annotations (debug/informational/warning/error messages) were provided:
    -INFO- Optional dependency commons-fileupload prerequisite failed with reason build failed
    -INFO- Optional dependency httpunit failed with reason build failed
    -DEBUG- (Apache Gump generated) Apache Maven Settings in: /srv/gump/public/workspace/turbine-core/gump_mvn_settings.xml
    -INFO- Failed with reason build failed
    -DEBUG- Maven POM in: /srv/gump/public/workspace/turbine-core/pom.xml
    -INFO- Failed to extract fallback artifacts from Gump Repository



    The following work was performed:
    http://vmgump.apache.org/gump/public/turbine-core/turbine-core/gump_work/build_turbine-core_turbine-core.html
    Work Name: build_turbine-core_turbine-core (Type: Build)
    Work ended in a state of : Failed
    Elapsed: 39 secs
    Command Line: /opt/maven2/bin/mvn --batch-mode -DskipTests=true --settings /srv/gump/public/workspace/turbine-core/gump_mvn_settings.xml package
    [Working Directory: /srv/gump/public/workspace/turbine-core]
    M2_HOME: /opt/maven2
    ---------------------------------------------
    urls[19] = file:/srv/gump/public/workspace/mvnlocalrepo/shared/xml-apis/xml-apis/1.0.b2/xml-apis-1.0.b2.jar
    urls[20] = file:/srv/gump/public/workspace/mvnlocalrepo/shared/commons-configuration/commons-configuration/1.4/commons-configuration-1.4.jar
    urls[21] = file:/srv/gump/public/workspace/mvnlocalrepo/shared/commons-logging/commons-logging-api/1.0.4/commons-logging-api-1.0.4.jar
    urls[22] = file:/srv/gump/public/workspace/mvnlocalrepo/shared/commons-digester/commons-digester/1.8/commons-digester-1.8.jar
    urls[23] = file:/srv/gump/public/workspace/mvnlocalrepo/shared/commons-beanutils/commons-beanutils/1.7.0/commons-beanutils-1.7.0.jar
    urls[24] = file:/srv/gump/public/workspace/mvnlocalrepo/shared/commons-beanutils/commons-beanutils-core/1.7.0/commons-beanutils-core-1.7.0.jar
    urls[25] = file:/srv/gump/public/workspace/mvnlocalrepo/shared/commons-codec/commons-codec/1.3/commons-codec-1.3.jar
    urls[26] = file:/srv/gump/public/workspace/mvnlocalrepo/shared/commons-jxpath/commons-jxpath/1.2/commons-jxpath-1.2.jar
    urls[27] = file:/srv/gump/public/workspace/mvnlocalrepo/shared/xerces/xerces/1.2.3/xerces-1.2.3.jar
    urls[28] = file:/srv/gump/public/workspace/mvnlocalrepo/shared/ant/ant-optional/1.5.1/ant-optional-1.5.1.jar
    urls[29] = file:/srv/gump/public/workspace/mvnlocalrepo/shared/jdom/jdom/b9/jdom-b9.jar
    Number of imports: 10
    import: org.codehaus.classworlds.Entry@a6c57a42
    import: org.codehaus.classworlds.Entry@12f43f3b
    import: org.codehaus.classworlds.Entry@20025374
    import: org.codehaus.classworlds.Entry@f8e44ca4
    import: org.codehaus.classworlds.Entry@92758522
    import: org.codehaus.classworlds.Entry@ebf2705b
    import: org.codehaus.classworlds.Entry@bb25e54
    import: org.codehaus.classworlds.Entry@bece5185
    import: org.codehaus.classworlds.Entry@3fee8e37
    import: org.codehaus.classworlds.Entry@3fee19d8


    this realm = plexus.core
    urls[0] = file:/opt/maven2/lib/maven-2.2.1-uber.jar
    Number of imports: 10
    import: org.codehaus.classworlds.Entry@a6c57a42
    import: org.codehaus.classworlds.Entry@12f43f3b
    import: org.codehaus.classworlds.Entry@20025374
    import: org.codehaus.classworlds.Entry@f8e44ca4
    import: org.codehaus.classworlds.Entry@92758522
    import: org.codehaus.classworlds.Entry@ebf2705b
    import: org.codehaus.classworlds.Entry@bb25e54
    import: org.codehaus.classworlds.Entry@bece5185
    import: org.codehaus.classworlds.Entry@3fee8e37
    import: org.codehaus.classworlds.Entry@3fee19d8
    -----------------------------------------------------
    [INFO] ------------------------------------------------------------------------
    [ERROR] BUILD ERROR
    [INFO] ------------------------------------------------------------------------
    [INFO] Internal error in the plugin manager executing goal 'org.apache.torque:torque-maven-plugin:3.3:om': Unable to load the mojo 'org.apache.torque:torque-maven-plugin:3.3:om' in the plugin 'org.apache.torque:torque-maven-plugin'. A required class is missing: org/apache/torque/task/TorqueDataModelTask
    org.apache.torque.task.TorqueDataModelTask
    [INFO] ------------------------------------------------------------------------
    [INFO] For more information, run Maven with the -e switch
    [INFO] ------------------------------------------------------------------------
    [INFO] Total time: 38 seconds
    [INFO] Finished at: Sun Apr 24 06:32:54 UTC 2011
    [INFO] Final Memory: 30M/72M
    [INFO] ------------------------------------------------------------------------
    ---------------------------------------------

    To subscribe to this information via syndicated feeds:
    - RSS: http://vmgump.apache.org/gump/public/turbine-core/turbine-core/rss.xml
    - Atom: http://vmgump.apache.org/gump/public/turbine-core/turbine-core/atom.xml

    ============================== Gump Tracking Only ===
    Produced by Apache Gump(TM) version 2.3.
    Gump Run 10000024042011, vmgump.apache.org:vmgump:10000024042011
    Gump E-mail Identifier (unique within run) #31.

    --
    Apache Gump
    http://gump.apache.org/ [Instance: vmgump]

    ---------------------------------------------------------------------
    To unsubscribe, e-mail: dev-unsubscribe@turbine.apache.org
    For additional commands, e-mail: dev-help@turbine.apache.org
  • Anonymous at Apr 25, 2011 at 6:42 am
    To whom it may engage...

    This is an automated request, but not an unsolicited one. For
    more information please visit http://gump.apache.org/nagged.html,
    and/or contact the folk at general@gump.apache.org.

    Project turbine-core has an issue affecting its community integration.
    This issue affects 2 projects,
    and has been outstanding for 111 runs.
    The current state of this project is 'Failed', with reason 'Build Failed'.
    For reference only, the following projects are affected by this:
    - turbine-core : A servlet based framework.
    - turbine-core-test : A servlet based framework.


    Full details are available at:
    http://vmgump.apache.org/gump/public/turbine-core/turbine-core/index.html

    That said, some information snippets are provided here.

    The following annotations (debug/informational/warning/error messages) were provided:
    -INFO- Optional dependency commons-fileupload prerequisite failed with reason build failed
    -INFO- Optional dependency httpunit failed with reason build failed
    -DEBUG- (Apache Gump generated) Apache Maven Settings in: /srv/gump/public/workspace/turbine-core/gump_mvn_settings.xml
    -INFO- Failed with reason build failed
    -DEBUG- Maven POM in: /srv/gump/public/workspace/turbine-core/pom.xml
    -INFO- Failed to extract fallback artifacts from Gump Repository



    The following work was performed:
    http://vmgump.apache.org/gump/public/turbine-core/turbine-core/gump_work/build_turbine-core_turbine-core.html
    Work Name: build_turbine-core_turbine-core (Type: Build)
    Work ended in a state of : Failed
    Elapsed: 41 secs
    Command Line: /opt/maven2/bin/mvn --batch-mode -DskipTests=true --settings /srv/gump/public/workspace/turbine-core/gump_mvn_settings.xml package
    [Working Directory: /srv/gump/public/workspace/turbine-core]
    M2_HOME: /opt/maven2
    ---------------------------------------------
    urls[19] = file:/srv/gump/public/workspace/mvnlocalrepo/shared/xml-apis/xml-apis/1.0.b2/xml-apis-1.0.b2.jar
    urls[20] = file:/srv/gump/public/workspace/mvnlocalrepo/shared/commons-configuration/commons-configuration/1.4/commons-configuration-1.4.jar
    urls[21] = file:/srv/gump/public/workspace/mvnlocalrepo/shared/commons-logging/commons-logging-api/1.0.4/commons-logging-api-1.0.4.jar
    urls[22] = file:/srv/gump/public/workspace/mvnlocalrepo/shared/commons-digester/commons-digester/1.8/commons-digester-1.8.jar
    urls[23] = file:/srv/gump/public/workspace/mvnlocalrepo/shared/commons-beanutils/commons-beanutils/1.7.0/commons-beanutils-1.7.0.jar
    urls[24] = file:/srv/gump/public/workspace/mvnlocalrepo/shared/commons-beanutils/commons-beanutils-core/1.7.0/commons-beanutils-core-1.7.0.jar
    urls[25] = file:/srv/gump/public/workspace/mvnlocalrepo/shared/commons-codec/commons-codec/1.3/commons-codec-1.3.jar
    urls[26] = file:/srv/gump/public/workspace/mvnlocalrepo/shared/commons-jxpath/commons-jxpath/1.2/commons-jxpath-1.2.jar
    urls[27] = file:/srv/gump/public/workspace/mvnlocalrepo/shared/xerces/xerces/1.2.3/xerces-1.2.3.jar
    urls[28] = file:/srv/gump/public/workspace/mvnlocalrepo/shared/ant/ant-optional/1.5.1/ant-optional-1.5.1.jar
    urls[29] = file:/srv/gump/public/workspace/mvnlocalrepo/shared/jdom/jdom/b9/jdom-b9.jar
    Number of imports: 10
    import: org.codehaus.classworlds.Entry@a6c57a42
    import: org.codehaus.classworlds.Entry@12f43f3b
    import: org.codehaus.classworlds.Entry@20025374
    import: org.codehaus.classworlds.Entry@f8e44ca4
    import: org.codehaus.classworlds.Entry@92758522
    import: org.codehaus.classworlds.Entry@ebf2705b
    import: org.codehaus.classworlds.Entry@bb25e54
    import: org.codehaus.classworlds.Entry@bece5185
    import: org.codehaus.classworlds.Entry@3fee8e37
    import: org.codehaus.classworlds.Entry@3fee19d8


    this realm = plexus.core
    urls[0] = file:/opt/maven2/lib/maven-2.2.1-uber.jar
    Number of imports: 10
    import: org.codehaus.classworlds.Entry@a6c57a42
    import: org.codehaus.classworlds.Entry@12f43f3b
    import: org.codehaus.classworlds.Entry@20025374
    import: org.codehaus.classworlds.Entry@f8e44ca4
    import: org.codehaus.classworlds.Entry@92758522
    import: org.codehaus.classworlds.Entry@ebf2705b
    import: org.codehaus.classworlds.Entry@bb25e54
    import: org.codehaus.classworlds.Entry@bece5185
    import: org.codehaus.classworlds.Entry@3fee8e37
    import: org.codehaus.classworlds.Entry@3fee19d8
    -----------------------------------------------------
    [INFO] ------------------------------------------------------------------------
    [ERROR] BUILD ERROR
    [INFO] ------------------------------------------------------------------------
    [INFO] Internal error in the plugin manager executing goal 'org.apache.torque:torque-maven-plugin:3.3:om': Unable to load the mojo 'org.apache.torque:torque-maven-plugin:3.3:om' in the plugin 'org.apache.torque:torque-maven-plugin'. A required class is missing: org/apache/torque/task/TorqueDataModelTask
    org.apache.torque.task.TorqueDataModelTask
    [INFO] ------------------------------------------------------------------------
    [INFO] For more information, run Maven with the -e switch
    [INFO] ------------------------------------------------------------------------
    [INFO] Total time: 40 seconds
    [INFO] Finished at: Mon Apr 25 06:42:11 UTC 2011
    [INFO] Final Memory: 30M/72M
    [INFO] ------------------------------------------------------------------------
    ---------------------------------------------

    To subscribe to this information via syndicated feeds:
    - RSS: http://vmgump.apache.org/gump/public/turbine-core/turbine-core/rss.xml
    - Atom: http://vmgump.apache.org/gump/public/turbine-core/turbine-core/atom.xml

    ============================== Gump Tracking Only ===
    Produced by Apache Gump(TM) version 2.3.
    Gump Run 10000025042011, vmgump.apache.org:vmgump:10000025042011
    Gump E-mail Identifier (unique within run) #31.

    --
    Apache Gump
    http://gump.apache.org/ [Instance: vmgump]

    ---------------------------------------------------------------------
    To unsubscribe, e-mail: dev-unsubscribe@turbine.apache.org
    For additional commands, e-mail: dev-help@turbine.apache.org
  • Anonymous at Apr 26, 2011 at 6:31 am
    To whom it may engage...

    This is an automated request, but not an unsolicited one. For
    more information please visit http://gump.apache.org/nagged.html,
    and/or contact the folk at general@gump.apache.org.

    Project turbine-core has an issue affecting its community integration.
    This issue affects 2 projects,
    and has been outstanding for 113 runs.
    The current state of this project is 'Failed', with reason 'Build Failed'.
    For reference only, the following projects are affected by this:
    - turbine-core : A servlet based framework.
    - turbine-core-test : A servlet based framework.


    Full details are available at:
    http://vmgump.apache.org/gump/public/turbine-core/turbine-core/index.html

    That said, some information snippets are provided here.

    The following annotations (debug/informational/warning/error messages) were provided:
    -INFO- Optional dependency commons-fileupload prerequisite failed with reason build failed
    -INFO- Optional dependency httpunit failed with reason build failed
    -DEBUG- (Apache Gump generated) Apache Maven Settings in: /srv/gump/public/workspace/turbine-core/gump_mvn_settings.xml
    -INFO- Failed with reason build failed
    -DEBUG- Maven POM in: /srv/gump/public/workspace/turbine-core/pom.xml
    -INFO- Failed to extract fallback artifacts from Gump Repository



    The following work was performed:
    http://vmgump.apache.org/gump/public/turbine-core/turbine-core/gump_work/build_turbine-core_turbine-core.html
    Work Name: build_turbine-core_turbine-core (Type: Build)
    Work ended in a state of : Failed
    Elapsed: 38 secs
    Command Line: /opt/maven2/bin/mvn --batch-mode -DskipTests=true --settings /srv/gump/public/workspace/turbine-core/gump_mvn_settings.xml package
    [Working Directory: /srv/gump/public/workspace/turbine-core]
    M2_HOME: /opt/maven2
    ---------------------------------------------
    urls[19] = file:/srv/gump/public/workspace/mvnlocalrepo/shared/xml-apis/xml-apis/1.0.b2/xml-apis-1.0.b2.jar
    urls[20] = file:/srv/gump/public/workspace/mvnlocalrepo/shared/commons-configuration/commons-configuration/1.4/commons-configuration-1.4.jar
    urls[21] = file:/srv/gump/public/workspace/mvnlocalrepo/shared/commons-logging/commons-logging-api/1.0.4/commons-logging-api-1.0.4.jar
    urls[22] = file:/srv/gump/public/workspace/mvnlocalrepo/shared/commons-digester/commons-digester/1.8/commons-digester-1.8.jar
    urls[23] = file:/srv/gump/public/workspace/mvnlocalrepo/shared/commons-beanutils/commons-beanutils/1.7.0/commons-beanutils-1.7.0.jar
    urls[24] = file:/srv/gump/public/workspace/mvnlocalrepo/shared/commons-beanutils/commons-beanutils-core/1.7.0/commons-beanutils-core-1.7.0.jar
    urls[25] = file:/srv/gump/public/workspace/mvnlocalrepo/shared/commons-codec/commons-codec/1.3/commons-codec-1.3.jar
    urls[26] = file:/srv/gump/public/workspace/mvnlocalrepo/shared/commons-jxpath/commons-jxpath/1.2/commons-jxpath-1.2.jar
    urls[27] = file:/srv/gump/public/workspace/mvnlocalrepo/shared/xerces/xerces/1.2.3/xerces-1.2.3.jar
    urls[28] = file:/srv/gump/public/workspace/mvnlocalrepo/shared/ant/ant-optional/1.5.1/ant-optional-1.5.1.jar
    urls[29] = file:/srv/gump/public/workspace/mvnlocalrepo/shared/jdom/jdom/b9/jdom-b9.jar
    Number of imports: 10
    import: org.codehaus.classworlds.Entry@a6c57a42
    import: org.codehaus.classworlds.Entry@12f43f3b
    import: org.codehaus.classworlds.Entry@20025374
    import: org.codehaus.classworlds.Entry@f8e44ca4
    import: org.codehaus.classworlds.Entry@92758522
    import: org.codehaus.classworlds.Entry@ebf2705b
    import: org.codehaus.classworlds.Entry@bb25e54
    import: org.codehaus.classworlds.Entry@bece5185
    import: org.codehaus.classworlds.Entry@3fee8e37
    import: org.codehaus.classworlds.Entry@3fee19d8


    this realm = plexus.core
    urls[0] = file:/opt/maven2/lib/maven-2.2.1-uber.jar
    Number of imports: 10
    import: org.codehaus.classworlds.Entry@a6c57a42
    import: org.codehaus.classworlds.Entry@12f43f3b
    import: org.codehaus.classworlds.Entry@20025374
    import: org.codehaus.classworlds.Entry@f8e44ca4
    import: org.codehaus.classworlds.Entry@92758522
    import: org.codehaus.classworlds.Entry@ebf2705b
    import: org.codehaus.classworlds.Entry@bb25e54
    import: org.codehaus.classworlds.Entry@bece5185
    import: org.codehaus.classworlds.Entry@3fee8e37
    import: org.codehaus.classworlds.Entry@3fee19d8
    -----------------------------------------------------
    [INFO] ------------------------------------------------------------------------
    [ERROR] BUILD ERROR
    [INFO] ------------------------------------------------------------------------
    [INFO] Internal error in the plugin manager executing goal 'org.apache.torque:torque-maven-plugin:3.3:om': Unable to load the mojo 'org.apache.torque:torque-maven-plugin:3.3:om' in the plugin 'org.apache.torque:torque-maven-plugin'. A required class is missing: org/apache/torque/task/TorqueDataModelTask
    org.apache.torque.task.TorqueDataModelTask
    [INFO] ------------------------------------------------------------------------
    [INFO] For more information, run Maven with the -e switch
    [INFO] ------------------------------------------------------------------------
    [INFO] Total time: 37 seconds
    [INFO] Finished at: Tue Apr 26 06:31:00 UTC 2011
    [INFO] Final Memory: 30M/72M
    [INFO] ------------------------------------------------------------------------
    ---------------------------------------------

    To subscribe to this information via syndicated feeds:
    - RSS: http://vmgump.apache.org/gump/public/turbine-core/turbine-core/rss.xml
    - Atom: http://vmgump.apache.org/gump/public/turbine-core/turbine-core/atom.xml

    ============================== Gump Tracking Only ===
    Produced by Apache Gump(TM) version 2.3.
    Gump Run 10000026042011, vmgump.apache.org:vmgump:10000026042011
    Gump E-mail Identifier (unique within run) #31.

    --
    Apache Gump
    http://gump.apache.org/ [Instance: vmgump]

    ---------------------------------------------------------------------
    To unsubscribe, e-mail: dev-unsubscribe@turbine.apache.org
    For additional commands, e-mail: dev-help@turbine.apache.org
  • Anonymous at Apr 27, 2011 at 6:50 am
    To whom it may engage...

    This is an automated request, but not an unsolicited one. For
    more information please visit http://gump.apache.org/nagged.html,
    and/or contact the folk at general@gump.apache.org.

    Project turbine-core has an issue affecting its community integration.
    This issue affects 2 projects,
    and has been outstanding for 115 runs.
    The current state of this project is 'Failed', with reason 'Build Failed'.
    For reference only, the following projects are affected by this:
    - turbine-core : A servlet based framework.
    - turbine-core-test : A servlet based framework.


    Full details are available at:
    http://vmgump.apache.org/gump/public/turbine-core/turbine-core/index.html

    That said, some information snippets are provided here.

    The following annotations (debug/informational/warning/error messages) were provided:
    -INFO- Optional dependency commons-fileupload prerequisite failed with reason build failed
    -INFO- Optional dependency httpunit failed with reason build failed
    -DEBUG- (Apache Gump generated) Apache Maven Settings in: /srv/gump/public/workspace/turbine-core/gump_mvn_settings.xml
    -INFO- Failed with reason build failed
    -DEBUG- Maven POM in: /srv/gump/public/workspace/turbine-core/pom.xml
    -INFO- Failed to extract fallback artifacts from Gump Repository



    The following work was performed:
    http://vmgump.apache.org/gump/public/turbine-core/turbine-core/gump_work/build_turbine-core_turbine-core.html
    Work Name: build_turbine-core_turbine-core (Type: Build)
    Work ended in a state of : Failed
    Elapsed: 37 secs
    Command Line: /opt/maven2/bin/mvn --batch-mode -DskipTests=true --settings /srv/gump/public/workspace/turbine-core/gump_mvn_settings.xml package
    [Working Directory: /srv/gump/public/workspace/turbine-core]
    M2_HOME: /opt/maven2
    ---------------------------------------------
    urls[19] = file:/srv/gump/public/workspace/mvnlocalrepo/shared/xml-apis/xml-apis/1.0.b2/xml-apis-1.0.b2.jar
    urls[20] = file:/srv/gump/public/workspace/mvnlocalrepo/shared/commons-configuration/commons-configuration/1.4/commons-configuration-1.4.jar
    urls[21] = file:/srv/gump/public/workspace/mvnlocalrepo/shared/commons-logging/commons-logging-api/1.0.4/commons-logging-api-1.0.4.jar
    urls[22] = file:/srv/gump/public/workspace/mvnlocalrepo/shared/commons-digester/commons-digester/1.8/commons-digester-1.8.jar
    urls[23] = file:/srv/gump/public/workspace/mvnlocalrepo/shared/commons-beanutils/commons-beanutils/1.7.0/commons-beanutils-1.7.0.jar
    urls[24] = file:/srv/gump/public/workspace/mvnlocalrepo/shared/commons-beanutils/commons-beanutils-core/1.7.0/commons-beanutils-core-1.7.0.jar
    urls[25] = file:/srv/gump/public/workspace/mvnlocalrepo/shared/commons-codec/commons-codec/1.3/commons-codec-1.3.jar
    urls[26] = file:/srv/gump/public/workspace/mvnlocalrepo/shared/commons-jxpath/commons-jxpath/1.2/commons-jxpath-1.2.jar
    urls[27] = file:/srv/gump/public/workspace/mvnlocalrepo/shared/xerces/xerces/1.2.3/xerces-1.2.3.jar
    urls[28] = file:/srv/gump/public/workspace/mvnlocalrepo/shared/ant/ant-optional/1.5.1/ant-optional-1.5.1.jar
    urls[29] = file:/srv/gump/public/workspace/mvnlocalrepo/shared/jdom/jdom/b9/jdom-b9.jar
    Number of imports: 10
    import: org.codehaus.classworlds.Entry@a6c57a42
    import: org.codehaus.classworlds.Entry@12f43f3b
    import: org.codehaus.classworlds.Entry@20025374
    import: org.codehaus.classworlds.Entry@f8e44ca4
    import: org.codehaus.classworlds.Entry@92758522
    import: org.codehaus.classworlds.Entry@ebf2705b
    import: org.codehaus.classworlds.Entry@bb25e54
    import: org.codehaus.classworlds.Entry@bece5185
    import: org.codehaus.classworlds.Entry@3fee8e37
    import: org.codehaus.classworlds.Entry@3fee19d8


    this realm = plexus.core
    urls[0] = file:/opt/maven2/lib/maven-2.2.1-uber.jar
    Number of imports: 10
    import: org.codehaus.classworlds.Entry@a6c57a42
    import: org.codehaus.classworlds.Entry@12f43f3b
    import: org.codehaus.classworlds.Entry@20025374
    import: org.codehaus.classworlds.Entry@f8e44ca4
    import: org.codehaus.classworlds.Entry@92758522
    import: org.codehaus.classworlds.Entry@ebf2705b
    import: org.codehaus.classworlds.Entry@bb25e54
    import: org.codehaus.classworlds.Entry@bece5185
    import: org.codehaus.classworlds.Entry@3fee8e37
    import: org.codehaus.classworlds.Entry@3fee19d8
    -----------------------------------------------------
    [INFO] ------------------------------------------------------------------------
    [ERROR] BUILD ERROR
    [INFO] ------------------------------------------------------------------------
    [INFO] Internal error in the plugin manager executing goal 'org.apache.torque:torque-maven-plugin:3.3:om': Unable to load the mojo 'org.apache.torque:torque-maven-plugin:3.3:om' in the plugin 'org.apache.torque:torque-maven-plugin'. A required class is missing: org/apache/torque/task/TorqueDataModelTask
    org.apache.torque.task.TorqueDataModelTask
    [INFO] ------------------------------------------------------------------------
    [INFO] For more information, run Maven with the -e switch
    [INFO] ------------------------------------------------------------------------
    [INFO] Total time: 36 seconds
    [INFO] Finished at: Wed Apr 27 06:50:04 UTC 2011
    [INFO] Final Memory: 30M/72M
    [INFO] ------------------------------------------------------------------------
    ---------------------------------------------

    To subscribe to this information via syndicated feeds:
    - RSS: http://vmgump.apache.org/gump/public/turbine-core/turbine-core/rss.xml
    - Atom: http://vmgump.apache.org/gump/public/turbine-core/turbine-core/atom.xml

    ============================== Gump Tracking Only ===
    Produced by Apache Gump(TM) version 2.3.
    Gump Run 11000027042011, vmgump.apache.org:vmgump:11000027042011
    Gump E-mail Identifier (unique within run) #30.

    --
    Apache Gump
    http://gump.apache.org/ [Instance: vmgump]

    ---------------------------------------------------------------------
    To unsubscribe, e-mail: dev-unsubscribe@turbine.apache.org
    For additional commands, e-mail: dev-help@turbine.apache.org
  • Anonymous at Apr 28, 2011 at 6:06 am
    To whom it may engage...

    This is an automated request, but not an unsolicited one. For
    more information please visit http://gump.apache.org/nagged.html,
    and/or contact the folk at general@gump.apache.org.

    Project turbine-core has an issue affecting its community integration.
    This issue affects 2 projects,
    and has been outstanding for 116 runs.
    The current state of this project is 'Failed', with reason 'Build Failed'.
    For reference only, the following projects are affected by this:
    - turbine-core : A servlet based framework.
    - turbine-core-test : A servlet based framework.


    Full details are available at:
    http://vmgump.apache.org/gump/public/turbine-core/turbine-core/index.html

    That said, some information snippets are provided here.

    The following annotations (debug/informational/warning/error messages) were provided:
    -INFO- Optional dependency commons-fileupload prerequisite failed with reason build failed
    -INFO- Optional dependency httpunit failed with reason build failed
    -DEBUG- (Apache Gump generated) Apache Maven Settings in: /srv/gump/public/workspace/turbine-core/gump_mvn_settings.xml
    -INFO- Failed with reason build failed
    -DEBUG- Maven POM in: /srv/gump/public/workspace/turbine-core/pom.xml
    -INFO- Failed to extract fallback artifacts from Gump Repository



    The following work was performed:
    http://vmgump.apache.org/gump/public/turbine-core/turbine-core/gump_work/build_turbine-core_turbine-core.html
    Work Name: build_turbine-core_turbine-core (Type: Build)
    Work ended in a state of : Failed
    Elapsed: 9 secs
    Command Line: /opt/maven2/bin/mvn --batch-mode -DskipTests=true --settings /srv/gump/public/workspace/turbine-core/gump_mvn_settings.xml package
    [Working Directory: /srv/gump/public/workspace/turbine-core]
    M2_HOME: /opt/maven2
    ---------------------------------------------
    urls[19] = file:/srv/gump/public/workspace/mvnlocalrepo/shared/xml-apis/xml-apis/1.0.b2/xml-apis-1.0.b2.jar
    urls[20] = file:/srv/gump/public/workspace/mvnlocalrepo/shared/commons-configuration/commons-configuration/1.4/commons-configuration-1.4.jar
    urls[21] = file:/srv/gump/public/workspace/mvnlocalrepo/shared/commons-logging/commons-logging-api/1.0.4/commons-logging-api-1.0.4.jar
    urls[22] = file:/srv/gump/public/workspace/mvnlocalrepo/shared/commons-digester/commons-digester/1.8/commons-digester-1.8.jar
    urls[23] = file:/srv/gump/public/workspace/mvnlocalrepo/shared/commons-beanutils/commons-beanutils/1.7.0/commons-beanutils-1.7.0.jar
    urls[24] = file:/srv/gump/public/workspace/mvnlocalrepo/shared/commons-beanutils/commons-beanutils-core/1.7.0/commons-beanutils-core-1.7.0.jar
    urls[25] = file:/srv/gump/public/workspace/mvnlocalrepo/shared/commons-codec/commons-codec/1.3/commons-codec-1.3.jar
    urls[26] = file:/srv/gump/public/workspace/mvnlocalrepo/shared/commons-jxpath/commons-jxpath/1.2/commons-jxpath-1.2.jar
    urls[27] = file:/srv/gump/public/workspace/mvnlocalrepo/shared/xerces/xerces/1.2.3/xerces-1.2.3.jar
    urls[28] = file:/srv/gump/public/workspace/mvnlocalrepo/shared/ant/ant-optional/1.5.1/ant-optional-1.5.1.jar
    urls[29] = file:/srv/gump/public/workspace/mvnlocalrepo/shared/jdom/jdom/b9/jdom-b9.jar
    Number of imports: 10
    import: org.codehaus.classworlds.Entry@a6c57a42
    import: org.codehaus.classworlds.Entry@12f43f3b
    import: org.codehaus.classworlds.Entry@20025374
    import: org.codehaus.classworlds.Entry@f8e44ca4
    import: org.codehaus.classworlds.Entry@92758522
    import: org.codehaus.classworlds.Entry@ebf2705b
    import: org.codehaus.classworlds.Entry@bb25e54
    import: org.codehaus.classworlds.Entry@bece5185
    import: org.codehaus.classworlds.Entry@3fee8e37
    import: org.codehaus.classworlds.Entry@3fee19d8


    this realm = plexus.core
    urls[0] = file:/opt/maven2/lib/maven-2.2.1-uber.jar
    Number of imports: 10
    import: org.codehaus.classworlds.Entry@a6c57a42
    import: org.codehaus.classworlds.Entry@12f43f3b
    import: org.codehaus.classworlds.Entry@20025374
    import: org.codehaus.classworlds.Entry@f8e44ca4
    import: org.codehaus.classworlds.Entry@92758522
    import: org.codehaus.classworlds.Entry@ebf2705b
    import: org.codehaus.classworlds.Entry@bb25e54
    import: org.codehaus.classworlds.Entry@bece5185
    import: org.codehaus.classworlds.Entry@3fee8e37
    import: org.codehaus.classworlds.Entry@3fee19d8
    -----------------------------------------------------
    [INFO] ------------------------------------------------------------------------
    [ERROR] BUILD ERROR
    [INFO] ------------------------------------------------------------------------
    [INFO] Internal error in the plugin manager executing goal 'org.apache.torque:torque-maven-plugin:3.3:om': Unable to load the mojo 'org.apache.torque:torque-maven-plugin:3.3:om' in the plugin 'org.apache.torque:torque-maven-plugin'. A required class is missing: org/apache/torque/task/TorqueDataModelTask
    org.apache.torque.task.TorqueDataModelTask
    [INFO] ------------------------------------------------------------------------
    [INFO] For more information, run Maven with the -e switch
    [INFO] ------------------------------------------------------------------------
    [INFO] Total time: 8 seconds
    [INFO] Finished at: Thu Apr 28 06:05:34 UTC 2011
    [INFO] Final Memory: 29M/71M
    [INFO] ------------------------------------------------------------------------
    ---------------------------------------------

    To subscribe to this information via syndicated feeds:
    - RSS: http://vmgump.apache.org/gump/public/turbine-core/turbine-core/rss.xml
    - Atom: http://vmgump.apache.org/gump/public/turbine-core/turbine-core/atom.xml

    ============================== Gump Tracking Only ===
    Produced by Apache Gump(TM) version 2.3.
    Gump Run 10000028042011, vmgump.apache.org:vmgump:10000028042011
    Gump E-mail Identifier (unique within run) #29.

    --
    Apache Gump
    http://gump.apache.org/ [Instance: vmgump]

    ---------------------------------------------------------------------
    To unsubscribe, e-mail: dev-unsubscribe@turbine.apache.org
    For additional commands, e-mail: dev-help@turbine.apache.org
  • Anonymous at Apr 29, 2011 at 7:31 am
    To whom it may engage...

    This is an automated request, but not an unsolicited one. For
    more information please visit http://gump.apache.org/nagged.html,
    and/or contact the folk at general@gump.apache.org.

    Project turbine-core has an issue affecting its community integration.
    This issue affects 2 projects,
    and has been outstanding for 118 runs.
    The current state of this project is 'Failed', with reason 'Build Failed'.
    For reference only, the following projects are affected by this:
    - turbine-core : A servlet based framework.
    - turbine-core-test : A servlet based framework.


    Full details are available at:
    http://vmgump.apache.org/gump/public/turbine-core/turbine-core/index.html

    That said, some information snippets are provided here.

    The following annotations (debug/informational/warning/error messages) were provided:
    -INFO- Optional dependency dom4j prerequisite failed with reason build failed
    -INFO- Optional dependency commons-fileupload prerequisite failed with reason build failed
    -INFO- Optional dependency httpunit failed with reason build failed
    -DEBUG- (Apache Gump generated) Apache Maven Settings in: /srv/gump/public/workspace/turbine-core/gump_mvn_settings.xml
    -INFO- Failed with reason build failed
    -DEBUG- Maven POM in: /srv/gump/public/workspace/turbine-core/pom.xml
    -INFO- Failed to extract fallback artifacts from Gump Repository



    The following work was performed:
    http://vmgump.apache.org/gump/public/turbine-core/turbine-core/gump_work/build_turbine-core_turbine-core.html
    Work Name: build_turbine-core_turbine-core (Type: Build)
    Work ended in a state of : Failed
    Elapsed: 41 secs
    Command Line: /opt/maven2/bin/mvn --batch-mode -DskipTests=true --settings /srv/gump/public/workspace/turbine-core/gump_mvn_settings.xml package
    [Working Directory: /srv/gump/public/workspace/turbine-core]
    M2_HOME: /opt/maven2
    ---------------------------------------------
    urls[19] = file:/srv/gump/public/workspace/mvnlocalrepo/shared/xml-apis/xml-apis/1.0.b2/xml-apis-1.0.b2.jar
    urls[20] = file:/srv/gump/public/workspace/mvnlocalrepo/shared/commons-configuration/commons-configuration/1.4/commons-configuration-1.4.jar
    urls[21] = file:/srv/gump/public/workspace/mvnlocalrepo/shared/commons-logging/commons-logging-api/1.0.4/commons-logging-api-1.0.4.jar
    urls[22] = file:/srv/gump/public/workspace/mvnlocalrepo/shared/commons-digester/commons-digester/1.8/commons-digester-1.8.jar
    urls[23] = file:/srv/gump/public/workspace/mvnlocalrepo/shared/commons-beanutils/commons-beanutils/1.7.0/commons-beanutils-1.7.0.jar
    urls[24] = file:/srv/gump/public/workspace/mvnlocalrepo/shared/commons-beanutils/commons-beanutils-core/1.7.0/commons-beanutils-core-1.7.0.jar
    urls[25] = file:/srv/gump/public/workspace/mvnlocalrepo/shared/commons-codec/commons-codec/1.3/commons-codec-1.3.jar
    urls[26] = file:/srv/gump/public/workspace/mvnlocalrepo/shared/commons-jxpath/commons-jxpath/1.2/commons-jxpath-1.2.jar
    urls[27] = file:/srv/gump/public/workspace/mvnlocalrepo/shared/xerces/xerces/1.2.3/xerces-1.2.3.jar
    urls[28] = file:/srv/gump/public/workspace/mvnlocalrepo/shared/ant/ant-optional/1.5.1/ant-optional-1.5.1.jar
    urls[29] = file:/srv/gump/public/workspace/mvnlocalrepo/shared/jdom/jdom/b9/jdom-b9.jar
    Number of imports: 10
    import: org.codehaus.classworlds.Entry@a6c57a42
    import: org.codehaus.classworlds.Entry@12f43f3b
    import: org.codehaus.classworlds.Entry@20025374
    import: org.codehaus.classworlds.Entry@f8e44ca4
    import: org.codehaus.classworlds.Entry@92758522
    import: org.codehaus.classworlds.Entry@ebf2705b
    import: org.codehaus.classworlds.Entry@bb25e54
    import: org.codehaus.classworlds.Entry@bece5185
    import: org.codehaus.classworlds.Entry@3fee8e37
    import: org.codehaus.classworlds.Entry@3fee19d8


    this realm = plexus.core
    urls[0] = file:/opt/maven2/lib/maven-2.2.1-uber.jar
    Number of imports: 10
    import: org.codehaus.classworlds.Entry@a6c57a42
    import: org.codehaus.classworlds.Entry@12f43f3b
    import: org.codehaus.classworlds.Entry@20025374
    import: org.codehaus.classworlds.Entry@f8e44ca4
    import: org.codehaus.classworlds.Entry@92758522
    import: org.codehaus.classworlds.Entry@ebf2705b
    import: org.codehaus.classworlds.Entry@bb25e54
    import: org.codehaus.classworlds.Entry@bece5185
    import: org.codehaus.classworlds.Entry@3fee8e37
    import: org.codehaus.classworlds.Entry@3fee19d8
    -----------------------------------------------------
    [INFO] ------------------------------------------------------------------------
    [ERROR] BUILD ERROR
    [INFO] ------------------------------------------------------------------------
    [INFO] Internal error in the plugin manager executing goal 'org.apache.torque:torque-maven-plugin:3.3:om': Unable to load the mojo 'org.apache.torque:torque-maven-plugin:3.3:om' in the plugin 'org.apache.torque:torque-maven-plugin'. A required class is missing: org/apache/torque/task/TorqueDataModelTask
    org.apache.torque.task.TorqueDataModelTask
    [INFO] ------------------------------------------------------------------------
    [INFO] For more information, run Maven with the -e switch
    [INFO] ------------------------------------------------------------------------
    [INFO] Total time: 40 seconds
    [INFO] Finished at: Fri Apr 29 07:31:16 UTC 2011
    [INFO] Final Memory: 30M/72M
    [INFO] ------------------------------------------------------------------------
    ---------------------------------------------

    To subscribe to this information via syndicated feeds:
    - RSS: http://vmgump.apache.org/gump/public/turbine-core/turbine-core/rss.xml
    - Atom: http://vmgump.apache.org/gump/public/turbine-core/turbine-core/atom.xml

    ============================== Gump Tracking Only ===
    Produced by Apache Gump(TM) version 2.3.
    Gump Run 10000029042011, vmgump.apache.org:vmgump:10000029042011
    Gump E-mail Identifier (unique within run) #29.

    --
    Apache Gump
    http://gump.apache.org/ [Instance: vmgump]

    ---------------------------------------------------------------------
    To unsubscribe, e-mail: dev-unsubscribe@turbine.apache.org
    For additional commands, e-mail: dev-help@turbine.apache.org
  • Anonymous at Apr 30, 2011 at 7:52 am
    To whom it may engage...

    This is an automated request, but not an unsolicited one. For
    more information please visit http://gump.apache.org/nagged.html,
    and/or contact the folk at general@gump.apache.org.

    Project turbine-core has an issue affecting its community integration.
    This issue affects 2 projects,
    and has been outstanding for 120 runs.
    The current state of this project is 'Failed', with reason 'Build Failed'.
    For reference only, the following projects are affected by this:
    - turbine-core : A servlet based framework.
    - turbine-core-test : A servlet based framework.


    Full details are available at:
    http://vmgump.apache.org/gump/public/turbine-core/turbine-core/index.html

    That said, some information snippets are provided here.

    The following annotations (debug/informational/warning/error messages) were provided:
    -INFO- Optional dependency commons-fileupload prerequisite failed with reason build failed
    -INFO- Optional dependency httpunit failed with reason build failed
    -DEBUG- (Apache Gump generated) Apache Maven Settings in: /srv/gump/public/workspace/turbine-core/gump_mvn_settings.xml
    -INFO- Failed with reason build failed
    -DEBUG- Maven POM in: /srv/gump/public/workspace/turbine-core/pom.xml
    -INFO- Failed to extract fallback artifacts from Gump Repository



    The following work was performed:
    http://vmgump.apache.org/gump/public/turbine-core/turbine-core/gump_work/build_turbine-core_turbine-core.html
    Work Name: build_turbine-core_turbine-core (Type: Build)
    Work ended in a state of : Failed
    Elapsed: 38 secs
    Command Line: /opt/maven2/bin/mvn --batch-mode -DskipTests=true --settings /srv/gump/public/workspace/turbine-core/gump_mvn_settings.xml package
    [Working Directory: /srv/gump/public/workspace/turbine-core]
    M2_HOME: /opt/maven2
    ---------------------------------------------
    urls[19] = file:/srv/gump/public/workspace/mvnlocalrepo/shared/xml-apis/xml-apis/1.0.b2/xml-apis-1.0.b2.jar
    urls[20] = file:/srv/gump/public/workspace/mvnlocalrepo/shared/commons-configuration/commons-configuration/1.4/commons-configuration-1.4.jar
    urls[21] = file:/srv/gump/public/workspace/mvnlocalrepo/shared/commons-logging/commons-logging-api/1.0.4/commons-logging-api-1.0.4.jar
    urls[22] = file:/srv/gump/public/workspace/mvnlocalrepo/shared/commons-digester/commons-digester/1.8/commons-digester-1.8.jar
    urls[23] = file:/srv/gump/public/workspace/mvnlocalrepo/shared/commons-beanutils/commons-beanutils/1.7.0/commons-beanutils-1.7.0.jar
    urls[24] = file:/srv/gump/public/workspace/mvnlocalrepo/shared/commons-beanutils/commons-beanutils-core/1.7.0/commons-beanutils-core-1.7.0.jar
    urls[25] = file:/srv/gump/public/workspace/mvnlocalrepo/shared/commons-codec/commons-codec/1.3/commons-codec-1.3.jar
    urls[26] = file:/srv/gump/public/workspace/mvnlocalrepo/shared/commons-jxpath/commons-jxpath/1.2/commons-jxpath-1.2.jar
    urls[27] = file:/srv/gump/public/workspace/mvnlocalrepo/shared/xerces/xerces/1.2.3/xerces-1.2.3.jar
    urls[28] = file:/srv/gump/public/workspace/mvnlocalrepo/shared/ant/ant-optional/1.5.1/ant-optional-1.5.1.jar
    urls[29] = file:/srv/gump/public/workspace/mvnlocalrepo/shared/jdom/jdom/b9/jdom-b9.jar
    Number of imports: 10
    import: org.codehaus.classworlds.Entry@a6c57a42
    import: org.codehaus.classworlds.Entry@12f43f3b
    import: org.codehaus.classworlds.Entry@20025374
    import: org.codehaus.classworlds.Entry@f8e44ca4
    import: org.codehaus.classworlds.Entry@92758522
    import: org.codehaus.classworlds.Entry@ebf2705b
    import: org.codehaus.classworlds.Entry@bb25e54
    import: org.codehaus.classworlds.Entry@bece5185
    import: org.codehaus.classworlds.Entry@3fee8e37
    import: org.codehaus.classworlds.Entry@3fee19d8


    this realm = plexus.core
    urls[0] = file:/opt/maven2/lib/maven-2.2.1-uber.jar
    Number of imports: 10
    import: org.codehaus.classworlds.Entry@a6c57a42
    import: org.codehaus.classworlds.Entry@12f43f3b
    import: org.codehaus.classworlds.Entry@20025374
    import: org.codehaus.classworlds.Entry@f8e44ca4
    import: org.codehaus.classworlds.Entry@92758522
    import: org.codehaus.classworlds.Entry@ebf2705b
    import: org.codehaus.classworlds.Entry@bb25e54
    import: org.codehaus.classworlds.Entry@bece5185
    import: org.codehaus.classworlds.Entry@3fee8e37
    import: org.codehaus.classworlds.Entry@3fee19d8
    -----------------------------------------------------
    [INFO] ------------------------------------------------------------------------
    [ERROR] BUILD ERROR
    [INFO] ------------------------------------------------------------------------
    [INFO] Internal error in the plugin manager executing goal 'org.apache.torque:torque-maven-plugin:3.3:om': Unable to load the mojo 'org.apache.torque:torque-maven-plugin:3.3:om' in the plugin 'org.apache.torque:torque-maven-plugin'. A required class is missing: org/apache/torque/task/TorqueDataModelTask
    org.apache.torque.task.TorqueDataModelTask
    [INFO] ------------------------------------------------------------------------
    [INFO] For more information, run Maven with the -e switch
    [INFO] ------------------------------------------------------------------------
    [INFO] Total time: 37 seconds
    [INFO] Finished at: Sat Apr 30 07:52:11 UTC 2011
    [INFO] Final Memory: 30M/72M
    [INFO] ------------------------------------------------------------------------
    ---------------------------------------------

    To subscribe to this information via syndicated feeds:
    - RSS: http://vmgump.apache.org/gump/public/turbine-core/turbine-core/rss.xml
    - Atom: http://vmgump.apache.org/gump/public/turbine-core/turbine-core/atom.xml

    ============================== Gump Tracking Only ===
    Produced by Apache Gump(TM) version 2.3.
    Gump Run 10000030042011, vmgump.apache.org:vmgump:10000030042011
    Gump E-mail Identifier (unique within run) #28.

    --
    Apache Gump
    http://gump.apache.org/ [Instance: vmgump]

    ---------------------------------------------------------------------
    To unsubscribe, e-mail: dev-unsubscribe@turbine.apache.org
    For additional commands, e-mail: dev-help@turbine.apache.org

Related Discussions

Discussion Navigation
viewthread | post
Discussion Overview
groupdev @
categoriesturbine
postedApr 1, '11 at 1:34p
activeApr 30, '11 at 7:52a
posts27
users1
websiteturbine.apache.org

1 user in discussion

Anonymous: 27 posts

People

Translate

site design / logo © 2019 Grokbase