FAQ
To whom it may engage...

This is an automated request, but not an unsolicited one. For
more information please visit http://gump.apache.org/nagged.html,
and/or contact the folk at general@gump.apache.org.

Project turbine-core has an issue affecting its community integration.
This issue affects 2 projects,
and has been outstanding for 9 runs.
The current state of this project is 'Failed', with reason 'Build Failed'.
For reference only, the following projects are affected by this:
- turbine-core : A servlet based framework.
- turbine-core-test : A servlet based framework.


Full details are available at:
http://vmgump.apache.org/gump/public/turbine-core/turbine-core/index.html

That said, some information snippets are provided here.

The following annotations (debug/informational/warning/error messages) were provided:
-INFO- Optional dependency commons-fileupload prerequisite failed with reason build failed
-INFO- Optional dependency httpunit failed with reason build failed
-DEBUG- (Apache Gump generated) Apache Maven Settings in: /srv/gump/public/workspace/turbine-core/gump_mvn_settings.xml
-INFO- Failed with reason build failed
-DEBUG- Maven POM in: /srv/gump/public/workspace/turbine-core/pom.xml
-INFO- Failed to extract fallback artifacts from Gump Repository



The following work was performed:
http://vmgump.apache.org/gump/public/turbine-core/turbine-core/gump_work/build_turbine-core_turbine-core.html
Work Name: build_turbine-core_turbine-core (Type: Build)
Work ended in a state of : Failed
Elapsed: 34 secs
Command Line: /opt/maven2/bin/mvn --batch-mode -DskipTests=true --settings /srv/gump/public/workspace/turbine-core/gump_mvn_settings.xml package
[Working Directory: /srv/gump/public/workspace/turbine-core]
M2_HOME: /opt/maven2
---------------------------------------------
urls[19] = file:/srv/gump/public/workspace/mvnlocalrepo/shared/xml-apis/xml-apis/1.0.b2/xml-apis-1.0.b2.jar
urls[20] = file:/srv/gump/public/workspace/mvnlocalrepo/shared/commons-configuration/commons-configuration/1.4/commons-configuration-1.4.jar
urls[21] = file:/srv/gump/public/workspace/mvnlocalrepo/shared/commons-logging/commons-logging-api/1.0.4/commons-logging-api-1.0.4.jar
urls[22] = file:/srv/gump/public/workspace/mvnlocalrepo/shared/commons-digester/commons-digester/1.8/commons-digester-1.8.jar
urls[23] = file:/srv/gump/public/workspace/mvnlocalrepo/shared/commons-beanutils/commons-beanutils/1.7.0/commons-beanutils-1.7.0.jar
urls[24] = file:/srv/gump/public/workspace/mvnlocalrepo/shared/commons-beanutils/commons-beanutils-core/1.7.0/commons-beanutils-core-1.7.0.jar
urls[25] = file:/srv/gump/public/workspace/mvnlocalrepo/shared/commons-codec/commons-codec/1.3/commons-codec-1.3.jar
urls[26] = file:/srv/gump/public/workspace/mvnlocalrepo/shared/commons-jxpath/commons-jxpath/1.2/commons-jxpath-1.2.jar
urls[27] = file:/srv/gump/public/workspace/mvnlocalrepo/shared/xerces/xerces/1.2.3/xerces-1.2.3.jar
urls[28] = file:/srv/gump/public/workspace/mvnlocalrepo/shared/ant/ant-optional/1.5.1/ant-optional-1.5.1.jar
urls[29] = file:/srv/gump/public/workspace/mvnlocalrepo/shared/jdom/jdom/b9/jdom-b9.jar
Number of imports: 10
import: org.codehaus.classworlds.Entry@a6c57a42
import: org.codehaus.classworlds.Entry@12f43f3b
import: org.codehaus.classworlds.Entry@20025374
import: org.codehaus.classworlds.Entry@f8e44ca4
import: org.codehaus.classworlds.Entry@92758522
import: org.codehaus.classworlds.Entry@ebf2705b
import: org.codehaus.classworlds.Entry@bb25e54
import: org.codehaus.classworlds.Entry@bece5185
import: org.codehaus.classworlds.Entry@3fee8e37
import: org.codehaus.classworlds.Entry@3fee19d8


this realm = plexus.core
urls[0] = file:/opt/maven2/lib/maven-2.2.1-uber.jar
Number of imports: 10
import: org.codehaus.classworlds.Entry@a6c57a42
import: org.codehaus.classworlds.Entry@12f43f3b
import: org.codehaus.classworlds.Entry@20025374
import: org.codehaus.classworlds.Entry@f8e44ca4
import: org.codehaus.classworlds.Entry@92758522
import: org.codehaus.classworlds.Entry@ebf2705b
import: org.codehaus.classworlds.Entry@bb25e54
import: org.codehaus.classworlds.Entry@bece5185
import: org.codehaus.classworlds.Entry@3fee8e37
import: org.codehaus.classworlds.Entry@3fee19d8
-----------------------------------------------------
[INFO] ------------------------------------------------------------------------
[ERROR] BUILD ERROR
[INFO] ------------------------------------------------------------------------
[INFO] Internal error in the plugin manager executing goal 'org.apache.torque:torque-maven-plugin:3.3:om': Unable to load the mojo 'org.apache.torque:torque-maven-plugin:3.3:om' in the plugin 'org.apache.torque:torque-maven-plugin'. A required class is missing: org/apache/torque/task/TorqueDataModelTask
org.apache.torque.task.TorqueDataModelTask
[INFO] ------------------------------------------------------------------------
[INFO] For more information, run Maven with the -e switch
[INFO] ------------------------------------------------------------------------
[INFO] Total time: 32 seconds
[INFO] Finished at: Wed Mar 02 13:40:40 UTC 2011
[INFO] Final Memory: 21M/51M
[INFO] ------------------------------------------------------------------------
---------------------------------------------

To subscribe to this information via syndicated feeds:
- RSS: http://vmgump.apache.org/gump/public/turbine-core/turbine-core/rss.xml
- Atom: http://vmgump.apache.org/gump/public/turbine-core/turbine-core/atom.xml

============================== Gump Tracking Only ===
Produced by Apache Gump(TM) version 2.3.
Gump Run 06000602032011, vmgump.apache.org:vmgump:06000602032011
Gump E-mail Identifier (unique within run) #41.

--
Apache Gump
http://gump.apache.org/ [Instance: vmgump]

---------------------------------------------------------------------
To unsubscribe, e-mail: dev-unsubscribe@turbine.apache.org
For additional commands, e-mail: dev-help@turbine.apache.org

Search Discussions

  • Anonymous at Mar 3, 2011 at 1:22 pm
    To whom it may engage...

    This is an automated request, but not an unsolicited one. For
    more information please visit http://gump.apache.org/nagged.html,
    and/or contact the folk at general@gump.apache.org.

    Project turbine-core has an issue affecting its community integration.
    This issue affects 2 projects,
    and has been outstanding for 11 runs.
    The current state of this project is 'Failed', with reason 'Build Failed'.
    For reference only, the following projects are affected by this:
    - turbine-core : A servlet based framework.
    - turbine-core-test : A servlet based framework.


    Full details are available at:
    http://vmgump.apache.org/gump/public/turbine-core/turbine-core/index.html

    That said, some information snippets are provided here.

    The following annotations (debug/informational/warning/error messages) were provided:
    -INFO- Optional dependency dom4j prerequisite failed with reason build timed out
    -INFO- Optional dependency commons-configuration prerequisite failed with reason build failed
    -INFO- Optional dependency commons-fileupload prerequisite failed with reason build failed
    -INFO- Optional dependency httpunit failed with reason build failed
    -DEBUG- (Apache Gump generated) Apache Maven Settings in: /srv/gump/public/workspace/turbine-core/gump_mvn_settings.xml
    -INFO- Failed with reason build failed
    -DEBUG- Maven POM in: /srv/gump/public/workspace/turbine-core/pom.xml
    -INFO- Failed to extract fallback artifacts from Gump Repository



    The following work was performed:
    http://vmgump.apache.org/gump/public/turbine-core/turbine-core/gump_work/build_turbine-core_turbine-core.html
    Work Name: build_turbine-core_turbine-core (Type: Build)
    Work ended in a state of : Failed
    Elapsed: 38 secs
    Command Line: /opt/maven2/bin/mvn --batch-mode -DskipTests=true --settings /srv/gump/public/workspace/turbine-core/gump_mvn_settings.xml package
    [Working Directory: /srv/gump/public/workspace/turbine-core]
    M2_HOME: /opt/maven2
    ---------------------------------------------
    urls[19] = file:/srv/gump/public/workspace/mvnlocalrepo/shared/xml-apis/xml-apis/1.0.b2/xml-apis-1.0.b2.jar
    urls[20] = file:/srv/gump/public/workspace/mvnlocalrepo/shared/commons-configuration/commons-configuration/1.4/commons-configuration-1.4.jar
    urls[21] = file:/srv/gump/public/workspace/mvnlocalrepo/shared/commons-logging/commons-logging-api/1.0.4/commons-logging-api-1.0.4.jar
    urls[22] = file:/srv/gump/public/workspace/mvnlocalrepo/shared/commons-digester/commons-digester/1.8/commons-digester-1.8.jar
    urls[23] = file:/srv/gump/public/workspace/mvnlocalrepo/shared/commons-beanutils/commons-beanutils/1.7.0/commons-beanutils-1.7.0.jar
    urls[24] = file:/srv/gump/public/workspace/mvnlocalrepo/shared/commons-beanutils/commons-beanutils-core/1.7.0/commons-beanutils-core-1.7.0.jar
    urls[25] = file:/srv/gump/public/workspace/mvnlocalrepo/shared/commons-codec/commons-codec/1.3/commons-codec-1.3.jar
    urls[26] = file:/srv/gump/public/workspace/mvnlocalrepo/shared/commons-jxpath/commons-jxpath/1.2/commons-jxpath-1.2.jar
    urls[27] = file:/srv/gump/public/workspace/mvnlocalrepo/shared/xerces/xerces/1.2.3/xerces-1.2.3.jar
    urls[28] = file:/srv/gump/public/workspace/mvnlocalrepo/shared/ant/ant-optional/1.5.1/ant-optional-1.5.1.jar
    urls[29] = file:/srv/gump/public/workspace/mvnlocalrepo/shared/jdom/jdom/b9/jdom-b9.jar
    Number of imports: 10
    import: org.codehaus.classworlds.Entry@a6c57a42
    import: org.codehaus.classworlds.Entry@12f43f3b
    import: org.codehaus.classworlds.Entry@20025374
    import: org.codehaus.classworlds.Entry@f8e44ca4
    import: org.codehaus.classworlds.Entry@92758522
    import: org.codehaus.classworlds.Entry@ebf2705b
    import: org.codehaus.classworlds.Entry@bb25e54
    import: org.codehaus.classworlds.Entry@bece5185
    import: org.codehaus.classworlds.Entry@3fee8e37
    import: org.codehaus.classworlds.Entry@3fee19d8


    this realm = plexus.core
    urls[0] = file:/opt/maven2/lib/maven-2.2.1-uber.jar
    Number of imports: 10
    import: org.codehaus.classworlds.Entry@a6c57a42
    import: org.codehaus.classworlds.Entry@12f43f3b
    import: org.codehaus.classworlds.Entry@20025374
    import: org.codehaus.classworlds.Entry@f8e44ca4
    import: org.codehaus.classworlds.Entry@92758522
    import: org.codehaus.classworlds.Entry@ebf2705b
    import: org.codehaus.classworlds.Entry@bb25e54
    import: org.codehaus.classworlds.Entry@bece5185
    import: org.codehaus.classworlds.Entry@3fee8e37
    import: org.codehaus.classworlds.Entry@3fee19d8
    -----------------------------------------------------
    [INFO] ------------------------------------------------------------------------
    [ERROR] BUILD ERROR
    [INFO] ------------------------------------------------------------------------
    [INFO] Internal error in the plugin manager executing goal 'org.apache.torque:torque-maven-plugin:3.3:om': Unable to load the mojo 'org.apache.torque:torque-maven-plugin:3.3:om' in the plugin 'org.apache.torque:torque-maven-plugin'. A required class is missing: org/apache/torque/task/TorqueDataModelTask
    org.apache.torque.task.TorqueDataModelTask
    [INFO] ------------------------------------------------------------------------
    [INFO] For more information, run Maven with the -e switch
    [INFO] ------------------------------------------------------------------------
    [INFO] Total time: 38 seconds
    [INFO] Finished at: Thu Mar 03 13:21:51 UTC 2011
    [INFO] Final Memory: 21M/51M
    [INFO] ------------------------------------------------------------------------
    ---------------------------------------------

    To subscribe to this information via syndicated feeds:
    - RSS: http://vmgump.apache.org/gump/public/turbine-core/turbine-core/rss.xml
    - Atom: http://vmgump.apache.org/gump/public/turbine-core/turbine-core/atom.xml

    ============================== Gump Tracking Only ===
    Produced by Apache Gump(TM) version 2.3.
    Gump Run 07000603032011, vmgump.apache.org:vmgump:07000603032011
    Gump E-mail Identifier (unique within run) #38.

    --
    Apache Gump
    http://gump.apache.org/ [Instance: vmgump]

    ---------------------------------------------------------------------
    To unsubscribe, e-mail: dev-unsubscribe@turbine.apache.org
    For additional commands, e-mail: dev-help@turbine.apache.org
  • Anonymous at Mar 5, 2011 at 11:45 am
    To whom it may engage...

    This is an automated request, but not an unsolicited one. For
    more information please visit http://gump.apache.org/nagged.html,
    and/or contact the folk at general@gump.apache.org.

    Project turbine-core has an issue affecting its community integration.
    This issue affects 2 projects,
    and has been outstanding for 15 runs.
    The current state of this project is 'Failed', with reason 'Build Failed'.
    For reference only, the following projects are affected by this:
    - turbine-core : A servlet based framework.
    - turbine-core-test : A servlet based framework.


    Full details are available at:
    http://vmgump.apache.org/gump/public/turbine-core/turbine-core/index.html

    That said, some information snippets are provided here.

    The following annotations (debug/informational/warning/error messages) were provided:
    -INFO- Optional dependency dom4j prerequisite failed with reason update failed
    -INFO- Optional dependency commons-fileupload prerequisite failed with reason build failed
    -INFO- Optional dependency commons-configuration prerequisite failed with reason build failed
    -INFO- Optional dependency httpunit failed with reason build failed
    -DEBUG- (Apache Gump generated) Apache Maven Settings in: /srv/gump/public/workspace/turbine-core/gump_mvn_settings.xml
    -INFO- Failed with reason build failed
    -DEBUG- Maven POM in: /srv/gump/public/workspace/turbine-core/pom.xml
    -INFO- Failed to extract fallback artifacts from Gump Repository



    The following work was performed:
    http://vmgump.apache.org/gump/public/turbine-core/turbine-core/gump_work/build_turbine-core_turbine-core.html
    Work Name: build_turbine-core_turbine-core (Type: Build)
    Work ended in a state of : Failed
    Elapsed: 37 secs
    Command Line: /opt/maven2/bin/mvn --batch-mode -DskipTests=true --settings /srv/gump/public/workspace/turbine-core/gump_mvn_settings.xml package
    [Working Directory: /srv/gump/public/workspace/turbine-core]
    M2_HOME: /opt/maven2
    ---------------------------------------------
    urls[19] = file:/srv/gump/public/workspace/mvnlocalrepo/shared/xml-apis/xml-apis/1.0.b2/xml-apis-1.0.b2.jar
    urls[20] = file:/srv/gump/public/workspace/mvnlocalrepo/shared/commons-configuration/commons-configuration/1.4/commons-configuration-1.4.jar
    urls[21] = file:/srv/gump/public/workspace/mvnlocalrepo/shared/commons-logging/commons-logging-api/1.0.4/commons-logging-api-1.0.4.jar
    urls[22] = file:/srv/gump/public/workspace/mvnlocalrepo/shared/commons-digester/commons-digester/1.8/commons-digester-1.8.jar
    urls[23] = file:/srv/gump/public/workspace/mvnlocalrepo/shared/commons-beanutils/commons-beanutils/1.7.0/commons-beanutils-1.7.0.jar
    urls[24] = file:/srv/gump/public/workspace/mvnlocalrepo/shared/commons-beanutils/commons-beanutils-core/1.7.0/commons-beanutils-core-1.7.0.jar
    urls[25] = file:/srv/gump/public/workspace/mvnlocalrepo/shared/commons-codec/commons-codec/1.3/commons-codec-1.3.jar
    urls[26] = file:/srv/gump/public/workspace/mvnlocalrepo/shared/commons-jxpath/commons-jxpath/1.2/commons-jxpath-1.2.jar
    urls[27] = file:/srv/gump/public/workspace/mvnlocalrepo/shared/xerces/xerces/1.2.3/xerces-1.2.3.jar
    urls[28] = file:/srv/gump/public/workspace/mvnlocalrepo/shared/ant/ant-optional/1.5.1/ant-optional-1.5.1.jar
    urls[29] = file:/srv/gump/public/workspace/mvnlocalrepo/shared/jdom/jdom/b9/jdom-b9.jar
    Number of imports: 10
    import: org.codehaus.classworlds.Entry@a6c57a42
    import: org.codehaus.classworlds.Entry@12f43f3b
    import: org.codehaus.classworlds.Entry@20025374
    import: org.codehaus.classworlds.Entry@f8e44ca4
    import: org.codehaus.classworlds.Entry@92758522
    import: org.codehaus.classworlds.Entry@ebf2705b
    import: org.codehaus.classworlds.Entry@bb25e54
    import: org.codehaus.classworlds.Entry@bece5185
    import: org.codehaus.classworlds.Entry@3fee8e37
    import: org.codehaus.classworlds.Entry@3fee19d8


    this realm = plexus.core
    urls[0] = file:/opt/maven2/lib/maven-2.2.1-uber.jar
    Number of imports: 10
    import: org.codehaus.classworlds.Entry@a6c57a42
    import: org.codehaus.classworlds.Entry@12f43f3b
    import: org.codehaus.classworlds.Entry@20025374
    import: org.codehaus.classworlds.Entry@f8e44ca4
    import: org.codehaus.classworlds.Entry@92758522
    import: org.codehaus.classworlds.Entry@ebf2705b
    import: org.codehaus.classworlds.Entry@bb25e54
    import: org.codehaus.classworlds.Entry@bece5185
    import: org.codehaus.classworlds.Entry@3fee8e37
    import: org.codehaus.classworlds.Entry@3fee19d8
    -----------------------------------------------------
    [INFO] ------------------------------------------------------------------------
    [ERROR] BUILD ERROR
    [INFO] ------------------------------------------------------------------------
    [INFO] Internal error in the plugin manager executing goal 'org.apache.torque:torque-maven-plugin:3.3:om': Unable to load the mojo 'org.apache.torque:torque-maven-plugin:3.3:om' in the plugin 'org.apache.torque:torque-maven-plugin'. A required class is missing: org/apache/torque/task/TorqueDataModelTask
    org.apache.torque.task.TorqueDataModelTask
    [INFO] ------------------------------------------------------------------------
    [INFO] For more information, run Maven with the -e switch
    [INFO] ------------------------------------------------------------------------
    [INFO] Total time: 35 seconds
    [INFO] Finished at: Sat Mar 05 11:45:26 UTC 2011
    [INFO] Final Memory: 21M/51M
    [INFO] ------------------------------------------------------------------------
    ---------------------------------------------

    To subscribe to this information via syndicated feeds:
    - RSS: http://vmgump.apache.org/gump/public/turbine-core/turbine-core/rss.xml
    - Atom: http://vmgump.apache.org/gump/public/turbine-core/turbine-core/atom.xml

    ============================== Gump Tracking Only ===
    Produced by Apache Gump(TM) version 2.3.
    Gump Run 06000605032011, vmgump.apache.org:vmgump:06000605032011
    Gump E-mail Identifier (unique within run) #37.

    --
    Apache Gump
    http://gump.apache.org/ [Instance: vmgump]

    ---------------------------------------------------------------------
    To unsubscribe, e-mail: dev-unsubscribe@turbine.apache.org
    For additional commands, e-mail: dev-help@turbine.apache.org
  • Anonymous at Mar 9, 2011 at 12:36 pm
    To whom it may engage...

    This is an automated request, but not an unsolicited one. For
    more information please visit http://gump.apache.org/nagged.html,
    and/or contact the folk at general@gump.apache.org.

    Project turbine-core has an issue affecting its community integration.
    This issue affects 2 projects,
    and has been outstanding for 23 runs.
    The current state of this project is 'Failed', with reason 'Build Failed'.
    For reference only, the following projects are affected by this:
    - turbine-core : A servlet based framework.
    - turbine-core-test : A servlet based framework.


    Full details are available at:
    http://vmgump.apache.org/gump/public/turbine-core/turbine-core/index.html

    That said, some information snippets are provided here.

    The following annotations (debug/informational/warning/error messages) were provided:
    -INFO- Optional dependency dom4j prerequisite failed with reason build timed out
    -INFO- Optional dependency commons-fileupload prerequisite failed with reason build failed
    -INFO- Optional dependency commons-configuration prerequisite failed with reason build failed
    -INFO- Optional dependency httpunit failed with reason build failed
    -DEBUG- (Apache Gump generated) Apache Maven Settings in: /srv/gump/public/workspace/turbine-core/gump_mvn_settings.xml
    -INFO- Failed with reason build failed
    -DEBUG- Maven POM in: /srv/gump/public/workspace/turbine-core/pom.xml
    -INFO- Failed to extract fallback artifacts from Gump Repository



    The following work was performed:
    http://vmgump.apache.org/gump/public/turbine-core/turbine-core/gump_work/build_turbine-core_turbine-core.html
    Work Name: build_turbine-core_turbine-core (Type: Build)
    Work ended in a state of : Failed
    Elapsed: 19 secs
    Command Line: /opt/maven2/bin/mvn --batch-mode -DskipTests=true --settings /srv/gump/public/workspace/turbine-core/gump_mvn_settings.xml package
    [Working Directory: /srv/gump/public/workspace/turbine-core]
    M2_HOME: /opt/maven2
    ---------------------------------------------
    urls[19] = file:/srv/gump/public/workspace/mvnlocalrepo/shared/xml-apis/xml-apis/1.0.b2/xml-apis-1.0.b2.jar
    urls[20] = file:/srv/gump/public/workspace/mvnlocalrepo/shared/commons-configuration/commons-configuration/1.4/commons-configuration-1.4.jar
    urls[21] = file:/srv/gump/public/workspace/mvnlocalrepo/shared/commons-logging/commons-logging-api/1.0.4/commons-logging-api-1.0.4.jar
    urls[22] = file:/srv/gump/public/workspace/mvnlocalrepo/shared/commons-digester/commons-digester/1.8/commons-digester-1.8.jar
    urls[23] = file:/srv/gump/public/workspace/mvnlocalrepo/shared/commons-beanutils/commons-beanutils/1.7.0/commons-beanutils-1.7.0.jar
    urls[24] = file:/srv/gump/public/workspace/mvnlocalrepo/shared/commons-beanutils/commons-beanutils-core/1.7.0/commons-beanutils-core-1.7.0.jar
    urls[25] = file:/srv/gump/public/workspace/mvnlocalrepo/shared/commons-codec/commons-codec/1.3/commons-codec-1.3.jar
    urls[26] = file:/srv/gump/public/workspace/mvnlocalrepo/shared/commons-jxpath/commons-jxpath/1.2/commons-jxpath-1.2.jar
    urls[27] = file:/srv/gump/public/workspace/mvnlocalrepo/shared/xerces/xerces/1.2.3/xerces-1.2.3.jar
    urls[28] = file:/srv/gump/public/workspace/mvnlocalrepo/shared/ant/ant-optional/1.5.1/ant-optional-1.5.1.jar
    urls[29] = file:/srv/gump/public/workspace/mvnlocalrepo/shared/jdom/jdom/b9/jdom-b9.jar
    Number of imports: 10
    import: org.codehaus.classworlds.Entry@a6c57a42
    import: org.codehaus.classworlds.Entry@12f43f3b
    import: org.codehaus.classworlds.Entry@20025374
    import: org.codehaus.classworlds.Entry@f8e44ca4
    import: org.codehaus.classworlds.Entry@92758522
    import: org.codehaus.classworlds.Entry@ebf2705b
    import: org.codehaus.classworlds.Entry@bb25e54
    import: org.codehaus.classworlds.Entry@bece5185
    import: org.codehaus.classworlds.Entry@3fee8e37
    import: org.codehaus.classworlds.Entry@3fee19d8


    this realm = plexus.core
    urls[0] = file:/opt/maven2/lib/maven-2.2.1-uber.jar
    Number of imports: 10
    import: org.codehaus.classworlds.Entry@a6c57a42
    import: org.codehaus.classworlds.Entry@12f43f3b
    import: org.codehaus.classworlds.Entry@20025374
    import: org.codehaus.classworlds.Entry@f8e44ca4
    import: org.codehaus.classworlds.Entry@92758522
    import: org.codehaus.classworlds.Entry@ebf2705b
    import: org.codehaus.classworlds.Entry@bb25e54
    import: org.codehaus.classworlds.Entry@bece5185
    import: org.codehaus.classworlds.Entry@3fee8e37
    import: org.codehaus.classworlds.Entry@3fee19d8
    -----------------------------------------------------
    [INFO] ------------------------------------------------------------------------
    [ERROR] BUILD ERROR
    [INFO] ------------------------------------------------------------------------
    [INFO] Internal error in the plugin manager executing goal 'org.apache.torque:torque-maven-plugin:3.3:om': Unable to load the mojo 'org.apache.torque:torque-maven-plugin:3.3:om' in the plugin 'org.apache.torque:torque-maven-plugin'. A required class is missing: org/apache/torque/task/TorqueDataModelTask
    org.apache.torque.task.TorqueDataModelTask
    [INFO] ------------------------------------------------------------------------
    [INFO] For more information, run Maven with the -e switch
    [INFO] ------------------------------------------------------------------------
    [INFO] Total time: 18 seconds
    [INFO] Finished at: Wed Mar 09 12:36:29 UTC 2011
    [INFO] Final Memory: 21M/51M
    [INFO] ------------------------------------------------------------------------
    ---------------------------------------------

    To subscribe to this information via syndicated feeds:
    - RSS: http://vmgump.apache.org/gump/public/turbine-core/turbine-core/rss.xml
    - Atom: http://vmgump.apache.org/gump/public/turbine-core/turbine-core/atom.xml

    ============================== Gump Tracking Only ===
    Produced by Apache Gump(TM) version 2.3.
    Gump Run 05000609032011, vmgump.apache.org:vmgump:05000609032011
    Gump E-mail Identifier (unique within run) #30.

    --
    Apache Gump
    http://gump.apache.org/ [Instance: vmgump]

    ---------------------------------------------------------------------
    To unsubscribe, e-mail: dev-unsubscribe@turbine.apache.org
    For additional commands, e-mail: dev-help@turbine.apache.org
  • Anonymous at Mar 10, 2011 at 12:18 pm
    To whom it may engage...

    This is an automated request, but not an unsolicited one. For
    more information please visit http://gump.apache.org/nagged.html,
    and/or contact the folk at general@gump.apache.org.

    Project turbine-core has an issue affecting its community integration.
    This issue affects 2 projects,
    and has been outstanding for 25 runs.
    The current state of this project is 'Failed', with reason 'Build Failed'.
    For reference only, the following projects are affected by this:
    - turbine-core : A servlet based framework.
    - turbine-core-test : A servlet based framework.


    Full details are available at:
    http://vmgump.apache.org/gump/public/turbine-core/turbine-core/index.html

    That said, some information snippets are provided here.

    The following annotations (debug/informational/warning/error messages) were provided:
    -INFO- Optional dependency commons-fileupload prerequisite failed with reason build failed
    -INFO- Optional dependency commons-configuration prerequisite failed with reason build failed
    -INFO- Optional dependency httpunit failed with reason build failed
    -DEBUG- (Apache Gump generated) Apache Maven Settings in: /srv/gump/public/workspace/turbine-core/gump_mvn_settings.xml
    -INFO- Failed with reason build failed
    -DEBUG- Maven POM in: /srv/gump/public/workspace/turbine-core/pom.xml
    -INFO- Failed to extract fallback artifacts from Gump Repository



    The following work was performed:
    http://vmgump.apache.org/gump/public/turbine-core/turbine-core/gump_work/build_turbine-core_turbine-core.html
    Work Name: build_turbine-core_turbine-core (Type: Build)
    Work ended in a state of : Failed
    Elapsed: 38 secs
    Command Line: /opt/maven2/bin/mvn --batch-mode -DskipTests=true --settings /srv/gump/public/workspace/turbine-core/gump_mvn_settings.xml package
    [Working Directory: /srv/gump/public/workspace/turbine-core]
    M2_HOME: /opt/maven2
    ---------------------------------------------
    urls[19] = file:/srv/gump/public/workspace/mvnlocalrepo/shared/xml-apis/xml-apis/1.0.b2/xml-apis-1.0.b2.jar
    urls[20] = file:/srv/gump/public/workspace/mvnlocalrepo/shared/commons-configuration/commons-configuration/1.4/commons-configuration-1.4.jar
    urls[21] = file:/srv/gump/public/workspace/mvnlocalrepo/shared/commons-logging/commons-logging-api/1.0.4/commons-logging-api-1.0.4.jar
    urls[22] = file:/srv/gump/public/workspace/mvnlocalrepo/shared/commons-digester/commons-digester/1.8/commons-digester-1.8.jar
    urls[23] = file:/srv/gump/public/workspace/mvnlocalrepo/shared/commons-beanutils/commons-beanutils/1.7.0/commons-beanutils-1.7.0.jar
    urls[24] = file:/srv/gump/public/workspace/mvnlocalrepo/shared/commons-beanutils/commons-beanutils-core/1.7.0/commons-beanutils-core-1.7.0.jar
    urls[25] = file:/srv/gump/public/workspace/mvnlocalrepo/shared/commons-codec/commons-codec/1.3/commons-codec-1.3.jar
    urls[26] = file:/srv/gump/public/workspace/mvnlocalrepo/shared/commons-jxpath/commons-jxpath/1.2/commons-jxpath-1.2.jar
    urls[27] = file:/srv/gump/public/workspace/mvnlocalrepo/shared/xerces/xerces/1.2.3/xerces-1.2.3.jar
    urls[28] = file:/srv/gump/public/workspace/mvnlocalrepo/shared/ant/ant-optional/1.5.1/ant-optional-1.5.1.jar
    urls[29] = file:/srv/gump/public/workspace/mvnlocalrepo/shared/jdom/jdom/b9/jdom-b9.jar
    Number of imports: 10
    import: org.codehaus.classworlds.Entry@a6c57a42
    import: org.codehaus.classworlds.Entry@12f43f3b
    import: org.codehaus.classworlds.Entry@20025374
    import: org.codehaus.classworlds.Entry@f8e44ca4
    import: org.codehaus.classworlds.Entry@92758522
    import: org.codehaus.classworlds.Entry@ebf2705b
    import: org.codehaus.classworlds.Entry@bb25e54
    import: org.codehaus.classworlds.Entry@bece5185
    import: org.codehaus.classworlds.Entry@3fee8e37
    import: org.codehaus.classworlds.Entry@3fee19d8


    this realm = plexus.core
    urls[0] = file:/opt/maven2/lib/maven-2.2.1-uber.jar
    Number of imports: 10
    import: org.codehaus.classworlds.Entry@a6c57a42
    import: org.codehaus.classworlds.Entry@12f43f3b
    import: org.codehaus.classworlds.Entry@20025374
    import: org.codehaus.classworlds.Entry@f8e44ca4
    import: org.codehaus.classworlds.Entry@92758522
    import: org.codehaus.classworlds.Entry@ebf2705b
    import: org.codehaus.classworlds.Entry@bb25e54
    import: org.codehaus.classworlds.Entry@bece5185
    import: org.codehaus.classworlds.Entry@3fee8e37
    import: org.codehaus.classworlds.Entry@3fee19d8
    -----------------------------------------------------
    [INFO] ------------------------------------------------------------------------
    [ERROR] BUILD ERROR
    [INFO] ------------------------------------------------------------------------
    [INFO] Internal error in the plugin manager executing goal 'org.apache.torque:torque-maven-plugin:3.3:om': Unable to load the mojo 'org.apache.torque:torque-maven-plugin:3.3:om' in the plugin 'org.apache.torque:torque-maven-plugin'. A required class is missing: org/apache/torque/task/TorqueDataModelTask
    org.apache.torque.task.TorqueDataModelTask
    [INFO] ------------------------------------------------------------------------
    [INFO] For more information, run Maven with the -e switch
    [INFO] ------------------------------------------------------------------------
    [INFO] Total time: 38 seconds
    [INFO] Finished at: Thu Mar 10 12:18:16 UTC 2011
    [INFO] Final Memory: 21M/51M
    [INFO] ------------------------------------------------------------------------
    ---------------------------------------------

    To subscribe to this information via syndicated feeds:
    - RSS: http://vmgump.apache.org/gump/public/turbine-core/turbine-core/rss.xml
    - Atom: http://vmgump.apache.org/gump/public/turbine-core/turbine-core/atom.xml

    ============================== Gump Tracking Only ===
    Produced by Apache Gump(TM) version 2.3.
    Gump Run 06000610032011, vmgump.apache.org:vmgump:06000610032011
    Gump E-mail Identifier (unique within run) #32.

    --
    Apache Gump
    http://gump.apache.org/ [Instance: vmgump]

    ---------------------------------------------------------------------
    To unsubscribe, e-mail: dev-unsubscribe@turbine.apache.org
    For additional commands, e-mail: dev-help@turbine.apache.org
  • Anonymous at Mar 12, 2011 at 12:20 pm
    To whom it may engage...

    This is an automated request, but not an unsolicited one. For
    more information please visit http://gump.apache.org/nagged.html,
    and/or contact the folk at general@gump.apache.org.

    Project turbine-core has an issue affecting its community integration.
    This issue affects 2 projects,
    and has been outstanding for 28 runs.
    The current state of this project is 'Failed', with reason 'Build Failed'.
    For reference only, the following projects are affected by this:
    - turbine-core : A servlet based framework.
    - turbine-core-test : A servlet based framework.


    Full details are available at:
    http://vmgump.apache.org/gump/public/turbine-core/turbine-core/index.html

    That said, some information snippets are provided here.

    The following annotations (debug/informational/warning/error messages) were provided:
    -INFO- Optional dependency commons-fileupload prerequisite failed with reason build failed
    -INFO- Optional dependency commons-configuration prerequisite failed with reason build failed
    -INFO- Optional dependency httpunit failed with reason build failed
    -DEBUG- (Apache Gump generated) Apache Maven Settings in: /srv/gump/public/workspace/turbine-core/gump_mvn_settings.xml
    -INFO- Failed with reason build failed
    -DEBUG- Maven POM in: /srv/gump/public/workspace/turbine-core/pom.xml
    -INFO- Failed to extract fallback artifacts from Gump Repository



    The following work was performed:
    http://vmgump.apache.org/gump/public/turbine-core/turbine-core/gump_work/build_turbine-core_turbine-core.html
    Work Name: build_turbine-core_turbine-core (Type: Build)
    Work ended in a state of : Failed
    Elapsed: 34 secs
    Command Line: /opt/maven2/bin/mvn --batch-mode -DskipTests=true --settings /srv/gump/public/workspace/turbine-core/gump_mvn_settings.xml package
    [Working Directory: /srv/gump/public/workspace/turbine-core]
    M2_HOME: /opt/maven2
    ---------------------------------------------
    urls[19] = file:/srv/gump/public/workspace/mvnlocalrepo/shared/xml-apis/xml-apis/1.0.b2/xml-apis-1.0.b2.jar
    urls[20] = file:/srv/gump/public/workspace/mvnlocalrepo/shared/commons-configuration/commons-configuration/1.4/commons-configuration-1.4.jar
    urls[21] = file:/srv/gump/public/workspace/mvnlocalrepo/shared/commons-logging/commons-logging-api/1.0.4/commons-logging-api-1.0.4.jar
    urls[22] = file:/srv/gump/public/workspace/mvnlocalrepo/shared/commons-digester/commons-digester/1.8/commons-digester-1.8.jar
    urls[23] = file:/srv/gump/public/workspace/mvnlocalrepo/shared/commons-beanutils/commons-beanutils/1.7.0/commons-beanutils-1.7.0.jar
    urls[24] = file:/srv/gump/public/workspace/mvnlocalrepo/shared/commons-beanutils/commons-beanutils-core/1.7.0/commons-beanutils-core-1.7.0.jar
    urls[25] = file:/srv/gump/public/workspace/mvnlocalrepo/shared/commons-codec/commons-codec/1.3/commons-codec-1.3.jar
    urls[26] = file:/srv/gump/public/workspace/mvnlocalrepo/shared/commons-jxpath/commons-jxpath/1.2/commons-jxpath-1.2.jar
    urls[27] = file:/srv/gump/public/workspace/mvnlocalrepo/shared/xerces/xerces/1.2.3/xerces-1.2.3.jar
    urls[28] = file:/srv/gump/public/workspace/mvnlocalrepo/shared/ant/ant-optional/1.5.1/ant-optional-1.5.1.jar
    urls[29] = file:/srv/gump/public/workspace/mvnlocalrepo/shared/jdom/jdom/b9/jdom-b9.jar
    Number of imports: 10
    import: org.codehaus.classworlds.Entry@a6c57a42
    import: org.codehaus.classworlds.Entry@12f43f3b
    import: org.codehaus.classworlds.Entry@20025374
    import: org.codehaus.classworlds.Entry@f8e44ca4
    import: org.codehaus.classworlds.Entry@92758522
    import: org.codehaus.classworlds.Entry@ebf2705b
    import: org.codehaus.classworlds.Entry@bb25e54
    import: org.codehaus.classworlds.Entry@bece5185
    import: org.codehaus.classworlds.Entry@3fee8e37
    import: org.codehaus.classworlds.Entry@3fee19d8


    this realm = plexus.core
    urls[0] = file:/opt/maven2/lib/maven-2.2.1-uber.jar
    Number of imports: 10
    import: org.codehaus.classworlds.Entry@a6c57a42
    import: org.codehaus.classworlds.Entry@12f43f3b
    import: org.codehaus.classworlds.Entry@20025374
    import: org.codehaus.classworlds.Entry@f8e44ca4
    import: org.codehaus.classworlds.Entry@92758522
    import: org.codehaus.classworlds.Entry@ebf2705b
    import: org.codehaus.classworlds.Entry@bb25e54
    import: org.codehaus.classworlds.Entry@bece5185
    import: org.codehaus.classworlds.Entry@3fee8e37
    import: org.codehaus.classworlds.Entry@3fee19d8
    -----------------------------------------------------
    [INFO] ------------------------------------------------------------------------
    [ERROR] BUILD ERROR
    [INFO] ------------------------------------------------------------------------
    [INFO] Internal error in the plugin manager executing goal 'org.apache.torque:torque-maven-plugin:3.3:om': Unable to load the mojo 'org.apache.torque:torque-maven-plugin:3.3:om' in the plugin 'org.apache.torque:torque-maven-plugin'. A required class is missing: org/apache/torque/task/TorqueDataModelTask
    org.apache.torque.task.TorqueDataModelTask
    [INFO] ------------------------------------------------------------------------
    [INFO] For more information, run Maven with the -e switch
    [INFO] ------------------------------------------------------------------------
    [INFO] Total time: 33 seconds
    [INFO] Finished at: Sat Mar 12 12:20:27 UTC 2011
    [INFO] Final Memory: 21M/51M
    [INFO] ------------------------------------------------------------------------
    ---------------------------------------------

    To subscribe to this information via syndicated feeds:
    - RSS: http://vmgump.apache.org/gump/public/turbine-core/turbine-core/rss.xml
    - Atom: http://vmgump.apache.org/gump/public/turbine-core/turbine-core/atom.xml

    ============================== Gump Tracking Only ===
    Produced by Apache Gump(TM) version 2.3.
    Gump Run 06000612032011, vmgump.apache.org:vmgump:06000612032011
    Gump E-mail Identifier (unique within run) #34.

    --
    Apache Gump
    http://gump.apache.org/ [Instance: vmgump]

    ---------------------------------------------------------------------
    To unsubscribe, e-mail: dev-unsubscribe@turbine.apache.org
    For additional commands, e-mail: dev-help@turbine.apache.org
  • Anonymous at Mar 13, 2011 at 12:19 pm
    To whom it may engage...

    This is an automated request, but not an unsolicited one. For
    more information please visit http://gump.apache.org/nagged.html,
    and/or contact the folk at general@gump.apache.org.

    Project turbine-core has an issue affecting its community integration.
    This issue affects 2 projects,
    and has been outstanding for 30 runs.
    The current state of this project is 'Failed', with reason 'Build Failed'.
    For reference only, the following projects are affected by this:
    - turbine-core : A servlet based framework.
    - turbine-core-test : A servlet based framework.


    Full details are available at:
    http://vmgump.apache.org/gump/public/turbine-core/turbine-core/index.html

    That said, some information snippets are provided here.

    The following annotations (debug/informational/warning/error messages) were provided:
    -INFO- Optional dependency commons-fileupload prerequisite failed with reason build failed
    -INFO- Optional dependency commons-configuration prerequisite failed with reason build failed
    -INFO- Optional dependency httpunit failed with reason build failed
    -DEBUG- (Apache Gump generated) Apache Maven Settings in: /srv/gump/public/workspace/turbine-core/gump_mvn_settings.xml
    -INFO- Failed with reason build failed
    -DEBUG- Maven POM in: /srv/gump/public/workspace/turbine-core/pom.xml
    -INFO- Failed to extract fallback artifacts from Gump Repository



    The following work was performed:
    http://vmgump.apache.org/gump/public/turbine-core/turbine-core/gump_work/build_turbine-core_turbine-core.html
    Work Name: build_turbine-core_turbine-core (Type: Build)
    Work ended in a state of : Failed
    Elapsed: 35 secs
    Command Line: /opt/maven2/bin/mvn --batch-mode -DskipTests=true --settings /srv/gump/public/workspace/turbine-core/gump_mvn_settings.xml package
    [Working Directory: /srv/gump/public/workspace/turbine-core]
    M2_HOME: /opt/maven2
    ---------------------------------------------
    urls[19] = file:/srv/gump/public/workspace/mvnlocalrepo/shared/xml-apis/xml-apis/1.0.b2/xml-apis-1.0.b2.jar
    urls[20] = file:/srv/gump/public/workspace/mvnlocalrepo/shared/commons-configuration/commons-configuration/1.4/commons-configuration-1.4.jar
    urls[21] = file:/srv/gump/public/workspace/mvnlocalrepo/shared/commons-logging/commons-logging-api/1.0.4/commons-logging-api-1.0.4.jar
    urls[22] = file:/srv/gump/public/workspace/mvnlocalrepo/shared/commons-digester/commons-digester/1.8/commons-digester-1.8.jar
    urls[23] = file:/srv/gump/public/workspace/mvnlocalrepo/shared/commons-beanutils/commons-beanutils/1.7.0/commons-beanutils-1.7.0.jar
    urls[24] = file:/srv/gump/public/workspace/mvnlocalrepo/shared/commons-beanutils/commons-beanutils-core/1.7.0/commons-beanutils-core-1.7.0.jar
    urls[25] = file:/srv/gump/public/workspace/mvnlocalrepo/shared/commons-codec/commons-codec/1.3/commons-codec-1.3.jar
    urls[26] = file:/srv/gump/public/workspace/mvnlocalrepo/shared/commons-jxpath/commons-jxpath/1.2/commons-jxpath-1.2.jar
    urls[27] = file:/srv/gump/public/workspace/mvnlocalrepo/shared/xerces/xerces/1.2.3/xerces-1.2.3.jar
    urls[28] = file:/srv/gump/public/workspace/mvnlocalrepo/shared/ant/ant-optional/1.5.1/ant-optional-1.5.1.jar
    urls[29] = file:/srv/gump/public/workspace/mvnlocalrepo/shared/jdom/jdom/b9/jdom-b9.jar
    Number of imports: 10
    import: org.codehaus.classworlds.Entry@a6c57a42
    import: org.codehaus.classworlds.Entry@12f43f3b
    import: org.codehaus.classworlds.Entry@20025374
    import: org.codehaus.classworlds.Entry@f8e44ca4
    import: org.codehaus.classworlds.Entry@92758522
    import: org.codehaus.classworlds.Entry@ebf2705b
    import: org.codehaus.classworlds.Entry@bb25e54
    import: org.codehaus.classworlds.Entry@bece5185
    import: org.codehaus.classworlds.Entry@3fee8e37
    import: org.codehaus.classworlds.Entry@3fee19d8


    this realm = plexus.core
    urls[0] = file:/opt/maven2/lib/maven-2.2.1-uber.jar
    Number of imports: 10
    import: org.codehaus.classworlds.Entry@a6c57a42
    import: org.codehaus.classworlds.Entry@12f43f3b
    import: org.codehaus.classworlds.Entry@20025374
    import: org.codehaus.classworlds.Entry@f8e44ca4
    import: org.codehaus.classworlds.Entry@92758522
    import: org.codehaus.classworlds.Entry@ebf2705b
    import: org.codehaus.classworlds.Entry@bb25e54
    import: org.codehaus.classworlds.Entry@bece5185
    import: org.codehaus.classworlds.Entry@3fee8e37
    import: org.codehaus.classworlds.Entry@3fee19d8
    -----------------------------------------------------
    [INFO] ------------------------------------------------------------------------
    [ERROR] BUILD ERROR
    [INFO] ------------------------------------------------------------------------
    [INFO] Internal error in the plugin manager executing goal 'org.apache.torque:torque-maven-plugin:3.3:om': Unable to load the mojo 'org.apache.torque:torque-maven-plugin:3.3:om' in the plugin 'org.apache.torque:torque-maven-plugin'. A required class is missing: org/apache/torque/task/TorqueDataModelTask
    org.apache.torque.task.TorqueDataModelTask
    [INFO] ------------------------------------------------------------------------
    [INFO] For more information, run Maven with the -e switch
    [INFO] ------------------------------------------------------------------------
    [INFO] Total time: 34 seconds
    [INFO] Finished at: Sun Mar 13 12:19:16 UTC 2011
    [INFO] Final Memory: 21M/51M
    [INFO] ------------------------------------------------------------------------
    ---------------------------------------------

    To subscribe to this information via syndicated feeds:
    - RSS: http://vmgump.apache.org/gump/public/turbine-core/turbine-core/rss.xml
    - Atom: http://vmgump.apache.org/gump/public/turbine-core/turbine-core/atom.xml

    ============================== Gump Tracking Only ===
    Produced by Apache Gump(TM) version 2.3.
    Gump Run 06000613032011, vmgump.apache.org:vmgump:06000613032011
    Gump E-mail Identifier (unique within run) #34.

    --
    Apache Gump
    http://gump.apache.org/ [Instance: vmgump]

    ---------------------------------------------------------------------
    To unsubscribe, e-mail: dev-unsubscribe@turbine.apache.org
    For additional commands, e-mail: dev-help@turbine.apache.org
  • Anonymous at Mar 14, 2011 at 12:15 pm
    To whom it may engage...

    This is an automated request, but not an unsolicited one. For
    more information please visit http://gump.apache.org/nagged.html,
    and/or contact the folk at general@gump.apache.org.

    Project turbine-core has an issue affecting its community integration.
    This issue affects 2 projects,
    and has been outstanding for 32 runs.
    The current state of this project is 'Failed', with reason 'Build Failed'.
    For reference only, the following projects are affected by this:
    - turbine-core : A servlet based framework.
    - turbine-core-test : A servlet based framework.


    Full details are available at:
    http://vmgump.apache.org/gump/public/turbine-core/turbine-core/index.html

    That said, some information snippets are provided here.

    The following annotations (debug/informational/warning/error messages) were provided:
    -INFO- Optional dependency velocity-engine prerequisite failed with reason build failed
    -INFO- Optional dependency dom4j prerequisite failed with reason build failed
    -INFO- Optional dependency mx4j-tools prerequisite failed with reason build failed
    -INFO- Optional dependency mx4j prerequisite failed with reason build failed
    -INFO- Optional dependency xalan prerequisite failed with reason build failed
    -INFO- Optional dependency commons-fileupload prerequisite failed with reason build failed
    -INFO- Optional dependency commons-configuration prerequisite failed with reason build failed
    -INFO- Optional dependency httpunit failed with reason build failed
    -DEBUG- (Apache Gump generated) Apache Maven Settings in: /srv/gump/public/workspace/turbine-core/gump_mvn_settings.xml
    -INFO- Failed with reason build failed
    -DEBUG- Maven POM in: /srv/gump/public/workspace/turbine-core/pom.xml
    -INFO- Failed to extract fallback artifacts from Gump Repository



    The following work was performed:
    http://vmgump.apache.org/gump/public/turbine-core/turbine-core/gump_work/build_turbine-core_turbine-core.html
    Work Name: build_turbine-core_turbine-core (Type: Build)
    Work ended in a state of : Failed
    Elapsed: 33 secs
    Command Line: /opt/maven2/bin/mvn --batch-mode -DskipTests=true --settings /srv/gump/public/workspace/turbine-core/gump_mvn_settings.xml package
    [Working Directory: /srv/gump/public/workspace/turbine-core]
    M2_HOME: /opt/maven2
    ---------------------------------------------
    urls[19] = file:/srv/gump/public/workspace/mvnlocalrepo/shared/xml-apis/xml-apis/1.0.b2/xml-apis-1.0.b2.jar
    urls[20] = file:/srv/gump/public/workspace/mvnlocalrepo/shared/commons-configuration/commons-configuration/1.4/commons-configuration-1.4.jar
    urls[21] = file:/srv/gump/public/workspace/mvnlocalrepo/shared/commons-logging/commons-logging-api/1.0.4/commons-logging-api-1.0.4.jar
    urls[22] = file:/srv/gump/public/workspace/mvnlocalrepo/shared/commons-digester/commons-digester/1.8/commons-digester-1.8.jar
    urls[23] = file:/srv/gump/public/workspace/mvnlocalrepo/shared/commons-beanutils/commons-beanutils/1.7.0/commons-beanutils-1.7.0.jar
    urls[24] = file:/srv/gump/public/workspace/mvnlocalrepo/shared/commons-beanutils/commons-beanutils-core/1.7.0/commons-beanutils-core-1.7.0.jar
    urls[25] = file:/srv/gump/public/workspace/mvnlocalrepo/shared/commons-codec/commons-codec/1.3/commons-codec-1.3.jar
    urls[26] = file:/srv/gump/public/workspace/mvnlocalrepo/shared/commons-jxpath/commons-jxpath/1.2/commons-jxpath-1.2.jar
    urls[27] = file:/srv/gump/public/workspace/mvnlocalrepo/shared/xerces/xerces/1.2.3/xerces-1.2.3.jar
    urls[28] = file:/srv/gump/public/workspace/mvnlocalrepo/shared/ant/ant-optional/1.5.1/ant-optional-1.5.1.jar
    urls[29] = file:/srv/gump/public/workspace/mvnlocalrepo/shared/jdom/jdom/b9/jdom-b9.jar
    Number of imports: 10
    import: org.codehaus.classworlds.Entry@a6c57a42
    import: org.codehaus.classworlds.Entry@12f43f3b
    import: org.codehaus.classworlds.Entry@20025374
    import: org.codehaus.classworlds.Entry@f8e44ca4
    import: org.codehaus.classworlds.Entry@92758522
    import: org.codehaus.classworlds.Entry@ebf2705b
    import: org.codehaus.classworlds.Entry@bb25e54
    import: org.codehaus.classworlds.Entry@bece5185
    import: org.codehaus.classworlds.Entry@3fee8e37
    import: org.codehaus.classworlds.Entry@3fee19d8


    this realm = plexus.core
    urls[0] = file:/opt/maven2/lib/maven-2.2.1-uber.jar
    Number of imports: 10
    import: org.codehaus.classworlds.Entry@a6c57a42
    import: org.codehaus.classworlds.Entry@12f43f3b
    import: org.codehaus.classworlds.Entry@20025374
    import: org.codehaus.classworlds.Entry@f8e44ca4
    import: org.codehaus.classworlds.Entry@92758522
    import: org.codehaus.classworlds.Entry@ebf2705b
    import: org.codehaus.classworlds.Entry@bb25e54
    import: org.codehaus.classworlds.Entry@bece5185
    import: org.codehaus.classworlds.Entry@3fee8e37
    import: org.codehaus.classworlds.Entry@3fee19d8
    -----------------------------------------------------
    [INFO] ------------------------------------------------------------------------
    [ERROR] BUILD ERROR
    [INFO] ------------------------------------------------------------------------
    [INFO] Internal error in the plugin manager executing goal 'org.apache.torque:torque-maven-plugin:3.3:om': Unable to load the mojo 'org.apache.torque:torque-maven-plugin:3.3:om' in the plugin 'org.apache.torque:torque-maven-plugin'. A required class is missing: org/apache/torque/task/TorqueDataModelTask
    org.apache.torque.task.TorqueDataModelTask
    [INFO] ------------------------------------------------------------------------
    [INFO] For more information, run Maven with the -e switch
    [INFO] ------------------------------------------------------------------------
    [INFO] Total time: 33 seconds
    [INFO] Finished at: Mon Mar 14 12:14:59 UTC 2011
    [INFO] Final Memory: 21M/51M
    [INFO] ------------------------------------------------------------------------
    ---------------------------------------------

    To subscribe to this information via syndicated feeds:
    - RSS: http://vmgump.apache.org/gump/public/turbine-core/turbine-core/rss.xml
    - Atom: http://vmgump.apache.org/gump/public/turbine-core/turbine-core/atom.xml

    ============================== Gump Tracking Only ===
    Produced by Apache Gump(TM) version 2.3.
    Gump Run 06000614032011, vmgump.apache.org:vmgump:06000614032011
    Gump E-mail Identifier (unique within run) #28.

    --
    Apache Gump
    http://gump.apache.org/ [Instance: vmgump]

    ---------------------------------------------------------------------
    To unsubscribe, e-mail: dev-unsubscribe@turbine.apache.org
    For additional commands, e-mail: dev-help@turbine.apache.org
  • Anonymous at Mar 15, 2011 at 12:24 pm
    To whom it may engage...

    This is an automated request, but not an unsolicited one. For
    more information please visit http://gump.apache.org/nagged.html,
    and/or contact the folk at general@gump.apache.org.

    Project turbine-core has an issue affecting its community integration.
    This issue affects 2 projects,
    and has been outstanding for 34 runs.
    The current state of this project is 'Failed', with reason 'Build Failed'.
    For reference only, the following projects are affected by this:
    - turbine-core : A servlet based framework.
    - turbine-core-test : A servlet based framework.


    Full details are available at:
    http://vmgump.apache.org/gump/public/turbine-core/turbine-core/index.html

    That said, some information snippets are provided here.

    The following annotations (debug/informational/warning/error messages) were provided:
    -INFO- Optional dependency commons-fileupload prerequisite failed with reason build failed
    -INFO- Optional dependency commons-configuration prerequisite failed with reason build failed
    -INFO- Optional dependency httpunit failed with reason build failed
    -DEBUG- (Apache Gump generated) Apache Maven Settings in: /srv/gump/public/workspace/turbine-core/gump_mvn_settings.xml
    -INFO- Failed with reason build failed
    -DEBUG- Maven POM in: /srv/gump/public/workspace/turbine-core/pom.xml
    -INFO- Failed to extract fallback artifacts from Gump Repository



    The following work was performed:
    http://vmgump.apache.org/gump/public/turbine-core/turbine-core/gump_work/build_turbine-core_turbine-core.html
    Work Name: build_turbine-core_turbine-core (Type: Build)
    Work ended in a state of : Failed
    Elapsed: 36 secs
    Command Line: /opt/maven2/bin/mvn --batch-mode -DskipTests=true --settings /srv/gump/public/workspace/turbine-core/gump_mvn_settings.xml package
    [Working Directory: /srv/gump/public/workspace/turbine-core]
    M2_HOME: /opt/maven2
    ---------------------------------------------
    urls[19] = file:/srv/gump/public/workspace/mvnlocalrepo/shared/xml-apis/xml-apis/1.0.b2/xml-apis-1.0.b2.jar
    urls[20] = file:/srv/gump/public/workspace/mvnlocalrepo/shared/commons-configuration/commons-configuration/1.4/commons-configuration-1.4.jar
    urls[21] = file:/srv/gump/public/workspace/mvnlocalrepo/shared/commons-logging/commons-logging-api/1.0.4/commons-logging-api-1.0.4.jar
    urls[22] = file:/srv/gump/public/workspace/mvnlocalrepo/shared/commons-digester/commons-digester/1.8/commons-digester-1.8.jar
    urls[23] = file:/srv/gump/public/workspace/mvnlocalrepo/shared/commons-beanutils/commons-beanutils/1.7.0/commons-beanutils-1.7.0.jar
    urls[24] = file:/srv/gump/public/workspace/mvnlocalrepo/shared/commons-beanutils/commons-beanutils-core/1.7.0/commons-beanutils-core-1.7.0.jar
    urls[25] = file:/srv/gump/public/workspace/mvnlocalrepo/shared/commons-codec/commons-codec/1.3/commons-codec-1.3.jar
    urls[26] = file:/srv/gump/public/workspace/mvnlocalrepo/shared/commons-jxpath/commons-jxpath/1.2/commons-jxpath-1.2.jar
    urls[27] = file:/srv/gump/public/workspace/mvnlocalrepo/shared/xerces/xerces/1.2.3/xerces-1.2.3.jar
    urls[28] = file:/srv/gump/public/workspace/mvnlocalrepo/shared/ant/ant-optional/1.5.1/ant-optional-1.5.1.jar
    urls[29] = file:/srv/gump/public/workspace/mvnlocalrepo/shared/jdom/jdom/b9/jdom-b9.jar
    Number of imports: 10
    import: org.codehaus.classworlds.Entry@a6c57a42
    import: org.codehaus.classworlds.Entry@12f43f3b
    import: org.codehaus.classworlds.Entry@20025374
    import: org.codehaus.classworlds.Entry@f8e44ca4
    import: org.codehaus.classworlds.Entry@92758522
    import: org.codehaus.classworlds.Entry@ebf2705b
    import: org.codehaus.classworlds.Entry@bb25e54
    import: org.codehaus.classworlds.Entry@bece5185
    import: org.codehaus.classworlds.Entry@3fee8e37
    import: org.codehaus.classworlds.Entry@3fee19d8


    this realm = plexus.core
    urls[0] = file:/opt/maven2/lib/maven-2.2.1-uber.jar
    Number of imports: 10
    import: org.codehaus.classworlds.Entry@a6c57a42
    import: org.codehaus.classworlds.Entry@12f43f3b
    import: org.codehaus.classworlds.Entry@20025374
    import: org.codehaus.classworlds.Entry@f8e44ca4
    import: org.codehaus.classworlds.Entry@92758522
    import: org.codehaus.classworlds.Entry@ebf2705b
    import: org.codehaus.classworlds.Entry@bb25e54
    import: org.codehaus.classworlds.Entry@bece5185
    import: org.codehaus.classworlds.Entry@3fee8e37
    import: org.codehaus.classworlds.Entry@3fee19d8
    -----------------------------------------------------
    [INFO] ------------------------------------------------------------------------
    [ERROR] BUILD ERROR
    [INFO] ------------------------------------------------------------------------
    [INFO] Internal error in the plugin manager executing goal 'org.apache.torque:torque-maven-plugin:3.3:om': Unable to load the mojo 'org.apache.torque:torque-maven-plugin:3.3:om' in the plugin 'org.apache.torque:torque-maven-plugin'. A required class is missing: org/apache/torque/task/TorqueDataModelTask
    org.apache.torque.task.TorqueDataModelTask
    [INFO] ------------------------------------------------------------------------
    [INFO] For more information, run Maven with the -e switch
    [INFO] ------------------------------------------------------------------------
    [INFO] Total time: 35 seconds
    [INFO] Finished at: Tue Mar 15 12:23:50 UTC 2011
    [INFO] Final Memory: 21M/51M
    [INFO] ------------------------------------------------------------------------
    ---------------------------------------------

    To subscribe to this information via syndicated feeds:
    - RSS: http://vmgump.apache.org/gump/public/turbine-core/turbine-core/rss.xml
    - Atom: http://vmgump.apache.org/gump/public/turbine-core/turbine-core/atom.xml

    ============================== Gump Tracking Only ===
    Produced by Apache Gump(TM) version 2.3.
    Gump Run 06000615032011, vmgump.apache.org:vmgump:06000615032011
    Gump E-mail Identifier (unique within run) #34.

    --
    Apache Gump
    http://gump.apache.org/ [Instance: vmgump]

    ---------------------------------------------------------------------
    To unsubscribe, e-mail: dev-unsubscribe@turbine.apache.org
    For additional commands, e-mail: dev-help@turbine.apache.org
  • Anonymous at Mar 16, 2011 at 1:07 pm
    To whom it may engage...

    This is an automated request, but not an unsolicited one. For
    more information please visit http://gump.apache.org/nagged.html,
    and/or contact the folk at general@gump.apache.org.

    Project turbine-core has an issue affecting its community integration.
    This issue affects 2 projects,
    and has been outstanding for 36 runs.
    The current state of this project is 'Failed', with reason 'Build Failed'.
    For reference only, the following projects are affected by this:
    - turbine-core : A servlet based framework.
    - turbine-core-test : A servlet based framework.


    Full details are available at:
    http://vmgump.apache.org/gump/public/turbine-core/turbine-core/index.html

    That said, some information snippets are provided here.

    The following annotations (debug/informational/warning/error messages) were provided:
    -INFO- Optional dependency dom4j prerequisite failed with reason build timed out
    -INFO- Optional dependency commons-fileupload prerequisite failed with reason build failed
    -INFO- Optional dependency commons-configuration prerequisite failed with reason build failed
    -INFO- Optional dependency httpunit failed with reason build failed
    -DEBUG- (Apache Gump generated) Apache Maven Settings in: /srv/gump/public/workspace/turbine-core/gump_mvn_settings.xml
    -INFO- Failed with reason build failed
    -DEBUG- Maven POM in: /srv/gump/public/workspace/turbine-core/pom.xml
    -INFO- Failed to extract fallback artifacts from Gump Repository



    The following work was performed:
    http://vmgump.apache.org/gump/public/turbine-core/turbine-core/gump_work/build_turbine-core_turbine-core.html
    Work Name: build_turbine-core_turbine-core (Type: Build)
    Work ended in a state of : Failed
    Elapsed: 32 secs
    Command Line: /opt/maven2/bin/mvn --batch-mode -DskipTests=true --settings /srv/gump/public/workspace/turbine-core/gump_mvn_settings.xml package
    [Working Directory: /srv/gump/public/workspace/turbine-core]
    M2_HOME: /opt/maven2
    ---------------------------------------------
    urls[19] = file:/srv/gump/public/workspace/mvnlocalrepo/shared/xml-apis/xml-apis/1.0.b2/xml-apis-1.0.b2.jar
    urls[20] = file:/srv/gump/public/workspace/mvnlocalrepo/shared/commons-configuration/commons-configuration/1.4/commons-configuration-1.4.jar
    urls[21] = file:/srv/gump/public/workspace/mvnlocalrepo/shared/commons-logging/commons-logging-api/1.0.4/commons-logging-api-1.0.4.jar
    urls[22] = file:/srv/gump/public/workspace/mvnlocalrepo/shared/commons-digester/commons-digester/1.8/commons-digester-1.8.jar
    urls[23] = file:/srv/gump/public/workspace/mvnlocalrepo/shared/commons-beanutils/commons-beanutils/1.7.0/commons-beanutils-1.7.0.jar
    urls[24] = file:/srv/gump/public/workspace/mvnlocalrepo/shared/commons-beanutils/commons-beanutils-core/1.7.0/commons-beanutils-core-1.7.0.jar
    urls[25] = file:/srv/gump/public/workspace/mvnlocalrepo/shared/commons-codec/commons-codec/1.3/commons-codec-1.3.jar
    urls[26] = file:/srv/gump/public/workspace/mvnlocalrepo/shared/commons-jxpath/commons-jxpath/1.2/commons-jxpath-1.2.jar
    urls[27] = file:/srv/gump/public/workspace/mvnlocalrepo/shared/xerces/xerces/1.2.3/xerces-1.2.3.jar
    urls[28] = file:/srv/gump/public/workspace/mvnlocalrepo/shared/ant/ant-optional/1.5.1/ant-optional-1.5.1.jar
    urls[29] = file:/srv/gump/public/workspace/mvnlocalrepo/shared/jdom/jdom/b9/jdom-b9.jar
    Number of imports: 10
    import: org.codehaus.classworlds.Entry@a6c57a42
    import: org.codehaus.classworlds.Entry@12f43f3b
    import: org.codehaus.classworlds.Entry@20025374
    import: org.codehaus.classworlds.Entry@f8e44ca4
    import: org.codehaus.classworlds.Entry@92758522
    import: org.codehaus.classworlds.Entry@ebf2705b
    import: org.codehaus.classworlds.Entry@bb25e54
    import: org.codehaus.classworlds.Entry@bece5185
    import: org.codehaus.classworlds.Entry@3fee8e37
    import: org.codehaus.classworlds.Entry@3fee19d8


    this realm = plexus.core
    urls[0] = file:/opt/maven2/lib/maven-2.2.1-uber.jar
    Number of imports: 10
    import: org.codehaus.classworlds.Entry@a6c57a42
    import: org.codehaus.classworlds.Entry@12f43f3b
    import: org.codehaus.classworlds.Entry@20025374
    import: org.codehaus.classworlds.Entry@f8e44ca4
    import: org.codehaus.classworlds.Entry@92758522
    import: org.codehaus.classworlds.Entry@ebf2705b
    import: org.codehaus.classworlds.Entry@bb25e54
    import: org.codehaus.classworlds.Entry@bece5185
    import: org.codehaus.classworlds.Entry@3fee8e37
    import: org.codehaus.classworlds.Entry@3fee19d8
    -----------------------------------------------------
    [INFO] ------------------------------------------------------------------------
    [ERROR] BUILD ERROR
    [INFO] ------------------------------------------------------------------------
    [INFO] Internal error in the plugin manager executing goal 'org.apache.torque:torque-maven-plugin:3.3:om': Unable to load the mojo 'org.apache.torque:torque-maven-plugin:3.3:om' in the plugin 'org.apache.torque:torque-maven-plugin'. A required class is missing: org/apache/torque/task/TorqueDataModelTask
    org.apache.torque.task.TorqueDataModelTask
    [INFO] ------------------------------------------------------------------------
    [INFO] For more information, run Maven with the -e switch
    [INFO] ------------------------------------------------------------------------
    [INFO] Total time: 31 seconds
    [INFO] Finished at: Wed Mar 16 13:07:18 UTC 2011
    [INFO] Final Memory: 21M/51M
    [INFO] ------------------------------------------------------------------------
    ---------------------------------------------

    To subscribe to this information via syndicated feeds:
    - RSS: http://vmgump.apache.org/gump/public/turbine-core/turbine-core/rss.xml
    - Atom: http://vmgump.apache.org/gump/public/turbine-core/turbine-core/atom.xml

    ============================== Gump Tracking Only ===
    Produced by Apache Gump(TM) version 2.3.
    Gump Run 05000616032011, vmgump.apache.org:vmgump:05000616032011
    Gump E-mail Identifier (unique within run) #30.

    --
    Apache Gump
    http://gump.apache.org/ [Instance: vmgump]

    ---------------------------------------------------------------------
    To unsubscribe, e-mail: dev-unsubscribe@turbine.apache.org
    For additional commands, e-mail: dev-help@turbine.apache.org
  • Anonymous at Mar 17, 2011 at 12:20 pm
    To whom it may engage...

    This is an automated request, but not an unsolicited one. For
    more information please visit http://gump.apache.org/nagged.html,
    and/or contact the folk at general@gump.apache.org.

    Project turbine-core has an issue affecting its community integration.
    This issue affects 2 projects,
    and has been outstanding for 38 runs.
    The current state of this project is 'Failed', with reason 'Build Failed'.
    For reference only, the following projects are affected by this:
    - turbine-core : A servlet based framework.
    - turbine-core-test : A servlet based framework.


    Full details are available at:
    http://vmgump.apache.org/gump/public/turbine-core/turbine-core/index.html

    That said, some information snippets are provided here.

    The following annotations (debug/informational/warning/error messages) were provided:
    -INFO- Optional dependency commons-fileupload prerequisite failed with reason build failed
    -INFO- Optional dependency commons-configuration prerequisite failed with reason build failed
    -INFO- Optional dependency httpunit failed with reason build failed
    -DEBUG- (Apache Gump generated) Apache Maven Settings in: /srv/gump/public/workspace/turbine-core/gump_mvn_settings.xml
    -INFO- Failed with reason build failed
    -DEBUG- Maven POM in: /srv/gump/public/workspace/turbine-core/pom.xml
    -INFO- Failed to extract fallback artifacts from Gump Repository



    The following work was performed:
    http://vmgump.apache.org/gump/public/turbine-core/turbine-core/gump_work/build_turbine-core_turbine-core.html
    Work Name: build_turbine-core_turbine-core (Type: Build)
    Work ended in a state of : Failed
    Elapsed: 36 secs
    Command Line: /opt/maven2/bin/mvn --batch-mode -DskipTests=true --settings /srv/gump/public/workspace/turbine-core/gump_mvn_settings.xml package
    [Working Directory: /srv/gump/public/workspace/turbine-core]
    M2_HOME: /opt/maven2
    ---------------------------------------------
    urls[19] = file:/srv/gump/public/workspace/mvnlocalrepo/shared/xml-apis/xml-apis/1.0.b2/xml-apis-1.0.b2.jar
    urls[20] = file:/srv/gump/public/workspace/mvnlocalrepo/shared/commons-configuration/commons-configuration/1.4/commons-configuration-1.4.jar
    urls[21] = file:/srv/gump/public/workspace/mvnlocalrepo/shared/commons-logging/commons-logging-api/1.0.4/commons-logging-api-1.0.4.jar
    urls[22] = file:/srv/gump/public/workspace/mvnlocalrepo/shared/commons-digester/commons-digester/1.8/commons-digester-1.8.jar
    urls[23] = file:/srv/gump/public/workspace/mvnlocalrepo/shared/commons-beanutils/commons-beanutils/1.7.0/commons-beanutils-1.7.0.jar
    urls[24] = file:/srv/gump/public/workspace/mvnlocalrepo/shared/commons-beanutils/commons-beanutils-core/1.7.0/commons-beanutils-core-1.7.0.jar
    urls[25] = file:/srv/gump/public/workspace/mvnlocalrepo/shared/commons-codec/commons-codec/1.3/commons-codec-1.3.jar
    urls[26] = file:/srv/gump/public/workspace/mvnlocalrepo/shared/commons-jxpath/commons-jxpath/1.2/commons-jxpath-1.2.jar
    urls[27] = file:/srv/gump/public/workspace/mvnlocalrepo/shared/xerces/xerces/1.2.3/xerces-1.2.3.jar
    urls[28] = file:/srv/gump/public/workspace/mvnlocalrepo/shared/ant/ant-optional/1.5.1/ant-optional-1.5.1.jar
    urls[29] = file:/srv/gump/public/workspace/mvnlocalrepo/shared/jdom/jdom/b9/jdom-b9.jar
    Number of imports: 10
    import: org.codehaus.classworlds.Entry@a6c57a42
    import: org.codehaus.classworlds.Entry@12f43f3b
    import: org.codehaus.classworlds.Entry@20025374
    import: org.codehaus.classworlds.Entry@f8e44ca4
    import: org.codehaus.classworlds.Entry@92758522
    import: org.codehaus.classworlds.Entry@ebf2705b
    import: org.codehaus.classworlds.Entry@bb25e54
    import: org.codehaus.classworlds.Entry@bece5185
    import: org.codehaus.classworlds.Entry@3fee8e37
    import: org.codehaus.classworlds.Entry@3fee19d8


    this realm = plexus.core
    urls[0] = file:/opt/maven2/lib/maven-2.2.1-uber.jar
    Number of imports: 10
    import: org.codehaus.classworlds.Entry@a6c57a42
    import: org.codehaus.classworlds.Entry@12f43f3b
    import: org.codehaus.classworlds.Entry@20025374
    import: org.codehaus.classworlds.Entry@f8e44ca4
    import: org.codehaus.classworlds.Entry@92758522
    import: org.codehaus.classworlds.Entry@ebf2705b
    import: org.codehaus.classworlds.Entry@bb25e54
    import: org.codehaus.classworlds.Entry@bece5185
    import: org.codehaus.classworlds.Entry@3fee8e37
    import: org.codehaus.classworlds.Entry@3fee19d8
    -----------------------------------------------------
    [INFO] ------------------------------------------------------------------------
    [ERROR] BUILD ERROR
    [INFO] ------------------------------------------------------------------------
    [INFO] Internal error in the plugin manager executing goal 'org.apache.torque:torque-maven-plugin:3.3:om': Unable to load the mojo 'org.apache.torque:torque-maven-plugin:3.3:om' in the plugin 'org.apache.torque:torque-maven-plugin'. A required class is missing: org/apache/torque/task/TorqueDataModelTask
    org.apache.torque.task.TorqueDataModelTask
    [INFO] ------------------------------------------------------------------------
    [INFO] For more information, run Maven with the -e switch
    [INFO] ------------------------------------------------------------------------
    [INFO] Total time: 35 seconds
    [INFO] Finished at: Thu Mar 17 12:20:29 UTC 2011
    [INFO] Final Memory: 21M/51M
    [INFO] ------------------------------------------------------------------------
    ---------------------------------------------

    To subscribe to this information via syndicated feeds:
    - RSS: http://vmgump.apache.org/gump/public/turbine-core/turbine-core/rss.xml
    - Atom: http://vmgump.apache.org/gump/public/turbine-core/turbine-core/atom.xml

    ============================== Gump Tracking Only ===
    Produced by Apache Gump(TM) version 2.3.
    Gump Run 06000617032011, vmgump.apache.org:vmgump:06000617032011
    Gump E-mail Identifier (unique within run) #33.

    --
    Apache Gump
    http://gump.apache.org/ [Instance: vmgump]

    ---------------------------------------------------------------------
    To unsubscribe, e-mail: dev-unsubscribe@turbine.apache.org
    For additional commands, e-mail: dev-help@turbine.apache.org
  • Anonymous at Mar 18, 2011 at 12:00 pm
    To whom it may engage...

    This is an automated request, but not an unsolicited one. For
    more information please visit http://gump.apache.org/nagged.html,
    and/or contact the folk at general@gump.apache.org.

    Project turbine-core has an issue affecting its community integration.
    This issue affects 2 projects,
    and has been outstanding for 40 runs.
    The current state of this project is 'Failed', with reason 'Build Failed'.
    For reference only, the following projects are affected by this:
    - turbine-core : A servlet based framework.
    - turbine-core-test : A servlet based framework.


    Full details are available at:
    http://vmgump.apache.org/gump/public/turbine-core/turbine-core/index.html

    That said, some information snippets are provided here.

    The following annotations (debug/informational/warning/error messages) were provided:
    -INFO- Optional dependency commons-fileupload prerequisite failed with reason build failed
    -INFO- Optional dependency commons-configuration prerequisite failed with reason build failed
    -INFO- Optional dependency httpunit failed with reason build failed
    -DEBUG- (Apache Gump generated) Apache Maven Settings in: /srv/gump/public/workspace/turbine-core/gump_mvn_settings.xml
    -INFO- Failed with reason build failed
    -DEBUG- Maven POM in: /srv/gump/public/workspace/turbine-core/pom.xml
    -INFO- Failed to extract fallback artifacts from Gump Repository



    The following work was performed:
    http://vmgump.apache.org/gump/public/turbine-core/turbine-core/gump_work/build_turbine-core_turbine-core.html
    Work Name: build_turbine-core_turbine-core (Type: Build)
    Work ended in a state of : Failed
    Elapsed: 38 secs
    Command Line: /opt/maven2/bin/mvn --batch-mode -DskipTests=true --settings /srv/gump/public/workspace/turbine-core/gump_mvn_settings.xml package
    [Working Directory: /srv/gump/public/workspace/turbine-core]
    M2_HOME: /opt/maven2
    ---------------------------------------------
    urls[19] = file:/srv/gump/public/workspace/mvnlocalrepo/shared/xml-apis/xml-apis/1.0.b2/xml-apis-1.0.b2.jar
    urls[20] = file:/srv/gump/public/workspace/mvnlocalrepo/shared/commons-configuration/commons-configuration/1.4/commons-configuration-1.4.jar
    urls[21] = file:/srv/gump/public/workspace/mvnlocalrepo/shared/commons-logging/commons-logging-api/1.0.4/commons-logging-api-1.0.4.jar
    urls[22] = file:/srv/gump/public/workspace/mvnlocalrepo/shared/commons-digester/commons-digester/1.8/commons-digester-1.8.jar
    urls[23] = file:/srv/gump/public/workspace/mvnlocalrepo/shared/commons-beanutils/commons-beanutils/1.7.0/commons-beanutils-1.7.0.jar
    urls[24] = file:/srv/gump/public/workspace/mvnlocalrepo/shared/commons-beanutils/commons-beanutils-core/1.7.0/commons-beanutils-core-1.7.0.jar
    urls[25] = file:/srv/gump/public/workspace/mvnlocalrepo/shared/commons-codec/commons-codec/1.3/commons-codec-1.3.jar
    urls[26] = file:/srv/gump/public/workspace/mvnlocalrepo/shared/commons-jxpath/commons-jxpath/1.2/commons-jxpath-1.2.jar
    urls[27] = file:/srv/gump/public/workspace/mvnlocalrepo/shared/xerces/xerces/1.2.3/xerces-1.2.3.jar
    urls[28] = file:/srv/gump/public/workspace/mvnlocalrepo/shared/ant/ant-optional/1.5.1/ant-optional-1.5.1.jar
    urls[29] = file:/srv/gump/public/workspace/mvnlocalrepo/shared/jdom/jdom/b9/jdom-b9.jar
    Number of imports: 10
    import: org.codehaus.classworlds.Entry@a6c57a42
    import: org.codehaus.classworlds.Entry@12f43f3b
    import: org.codehaus.classworlds.Entry@20025374
    import: org.codehaus.classworlds.Entry@f8e44ca4
    import: org.codehaus.classworlds.Entry@92758522
    import: org.codehaus.classworlds.Entry@ebf2705b
    import: org.codehaus.classworlds.Entry@bb25e54
    import: org.codehaus.classworlds.Entry@bece5185
    import: org.codehaus.classworlds.Entry@3fee8e37
    import: org.codehaus.classworlds.Entry@3fee19d8


    this realm = plexus.core
    urls[0] = file:/opt/maven2/lib/maven-2.2.1-uber.jar
    Number of imports: 10
    import: org.codehaus.classworlds.Entry@a6c57a42
    import: org.codehaus.classworlds.Entry@12f43f3b
    import: org.codehaus.classworlds.Entry@20025374
    import: org.codehaus.classworlds.Entry@f8e44ca4
    import: org.codehaus.classworlds.Entry@92758522
    import: org.codehaus.classworlds.Entry@ebf2705b
    import: org.codehaus.classworlds.Entry@bb25e54
    import: org.codehaus.classworlds.Entry@bece5185
    import: org.codehaus.classworlds.Entry@3fee8e37
    import: org.codehaus.classworlds.Entry@3fee19d8
    -----------------------------------------------------
    [INFO] ------------------------------------------------------------------------
    [ERROR] BUILD ERROR
    [INFO] ------------------------------------------------------------------------
    [INFO] Internal error in the plugin manager executing goal 'org.apache.torque:torque-maven-plugin:3.3:om': Unable to load the mojo 'org.apache.torque:torque-maven-plugin:3.3:om' in the plugin 'org.apache.torque:torque-maven-plugin'. A required class is missing: org/apache/torque/task/TorqueDataModelTask
    org.apache.torque.task.TorqueDataModelTask
    [INFO] ------------------------------------------------------------------------
    [INFO] For more information, run Maven with the -e switch
    [INFO] ------------------------------------------------------------------------
    [INFO] Total time: 37 seconds
    [INFO] Finished at: Fri Mar 18 12:00:28 UTC 2011
    [INFO] Final Memory: 21M/51M
    [INFO] ------------------------------------------------------------------------
    ---------------------------------------------

    To subscribe to this information via syndicated feeds:
    - RSS: http://vmgump.apache.org/gump/public/turbine-core/turbine-core/rss.xml
    - Atom: http://vmgump.apache.org/gump/public/turbine-core/turbine-core/atom.xml

    ============================== Gump Tracking Only ===
    Produced by Apache Gump(TM) version 2.3.
    Gump Run 06000618032011, vmgump.apache.org:vmgump:06000618032011
    Gump E-mail Identifier (unique within run) #35.

    --
    Apache Gump
    http://gump.apache.org/ [Instance: vmgump]

    ---------------------------------------------------------------------
    To unsubscribe, e-mail: dev-unsubscribe@turbine.apache.org
    For additional commands, e-mail: dev-help@turbine.apache.org
  • Anonymous at Mar 19, 2011 at 1:06 pm
    To whom it may engage...

    This is an automated request, but not an unsolicited one. For
    more information please visit http://gump.apache.org/nagged.html,
    and/or contact the folk at general@gump.apache.org.

    Project turbine-core has an issue affecting its community integration.
    This issue affects 2 projects,
    and has been outstanding for 42 runs.
    The current state of this project is 'Failed', with reason 'Build Failed'.
    For reference only, the following projects are affected by this:
    - turbine-core : A servlet based framework.
    - turbine-core-test : A servlet based framework.


    Full details are available at:
    http://vmgump.apache.org/gump/public/turbine-core/turbine-core/index.html

    That said, some information snippets are provided here.

    The following annotations (debug/informational/warning/error messages) were provided:
    -INFO- Optional dependency dom4j prerequisite failed with reason build timed out
    -INFO- Optional dependency commons-fileupload prerequisite failed with reason build failed
    -INFO- Optional dependency commons-configuration prerequisite failed with reason build failed
    -INFO- Optional dependency httpunit failed with reason build failed
    -DEBUG- (Apache Gump generated) Apache Maven Settings in: /srv/gump/public/workspace/turbine-core/gump_mvn_settings.xml
    -INFO- Failed with reason build failed
    -DEBUG- Maven POM in: /srv/gump/public/workspace/turbine-core/pom.xml
    -INFO- Failed to extract fallback artifacts from Gump Repository



    The following work was performed:
    http://vmgump.apache.org/gump/public/turbine-core/turbine-core/gump_work/build_turbine-core_turbine-core.html
    Work Name: build_turbine-core_turbine-core (Type: Build)
    Work ended in a state of : Failed
    Elapsed: 32 secs
    Command Line: /opt/maven2/bin/mvn --batch-mode -DskipTests=true --settings /srv/gump/public/workspace/turbine-core/gump_mvn_settings.xml package
    [Working Directory: /srv/gump/public/workspace/turbine-core]
    M2_HOME: /opt/maven2
    ---------------------------------------------
    urls[19] = file:/srv/gump/public/workspace/mvnlocalrepo/shared/xml-apis/xml-apis/1.0.b2/xml-apis-1.0.b2.jar
    urls[20] = file:/srv/gump/public/workspace/mvnlocalrepo/shared/commons-configuration/commons-configuration/1.4/commons-configuration-1.4.jar
    urls[21] = file:/srv/gump/public/workspace/mvnlocalrepo/shared/commons-logging/commons-logging-api/1.0.4/commons-logging-api-1.0.4.jar
    urls[22] = file:/srv/gump/public/workspace/mvnlocalrepo/shared/commons-digester/commons-digester/1.8/commons-digester-1.8.jar
    urls[23] = file:/srv/gump/public/workspace/mvnlocalrepo/shared/commons-beanutils/commons-beanutils/1.7.0/commons-beanutils-1.7.0.jar
    urls[24] = file:/srv/gump/public/workspace/mvnlocalrepo/shared/commons-beanutils/commons-beanutils-core/1.7.0/commons-beanutils-core-1.7.0.jar
    urls[25] = file:/srv/gump/public/workspace/mvnlocalrepo/shared/commons-codec/commons-codec/1.3/commons-codec-1.3.jar
    urls[26] = file:/srv/gump/public/workspace/mvnlocalrepo/shared/commons-jxpath/commons-jxpath/1.2/commons-jxpath-1.2.jar
    urls[27] = file:/srv/gump/public/workspace/mvnlocalrepo/shared/xerces/xerces/1.2.3/xerces-1.2.3.jar
    urls[28] = file:/srv/gump/public/workspace/mvnlocalrepo/shared/ant/ant-optional/1.5.1/ant-optional-1.5.1.jar
    urls[29] = file:/srv/gump/public/workspace/mvnlocalrepo/shared/jdom/jdom/b9/jdom-b9.jar
    Number of imports: 10
    import: org.codehaus.classworlds.Entry@a6c57a42
    import: org.codehaus.classworlds.Entry@12f43f3b
    import: org.codehaus.classworlds.Entry@20025374
    import: org.codehaus.classworlds.Entry@f8e44ca4
    import: org.codehaus.classworlds.Entry@92758522
    import: org.codehaus.classworlds.Entry@ebf2705b
    import: org.codehaus.classworlds.Entry@bb25e54
    import: org.codehaus.classworlds.Entry@bece5185
    import: org.codehaus.classworlds.Entry@3fee8e37
    import: org.codehaus.classworlds.Entry@3fee19d8


    this realm = plexus.core
    urls[0] = file:/opt/maven2/lib/maven-2.2.1-uber.jar
    Number of imports: 10
    import: org.codehaus.classworlds.Entry@a6c57a42
    import: org.codehaus.classworlds.Entry@12f43f3b
    import: org.codehaus.classworlds.Entry@20025374
    import: org.codehaus.classworlds.Entry@f8e44ca4
    import: org.codehaus.classworlds.Entry@92758522
    import: org.codehaus.classworlds.Entry@ebf2705b
    import: org.codehaus.classworlds.Entry@bb25e54
    import: org.codehaus.classworlds.Entry@bece5185
    import: org.codehaus.classworlds.Entry@3fee8e37
    import: org.codehaus.classworlds.Entry@3fee19d8
    -----------------------------------------------------
    [INFO] ------------------------------------------------------------------------
    [ERROR] BUILD ERROR
    [INFO] ------------------------------------------------------------------------
    [INFO] Internal error in the plugin manager executing goal 'org.apache.torque:torque-maven-plugin:3.3:om': Unable to load the mojo 'org.apache.torque:torque-maven-plugin:3.3:om' in the plugin 'org.apache.torque:torque-maven-plugin'. A required class is missing: org/apache/torque/task/TorqueDataModelTask
    org.apache.torque.task.TorqueDataModelTask
    [INFO] ------------------------------------------------------------------------
    [INFO] For more information, run Maven with the -e switch
    [INFO] ------------------------------------------------------------------------
    [INFO] Total time: 31 seconds
    [INFO] Finished at: Sat Mar 19 13:05:38 UTC 2011
    [INFO] Final Memory: 21M/51M
    [INFO] ------------------------------------------------------------------------
    ---------------------------------------------

    To subscribe to this information via syndicated feeds:
    - RSS: http://vmgump.apache.org/gump/public/turbine-core/turbine-core/rss.xml
    - Atom: http://vmgump.apache.org/gump/public/turbine-core/turbine-core/atom.xml

    ============================== Gump Tracking Only ===
    Produced by Apache Gump(TM) version 2.3.
    Gump Run 06000619032011, vmgump.apache.org:vmgump:06000619032011
    Gump E-mail Identifier (unique within run) #30.

    --
    Apache Gump
    http://gump.apache.org/ [Instance: vmgump]

    ---------------------------------------------------------------------
    To unsubscribe, e-mail: dev-unsubscribe@turbine.apache.org
    For additional commands, e-mail: dev-help@turbine.apache.org
  • Anonymous at Mar 20, 2011 at 12:53 pm
    To whom it may engage...

    This is an automated request, but not an unsolicited one. For
    more information please visit http://gump.apache.org/nagged.html,
    and/or contact the folk at general@gump.apache.org.

    Project turbine-core has an issue affecting its community integration.
    This issue affects 2 projects,
    and has been outstanding for 44 runs.
    The current state of this project is 'Failed', with reason 'Build Failed'.
    For reference only, the following projects are affected by this:
    - turbine-core : A servlet based framework.
    - turbine-core-test : A servlet based framework.


    Full details are available at:
    http://vmgump.apache.org/gump/public/turbine-core/turbine-core/index.html

    That said, some information snippets are provided here.

    The following annotations (debug/informational/warning/error messages) were provided:
    -INFO- Optional dependency dom4j prerequisite failed with reason build timed out
    -INFO- Optional dependency commons-fileupload prerequisite failed with reason build failed
    -INFO- Optional dependency commons-configuration prerequisite failed with reason build failed
    -INFO- Optional dependency httpunit failed with reason build failed
    -DEBUG- (Apache Gump generated) Apache Maven Settings in: /srv/gump/public/workspace/turbine-core/gump_mvn_settings.xml
    -INFO- Failed with reason build failed
    -DEBUG- Maven POM in: /srv/gump/public/workspace/turbine-core/pom.xml
    -INFO- Failed to extract fallback artifacts from Gump Repository



    The following work was performed:
    http://vmgump.apache.org/gump/public/turbine-core/turbine-core/gump_work/build_turbine-core_turbine-core.html
    Work Name: build_turbine-core_turbine-core (Type: Build)
    Work ended in a state of : Failed
    Elapsed: 33 secs
    Command Line: /opt/maven2/bin/mvn --batch-mode -DskipTests=true --settings /srv/gump/public/workspace/turbine-core/gump_mvn_settings.xml package
    [Working Directory: /srv/gump/public/workspace/turbine-core]
    M2_HOME: /opt/maven2
    ---------------------------------------------
    urls[19] = file:/srv/gump/public/workspace/mvnlocalrepo/shared/xml-apis/xml-apis/1.0.b2/xml-apis-1.0.b2.jar
    urls[20] = file:/srv/gump/public/workspace/mvnlocalrepo/shared/commons-configuration/commons-configuration/1.4/commons-configuration-1.4.jar
    urls[21] = file:/srv/gump/public/workspace/mvnlocalrepo/shared/commons-logging/commons-logging-api/1.0.4/commons-logging-api-1.0.4.jar
    urls[22] = file:/srv/gump/public/workspace/mvnlocalrepo/shared/commons-digester/commons-digester/1.8/commons-digester-1.8.jar
    urls[23] = file:/srv/gump/public/workspace/mvnlocalrepo/shared/commons-beanutils/commons-beanutils/1.7.0/commons-beanutils-1.7.0.jar
    urls[24] = file:/srv/gump/public/workspace/mvnlocalrepo/shared/commons-beanutils/commons-beanutils-core/1.7.0/commons-beanutils-core-1.7.0.jar
    urls[25] = file:/srv/gump/public/workspace/mvnlocalrepo/shared/commons-codec/commons-codec/1.3/commons-codec-1.3.jar
    urls[26] = file:/srv/gump/public/workspace/mvnlocalrepo/shared/commons-jxpath/commons-jxpath/1.2/commons-jxpath-1.2.jar
    urls[27] = file:/srv/gump/public/workspace/mvnlocalrepo/shared/xerces/xerces/1.2.3/xerces-1.2.3.jar
    urls[28] = file:/srv/gump/public/workspace/mvnlocalrepo/shared/ant/ant-optional/1.5.1/ant-optional-1.5.1.jar
    urls[29] = file:/srv/gump/public/workspace/mvnlocalrepo/shared/jdom/jdom/b9/jdom-b9.jar
    Number of imports: 10
    import: org.codehaus.classworlds.Entry@a6c57a42
    import: org.codehaus.classworlds.Entry@12f43f3b
    import: org.codehaus.classworlds.Entry@20025374
    import: org.codehaus.classworlds.Entry@f8e44ca4
    import: org.codehaus.classworlds.Entry@92758522
    import: org.codehaus.classworlds.Entry@ebf2705b
    import: org.codehaus.classworlds.Entry@bb25e54
    import: org.codehaus.classworlds.Entry@bece5185
    import: org.codehaus.classworlds.Entry@3fee8e37
    import: org.codehaus.classworlds.Entry@3fee19d8


    this realm = plexus.core
    urls[0] = file:/opt/maven2/lib/maven-2.2.1-uber.jar
    Number of imports: 10
    import: org.codehaus.classworlds.Entry@a6c57a42
    import: org.codehaus.classworlds.Entry@12f43f3b
    import: org.codehaus.classworlds.Entry@20025374
    import: org.codehaus.classworlds.Entry@f8e44ca4
    import: org.codehaus.classworlds.Entry@92758522
    import: org.codehaus.classworlds.Entry@ebf2705b
    import: org.codehaus.classworlds.Entry@bb25e54
    import: org.codehaus.classworlds.Entry@bece5185
    import: org.codehaus.classworlds.Entry@3fee8e37
    import: org.codehaus.classworlds.Entry@3fee19d8
    -----------------------------------------------------
    [INFO] ------------------------------------------------------------------------
    [ERROR] BUILD ERROR
    [INFO] ------------------------------------------------------------------------
    [INFO] Internal error in the plugin manager executing goal 'org.apache.torque:torque-maven-plugin:3.3:om': Unable to load the mojo 'org.apache.torque:torque-maven-plugin:3.3:om' in the plugin 'org.apache.torque:torque-maven-plugin'. A required class is missing: org/apache/torque/task/TorqueDataModelTask
    org.apache.torque.task.TorqueDataModelTask
    [INFO] ------------------------------------------------------------------------
    [INFO] For more information, run Maven with the -e switch
    [INFO] ------------------------------------------------------------------------
    [INFO] Total time: 32 seconds
    [INFO] Finished at: Sun Mar 20 12:53:18 UTC 2011
    [INFO] Final Memory: 21M/51M
    [INFO] ------------------------------------------------------------------------
    ---------------------------------------------

    To subscribe to this information via syndicated feeds:
    - RSS: http://vmgump.apache.org/gump/public/turbine-core/turbine-core/rss.xml
    - Atom: http://vmgump.apache.org/gump/public/turbine-core/turbine-core/atom.xml

    ============================== Gump Tracking Only ===
    Produced by Apache Gump(TM) version 2.3.
    Gump Run 06000620032011, vmgump.apache.org:vmgump:06000620032011
    Gump E-mail Identifier (unique within run) #31.

    --
    Apache Gump
    http://gump.apache.org/ [Instance: vmgump]

    ---------------------------------------------------------------------
    To unsubscribe, e-mail: dev-unsubscribe@turbine.apache.org
    For additional commands, e-mail: dev-help@turbine.apache.org
  • Anonymous at Mar 21, 2011 at 12:13 pm
    To whom it may engage...

    This is an automated request, but not an unsolicited one. For
    more information please visit http://gump.apache.org/nagged.html,
    and/or contact the folk at general@gump.apache.org.

    Project turbine-core has an issue affecting its community integration.
    This issue affects 2 projects,
    and has been outstanding for 46 runs.
    The current state of this project is 'Failed', with reason 'Build Failed'.
    For reference only, the following projects are affected by this:
    - turbine-core : A servlet based framework.
    - turbine-core-test : A servlet based framework.


    Full details are available at:
    http://vmgump.apache.org/gump/public/turbine-core/turbine-core/index.html

    That said, some information snippets are provided here.

    The following annotations (debug/informational/warning/error messages) were provided:
    -INFO- Optional dependency commons-fileupload prerequisite failed with reason build failed
    -INFO- Optional dependency commons-configuration prerequisite failed with reason build failed
    -INFO- Optional dependency httpunit failed with reason build failed
    -DEBUG- (Apache Gump generated) Apache Maven Settings in: /srv/gump/public/workspace/turbine-core/gump_mvn_settings.xml
    -INFO- Failed with reason build failed
    -DEBUG- Maven POM in: /srv/gump/public/workspace/turbine-core/pom.xml
    -INFO- Failed to extract fallback artifacts from Gump Repository



    The following work was performed:
    http://vmgump.apache.org/gump/public/turbine-core/turbine-core/gump_work/build_turbine-core_turbine-core.html
    Work Name: build_turbine-core_turbine-core (Type: Build)
    Work ended in a state of : Failed
    Elapsed: 35 secs
    Command Line: /opt/maven2/bin/mvn --batch-mode -DskipTests=true --settings /srv/gump/public/workspace/turbine-core/gump_mvn_settings.xml package
    [Working Directory: /srv/gump/public/workspace/turbine-core]
    M2_HOME: /opt/maven2
    ---------------------------------------------
    urls[19] = file:/srv/gump/public/workspace/mvnlocalrepo/shared/xml-apis/xml-apis/1.0.b2/xml-apis-1.0.b2.jar
    urls[20] = file:/srv/gump/public/workspace/mvnlocalrepo/shared/commons-configuration/commons-configuration/1.4/commons-configuration-1.4.jar
    urls[21] = file:/srv/gump/public/workspace/mvnlocalrepo/shared/commons-logging/commons-logging-api/1.0.4/commons-logging-api-1.0.4.jar
    urls[22] = file:/srv/gump/public/workspace/mvnlocalrepo/shared/commons-digester/commons-digester/1.8/commons-digester-1.8.jar
    urls[23] = file:/srv/gump/public/workspace/mvnlocalrepo/shared/commons-beanutils/commons-beanutils/1.7.0/commons-beanutils-1.7.0.jar
    urls[24] = file:/srv/gump/public/workspace/mvnlocalrepo/shared/commons-beanutils/commons-beanutils-core/1.7.0/commons-beanutils-core-1.7.0.jar
    urls[25] = file:/srv/gump/public/workspace/mvnlocalrepo/shared/commons-codec/commons-codec/1.3/commons-codec-1.3.jar
    urls[26] = file:/srv/gump/public/workspace/mvnlocalrepo/shared/commons-jxpath/commons-jxpath/1.2/commons-jxpath-1.2.jar
    urls[27] = file:/srv/gump/public/workspace/mvnlocalrepo/shared/xerces/xerces/1.2.3/xerces-1.2.3.jar
    urls[28] = file:/srv/gump/public/workspace/mvnlocalrepo/shared/ant/ant-optional/1.5.1/ant-optional-1.5.1.jar
    urls[29] = file:/srv/gump/public/workspace/mvnlocalrepo/shared/jdom/jdom/b9/jdom-b9.jar
    Number of imports: 10
    import: org.codehaus.classworlds.Entry@a6c57a42
    import: org.codehaus.classworlds.Entry@12f43f3b
    import: org.codehaus.classworlds.Entry@20025374
    import: org.codehaus.classworlds.Entry@f8e44ca4
    import: org.codehaus.classworlds.Entry@92758522
    import: org.codehaus.classworlds.Entry@ebf2705b
    import: org.codehaus.classworlds.Entry@bb25e54
    import: org.codehaus.classworlds.Entry@bece5185
    import: org.codehaus.classworlds.Entry@3fee8e37
    import: org.codehaus.classworlds.Entry@3fee19d8


    this realm = plexus.core
    urls[0] = file:/opt/maven2/lib/maven-2.2.1-uber.jar
    Number of imports: 10
    import: org.codehaus.classworlds.Entry@a6c57a42
    import: org.codehaus.classworlds.Entry@12f43f3b
    import: org.codehaus.classworlds.Entry@20025374
    import: org.codehaus.classworlds.Entry@f8e44ca4
    import: org.codehaus.classworlds.Entry@92758522
    import: org.codehaus.classworlds.Entry@ebf2705b
    import: org.codehaus.classworlds.Entry@bb25e54
    import: org.codehaus.classworlds.Entry@bece5185
    import: org.codehaus.classworlds.Entry@3fee8e37
    import: org.codehaus.classworlds.Entry@3fee19d8
    -----------------------------------------------------
    [INFO] ------------------------------------------------------------------------
    [ERROR] BUILD ERROR
    [INFO] ------------------------------------------------------------------------
    [INFO] Internal error in the plugin manager executing goal 'org.apache.torque:torque-maven-plugin:3.3:om': Unable to load the mojo 'org.apache.torque:torque-maven-plugin:3.3:om' in the plugin 'org.apache.torque:torque-maven-plugin'. A required class is missing: org/apache/torque/task/TorqueDataModelTask
    org.apache.torque.task.TorqueDataModelTask
    [INFO] ------------------------------------------------------------------------
    [INFO] For more information, run Maven with the -e switch
    [INFO] ------------------------------------------------------------------------
    [INFO] Total time: 34 seconds
    [INFO] Finished at: Mon Mar 21 12:13:21 UTC 2011
    [INFO] Final Memory: 21M/51M
    [INFO] ------------------------------------------------------------------------
    ---------------------------------------------

    To subscribe to this information via syndicated feeds:
    - RSS: http://vmgump.apache.org/gump/public/turbine-core/turbine-core/rss.xml
    - Atom: http://vmgump.apache.org/gump/public/turbine-core/turbine-core/atom.xml

    ============================== Gump Tracking Only ===
    Produced by Apache Gump(TM) version 2.3.
    Gump Run 06000621032011, vmgump.apache.org:vmgump:06000621032011
    Gump E-mail Identifier (unique within run) #34.

    --
    Apache Gump
    http://gump.apache.org/ [Instance: vmgump]

    ---------------------------------------------------------------------
    To unsubscribe, e-mail: dev-unsubscribe@turbine.apache.org
    For additional commands, e-mail: dev-help@turbine.apache.org
  • Anonymous at Mar 23, 2011 at 11:52 am
    To whom it may engage...

    This is an automated request, but not an unsolicited one. For
    more information please visit http://gump.apache.org/nagged.html,
    and/or contact the folk at general@gump.apache.org.

    Project turbine-core has an issue affecting its community integration.
    This issue affects 2 projects,
    and has been outstanding for 50 runs.
    The current state of this project is 'Failed', with reason 'Build Failed'.
    For reference only, the following projects are affected by this:
    - turbine-core : A servlet based framework.
    - turbine-core-test : A servlet based framework.


    Full details are available at:
    http://vmgump.apache.org/gump/public/turbine-core/turbine-core/index.html

    That said, some information snippets are provided here.

    The following annotations (debug/informational/warning/error messages) were provided:
    -INFO- Optional dependency commons-fileupload prerequisite failed with reason build failed
    -INFO- Optional dependency commons-configuration prerequisite failed with reason build failed
    -INFO- Optional dependency httpunit failed with reason build failed
    -DEBUG- (Apache Gump generated) Apache Maven Settings in: /srv/gump/public/workspace/turbine-core/gump_mvn_settings.xml
    -INFO- Failed with reason build failed
    -DEBUG- Maven POM in: /srv/gump/public/workspace/turbine-core/pom.xml
    -INFO- Failed to extract fallback artifacts from Gump Repository



    The following work was performed:
    http://vmgump.apache.org/gump/public/turbine-core/turbine-core/gump_work/build_turbine-core_turbine-core.html
    Work Name: build_turbine-core_turbine-core (Type: Build)
    Work ended in a state of : Failed
    Elapsed: 32 secs
    Command Line: /opt/maven2/bin/mvn --batch-mode -DskipTests=true --settings /srv/gump/public/workspace/turbine-core/gump_mvn_settings.xml package
    [Working Directory: /srv/gump/public/workspace/turbine-core]
    M2_HOME: /opt/maven2
    ---------------------------------------------
    urls[19] = file:/srv/gump/public/workspace/mvnlocalrepo/shared/xml-apis/xml-apis/1.0.b2/xml-apis-1.0.b2.jar
    urls[20] = file:/srv/gump/public/workspace/mvnlocalrepo/shared/commons-configuration/commons-configuration/1.4/commons-configuration-1.4.jar
    urls[21] = file:/srv/gump/public/workspace/mvnlocalrepo/shared/commons-logging/commons-logging-api/1.0.4/commons-logging-api-1.0.4.jar
    urls[22] = file:/srv/gump/public/workspace/mvnlocalrepo/shared/commons-digester/commons-digester/1.8/commons-digester-1.8.jar
    urls[23] = file:/srv/gump/public/workspace/mvnlocalrepo/shared/commons-beanutils/commons-beanutils/1.7.0/commons-beanutils-1.7.0.jar
    urls[24] = file:/srv/gump/public/workspace/mvnlocalrepo/shared/commons-beanutils/commons-beanutils-core/1.7.0/commons-beanutils-core-1.7.0.jar
    urls[25] = file:/srv/gump/public/workspace/mvnlocalrepo/shared/commons-codec/commons-codec/1.3/commons-codec-1.3.jar
    urls[26] = file:/srv/gump/public/workspace/mvnlocalrepo/shared/commons-jxpath/commons-jxpath/1.2/commons-jxpath-1.2.jar
    urls[27] = file:/srv/gump/public/workspace/mvnlocalrepo/shared/xerces/xerces/1.2.3/xerces-1.2.3.jar
    urls[28] = file:/srv/gump/public/workspace/mvnlocalrepo/shared/ant/ant-optional/1.5.1/ant-optional-1.5.1.jar
    urls[29] = file:/srv/gump/public/workspace/mvnlocalrepo/shared/jdom/jdom/b9/jdom-b9.jar
    Number of imports: 10
    import: org.codehaus.classworlds.Entry@a6c57a42
    import: org.codehaus.classworlds.Entry@12f43f3b
    import: org.codehaus.classworlds.Entry@20025374
    import: org.codehaus.classworlds.Entry@f8e44ca4
    import: org.codehaus.classworlds.Entry@92758522
    import: org.codehaus.classworlds.Entry@ebf2705b
    import: org.codehaus.classworlds.Entry@bb25e54
    import: org.codehaus.classworlds.Entry@bece5185
    import: org.codehaus.classworlds.Entry@3fee8e37
    import: org.codehaus.classworlds.Entry@3fee19d8


    this realm = plexus.core
    urls[0] = file:/opt/maven2/lib/maven-2.2.1-uber.jar
    Number of imports: 10
    import: org.codehaus.classworlds.Entry@a6c57a42
    import: org.codehaus.classworlds.Entry@12f43f3b
    import: org.codehaus.classworlds.Entry@20025374
    import: org.codehaus.classworlds.Entry@f8e44ca4
    import: org.codehaus.classworlds.Entry@92758522
    import: org.codehaus.classworlds.Entry@ebf2705b
    import: org.codehaus.classworlds.Entry@bb25e54
    import: org.codehaus.classworlds.Entry@bece5185
    import: org.codehaus.classworlds.Entry@3fee8e37
    import: org.codehaus.classworlds.Entry@3fee19d8
    -----------------------------------------------------
    [INFO] ------------------------------------------------------------------------
    [ERROR] BUILD ERROR
    [INFO] ------------------------------------------------------------------------
    [INFO] Internal error in the plugin manager executing goal 'org.apache.torque:torque-maven-plugin:3.3:om': Unable to load the mojo 'org.apache.torque:torque-maven-plugin:3.3:om' in the plugin 'org.apache.torque:torque-maven-plugin'. A required class is missing: org/apache/torque/task/TorqueDataModelTask
    org.apache.torque.task.TorqueDataModelTask
    [INFO] ------------------------------------------------------------------------
    [INFO] For more information, run Maven with the -e switch
    [INFO] ------------------------------------------------------------------------
    [INFO] Total time: 31 seconds
    [INFO] Finished at: Wed Mar 23 11:52:29 UTC 2011
    [INFO] Final Memory: 21M/51M
    [INFO] ------------------------------------------------------------------------
    ---------------------------------------------

    To subscribe to this information via syndicated feeds:
    - RSS: http://vmgump.apache.org/gump/public/turbine-core/turbine-core/rss.xml
    - Atom: http://vmgump.apache.org/gump/public/turbine-core/turbine-core/atom.xml

    ============================== Gump Tracking Only ===
    Produced by Apache Gump(TM) version 2.3.
    Gump Run 06000623032011, vmgump.apache.org:vmgump:06000623032011
    Gump E-mail Identifier (unique within run) #33.

    --
    Apache Gump
    http://gump.apache.org/ [Instance: vmgump]

    ---------------------------------------------------------------------
    To unsubscribe, e-mail: dev-unsubscribe@turbine.apache.org
    For additional commands, e-mail: dev-help@turbine.apache.org
  • Anonymous at Mar 24, 2011 at 11:57 am
    To whom it may engage...

    This is an automated request, but not an unsolicited one. For
    more information please visit http://gump.apache.org/nagged.html,
    and/or contact the folk at general@gump.apache.org.

    Project turbine-core has an issue affecting its community integration.
    This issue affects 2 projects,
    and has been outstanding for 52 runs.
    The current state of this project is 'Failed', with reason 'Build Failed'.
    For reference only, the following projects are affected by this:
    - turbine-core : A servlet based framework.
    - turbine-core-test : A servlet based framework.


    Full details are available at:
    http://vmgump.apache.org/gump/public/turbine-core/turbine-core/index.html

    That said, some information snippets are provided here.

    The following annotations (debug/informational/warning/error messages) were provided:
    -INFO- Optional dependency commons-fileupload prerequisite failed with reason build failed
    -INFO- Optional dependency commons-configuration prerequisite failed with reason build failed
    -INFO- Optional dependency httpunit failed with reason build failed
    -DEBUG- (Apache Gump generated) Apache Maven Settings in: /srv/gump/public/workspace/turbine-core/gump_mvn_settings.xml
    -INFO- Failed with reason build failed
    -DEBUG- Maven POM in: /srv/gump/public/workspace/turbine-core/pom.xml
    -INFO- Failed to extract fallback artifacts from Gump Repository



    The following work was performed:
    http://vmgump.apache.org/gump/public/turbine-core/turbine-core/gump_work/build_turbine-core_turbine-core.html
    Work Name: build_turbine-core_turbine-core (Type: Build)
    Work ended in a state of : Failed
    Elapsed: 32 secs
    Command Line: /opt/maven2/bin/mvn --batch-mode -DskipTests=true --settings /srv/gump/public/workspace/turbine-core/gump_mvn_settings.xml package
    [Working Directory: /srv/gump/public/workspace/turbine-core]
    M2_HOME: /opt/maven2
    ---------------------------------------------
    urls[19] = file:/srv/gump/public/workspace/mvnlocalrepo/shared/xml-apis/xml-apis/1.0.b2/xml-apis-1.0.b2.jar
    urls[20] = file:/srv/gump/public/workspace/mvnlocalrepo/shared/commons-configuration/commons-configuration/1.4/commons-configuration-1.4.jar
    urls[21] = file:/srv/gump/public/workspace/mvnlocalrepo/shared/commons-logging/commons-logging-api/1.0.4/commons-logging-api-1.0.4.jar
    urls[22] = file:/srv/gump/public/workspace/mvnlocalrepo/shared/commons-digester/commons-digester/1.8/commons-digester-1.8.jar
    urls[23] = file:/srv/gump/public/workspace/mvnlocalrepo/shared/commons-beanutils/commons-beanutils/1.7.0/commons-beanutils-1.7.0.jar
    urls[24] = file:/srv/gump/public/workspace/mvnlocalrepo/shared/commons-beanutils/commons-beanutils-core/1.7.0/commons-beanutils-core-1.7.0.jar
    urls[25] = file:/srv/gump/public/workspace/mvnlocalrepo/shared/commons-codec/commons-codec/1.3/commons-codec-1.3.jar
    urls[26] = file:/srv/gump/public/workspace/mvnlocalrepo/shared/commons-jxpath/commons-jxpath/1.2/commons-jxpath-1.2.jar
    urls[27] = file:/srv/gump/public/workspace/mvnlocalrepo/shared/xerces/xerces/1.2.3/xerces-1.2.3.jar
    urls[28] = file:/srv/gump/public/workspace/mvnlocalrepo/shared/ant/ant-optional/1.5.1/ant-optional-1.5.1.jar
    urls[29] = file:/srv/gump/public/workspace/mvnlocalrepo/shared/jdom/jdom/b9/jdom-b9.jar
    Number of imports: 10
    import: org.codehaus.classworlds.Entry@a6c57a42
    import: org.codehaus.classworlds.Entry@12f43f3b
    import: org.codehaus.classworlds.Entry@20025374
    import: org.codehaus.classworlds.Entry@f8e44ca4
    import: org.codehaus.classworlds.Entry@92758522
    import: org.codehaus.classworlds.Entry@ebf2705b
    import: org.codehaus.classworlds.Entry@bb25e54
    import: org.codehaus.classworlds.Entry@bece5185
    import: org.codehaus.classworlds.Entry@3fee8e37
    import: org.codehaus.classworlds.Entry@3fee19d8


    this realm = plexus.core
    urls[0] = file:/opt/maven2/lib/maven-2.2.1-uber.jar
    Number of imports: 10
    import: org.codehaus.classworlds.Entry@a6c57a42
    import: org.codehaus.classworlds.Entry@12f43f3b
    import: org.codehaus.classworlds.Entry@20025374
    import: org.codehaus.classworlds.Entry@f8e44ca4
    import: org.codehaus.classworlds.Entry@92758522
    import: org.codehaus.classworlds.Entry@ebf2705b
    import: org.codehaus.classworlds.Entry@bb25e54
    import: org.codehaus.classworlds.Entry@bece5185
    import: org.codehaus.classworlds.Entry@3fee8e37
    import: org.codehaus.classworlds.Entry@3fee19d8
    -----------------------------------------------------
    [INFO] ------------------------------------------------------------------------
    [ERROR] BUILD ERROR
    [INFO] ------------------------------------------------------------------------
    [INFO] Internal error in the plugin manager executing goal 'org.apache.torque:torque-maven-plugin:3.3:om': Unable to load the mojo 'org.apache.torque:torque-maven-plugin:3.3:om' in the plugin 'org.apache.torque:torque-maven-plugin'. A required class is missing: org/apache/torque/task/TorqueDataModelTask
    org.apache.torque.task.TorqueDataModelTask
    [INFO] ------------------------------------------------------------------------
    [INFO] For more information, run Maven with the -e switch
    [INFO] ------------------------------------------------------------------------
    [INFO] Total time: 32 seconds
    [INFO] Finished at: Thu Mar 24 11:56:39 UTC 2011
    [INFO] Final Memory: 21M/51M
    [INFO] ------------------------------------------------------------------------
    ---------------------------------------------

    To subscribe to this information via syndicated feeds:
    - RSS: http://vmgump.apache.org/gump/public/turbine-core/turbine-core/rss.xml
    - Atom: http://vmgump.apache.org/gump/public/turbine-core/turbine-core/atom.xml

    ============================== Gump Tracking Only ===
    Produced by Apache Gump(TM) version 2.3.
    Gump Run 05000624032011, vmgump.apache.org:vmgump:05000624032011
    Gump E-mail Identifier (unique within run) #31.

    --
    Apache Gump
    http://gump.apache.org/ [Instance: vmgump]

    ---------------------------------------------------------------------
    To unsubscribe, e-mail: dev-unsubscribe@turbine.apache.org
    For additional commands, e-mail: dev-help@turbine.apache.org
  • Anonymous at Mar 25, 2011 at 1:15 pm
    To whom it may engage...

    This is an automated request, but not an unsolicited one. For
    more information please visit http://gump.apache.org/nagged.html,
    and/or contact the folk at general@gump.apache.org.

    Project turbine-core has an issue affecting its community integration.
    This issue affects 2 projects,
    and has been outstanding for 54 runs.
    The current state of this project is 'Failed', with reason 'Build Failed'.
    For reference only, the following projects are affected by this:
    - turbine-core : A servlet based framework.
    - turbine-core-test : A servlet based framework.


    Full details are available at:
    http://vmgump.apache.org/gump/public/turbine-core/turbine-core/index.html

    That said, some information snippets are provided here.

    The following annotations (debug/informational/warning/error messages) were provided:
    -INFO- Optional dependency dom4j prerequisite failed with reason build timed out
    -INFO- Optional dependency commons-fileupload prerequisite failed with reason build failed
    -INFO- Optional dependency httpunit failed with reason build failed
    -DEBUG- (Apache Gump generated) Apache Maven Settings in: /srv/gump/public/workspace/turbine-core/gump_mvn_settings.xml
    -INFO- Failed with reason build failed
    -DEBUG- Maven POM in: /srv/gump/public/workspace/turbine-core/pom.xml
    -INFO- Failed to extract fallback artifacts from Gump Repository



    The following work was performed:
    http://vmgump.apache.org/gump/public/turbine-core/turbine-core/gump_work/build_turbine-core_turbine-core.html
    Work Name: build_turbine-core_turbine-core (Type: Build)
    Work ended in a state of : Failed
    Elapsed: 29 secs
    Command Line: /opt/maven2/bin/mvn --batch-mode -DskipTests=true --settings /srv/gump/public/workspace/turbine-core/gump_mvn_settings.xml package
    [Working Directory: /srv/gump/public/workspace/turbine-core]
    M2_HOME: /opt/maven2
    ---------------------------------------------
    urls[19] = file:/srv/gump/public/workspace/mvnlocalrepo/shared/xml-apis/xml-apis/1.0.b2/xml-apis-1.0.b2.jar
    urls[20] = file:/srv/gump/public/workspace/mvnlocalrepo/shared/commons-configuration/commons-configuration/1.4/commons-configuration-1.4.jar
    urls[21] = file:/srv/gump/public/workspace/mvnlocalrepo/shared/commons-logging/commons-logging-api/1.0.4/commons-logging-api-1.0.4.jar
    urls[22] = file:/srv/gump/public/workspace/mvnlocalrepo/shared/commons-digester/commons-digester/1.8/commons-digester-1.8.jar
    urls[23] = file:/srv/gump/public/workspace/mvnlocalrepo/shared/commons-beanutils/commons-beanutils/1.7.0/commons-beanutils-1.7.0.jar
    urls[24] = file:/srv/gump/public/workspace/mvnlocalrepo/shared/commons-beanutils/commons-beanutils-core/1.7.0/commons-beanutils-core-1.7.0.jar
    urls[25] = file:/srv/gump/public/workspace/mvnlocalrepo/shared/commons-codec/commons-codec/1.3/commons-codec-1.3.jar
    urls[26] = file:/srv/gump/public/workspace/mvnlocalrepo/shared/commons-jxpath/commons-jxpath/1.2/commons-jxpath-1.2.jar
    urls[27] = file:/srv/gump/public/workspace/mvnlocalrepo/shared/xerces/xerces/1.2.3/xerces-1.2.3.jar
    urls[28] = file:/srv/gump/public/workspace/mvnlocalrepo/shared/ant/ant-optional/1.5.1/ant-optional-1.5.1.jar
    urls[29] = file:/srv/gump/public/workspace/mvnlocalrepo/shared/jdom/jdom/b9/jdom-b9.jar
    Number of imports: 10
    import: org.codehaus.classworlds.Entry@a6c57a42
    import: org.codehaus.classworlds.Entry@12f43f3b
    import: org.codehaus.classworlds.Entry@20025374
    import: org.codehaus.classworlds.Entry@f8e44ca4
    import: org.codehaus.classworlds.Entry@92758522
    import: org.codehaus.classworlds.Entry@ebf2705b
    import: org.codehaus.classworlds.Entry@bb25e54
    import: org.codehaus.classworlds.Entry@bece5185
    import: org.codehaus.classworlds.Entry@3fee8e37
    import: org.codehaus.classworlds.Entry@3fee19d8


    this realm = plexus.core
    urls[0] = file:/opt/maven2/lib/maven-2.2.1-uber.jar
    Number of imports: 10
    import: org.codehaus.classworlds.Entry@a6c57a42
    import: org.codehaus.classworlds.Entry@12f43f3b
    import: org.codehaus.classworlds.Entry@20025374
    import: org.codehaus.classworlds.Entry@f8e44ca4
    import: org.codehaus.classworlds.Entry@92758522
    import: org.codehaus.classworlds.Entry@ebf2705b
    import: org.codehaus.classworlds.Entry@bb25e54
    import: org.codehaus.classworlds.Entry@bece5185
    import: org.codehaus.classworlds.Entry@3fee8e37
    import: org.codehaus.classworlds.Entry@3fee19d8
    -----------------------------------------------------
    [INFO] ------------------------------------------------------------------------
    [ERROR] BUILD ERROR
    [INFO] ------------------------------------------------------------------------
    [INFO] Internal error in the plugin manager executing goal 'org.apache.torque:torque-maven-plugin:3.3:om': Unable to load the mojo 'org.apache.torque:torque-maven-plugin:3.3:om' in the plugin 'org.apache.torque:torque-maven-plugin'. A required class is missing: org/apache/torque/task/TorqueDataModelTask
    org.apache.torque.task.TorqueDataModelTask
    [INFO] ------------------------------------------------------------------------
    [INFO] For more information, run Maven with the -e switch
    [INFO] ------------------------------------------------------------------------
    [INFO] Total time: 28 seconds
    [INFO] Finished at: Fri Mar 25 13:14:41 UTC 2011
    [INFO] Final Memory: 21M/56M
    [INFO] ------------------------------------------------------------------------
    ---------------------------------------------

    To subscribe to this information via syndicated feeds:
    - RSS: http://vmgump.apache.org/gump/public/turbine-core/turbine-core/rss.xml
    - Atom: http://vmgump.apache.org/gump/public/turbine-core/turbine-core/atom.xml

    ============================== Gump Tracking Only ===
    Produced by Apache Gump(TM) version 2.3.
    Gump Run 06000625032011, vmgump.apache.org:vmgump:06000625032011
    Gump E-mail Identifier (unique within run) #27.

    --
    Apache Gump
    http://gump.apache.org/ [Instance: vmgump]

    ---------------------------------------------------------------------
    To unsubscribe, e-mail: dev-unsubscribe@turbine.apache.org
    For additional commands, e-mail: dev-help@turbine.apache.org
  • Anonymous at Mar 26, 2011 at 12:01 pm
    To whom it may engage...

    This is an automated request, but not an unsolicited one. For
    more information please visit http://gump.apache.org/nagged.html,
    and/or contact the folk at general@gump.apache.org.

    Project turbine-core has an issue affecting its community integration.
    This issue affects 2 projects,
    and has been outstanding for 56 runs.
    The current state of this project is 'Failed', with reason 'Build Failed'.
    For reference only, the following projects are affected by this:
    - turbine-core : A servlet based framework.
    - turbine-core-test : A servlet based framework.


    Full details are available at:
    http://vmgump.apache.org/gump/public/turbine-core/turbine-core/index.html

    That said, some information snippets are provided here.

    The following annotations (debug/informational/warning/error messages) were provided:
    -INFO- Optional dependency commons-fileupload prerequisite failed with reason build failed
    -INFO- Optional dependency httpunit failed with reason build failed
    -DEBUG- (Apache Gump generated) Apache Maven Settings in: /srv/gump/public/workspace/turbine-core/gump_mvn_settings.xml
    -INFO- Failed with reason build failed
    -DEBUG- Maven POM in: /srv/gump/public/workspace/turbine-core/pom.xml
    -INFO- Failed to extract fallback artifacts from Gump Repository



    The following work was performed:
    http://vmgump.apache.org/gump/public/turbine-core/turbine-core/gump_work/build_turbine-core_turbine-core.html
    Work Name: build_turbine-core_turbine-core (Type: Build)
    Work ended in a state of : Failed
    Elapsed: 30 secs
    Command Line: /opt/maven2/bin/mvn --batch-mode -DskipTests=true --settings /srv/gump/public/workspace/turbine-core/gump_mvn_settings.xml package
    [Working Directory: /srv/gump/public/workspace/turbine-core]
    M2_HOME: /opt/maven2
    ---------------------------------------------
    urls[19] = file:/srv/gump/public/workspace/mvnlocalrepo/shared/xml-apis/xml-apis/1.0.b2/xml-apis-1.0.b2.jar
    urls[20] = file:/srv/gump/public/workspace/mvnlocalrepo/shared/commons-configuration/commons-configuration/1.4/commons-configuration-1.4.jar
    urls[21] = file:/srv/gump/public/workspace/mvnlocalrepo/shared/commons-logging/commons-logging-api/1.0.4/commons-logging-api-1.0.4.jar
    urls[22] = file:/srv/gump/public/workspace/mvnlocalrepo/shared/commons-digester/commons-digester/1.8/commons-digester-1.8.jar
    urls[23] = file:/srv/gump/public/workspace/mvnlocalrepo/shared/commons-beanutils/commons-beanutils/1.7.0/commons-beanutils-1.7.0.jar
    urls[24] = file:/srv/gump/public/workspace/mvnlocalrepo/shared/commons-beanutils/commons-beanutils-core/1.7.0/commons-beanutils-core-1.7.0.jar
    urls[25] = file:/srv/gump/public/workspace/mvnlocalrepo/shared/commons-codec/commons-codec/1.3/commons-codec-1.3.jar
    urls[26] = file:/srv/gump/public/workspace/mvnlocalrepo/shared/commons-jxpath/commons-jxpath/1.2/commons-jxpath-1.2.jar
    urls[27] = file:/srv/gump/public/workspace/mvnlocalrepo/shared/xerces/xerces/1.2.3/xerces-1.2.3.jar
    urls[28] = file:/srv/gump/public/workspace/mvnlocalrepo/shared/ant/ant-optional/1.5.1/ant-optional-1.5.1.jar
    urls[29] = file:/srv/gump/public/workspace/mvnlocalrepo/shared/jdom/jdom/b9/jdom-b9.jar
    Number of imports: 10
    import: org.codehaus.classworlds.Entry@a6c57a42
    import: org.codehaus.classworlds.Entry@12f43f3b
    import: org.codehaus.classworlds.Entry@20025374
    import: org.codehaus.classworlds.Entry@f8e44ca4
    import: org.codehaus.classworlds.Entry@92758522
    import: org.codehaus.classworlds.Entry@ebf2705b
    import: org.codehaus.classworlds.Entry@bb25e54
    import: org.codehaus.classworlds.Entry@bece5185
    import: org.codehaus.classworlds.Entry@3fee8e37
    import: org.codehaus.classworlds.Entry@3fee19d8


    this realm = plexus.core
    urls[0] = file:/opt/maven2/lib/maven-2.2.1-uber.jar
    Number of imports: 10
    import: org.codehaus.classworlds.Entry@a6c57a42
    import: org.codehaus.classworlds.Entry@12f43f3b
    import: org.codehaus.classworlds.Entry@20025374
    import: org.codehaus.classworlds.Entry@f8e44ca4
    import: org.codehaus.classworlds.Entry@92758522
    import: org.codehaus.classworlds.Entry@ebf2705b
    import: org.codehaus.classworlds.Entry@bb25e54
    import: org.codehaus.classworlds.Entry@bece5185
    import: org.codehaus.classworlds.Entry@3fee8e37
    import: org.codehaus.classworlds.Entry@3fee19d8
    -----------------------------------------------------
    [INFO] ------------------------------------------------------------------------
    [ERROR] BUILD ERROR
    [INFO] ------------------------------------------------------------------------
    [INFO] Internal error in the plugin manager executing goal 'org.apache.torque:torque-maven-plugin:3.3:om': Unable to load the mojo 'org.apache.torque:torque-maven-plugin:3.3:om' in the plugin 'org.apache.torque:torque-maven-plugin'. A required class is missing: org/apache/torque/task/TorqueDataModelTask
    org.apache.torque.task.TorqueDataModelTask
    [INFO] ------------------------------------------------------------------------
    [INFO] For more information, run Maven with the -e switch
    [INFO] ------------------------------------------------------------------------
    [INFO] Total time: 29 seconds
    [INFO] Finished at: Sat Mar 26 12:00:49 UTC 2011
    [INFO] Final Memory: 21M/57M
    [INFO] ------------------------------------------------------------------------
    ---------------------------------------------

    To subscribe to this information via syndicated feeds:
    - RSS: http://vmgump.apache.org/gump/public/turbine-core/turbine-core/rss.xml
    - Atom: http://vmgump.apache.org/gump/public/turbine-core/turbine-core/atom.xml

    ============================== Gump Tracking Only ===
    Produced by Apache Gump(TM) version 2.3.
    Gump Run 05000626032011, vmgump.apache.org:vmgump:05000626032011
    Gump E-mail Identifier (unique within run) #31.

    --
    Apache Gump
    http://gump.apache.org/ [Instance: vmgump]

    ---------------------------------------------------------------------
    To unsubscribe, e-mail: dev-unsubscribe@turbine.apache.org
    For additional commands, e-mail: dev-help@turbine.apache.org
  • Anonymous at Mar 28, 2011 at 12:02 pm
    To whom it may engage...

    This is an automated request, but not an unsolicited one. For
    more information please visit http://gump.apache.org/nagged.html,
    and/or contact the folk at general@gump.apache.org.

    Project turbine-core has an issue affecting its community integration.
    This issue affects 2 projects,
    and has been outstanding for 60 runs.
    The current state of this project is 'Failed', with reason 'Build Failed'.
    For reference only, the following projects are affected by this:
    - turbine-core : A servlet based framework.
    - turbine-core-test : A servlet based framework.


    Full details are available at:
    http://vmgump.apache.org/gump/public/turbine-core/turbine-core/index.html

    That said, some information snippets are provided here.

    The following annotations (debug/informational/warning/error messages) were provided:
    -INFO- Optional dependency commons-fileupload prerequisite failed with reason build failed
    -INFO- Optional dependency httpunit failed with reason build failed
    -DEBUG- (Apache Gump generated) Apache Maven Settings in: /srv/gump/public/workspace/turbine-core/gump_mvn_settings.xml
    -INFO- Failed with reason build failed
    -DEBUG- Maven POM in: /srv/gump/public/workspace/turbine-core/pom.xml
    -INFO- Failed to extract fallback artifacts from Gump Repository



    The following work was performed:
    http://vmgump.apache.org/gump/public/turbine-core/turbine-core/gump_work/build_turbine-core_turbine-core.html
    Work Name: build_turbine-core_turbine-core (Type: Build)
    Work ended in a state of : Failed
    Elapsed: 29 secs
    Command Line: /opt/maven2/bin/mvn --batch-mode -DskipTests=true --settings /srv/gump/public/workspace/turbine-core/gump_mvn_settings.xml package
    [Working Directory: /srv/gump/public/workspace/turbine-core]
    M2_HOME: /opt/maven2
    ---------------------------------------------
    urls[19] = file:/srv/gump/public/workspace/mvnlocalrepo/shared/xml-apis/xml-apis/1.0.b2/xml-apis-1.0.b2.jar
    urls[20] = file:/srv/gump/public/workspace/mvnlocalrepo/shared/commons-configuration/commons-configuration/1.4/commons-configuration-1.4.jar
    urls[21] = file:/srv/gump/public/workspace/mvnlocalrepo/shared/commons-logging/commons-logging-api/1.0.4/commons-logging-api-1.0.4.jar
    urls[22] = file:/srv/gump/public/workspace/mvnlocalrepo/shared/commons-digester/commons-digester/1.8/commons-digester-1.8.jar
    urls[23] = file:/srv/gump/public/workspace/mvnlocalrepo/shared/commons-beanutils/commons-beanutils/1.7.0/commons-beanutils-1.7.0.jar
    urls[24] = file:/srv/gump/public/workspace/mvnlocalrepo/shared/commons-beanutils/commons-beanutils-core/1.7.0/commons-beanutils-core-1.7.0.jar
    urls[25] = file:/srv/gump/public/workspace/mvnlocalrepo/shared/commons-codec/commons-codec/1.3/commons-codec-1.3.jar
    urls[26] = file:/srv/gump/public/workspace/mvnlocalrepo/shared/commons-jxpath/commons-jxpath/1.2/commons-jxpath-1.2.jar
    urls[27] = file:/srv/gump/public/workspace/mvnlocalrepo/shared/xerces/xerces/1.2.3/xerces-1.2.3.jar
    urls[28] = file:/srv/gump/public/workspace/mvnlocalrepo/shared/ant/ant-optional/1.5.1/ant-optional-1.5.1.jar
    urls[29] = file:/srv/gump/public/workspace/mvnlocalrepo/shared/jdom/jdom/b9/jdom-b9.jar
    Number of imports: 10
    import: org.codehaus.classworlds.Entry@a6c57a42
    import: org.codehaus.classworlds.Entry@12f43f3b
    import: org.codehaus.classworlds.Entry@20025374
    import: org.codehaus.classworlds.Entry@f8e44ca4
    import: org.codehaus.classworlds.Entry@92758522
    import: org.codehaus.classworlds.Entry@ebf2705b
    import: org.codehaus.classworlds.Entry@bb25e54
    import: org.codehaus.classworlds.Entry@bece5185
    import: org.codehaus.classworlds.Entry@3fee8e37
    import: org.codehaus.classworlds.Entry@3fee19d8


    this realm = plexus.core
    urls[0] = file:/opt/maven2/lib/maven-2.2.1-uber.jar
    Number of imports: 10
    import: org.codehaus.classworlds.Entry@a6c57a42
    import: org.codehaus.classworlds.Entry@12f43f3b
    import: org.codehaus.classworlds.Entry@20025374
    import: org.codehaus.classworlds.Entry@f8e44ca4
    import: org.codehaus.classworlds.Entry@92758522
    import: org.codehaus.classworlds.Entry@ebf2705b
    import: org.codehaus.classworlds.Entry@bb25e54
    import: org.codehaus.classworlds.Entry@bece5185
    import: org.codehaus.classworlds.Entry@3fee8e37
    import: org.codehaus.classworlds.Entry@3fee19d8
    -----------------------------------------------------
    [INFO] ------------------------------------------------------------------------
    [ERROR] BUILD ERROR
    [INFO] ------------------------------------------------------------------------
    [INFO] Internal error in the plugin manager executing goal 'org.apache.torque:torque-maven-plugin:3.3:om': Unable to load the mojo 'org.apache.torque:torque-maven-plugin:3.3:om' in the plugin 'org.apache.torque:torque-maven-plugin'. A required class is missing: org/apache/torque/task/TorqueDataModelTask
    org.apache.torque.task.TorqueDataModelTask
    [INFO] ------------------------------------------------------------------------
    [INFO] For more information, run Maven with the -e switch
    [INFO] ------------------------------------------------------------------------
    [INFO] Total time: 28 seconds
    [INFO] Finished at: Mon Mar 28 12:02:13 UTC 2011
    [INFO] Final Memory: 21M/55M
    [INFO] ------------------------------------------------------------------------
    ---------------------------------------------

    To subscribe to this information via syndicated feeds:
    - RSS: http://vmgump.apache.org/gump/public/turbine-core/turbine-core/rss.xml
    - Atom: http://vmgump.apache.org/gump/public/turbine-core/turbine-core/atom.xml

    ============================== Gump Tracking Only ===
    Produced by Apache Gump(TM) version 2.3.
    Gump Run 08000628032011, vmgump.apache.org:vmgump:08000628032011
    Gump E-mail Identifier (unique within run) #31.

    --
    Apache Gump
    http://gump.apache.org/ [Instance: vmgump]

    ---------------------------------------------------------------------
    To unsubscribe, e-mail: dev-unsubscribe@turbine.apache.org
    For additional commands, e-mail: dev-help@turbine.apache.org
  • Anonymous at Mar 29, 2011 at 12:39 pm
    To whom it may engage...

    This is an automated request, but not an unsolicited one. For
    more information please visit http://gump.apache.org/nagged.html,
    and/or contact the folk at general@gump.apache.org.

    Project turbine-core has an issue affecting its community integration.
    This issue affects 2 projects,
    and has been outstanding for 62 runs.
    The current state of this project is 'Failed', with reason 'Build Failed'.
    For reference only, the following projects are affected by this:
    - turbine-core : A servlet based framework.
    - turbine-core-test : A servlet based framework.


    Full details are available at:
    http://vmgump.apache.org/gump/public/turbine-core/turbine-core/index.html

    That said, some information snippets are provided here.

    The following annotations (debug/informational/warning/error messages) were provided:
    -INFO- Optional dependency commons-fileupload prerequisite failed with reason build failed
    -INFO- Optional dependency httpunit failed with reason build failed
    -DEBUG- (Apache Gump generated) Apache Maven Settings in: /srv/gump/public/workspace/turbine-core/gump_mvn_settings.xml
    -INFO- Failed with reason build failed
    -DEBUG- Maven POM in: /srv/gump/public/workspace/turbine-core/pom.xml
    -INFO- Failed to extract fallback artifacts from Gump Repository



    The following work was performed:
    http://vmgump.apache.org/gump/public/turbine-core/turbine-core/gump_work/build_turbine-core_turbine-core.html
    Work Name: build_turbine-core_turbine-core (Type: Build)
    Work ended in a state of : Failed
    Elapsed: 30 secs
    Command Line: /opt/maven2/bin/mvn --batch-mode -DskipTests=true --settings /srv/gump/public/workspace/turbine-core/gump_mvn_settings.xml package
    [Working Directory: /srv/gump/public/workspace/turbine-core]
    M2_HOME: /opt/maven2
    ---------------------------------------------
    urls[19] = file:/srv/gump/public/workspace/mvnlocalrepo/shared/xml-apis/xml-apis/1.0.b2/xml-apis-1.0.b2.jar
    urls[20] = file:/srv/gump/public/workspace/mvnlocalrepo/shared/commons-configuration/commons-configuration/1.4/commons-configuration-1.4.jar
    urls[21] = file:/srv/gump/public/workspace/mvnlocalrepo/shared/commons-logging/commons-logging-api/1.0.4/commons-logging-api-1.0.4.jar
    urls[22] = file:/srv/gump/public/workspace/mvnlocalrepo/shared/commons-digester/commons-digester/1.8/commons-digester-1.8.jar
    urls[23] = file:/srv/gump/public/workspace/mvnlocalrepo/shared/commons-beanutils/commons-beanutils/1.7.0/commons-beanutils-1.7.0.jar
    urls[24] = file:/srv/gump/public/workspace/mvnlocalrepo/shared/commons-beanutils/commons-beanutils-core/1.7.0/commons-beanutils-core-1.7.0.jar
    urls[25] = file:/srv/gump/public/workspace/mvnlocalrepo/shared/commons-codec/commons-codec/1.3/commons-codec-1.3.jar
    urls[26] = file:/srv/gump/public/workspace/mvnlocalrepo/shared/commons-jxpath/commons-jxpath/1.2/commons-jxpath-1.2.jar
    urls[27] = file:/srv/gump/public/workspace/mvnlocalrepo/shared/xerces/xerces/1.2.3/xerces-1.2.3.jar
    urls[28] = file:/srv/gump/public/workspace/mvnlocalrepo/shared/ant/ant-optional/1.5.1/ant-optional-1.5.1.jar
    urls[29] = file:/srv/gump/public/workspace/mvnlocalrepo/shared/jdom/jdom/b9/jdom-b9.jar
    Number of imports: 10
    import: org.codehaus.classworlds.Entry@a6c57a42
    import: org.codehaus.classworlds.Entry@12f43f3b
    import: org.codehaus.classworlds.Entry@20025374
    import: org.codehaus.classworlds.Entry@f8e44ca4
    import: org.codehaus.classworlds.Entry@92758522
    import: org.codehaus.classworlds.Entry@ebf2705b
    import: org.codehaus.classworlds.Entry@bb25e54
    import: org.codehaus.classworlds.Entry@bece5185
    import: org.codehaus.classworlds.Entry@3fee8e37
    import: org.codehaus.classworlds.Entry@3fee19d8


    this realm = plexus.core
    urls[0] = file:/opt/maven2/lib/maven-2.2.1-uber.jar
    Number of imports: 10
    import: org.codehaus.classworlds.Entry@a6c57a42
    import: org.codehaus.classworlds.Entry@12f43f3b
    import: org.codehaus.classworlds.Entry@20025374
    import: org.codehaus.classworlds.Entry@f8e44ca4
    import: org.codehaus.classworlds.Entry@92758522
    import: org.codehaus.classworlds.Entry@ebf2705b
    import: org.codehaus.classworlds.Entry@bb25e54
    import: org.codehaus.classworlds.Entry@bece5185
    import: org.codehaus.classworlds.Entry@3fee8e37
    import: org.codehaus.classworlds.Entry@3fee19d8
    -----------------------------------------------------
    [INFO] ------------------------------------------------------------------------
    [ERROR] BUILD ERROR
    [INFO] ------------------------------------------------------------------------
    [INFO] Internal error in the plugin manager executing goal 'org.apache.torque:torque-maven-plugin:3.3:om': Unable to load the mojo 'org.apache.torque:torque-maven-plugin:3.3:om' in the plugin 'org.apache.torque:torque-maven-plugin'. A required class is missing: org/apache/torque/task/TorqueDataModelTask
    org.apache.torque.task.TorqueDataModelTask
    [INFO] ------------------------------------------------------------------------
    [INFO] For more information, run Maven with the -e switch
    [INFO] ------------------------------------------------------------------------
    [INFO] Total time: 29 seconds
    [INFO] Finished at: Tue Mar 29 12:38:58 UTC 2011
    [INFO] Final Memory: 21M/58M
    [INFO] ------------------------------------------------------------------------
    ---------------------------------------------

    To subscribe to this information via syndicated feeds:
    - RSS: http://vmgump.apache.org/gump/public/turbine-core/turbine-core/rss.xml
    - Atom: http://vmgump.apache.org/gump/public/turbine-core/turbine-core/atom.xml

    ============================== Gump Tracking Only ===
    Produced by Apache Gump(TM) version 2.3.
    Gump Run 07000629032011, vmgump.apache.org:vmgump:07000629032011
    Gump E-mail Identifier (unique within run) #28.

    --
    Apache Gump
    http://gump.apache.org/ [Instance: vmgump]

    ---------------------------------------------------------------------
    To unsubscribe, e-mail: dev-unsubscribe@turbine.apache.org
    For additional commands, e-mail: dev-help@turbine.apache.org

Related Discussions

Discussion Navigation
viewthread | post
Discussion Overview
groupdev @
categoriesturbine
postedMar 2, '11 at 1:41p
activeMar 29, '11 at 12:39p
posts21
users1
websiteturbine.apache.org

1 user in discussion

Anonymous: 21 posts

People

Translate

site design / logo © 2019 Grokbase