FAQ
To whom it may engage...

This is an automated request, but not an unsolicited one. For
more information please visit http://gump.apache.org/nagged.html,
and/or contact the folk at general@gump.apache.org.

Project fulcrum-template has an issue affecting its community integration.
This issue affects 1 projects.
The current state of this project is 'Failed', with reason 'Build Failed'.
For reference only, the following projects are affected by this:
- fulcrum-template : Services Framework


Full details are available at:
http://brutus.apache.org/gump/public/jakarta-turbine-fulcrum/fulcrum-template/index.html

That said, some information snippets are provided here.

The following annotations (debug/informational/warning/error messages) were provided:
-DEBUG- Sole output [fulcrum-template-1.0.2-dev.jar] identifier set to project name
-DEBUG- (Gump generated) Maven Properties in: /usr/local/gump/public/workspace/jakarta-turbine-fulcrum/template/build.properties
-INFO- Failed with reason build failed
-DEBUG- Maven POM in: /usr/local/gump/public/workspace/jakarta-turbine-fulcrum/template/project.xml
-DEBUG- Maven project properties in: /usr/local/gump/public/workspace/jakarta-turbine-fulcrum/template/project.properties
-INFO- Failed to extract fallback artifacts from Gump Repository



The following work was performed:
http://brutus.apache.org/gump/public/jakarta-turbine-fulcrum/fulcrum-template/gump_work/build_jakarta-turbine-fulcrum_fulcrum-template.html
Work Name: build_jakarta-turbine-fulcrum_fulcrum-template (Type: Build)
Work ended in a state of : Failed
Elapsed: 5 secs
Command Line: maven --offline jar
[Working Directory: /usr/local/gump/public/workspace/jakarta-turbine-fulcrum/template]
CLASSPATH: /opt/jdk1.4/lib/tools.jar:/usr/local/gump/public/workspace/ant/dist/lib/ant-jmf.jar:/usr/local/gump/public/workspace/ant/dist/lib/ant-swing.jar:/usr/local/gump/public/workspace/ant/dist/lib/ant-apache-resolver.jar:/usr/local/gump/public/workspace/ant/dist/lib/ant-trax.jar:/usr/local/gump/public/workspace/ant/dist/lib/ant-junit.jar:/usr/local/gump/public/workspace/ant/dist/lib/ant-launcher.jar:/usr/local/gump/public/workspace/ant/dist/lib/ant-nodeps.jar:/usr/local/gump/public/workspace/ant/dist/lib/ant.jar:/usr/local/gump/public/workspace/avalon-trunk/runtime/framework/api/target/deliverables/jars/avalon-framework-api-22042005.jar:/usr/local/gump/public/workspace/avalon-trunk/runtime/framework/impl/target/deliverables/jars/avalon-framework-impl-22042005.jar:/usr/local/gump/public/workspace/jakarta-turbine-fulcrum/yaafi/target/fulcrum-yaafi-1.0.4-dev.jar:/usr/local/gump/public/workspace/jakarta-turbine-fulcrum/testcontainer/target/fulcrum-testcontainer-1.0.5-dev.jar:/usr/local/gump/public/workspace/jakarta-commons/lang/dist/commons-lang-22042005.jar:/usr/local/gump/public/workspace/jakarta-commons/io/dist/jakarta-commons-io-22042005.jar:/usr/local/gump/public/workspace/jakarta-commons/logging/dist/commons-logging.jar:/usr/local/gump/public/workspace/jakarta-commons/logging/dist/commons-logging-api.jar:/usr/local/gump/public/workspace/jakarta-commons/collections/build/commons-collections-22042005.jar:/usr/local/gump/public/workspace/jakarta-commons/configuration/target/commons-configuration-22042005.jar:/usr/local/gump/public/workspace/logging-log4j/log4j-22042005.jar:/usr/local/gump/public/workspace/jakarta-commons/email/target/commons-email-22042005.jar:/usr/local/gump/packages/javamail-1.3.2/mail.jar:/usr/local/gump/packages/jaf-1.0.1/activation.jar:/usr/local/gump/public/workspace/jakarta-velocity/bin/velocity-22042005.jar:/usr/local/gump/public/workspace/jakarta-velocity/bin/velocity-dep-22042005.jar
---------------------------------------------
__ __
\/ |__ _Apache__ ___
\/| / _` \ V / -_) ' \ ~ intelligent projects ~
_| |_\__,_|\_/\___|_||_| v. 1.0.2
build:start:

java:prepare-filesystem:
[mkdir] Created dir: /home/gump/workspaces2/public/workspace/jakarta-turbine-fulcrum/template/target/classes

java:compile:
[echo] Compiling to /home/gump/workspaces2/public/workspace/jakarta-turbine-fulcrum/template/target/classes
[echo]
==========================================================

NOTE: Targetting JVM 1.4, classes
will not run on earlier JVMs

==========================================================

[javac] Compiling 16 source files to /home/gump/workspaces2/public/workspace/jakarta-turbine-fulcrum/template/target/classes
/home/gump/workspaces2/public/workspace/jakarta-turbine-fulcrum/template/src/java/org/apache/fulcrum/template/TemplateHtmlEmail.java:131: send() in org.apache.fulcrum.template.TemplateHtmlEmail cannot override send() in org.apache.commons.mail.HtmlEmail; overridden method does not throw javax.mail.MessagingException
public void send()
^
Note: /home/gump/workspaces2/public/workspace/jakarta-turbine-fulcrum/template/src/java/org/apache/fulcrum/template/velocity/DefaultVelocityService.java uses or overrides a deprecated API.
Note: Recompile with -deprecation for details.
1 error

BUILD FAILED
File...... /home/gump/.maven/cache/maven-java-plugin-1.5/plugin.jelly
Element... ant:javac
Line...... 63
Column.... 48
Compile failed; see the compiler error output for details.
Total time: 5 seconds
Finished at: Fri Apr 22 03:26:42 PDT 2005

---------------------------------------------

To subscribe to this information via syndicated feeds:
- RSS: http://brutus.apache.org/gump/public/jakarta-turbine-fulcrum/fulcrum-template/rss.xml
- Atom: http://brutus.apache.org/gump/public/jakarta-turbine-fulcrum/fulcrum-template/atom.xml

============================== Gump Tracking Only ===
Produced by Gump version 2.2.
Gump Run 26000022042005, brutus:brutus-public:26000022042005
Gump E-mail Identifier (unique within run) #34.

--
Apache Gump
http://gump.apache.org/ [Instance: brutus]

---------------------------------------------------------------------
To unsubscribe, e-mail: turbine-dev-unsubscribe@jakarta.apache.org
For additional commands, e-mail: turbine-dev-help@jakarta.apache.org

Search Discussions

  • Fulcrum-template development at Apr 23, 2005 at 10:25 am
    To whom it may engage...

    This is an automated request, but not an unsolicited one. For
    more information please visit http://gump.apache.org/nagged.html,
    and/or contact the folk at general@gump.apache.org.

    Project fulcrum-template has an issue affecting its community integration.
    This issue affects 1 projects,
    and has been outstanding for 3 runs.
    The current state of this project is 'Failed', with reason 'Build Failed'.
    For reference only, the following projects are affected by this:
    - fulcrum-template : Services Framework


    Full details are available at:
    http://brutus.apache.org/gump/public/jakarta-turbine-fulcrum/fulcrum-template/index.html

    That said, some information snippets are provided here.

    The following annotations (debug/informational/warning/error messages) were provided:
    -DEBUG- Sole output [fulcrum-template-1.0.2-dev.jar] identifier set to project name
    -DEBUG- (Gump generated) Maven Properties in: /usr/local/gump/public/workspace/jakarta-turbine-fulcrum/template/build.properties
    -INFO- Failed with reason build failed
    -DEBUG- Maven POM in: /usr/local/gump/public/workspace/jakarta-turbine-fulcrum/template/project.xml
    -DEBUG- Maven project properties in: /usr/local/gump/public/workspace/jakarta-turbine-fulcrum/template/project.properties
    -INFO- Failed to extract fallback artifacts from Gump Repository



    The following work was performed:
    http://brutus.apache.org/gump/public/jakarta-turbine-fulcrum/fulcrum-template/gump_work/build_jakarta-turbine-fulcrum_fulcrum-template.html
    Work Name: build_jakarta-turbine-fulcrum_fulcrum-template (Type: Build)
    Work ended in a state of : Failed
    Elapsed: 5 secs
    Command Line: maven --offline jar
    [Working Directory: /usr/local/gump/public/workspace/jakarta-turbine-fulcrum/template]
    CLASSPATH: /opt/jdk1.4/lib/tools.jar:/usr/local/gump/public/workspace/ant/dist/lib/ant-jmf.jar:/usr/local/gump/public/workspace/ant/dist/lib/ant-swing.jar:/usr/local/gump/public/workspace/ant/dist/lib/ant-apache-resolver.jar:/usr/local/gump/public/workspace/ant/dist/lib/ant-trax.jar:/usr/local/gump/public/workspace/ant/dist/lib/ant-junit.jar:/usr/local/gump/public/workspace/ant/dist/lib/ant-launcher.jar:/usr/local/gump/public/workspace/ant/dist/lib/ant-nodeps.jar:/usr/local/gump/public/workspace/ant/dist/lib/ant.jar:/usr/local/gump/public/workspace/avalon-trunk/runtime/framework/api/target/deliverables/jars/avalon-framework-api-23042005.jar:/usr/local/gump/public/workspace/avalon-trunk/runtime/framework/impl/target/deliverables/jars/avalon-framework-impl-23042005.jar:/usr/local/gump/public/workspace/jakarta-turbine-fulcrum/yaafi/target/fulcrum-yaafi-1.0.4-dev.jar:/usr/local/gump/public/workspace/jakarta-turbine-fulcrum/testcontainer/target/fulcrum-testcontainer-1.0.5-dev.jar:/usr/local/gump/public/workspace/jakarta-commons/lang/dist/commons-lang-23042005.jar:/usr/local/gump/public/workspace/jakarta-commons/io/dist/jakarta-commons-io-23042005.jar:/usr/local/gump/public/workspace/jakarta-commons/logging/dist/commons-logging.jar:/usr/local/gump/public/workspace/jakarta-commons/logging/dist/commons-logging-api.jar:/usr/local/gump/public/workspace/jakarta-commons/collections/build/commons-collections-23042005.jar:/usr/local/gump/public/workspace/jakarta-commons/configuration/target/commons-configuration-23042005.jar:/usr/local/gump/public/workspace/logging-log4j/log4j-23042005.jar:/usr/local/gump/public/workspace/jakarta-commons/email/target/commons-email-23042005.jar:/usr/local/gump/packages/javamail-1.3.2/mail.jar:/usr/local/gump/packages/jaf-1.0.1/activation.jar:/usr/local/gump/public/workspace/jakarta-velocity/bin/velocity-23042005.jar:/usr/local/gump/public/workspace/jakarta-velocity/bin/velocity-dep-23042005.jar
    ---------------------------------------------
    __ __
    \/ |__ _Apache__ ___
    \/| / _` \ V / -_) ' \ ~ intelligent projects ~
    _| |_\__,_|\_/\___|_||_| v. 1.0.2
    build:start:

    java:prepare-filesystem:
    [mkdir] Created dir: /home/gump/workspaces2/public/workspace/jakarta-turbine-fulcrum/template/target/classes

    java:compile:
    [echo] Compiling to /home/gump/workspaces2/public/workspace/jakarta-turbine-fulcrum/template/target/classes
    [echo]
    ==========================================================

    NOTE: Targetting JVM 1.4, classes
    will not run on earlier JVMs

    ==========================================================

    [javac] Compiling 16 source files to /home/gump/workspaces2/public/workspace/jakarta-turbine-fulcrum/template/target/classes
    /home/gump/workspaces2/public/workspace/jakarta-turbine-fulcrum/template/src/java/org/apache/fulcrum/template/TemplateHtmlEmail.java:131: send() in org.apache.fulcrum.template.TemplateHtmlEmail cannot override send() in org.apache.commons.mail.HtmlEmail; overridden method does not throw javax.mail.MessagingException
    public void send()
    ^
    Note: /home/gump/workspaces2/public/workspace/jakarta-turbine-fulcrum/template/src/java/org/apache/fulcrum/template/velocity/DefaultVelocityService.java uses or overrides a deprecated API.
    Note: Recompile with -deprecation for details.
    1 error

    BUILD FAILED
    File...... /home/gump/.maven/cache/maven-java-plugin-1.5/plugin.jelly
    Element... ant:javac
    Line...... 63
    Column.... 48
    Compile failed; see the compiler error output for details.
    Total time: 5 seconds
    Finished at: Sat Apr 23 03:25:09 PDT 2005

    ---------------------------------------------

    To subscribe to this information via syndicated feeds:
    - RSS: http://brutus.apache.org/gump/public/jakarta-turbine-fulcrum/fulcrum-template/rss.xml
    - Atom: http://brutus.apache.org/gump/public/jakarta-turbine-fulcrum/fulcrum-template/atom.xml

    ============================== Gump Tracking Only ===
    Produced by Gump version 2.2.
    Gump Run 22000023042005, brutus:brutus-public:22000023042005
    Gump E-mail Identifier (unique within run) #37.

    --
    Apache Gump
    http://gump.apache.org/ [Instance: brutus]

    ---------------------------------------------------------------------
    To unsubscribe, e-mail: turbine-dev-unsubscribe@jakarta.apache.org
    For additional commands, e-mail: turbine-dev-help@jakarta.apache.org
  • Fulcrum-template development at Apr 24, 2005 at 10:24 am
    To whom it may engage...

    This is an automated request, but not an unsolicited one. For
    more information please visit http://gump.apache.org/nagged.html,
    and/or contact the folk at general@gump.apache.org.

    Project fulcrum-template has an issue affecting its community integration.
    This issue affects 1 projects,
    and has been outstanding for 5 runs.
    The current state of this project is 'Failed', with reason 'Build Failed'.
    For reference only, the following projects are affected by this:
    - fulcrum-template : Services Framework


    Full details are available at:
    http://brutus.apache.org/gump/public/jakarta-turbine-fulcrum/fulcrum-template/index.html

    That said, some information snippets are provided here.

    The following annotations (debug/informational/warning/error messages) were provided:
    -DEBUG- Sole output [fulcrum-template-1.0.2-dev.jar] identifier set to project name
    -DEBUG- (Gump generated) Maven Properties in: /usr/local/gump/public/workspace/jakarta-turbine-fulcrum/template/build.properties
    -INFO- Failed with reason build failed
    -DEBUG- Maven POM in: /usr/local/gump/public/workspace/jakarta-turbine-fulcrum/template/project.xml
    -DEBUG- Maven project properties in: /usr/local/gump/public/workspace/jakarta-turbine-fulcrum/template/project.properties
    -INFO- Failed to extract fallback artifacts from Gump Repository



    The following work was performed:
    http://brutus.apache.org/gump/public/jakarta-turbine-fulcrum/fulcrum-template/gump_work/build_jakarta-turbine-fulcrum_fulcrum-template.html
    Work Name: build_jakarta-turbine-fulcrum_fulcrum-template (Type: Build)
    Work ended in a state of : Failed
    Elapsed: 5 secs
    Command Line: maven --offline jar
    [Working Directory: /usr/local/gump/public/workspace/jakarta-turbine-fulcrum/template]
    CLASSPATH: /opt/jdk1.4/lib/tools.jar:/usr/local/gump/public/workspace/ant/dist/lib/ant-jmf.jar:/usr/local/gump/public/workspace/ant/dist/lib/ant-swing.jar:/usr/local/gump/public/workspace/ant/dist/lib/ant-apache-resolver.jar:/usr/local/gump/public/workspace/ant/dist/lib/ant-trax.jar:/usr/local/gump/public/workspace/ant/dist/lib/ant-junit.jar:/usr/local/gump/public/workspace/ant/dist/lib/ant-launcher.jar:/usr/local/gump/public/workspace/ant/dist/lib/ant-nodeps.jar:/usr/local/gump/public/workspace/ant/dist/lib/ant.jar:/usr/local/gump/public/workspace/avalon-trunk/runtime/framework/api/target/deliverables/jars/avalon-framework-api-24042005.jar:/usr/local/gump/public/workspace/avalon-trunk/runtime/framework/impl/target/deliverables/jars/avalon-framework-impl-24042005.jar:/usr/local/gump/public/workspace/jakarta-turbine-fulcrum/yaafi/target/fulcrum-yaafi-1.0.4-dev.jar:/usr/local/gump/public/workspace/jakarta-turbine-fulcrum/testcontainer/target/fulcrum-testcontainer-1.0.5-dev.jar:/usr/local/gump/public/workspace/jakarta-commons/lang/dist/commons-lang-24042005.jar:/usr/local/gump/public/workspace/jakarta-commons/io/dist/jakarta-commons-io-24042005.jar:/usr/local/gump/public/workspace/jakarta-commons/logging/dist/commons-logging.jar:/usr/local/gump/public/workspace/jakarta-commons/logging/dist/commons-logging-api.jar:/usr/local/gump/public/workspace/jakarta-commons/collections/build/commons-collections-24042005.jar:/usr/local/gump/public/workspace/jakarta-commons/configuration/target/commons-configuration-24042005.jar:/usr/local/gump/public/workspace/logging-log4j/log4j-24042005.jar:/usr/local/gump/public/workspace/jakarta-commons/email/target/commons-email-24042005.jar:/usr/local/gump/packages/javamail-1.3.2/mail.jar:/usr/local/gump/packages/jaf-1.0.1/activation.jar:/usr/local/gump/public/workspace/jakarta-velocity/bin/velocity-24042005.jar:/usr/local/gump/public/workspace/jakarta-velocity/bin/velocity-dep-24042005.jar
    ---------------------------------------------
    __ __
    \/ |__ _Apache__ ___
    \/| / _` \ V / -_) ' \ ~ intelligent projects ~
    _| |_\__,_|\_/\___|_||_| v. 1.0.2
    build:start:

    java:prepare-filesystem:
    [mkdir] Created dir: /home/gump/workspaces2/public/workspace/jakarta-turbine-fulcrum/template/target/classes

    java:compile:
    [echo] Compiling to /home/gump/workspaces2/public/workspace/jakarta-turbine-fulcrum/template/target/classes
    [echo]
    ==========================================================

    NOTE: Targetting JVM 1.4, classes
    will not run on earlier JVMs

    ==========================================================

    [javac] Compiling 16 source files to /home/gump/workspaces2/public/workspace/jakarta-turbine-fulcrum/template/target/classes
    /home/gump/workspaces2/public/workspace/jakarta-turbine-fulcrum/template/src/java/org/apache/fulcrum/template/TemplateHtmlEmail.java:131: send() in org.apache.fulcrum.template.TemplateHtmlEmail cannot override send() in org.apache.commons.mail.HtmlEmail; overridden method does not throw javax.mail.MessagingException
    public void send()
    ^
    Note: /home/gump/workspaces2/public/workspace/jakarta-turbine-fulcrum/template/src/java/org/apache/fulcrum/template/velocity/DefaultVelocityService.java uses or overrides a deprecated API.
    Note: Recompile with -deprecation for details.
    1 error

    BUILD FAILED
    File...... /home/gump/.maven/cache/maven-java-plugin-1.5/plugin.jelly
    Element... ant:javac
    Line...... 63
    Column.... 48
    Compile failed; see the compiler error output for details.
    Total time: 5 seconds
    Finished at: Sun Apr 24 03:23:51 PDT 2005

    ---------------------------------------------

    To subscribe to this information via syndicated feeds:
    - RSS: http://brutus.apache.org/gump/public/jakarta-turbine-fulcrum/fulcrum-template/rss.xml
    - Atom: http://brutus.apache.org/gump/public/jakarta-turbine-fulcrum/fulcrum-template/atom.xml

    ============================== Gump Tracking Only ===
    Produced by Gump version 2.2.
    Gump Run 21000024042005, brutus:brutus-public:21000024042005
    Gump E-mail Identifier (unique within run) #33.

    --
    Apache Gump
    http://gump.apache.org/ [Instance: brutus]

    ---------------------------------------------------------------------
    To unsubscribe, e-mail: turbine-dev-unsubscribe@jakarta.apache.org
    For additional commands, e-mail: turbine-dev-help@jakarta.apache.org
  • Fulcrum-template development at Apr 25, 2005 at 10:31 am
    To whom it may engage...

    This is an automated request, but not an unsolicited one. For
    more information please visit http://gump.apache.org/nagged.html,
    and/or contact the folk at general@gump.apache.org.

    Project fulcrum-template has an issue affecting its community integration.
    This issue affects 1 projects,
    and has been outstanding for 7 runs.
    The current state of this project is 'Failed', with reason 'Build Failed'.
    For reference only, the following projects are affected by this:
    - fulcrum-template : Services Framework


    Full details are available at:
    http://brutus.apache.org/gump/public/jakarta-turbine-fulcrum/fulcrum-template/index.html

    That said, some information snippets are provided here.

    The following annotations (debug/informational/warning/error messages) were provided:
    -DEBUG- Sole output [fulcrum-template-1.0.2-dev.jar] identifier set to project name
    -DEBUG- (Gump generated) Maven Properties in: /usr/local/gump/public/workspace/jakarta-turbine-fulcrum/template/build.properties
    -INFO- Failed with reason build failed
    -DEBUG- Maven POM in: /usr/local/gump/public/workspace/jakarta-turbine-fulcrum/template/project.xml
    -DEBUG- Maven project properties in: /usr/local/gump/public/workspace/jakarta-turbine-fulcrum/template/project.properties
    -INFO- Failed to extract fallback artifacts from Gump Repository



    The following work was performed:
    http://brutus.apache.org/gump/public/jakarta-turbine-fulcrum/fulcrum-template/gump_work/build_jakarta-turbine-fulcrum_fulcrum-template.html
    Work Name: build_jakarta-turbine-fulcrum_fulcrum-template (Type: Build)
    Work ended in a state of : Failed
    Elapsed: 6 secs
    Command Line: maven --offline jar
    [Working Directory: /usr/local/gump/public/workspace/jakarta-turbine-fulcrum/template]
    CLASSPATH: /opt/jdk1.4/lib/tools.jar:/usr/local/gump/public/workspace/ant/dist/lib/ant-jmf.jar:/usr/local/gump/public/workspace/ant/dist/lib/ant-swing.jar:/usr/local/gump/public/workspace/ant/dist/lib/ant-apache-resolver.jar:/usr/local/gump/public/workspace/ant/dist/lib/ant-trax.jar:/usr/local/gump/public/workspace/ant/dist/lib/ant-junit.jar:/usr/local/gump/public/workspace/ant/dist/lib/ant-launcher.jar:/usr/local/gump/public/workspace/ant/dist/lib/ant-nodeps.jar:/usr/local/gump/public/workspace/ant/dist/lib/ant.jar:/usr/local/gump/public/workspace/avalon-trunk/runtime/framework/api/target/deliverables/jars/avalon-framework-api-25042005.jar:/usr/local/gump/public/workspace/avalon-trunk/runtime/framework/impl/target/deliverables/jars/avalon-framework-impl-25042005.jar:/usr/local/gump/public/workspace/jakarta-turbine-fulcrum/yaafi/target/fulcrum-yaafi-1.0.4-dev.jar:/usr/local/gump/public/workspace/jakarta-turbine-fulcrum/testcontainer/target/fulcrum-testcontainer-1.0.5-dev.jar:/usr/local/gump/public/workspace/jakarta-commons/lang/dist/commons-lang-25042005.jar:/usr/local/gump/public/workspace/jakarta-commons/io/dist/jakarta-commons-io-25042005.jar:/usr/local/gump/public/workspace/jakarta-commons/logging/dist/commons-logging.jar:/usr/local/gump/public/workspace/jakarta-commons/logging/dist/commons-logging-api.jar:/usr/local/gump/public/workspace/jakarta-commons/collections/build/commons-collections-25042005.jar:/usr/local/gump/public/workspace/jakarta-commons/configuration/target/commons-configuration-25042005.jar:/usr/local/gump/public/workspace/logging-log4j/log4j-25042005.jar:/usr/local/gump/public/workspace/jakarta-commons/email/target/commons-email-25042005.jar:/usr/local/gump/packages/javamail-1.3.2/mail.jar:/usr/local/gump/packages/jaf-1.0.1/activation.jar:/usr/local/gump/public/workspace/jakarta-velocity/bin/velocity-25042005.jar:/usr/local/gump/public/workspace/jakarta-velocity/bin/velocity-dep-25042005.jar
    ---------------------------------------------
    __ __
    \/ |__ _Apache__ ___
    \/| / _` \ V / -_) ' \ ~ intelligent projects ~
    _| |_\__,_|\_/\___|_||_| v. 1.0.2
    build:start:

    java:prepare-filesystem:
    [mkdir] Created dir: /home/gump/workspaces2/public/workspace/jakarta-turbine-fulcrum/template/target/classes

    java:compile:
    [echo] Compiling to /home/gump/workspaces2/public/workspace/jakarta-turbine-fulcrum/template/target/classes
    [echo]
    ==========================================================

    NOTE: Targetting JVM 1.4, classes
    will not run on earlier JVMs

    ==========================================================

    [javac] Compiling 16 source files to /home/gump/workspaces2/public/workspace/jakarta-turbine-fulcrum/template/target/classes
    /home/gump/workspaces2/public/workspace/jakarta-turbine-fulcrum/template/src/java/org/apache/fulcrum/template/TemplateHtmlEmail.java:131: send() in org.apache.fulcrum.template.TemplateHtmlEmail cannot override send() in org.apache.commons.mail.HtmlEmail; overridden method does not throw javax.mail.MessagingException
    public void send()
    ^
    Note: /home/gump/workspaces2/public/workspace/jakarta-turbine-fulcrum/template/src/java/org/apache/fulcrum/template/velocity/DefaultVelocityService.java uses or overrides a deprecated API.
    Note: Recompile with -deprecation for details.
    1 error

    BUILD FAILED
    File...... /home/gump/.maven/cache/maven-java-plugin-1.5/plugin.jelly
    Element... ant:javac
    Line...... 63
    Column.... 48
    Compile failed; see the compiler error output for details.
    Total time: 6 seconds
    Finished at: Mon Apr 25 03:31:09 PDT 2005

    ---------------------------------------------

    To subscribe to this information via syndicated feeds:
    - RSS: http://brutus.apache.org/gump/public/jakarta-turbine-fulcrum/fulcrum-template/rss.xml
    - Atom: http://brutus.apache.org/gump/public/jakarta-turbine-fulcrum/fulcrum-template/atom.xml

    ============================== Gump Tracking Only ===
    Produced by Gump version 2.2.
    Gump Run 21000025042005, brutus:brutus-public:21000025042005
    Gump E-mail Identifier (unique within run) #33.

    --
    Apache Gump
    http://gump.apache.org/ [Instance: brutus]

    ---------------------------------------------------------------------
    To unsubscribe, e-mail: turbine-dev-unsubscribe@jakarta.apache.org
    For additional commands, e-mail: turbine-dev-help@jakarta.apache.org
  • Fulcrum-template development at Apr 27, 2005 at 10:25 am
    To whom it may engage...

    This is an automated request, but not an unsolicited one. For
    more information please visit http://gump.apache.org/nagged.html,
    and/or contact the folk at general@gump.apache.org.

    Project fulcrum-template has an issue affecting its community integration.
    This issue affects 1 projects.
    The current state of this project is 'Failed', with reason 'Build Failed'.
    For reference only, the following projects are affected by this:
    - fulcrum-template : Services Framework


    Full details are available at:
    http://brutus.apache.org/gump/public/jakarta-turbine-fulcrum/fulcrum-template/index.html

    That said, some information snippets are provided here.

    The following annotations (debug/informational/warning/error messages) were provided:
    -DEBUG- Sole output [fulcrum-template-1.0.2-dev.jar] identifier set to project name
    -DEBUG- (Gump generated) Maven Properties in: /usr/local/gump/public/workspace/jakarta-turbine-fulcrum/template/build.properties
    -INFO- Failed with reason build failed
    -DEBUG- Maven POM in: /usr/local/gump/public/workspace/jakarta-turbine-fulcrum/template/project.xml
    -DEBUG- Maven project properties in: /usr/local/gump/public/workspace/jakarta-turbine-fulcrum/template/project.properties
    -INFO- Failed to extract fallback artifacts from Gump Repository



    The following work was performed:
    http://brutus.apache.org/gump/public/jakarta-turbine-fulcrum/fulcrum-template/gump_work/build_jakarta-turbine-fulcrum_fulcrum-template.html
    Work Name: build_jakarta-turbine-fulcrum_fulcrum-template (Type: Build)
    Work ended in a state of : Failed
    Elapsed: 6 secs
    Command Line: maven --offline jar
    [Working Directory: /usr/local/gump/public/workspace/jakarta-turbine-fulcrum/template]
    CLASSPATH: /opt/jdk1.4/lib/tools.jar:/usr/local/gump/public/workspace/ant/dist/lib/ant-jmf.jar:/usr/local/gump/public/workspace/ant/dist/lib/ant-swing.jar:/usr/local/gump/public/workspace/ant/dist/lib/ant-apache-resolver.jar:/usr/local/gump/public/workspace/ant/dist/lib/ant-trax.jar:/usr/local/gump/public/workspace/ant/dist/lib/ant-junit.jar:/usr/local/gump/public/workspace/ant/dist/lib/ant-launcher.jar:/usr/local/gump/public/workspace/ant/dist/lib/ant-nodeps.jar:/usr/local/gump/public/workspace/ant/dist/lib/ant.jar:/usr/local/gump/public/workspace/avalon-trunk/runtime/framework/api/target/deliverables/jars/avalon-framework-api-27042005.jar:/usr/local/gump/public/workspace/avalon-trunk/runtime/framework/impl/target/deliverables/jars/avalon-framework-impl-27042005.jar:/usr/local/gump/public/workspace/jakarta-turbine-fulcrum/yaafi/target/fulcrum-yaafi-1.0.4-dev.jar:/usr/local/gump/public/workspace/jakarta-turbine-fulcrum/testcontainer/target/fulcrum-testcontainer-1.0.5-dev.jar:/usr/local/gump/public/workspace/jakarta-commons/lang/dist/commons-lang-27042005.jar:/usr/local/gump/public/workspace/jakarta-commons/io/dist/jakarta-commons-io-27042005.jar:/usr/local/gump/public/workspace/jakarta-commons/logging/dist/commons-logging.jar:/usr/local/gump/public/workspace/jakarta-commons/logging/dist/commons-logging-api.jar:/usr/local/gump/public/workspace/jakarta-commons/collections/build/commons-collections-27042005.jar:/usr/local/gump/public/workspace/jakarta-commons/configuration/target/commons-configuration-27042005.jar:/usr/local/gump/public/workspace/logging-log4j/log4j-27042005.jar:/usr/local/gump/public/workspace/jakarta-commons/email/target/commons-email-27042005.jar:/usr/local/gump/packages/javamail-1.3.2/mail.jar:/usr/local/gump/packages/jaf-1.0.1/activation.jar:/usr/local/gump/public/workspace/jakarta-velocity/bin/velocity-27042005.jar:/usr/local/gump/public/workspace/jakarta-velocity/bin/velocity-dep-27042005.jar
    ---------------------------------------------
    __ __
    \/ |__ _Apache__ ___
    \/| / _` \ V / -_) ' \ ~ intelligent projects ~
    _| |_\__,_|\_/\___|_||_| v. 1.0.2
    build:start:

    java:prepare-filesystem:
    [mkdir] Created dir: /home/gump/workspaces2/public/workspace/jakarta-turbine-fulcrum/template/target/classes

    java:compile:
    [echo] Compiling to /home/gump/workspaces2/public/workspace/jakarta-turbine-fulcrum/template/target/classes
    [echo]
    ==========================================================

    NOTE: Targetting JVM 1.4, classes
    will not run on earlier JVMs

    ==========================================================

    [javac] Compiling 16 source files to /home/gump/workspaces2/public/workspace/jakarta-turbine-fulcrum/template/target/classes
    /home/gump/workspaces2/public/workspace/jakarta-turbine-fulcrum/template/src/java/org/apache/fulcrum/template/TemplateHtmlEmail.java:131: send() in org.apache.fulcrum.template.TemplateHtmlEmail cannot override send() in org.apache.commons.mail.HtmlEmail; overridden method does not throw javax.mail.MessagingException
    public void send()
    ^
    Note: /home/gump/workspaces2/public/workspace/jakarta-turbine-fulcrum/template/src/java/org/apache/fulcrum/template/velocity/DefaultVelocityService.java uses or overrides a deprecated API.
    Note: Recompile with -deprecation for details.
    1 error

    BUILD FAILED
    File...... /home/gump/.maven/cache/maven-java-plugin-1.5/plugin.jelly
    Element... ant:javac
    Line...... 63
    Column.... 48
    Compile failed; see the compiler error output for details.
    Total time: 5 seconds
    Finished at: Wed Apr 27 03:25:16 PDT 2005

    ---------------------------------------------

    To subscribe to this information via syndicated feeds:
    - RSS: http://brutus.apache.org/gump/public/jakarta-turbine-fulcrum/fulcrum-template/rss.xml
    - Atom: http://brutus.apache.org/gump/public/jakarta-turbine-fulcrum/fulcrum-template/atom.xml

    ============================== Gump Tracking Only ===
    Produced by Gump version 2.2.
    Gump Run 22000027042005, brutus:brutus-public:22000027042005
    Gump E-mail Identifier (unique within run) #33.

    --
    Apache Gump
    http://gump.apache.org/ [Instance: brutus]

    ---------------------------------------------------------------------
    To unsubscribe, e-mail: turbine-dev-unsubscribe@jakarta.apache.org
    For additional commands, e-mail: turbine-dev-help@jakarta.apache.org
  • Fulcrum-template development at Apr 28, 2005 at 10:36 am
    To whom it may engage...

    This is an automated request, but not an unsolicited one. For
    more information please visit http://gump.apache.org/nagged.html,
    and/or contact the folk at general@gump.apache.org.

    Project fulcrum-template has an issue affecting its community integration.
    This issue affects 1 projects,
    and has been outstanding for 3 runs.
    The current state of this project is 'Failed', with reason 'Build Failed'.
    For reference only, the following projects are affected by this:
    - fulcrum-template : Services Framework


    Full details are available at:
    http://brutus.apache.org/gump/public/jakarta-turbine-fulcrum/fulcrum-template/index.html

    That said, some information snippets are provided here.

    The following annotations (debug/informational/warning/error messages) were provided:
    -DEBUG- Sole output [fulcrum-template-1.0.2-dev.jar] identifier set to project name
    -DEBUG- (Gump generated) Maven Properties in: /usr/local/gump/public/workspace/jakarta-turbine-fulcrum/template/build.properties
    -INFO- Failed with reason build failed
    -DEBUG- Maven POM in: /usr/local/gump/public/workspace/jakarta-turbine-fulcrum/template/project.xml
    -DEBUG- Maven project properties in: /usr/local/gump/public/workspace/jakarta-turbine-fulcrum/template/project.properties
    -INFO- Failed to extract fallback artifacts from Gump Repository



    The following work was performed:
    http://brutus.apache.org/gump/public/jakarta-turbine-fulcrum/fulcrum-template/gump_work/build_jakarta-turbine-fulcrum_fulcrum-template.html
    Work Name: build_jakarta-turbine-fulcrum_fulcrum-template (Type: Build)
    Work ended in a state of : Failed
    Elapsed: 5 secs
    Command Line: maven --offline jar
    [Working Directory: /usr/local/gump/public/workspace/jakarta-turbine-fulcrum/template]
    CLASSPATH: /opt/jdk1.4/lib/tools.jar:/usr/local/gump/public/workspace/ant/dist/lib/ant-jmf.jar:/usr/local/gump/public/workspace/ant/dist/lib/ant-swing.jar:/usr/local/gump/public/workspace/ant/dist/lib/ant-apache-resolver.jar:/usr/local/gump/public/workspace/ant/dist/lib/ant-trax.jar:/usr/local/gump/public/workspace/ant/dist/lib/ant-junit.jar:/usr/local/gump/public/workspace/ant/dist/lib/ant-launcher.jar:/usr/local/gump/public/workspace/ant/dist/lib/ant-nodeps.jar:/usr/local/gump/public/workspace/ant/dist/lib/ant.jar:/usr/local/gump/public/workspace/avalon-trunk/runtime/framework/api/target/deliverables/jars/avalon-framework-api-28042005.jar:/usr/local/gump/public/workspace/avalon-trunk/runtime/framework/impl/target/deliverables/jars/avalon-framework-impl-28042005.jar:/usr/local/gump/public/workspace/jakarta-turbine-fulcrum/yaafi/target/fulcrum-yaafi-1.0.4-dev.jar:/usr/local/gump/public/workspace/jakarta-turbine-fulcrum/testcontainer/target/fulcrum-testcontainer-1.0.5-dev.jar:/usr/local/gump/public/workspace/jakarta-commons/lang/dist/commons-lang-28042005.jar:/usr/local/gump/public/workspace/jakarta-commons/io/dist/jakarta-commons-io-28042005.jar:/usr/local/gump/public/workspace/jakarta-commons/logging/dist/commons-logging.jar:/usr/local/gump/public/workspace/jakarta-commons/logging/dist/commons-logging-api.jar:/usr/local/gump/public/workspace/jakarta-commons/collections/build/commons-collections-28042005.jar:/usr/local/gump/public/workspace/jakarta-commons/configuration/target/commons-configuration-28042005.jar:/usr/local/gump/public/workspace/logging-log4j/log4j-28042005.jar:/usr/local/gump/public/workspace/jakarta-commons/email/target/commons-email-28042005.jar:/usr/local/gump/packages/javamail-1.3.2/mail.jar:/usr/local/gump/packages/jaf-1.0.1/activation.jar:/usr/local/gump/public/workspace/jakarta-velocity/bin/velocity-28042005.jar:/usr/local/gump/public/workspace/jakarta-velocity/bin/velocity-dep-28042005.jar
    ---------------------------------------------
    __ __
    \/ |__ _Apache__ ___
    \/| / _` \ V / -_) ' \ ~ intelligent projects ~
    _| |_\__,_|\_/\___|_||_| v. 1.0.2
    build:start:

    java:prepare-filesystem:
    [mkdir] Created dir: /home/gump/workspaces2/public/workspace/jakarta-turbine-fulcrum/template/target/classes

    java:compile:
    [echo] Compiling to /home/gump/workspaces2/public/workspace/jakarta-turbine-fulcrum/template/target/classes
    [echo]
    ==========================================================

    NOTE: Targetting JVM 1.4, classes
    will not run on earlier JVMs

    ==========================================================

    [javac] Compiling 16 source files to /home/gump/workspaces2/public/workspace/jakarta-turbine-fulcrum/template/target/classes
    /home/gump/workspaces2/public/workspace/jakarta-turbine-fulcrum/template/src/java/org/apache/fulcrum/template/TemplateHtmlEmail.java:131: send() in org.apache.fulcrum.template.TemplateHtmlEmail cannot override send() in org.apache.commons.mail.HtmlEmail; overridden method does not throw javax.mail.MessagingException
    public void send()
    ^
    Note: /home/gump/workspaces2/public/workspace/jakarta-turbine-fulcrum/template/src/java/org/apache/fulcrum/template/velocity/DefaultVelocityService.java uses or overrides a deprecated API.
    Note: Recompile with -deprecation for details.
    1 error

    BUILD FAILED
    File...... /home/gump/.maven/cache/maven-java-plugin-1.5/plugin.jelly
    Element... ant:javac
    Line...... 63
    Column.... 48
    Compile failed; see the compiler error output for details.
    Total time: 4 seconds
    Finished at: Thu Apr 28 03:35:30 PDT 2005

    ---------------------------------------------

    To subscribe to this information via syndicated feeds:
    - RSS: http://brutus.apache.org/gump/public/jakarta-turbine-fulcrum/fulcrum-template/rss.xml
    - Atom: http://brutus.apache.org/gump/public/jakarta-turbine-fulcrum/fulcrum-template/atom.xml

    ============================== Gump Tracking Only ===
    Produced by Gump version 2.2.
    Gump Run 27000028042005, brutus:brutus-public:27000028042005
    Gump E-mail Identifier (unique within run) #31.

    --
    Apache Gump
    http://gump.apache.org/ [Instance: brutus]

    ---------------------------------------------------------------------
    To unsubscribe, e-mail: turbine-dev-unsubscribe@jakarta.apache.org
    For additional commands, e-mail: turbine-dev-help@jakarta.apache.org
  • Fulcrum-template development at Apr 30, 2005 at 10:34 am
    To whom it may engage...

    This is an automated request, but not an unsolicited one. For
    more information please visit http://gump.apache.org/nagged.html,
    and/or contact the folk at general@gump.apache.org.

    Project fulcrum-template has an issue affecting its community integration.
    This issue affects 1 projects.
    The current state of this project is 'Failed', with reason 'Build Failed'.
    For reference only, the following projects are affected by this:
    - fulcrum-template : Services Framework


    Full details are available at:
    http://brutus.apache.org/gump/public/jakarta-turbine-fulcrum/fulcrum-template/index.html

    That said, some information snippets are provided here.

    The following annotations (debug/informational/warning/error messages) were provided:
    -DEBUG- Sole output [fulcrum-template-1.0.2-dev.jar] identifier set to project name
    -DEBUG- (Gump generated) Maven Properties in: /usr/local/gump/public/workspace/jakarta-turbine-fulcrum/template/build.properties
    -INFO- Failed with reason build failed
    -DEBUG- Maven POM in: /usr/local/gump/public/workspace/jakarta-turbine-fulcrum/template/project.xml
    -DEBUG- Maven project properties in: /usr/local/gump/public/workspace/jakarta-turbine-fulcrum/template/project.properties
    -INFO- Failed to extract fallback artifacts from Gump Repository



    The following work was performed:
    http://brutus.apache.org/gump/public/jakarta-turbine-fulcrum/fulcrum-template/gump_work/build_jakarta-turbine-fulcrum_fulcrum-template.html
    Work Name: build_jakarta-turbine-fulcrum_fulcrum-template (Type: Build)
    Work ended in a state of : Failed
    Elapsed: 5 secs
    Command Line: maven --offline jar
    [Working Directory: /usr/local/gump/public/workspace/jakarta-turbine-fulcrum/template]
    CLASSPATH: /opt/jdk1.4/lib/tools.jar:/usr/local/gump/public/workspace/ant/dist/lib/ant-jmf.jar:/usr/local/gump/public/workspace/ant/dist/lib/ant-swing.jar:/usr/local/gump/public/workspace/ant/dist/lib/ant-apache-resolver.jar:/usr/local/gump/public/workspace/ant/dist/lib/ant-trax.jar:/usr/local/gump/public/workspace/ant/dist/lib/ant-junit.jar:/usr/local/gump/public/workspace/ant/dist/lib/ant-launcher.jar:/usr/local/gump/public/workspace/ant/dist/lib/ant-nodeps.jar:/usr/local/gump/public/workspace/ant/dist/lib/ant.jar:/usr/local/gump/public/workspace/avalon-trunk/runtime/framework/api/target/deliverables/jars/avalon-framework-api-30042005.jar:/usr/local/gump/public/workspace/avalon-trunk/runtime/framework/impl/target/deliverables/jars/avalon-framework-impl-30042005.jar:/usr/local/gump/public/workspace/jakarta-turbine-fulcrum/yaafi/target/fulcrum-yaafi-1.0.4-dev.jar:/usr/local/gump/public/workspace/jakarta-turbine-fulcrum/testcontainer/target/fulcrum-testcontainer-1.0.5-dev.jar:/usr/local/gump/public/workspace/jakarta-commons/lang/dist/commons-lang-30042005.jar:/usr/local/gump/public/workspace/jakarta-commons/io/dist/jakarta-commons-io-30042005.jar:/usr/local/gump/public/workspace/jakarta-commons/logging/dist/commons-logging.jar:/usr/local/gump/public/workspace/jakarta-commons/logging/dist/commons-logging-api.jar:/usr/local/gump/public/workspace/jakarta-commons/collections/build/commons-collections-30042005.jar:/usr/local/gump/public/workspace/jakarta-commons/configuration/target/commons-configuration-30042005.jar:/usr/local/gump/public/workspace/logging-log4j/log4j-30042005.jar:/usr/local/gump/public/workspace/jakarta-commons/email/target/commons-email-30042005.jar:/usr/local/gump/packages/javamail-1.3.2/mail.jar:/usr/local/gump/packages/jaf-1.0.1/activation.jar:/usr/local/gump/public/workspace/jakarta-velocity/bin/velocity-30042005.jar:/usr/local/gump/public/workspace/jakarta-velocity/bin/velocity-dep-30042005.jar
    ---------------------------------------------
    __ __
    \/ |__ _Apache__ ___
    \/| / _` \ V / -_) ' \ ~ intelligent projects ~
    _| |_\__,_|\_/\___|_||_| v. 1.0.2
    build:start:

    java:prepare-filesystem:
    [mkdir] Created dir: /home/gump/workspaces2/public/workspace/jakarta-turbine-fulcrum/template/target/classes

    java:compile:
    [echo] Compiling to /home/gump/workspaces2/public/workspace/jakarta-turbine-fulcrum/template/target/classes
    [echo]
    ==========================================================

    NOTE: Targetting JVM 1.4, classes
    will not run on earlier JVMs

    ==========================================================

    [javac] Compiling 16 source files to /home/gump/workspaces2/public/workspace/jakarta-turbine-fulcrum/template/target/classes
    /home/gump/workspaces2/public/workspace/jakarta-turbine-fulcrum/template/src/java/org/apache/fulcrum/template/TemplateHtmlEmail.java:131: send() in org.apache.fulcrum.template.TemplateHtmlEmail cannot override send() in org.apache.commons.mail.HtmlEmail; overridden method does not throw javax.mail.MessagingException
    public void send()
    ^
    Note: /home/gump/workspaces2/public/workspace/jakarta-turbine-fulcrum/template/src/java/org/apache/fulcrum/template/velocity/DefaultVelocityService.java uses or overrides a deprecated API.
    Note: Recompile with -deprecation for details.
    1 error

    BUILD FAILED
    File...... /home/gump/.maven/cache/maven-java-plugin-1.5/plugin.jelly
    Element... ant:javac
    Line...... 63
    Column.... 48
    Compile failed; see the compiler error output for details.
    Total time: 4 seconds
    Finished at: Sat Apr 30 03:34:16 PDT 2005

    ---------------------------------------------

    To subscribe to this information via syndicated feeds:
    - RSS: http://brutus.apache.org/gump/public/jakarta-turbine-fulcrum/fulcrum-template/rss.xml
    - Atom: http://brutus.apache.org/gump/public/jakarta-turbine-fulcrum/fulcrum-template/atom.xml

    ============================== Gump Tracking Only ===
    Produced by Gump version 2.2.
    Gump Run 23000030042005, brutus:brutus-public:23000030042005
    Gump E-mail Identifier (unique within run) #28.

    --
    Apache Gump
    http://gump.apache.org/ [Instance: brutus]

    ---------------------------------------------------------------------
    To unsubscribe, e-mail: turbine-dev-unsubscribe@jakarta.apache.org
    For additional commands, e-mail: turbine-dev-help@jakarta.apache.org

Related Discussions

Discussion Navigation
viewthread | post
Discussion Overview
groupdev @
categoriesturbine
postedApr 22, '05 at 10:26a
activeApr 30, '05 at 10:34a
posts7
users1
websiteturbine.apache.org

1 user in discussion

Fulcrum-template development: 7 posts

People

Translate

site design / logo © 2019 Grokbase