FAQ
To whom it may engage...

This is an automated request, but not an unsolicited one. For
more information please visit http://gump.apache.org/nagged.html,
and/or contact the folk at general@gump.apache.org.

Project fulcrum-quartz has an issue affecting its community integration.
This issue affects 1 projects.
The current state of this project is 'Failed', with reason 'Build Failed'.
For reference only, the following projects are affected by this:
- fulcrum-quartz : Services Framework


Full details are available at:
http://brutus.apache.org/gump/public/jakarta-turbine-fulcrum/fulcrum-quartz/index.html

That said, some information snippets are provided here.

The following annotations (debug/informational/warning/error messages) were provided:
-DEBUG- Sole output [fulcrum-quartz-1.0.jar] identifier set to project name
-DEBUG- (Gump generated) Maven Properties in: /usr/local/gump/public/workspace/jakarta-turbine-fulcrum/quartz/build.properties
-INFO- Failed with reason build failed
-DEBUG- Maven POM in: /usr/local/gump/public/workspace/jakarta-turbine-fulcrum/quartz/project.xml
-INFO- Failed to extract fallback artifacts from Gump Repository



The following work was performed:
http://brutus.apache.org/gump/public/jakarta-turbine-fulcrum/fulcrum-quartz/gump_work/build_jakarta-turbine-fulcrum_fulcrum-quartz.html
Work Name: build_jakarta-turbine-fulcrum_fulcrum-quartz (Type: Build)
Work ended in a state of : Failed
Elapsed: 11 secs
Command Line: maven --offline jar
[Working Directory: /usr/local/gump/public/workspace/jakarta-turbine-fulcrum/quartz]
CLASSPATH: /opt/jdk1.4/lib/tools.jar:/usr/local/gump/public/workspace/jakarta-turbine-fulcrum/quartz/target/classes:/usr/local/gump/public/workspace/ant/dist/lib/ant-jmf.jar:/usr/local/gump/public/workspace/ant/dist/lib/ant-swing.jar:/usr/local/gump/public/workspace/ant/dist/lib/ant-apache-resolver.jar:/usr/local/gump/public/workspace/ant/dist/lib/ant-trax.jar:/usr/local/gump/public/workspace/ant/dist/lib/ant-junit.jar:/usr/local/gump/public/workspace/ant/dist/lib/ant-launcher.jar:/usr/local/gump/public/workspace/ant/dist/lib/ant-nodeps.jar:/usr/local/gump/public/workspace/ant/dist/lib/ant.jar:/usr/local/gump/public/workspace/avalon-trunk/runtime/framework/api/target/deliverables/jars/avalon-framework-api-02042005.jar:/usr/local/gump/public/workspace/avalon-trunk/runtime/framework/impl/target/deliverables/jars/avalon-framework-impl-02042005.jar:/usr/local/gump/public/workspace/jakarta-turbine-fulcrum/yaafi/target/fulcrum-yaafi-1.0.4-dev.jar:/usr/local/gump/public/workspace/jakarta-turbine-fulcrum/testcontainer/target/fulcrum-testcontainer-1.0.5-dev.jar:/usr/local/gump/public/workspace/jakarta-commons/lang/dist/commons-lang-02042005.jar:/usr/local/gump/public/workspace/jakarta-commons/logging/dist/commons-logging.jar:/usr/local/gump/public/workspace/jakarta-commons/logging/dist/commons-logging-api.jar:/usr/local/gump/public/workspace/quartz/lib/quartz.jar:/usr/local/gump/public/workspace/jakarta-jmeter/lib/xstream-1.1.jar
---------------------------------------------

java:prepare-filesystem:
[mkdir] Created dir: /home/gump/workspaces2/public/workspace/jakarta-turbine-fulcrum/quartz/target/classes

java:compile:
[echo] Compiling to /home/gump/workspaces2/public/workspace/jakarta-turbine-fulcrum/quartz/target/classes
[echo]
==========================================================

NOTE: Targetting JVM 1.4, classes
will not run on earlier JVMs

==========================================================

[javac] Compiling 4 source files to /home/gump/workspaces2/public/workspace/jakarta-turbine-fulcrum/quartz/target/classes
Note: /home/gump/workspaces2/public/workspace/jakarta-turbine-fulcrum/quartz/src/java/org/apache/fulcrum/quartz/impl/DefaultQuartzScheduler.java uses or overrides a deprecated API.
Note: Recompile with -deprecation for details.

java:jar-resources:

test:prepare-filesystem:
[mkdir] Created dir: /home/gump/workspaces2/public/workspace/jakarta-turbine-fulcrum/quartz/target/test-classes
[mkdir] Created dir: /home/gump/workspaces2/public/workspace/jakarta-turbine-fulcrum/quartz/target/test-reports

test:test-resources:

test:compile:
[javac] Compiling 7 source files to /home/gump/workspaces2/public/workspace/jakarta-turbine-fulcrum/quartz/target/test-classes
Note: /home/gump/workspaces2/public/workspace/jakarta-turbine-fulcrum/quartz/src/test/org/apache/fulcrum/quartz/SchedulerShutDownTest.java uses or overrides a deprecated API.
Note: Recompile with -deprecation for details.

test:test:
[junit] Running org.apache.fulcrum.quartz.DefaultQuartzSchedulerImplTest
[junit] Tests run: 8, Failures: 0, Errors: 8, Time elapsed: 1.496 sec
[junit] [ERROR] TEST org.apache.fulcrum.quartz.DefaultQuartzSchedulerImplTest FAILED
[junit] Running org.apache.fulcrum.quartz.SchedulerShutDownTest
[junit] Tests run: 1, Failures: 0, Errors: 1, Time elapsed: 1.1 sec
[junit] [ERROR] TEST org.apache.fulcrum.quartz.SchedulerShutDownTest FAILED
[junit] Running org.apache.fulcrum.quartz.XStreamTest
[junit] Tests run: 2, Failures: 0, Errors: 0, Time elapsed: 0.881 sec

BUILD FAILED
File...... /home/gump/.maven/cache/maven-test-plugin-1.6.2/plugin.jelly
Element... fail
Line...... 181
Column.... 54
There were test failures.
Total time: 11 seconds
Finished at: Sat Apr 02 03:00:29 PST 2005

---------------------------------------------

To subscribe to this information via syndicated feeds:
- RSS: http://brutus.apache.org/gump/public/jakarta-turbine-fulcrum/fulcrum-quartz/rss.xml
- Atom: http://brutus.apache.org/gump/public/jakarta-turbine-fulcrum/fulcrum-quartz/atom.xml

============================== Gump Tracking Only ===
Produced by Gump version 2.2.
Gump Run 22000002042005, brutus:brutus-public:22000002042005
Gump E-mail Identifier (unique within run) #33.

--
Apache Gump
http://gump.apache.org/ [Instance: brutus]

---------------------------------------------------------------------
To unsubscribe, e-mail: turbine-dev-unsubscribe@jakarta.apache.org
For additional commands, e-mail: turbine-dev-help@jakarta.apache.org

Search Discussions

  • Fulcrum-quartz development at Apr 3, 2005 at 11:06 am
    To whom it may engage...

    This is an automated request, but not an unsolicited one. For
    more information please visit http://gump.apache.org/nagged.html,
    and/or contact the folk at general@gump.apache.org.

    Project fulcrum-quartz has an issue affecting its community integration.
    This issue affects 1 projects,
    and has been outstanding for 3 runs.
    The current state of this project is 'Failed', with reason 'Build Failed'.
    For reference only, the following projects are affected by this:
    - fulcrum-quartz : Services Framework


    Full details are available at:
    http://brutus.apache.org/gump/public/jakarta-turbine-fulcrum/fulcrum-quartz/index.html

    That said, some information snippets are provided here.

    The following annotations (debug/informational/warning/error messages) were provided:
    -DEBUG- Sole output [fulcrum-quartz-1.0.jar] identifier set to project name
    -DEBUG- (Gump generated) Maven Properties in: /usr/local/gump/public/workspace/jakarta-turbine-fulcrum/quartz/build.properties
    -INFO- Failed with reason build failed
    -DEBUG- Maven POM in: /usr/local/gump/public/workspace/jakarta-turbine-fulcrum/quartz/project.xml
    -INFO- Failed to extract fallback artifacts from Gump Repository



    The following work was performed:
    http://brutus.apache.org/gump/public/jakarta-turbine-fulcrum/fulcrum-quartz/gump_work/build_jakarta-turbine-fulcrum_fulcrum-quartz.html
    Work Name: build_jakarta-turbine-fulcrum_fulcrum-quartz (Type: Build)
    Work ended in a state of : Failed
    Elapsed: 9 secs
    Command Line: maven --offline jar
    [Working Directory: /usr/local/gump/public/workspace/jakarta-turbine-fulcrum/quartz]
    CLASSPATH: /opt/jdk1.4/lib/tools.jar:/usr/local/gump/public/workspace/jakarta-turbine-fulcrum/quartz/target/classes:/usr/local/gump/public/workspace/ant/dist/lib/ant-jmf.jar:/usr/local/gump/public/workspace/ant/dist/lib/ant-swing.jar:/usr/local/gump/public/workspace/ant/dist/lib/ant-apache-resolver.jar:/usr/local/gump/public/workspace/ant/dist/lib/ant-trax.jar:/usr/local/gump/public/workspace/ant/dist/lib/ant-junit.jar:/usr/local/gump/public/workspace/ant/dist/lib/ant-launcher.jar:/usr/local/gump/public/workspace/ant/dist/lib/ant-nodeps.jar:/usr/local/gump/public/workspace/ant/dist/lib/ant.jar:/usr/local/gump/public/workspace/avalon-trunk/runtime/framework/api/target/deliverables/jars/avalon-framework-api-03042005.jar:/usr/local/gump/public/workspace/avalon-trunk/runtime/framework/impl/target/deliverables/jars/avalon-framework-impl-03042005.jar:/usr/local/gump/public/workspace/jakarta-turbine-fulcrum/yaafi/target/fulcrum-yaafi-1.0.4-dev.jar:/usr/local/gump/public/workspace/jakarta-turbine-fulcrum/testcontainer/target/fulcrum-testcontainer-1.0.5-dev.jar:/usr/local/gump/public/workspace/jakarta-commons/lang/dist/commons-lang-03042005.jar:/usr/local/gump/public/workspace/jakarta-commons/logging/dist/commons-logging.jar:/usr/local/gump/public/workspace/jakarta-commons/logging/dist/commons-logging-api.jar:/usr/local/gump/public/workspace/quartz/lib/quartz.jar:/usr/local/gump/public/workspace/jakarta-jmeter/lib/xstream-1.1.jar
    ---------------------------------------------

    java:prepare-filesystem:
    [mkdir] Created dir: /home/gump/workspaces2/public/workspace/jakarta-turbine-fulcrum/quartz/target/classes

    java:compile:
    [echo] Compiling to /home/gump/workspaces2/public/workspace/jakarta-turbine-fulcrum/quartz/target/classes
    [echo]
    ==========================================================

    NOTE: Targetting JVM 1.4, classes
    will not run on earlier JVMs

    ==========================================================

    [javac] Compiling 4 source files to /home/gump/workspaces2/public/workspace/jakarta-turbine-fulcrum/quartz/target/classes
    Note: /home/gump/workspaces2/public/workspace/jakarta-turbine-fulcrum/quartz/src/java/org/apache/fulcrum/quartz/impl/DefaultQuartzScheduler.java uses or overrides a deprecated API.
    Note: Recompile with -deprecation for details.

    java:jar-resources:

    test:prepare-filesystem:
    [mkdir] Created dir: /home/gump/workspaces2/public/workspace/jakarta-turbine-fulcrum/quartz/target/test-classes
    [mkdir] Created dir: /home/gump/workspaces2/public/workspace/jakarta-turbine-fulcrum/quartz/target/test-reports

    test:test-resources:

    test:compile:
    [javac] Compiling 7 source files to /home/gump/workspaces2/public/workspace/jakarta-turbine-fulcrum/quartz/target/test-classes
    Note: /home/gump/workspaces2/public/workspace/jakarta-turbine-fulcrum/quartz/src/test/org/apache/fulcrum/quartz/SchedulerShutDownTest.java uses or overrides a deprecated API.
    Note: Recompile with -deprecation for details.

    test:test:
    [junit] Running org.apache.fulcrum.quartz.DefaultQuartzSchedulerImplTest
    [junit] Tests run: 8, Failures: 0, Errors: 8, Time elapsed: 1.295 sec
    [junit] [ERROR] TEST org.apache.fulcrum.quartz.DefaultQuartzSchedulerImplTest FAILED
    [junit] Running org.apache.fulcrum.quartz.SchedulerShutDownTest
    [junit] Tests run: 1, Failures: 0, Errors: 1, Time elapsed: 1.01 sec
    [junit] [ERROR] TEST org.apache.fulcrum.quartz.SchedulerShutDownTest FAILED
    [junit] Running org.apache.fulcrum.quartz.XStreamTest
    [junit] Tests run: 2, Failures: 0, Errors: 0, Time elapsed: 0.819 sec

    BUILD FAILED
    File...... /home/gump/.maven/cache/maven-test-plugin-1.6.2/plugin.jelly
    Element... fail
    Line...... 181
    Column.... 54
    There were test failures.
    Total time: 9 seconds
    Finished at: Sun Apr 03 04:06:46 PDT 2005

    ---------------------------------------------

    To subscribe to this information via syndicated feeds:
    - RSS: http://brutus.apache.org/gump/public/jakarta-turbine-fulcrum/fulcrum-quartz/rss.xml
    - Atom: http://brutus.apache.org/gump/public/jakarta-turbine-fulcrum/fulcrum-quartz/atom.xml

    ============================== Gump Tracking Only ===
    Produced by Gump version 2.2.
    Gump Run 23000003042005, brutus:brutus-public:23000003042005
    Gump E-mail Identifier (unique within run) #34.

    --
    Apache Gump
    http://gump.apache.org/ [Instance: brutus]

    ---------------------------------------------------------------------
    To unsubscribe, e-mail: turbine-dev-unsubscribe@jakarta.apache.org
    For additional commands, e-mail: turbine-dev-help@jakarta.apache.org
  • Fulcrum-quartz development at Apr 4, 2005 at 10:07 am
    To whom it may engage...

    This is an automated request, but not an unsolicited one. For
    more information please visit http://gump.apache.org/nagged.html,
    and/or contact the folk at general@gump.apache.org.

    Project fulcrum-quartz has an issue affecting its community integration.
    This issue affects 1 projects,
    and has been outstanding for 5 runs.
    The current state of this project is 'Failed', with reason 'Build Failed'.
    For reference only, the following projects are affected by this:
    - fulcrum-quartz : Services Framework


    Full details are available at:
    http://brutus.apache.org/gump/public/jakarta-turbine-fulcrum/fulcrum-quartz/index.html

    That said, some information snippets are provided here.

    The following annotations (debug/informational/warning/error messages) were provided:
    -DEBUG- Sole output [fulcrum-quartz-1.0.jar] identifier set to project name
    -DEBUG- (Gump generated) Maven Properties in: /usr/local/gump/public/workspace/jakarta-turbine-fulcrum/quartz/build.properties
    -INFO- Failed with reason build failed
    -DEBUG- Maven POM in: /usr/local/gump/public/workspace/jakarta-turbine-fulcrum/quartz/project.xml
    -INFO- Failed to extract fallback artifacts from Gump Repository



    The following work was performed:
    http://brutus.apache.org/gump/public/jakarta-turbine-fulcrum/fulcrum-quartz/gump_work/build_jakarta-turbine-fulcrum_fulcrum-quartz.html
    Work Name: build_jakarta-turbine-fulcrum_fulcrum-quartz (Type: Build)
    Work ended in a state of : Failed
    Elapsed: 11 secs
    Command Line: maven --offline jar
    [Working Directory: /usr/local/gump/public/workspace/jakarta-turbine-fulcrum/quartz]
    CLASSPATH: /opt/jdk1.4/lib/tools.jar:/usr/local/gump/public/workspace/jakarta-turbine-fulcrum/quartz/target/classes:/usr/local/gump/public/workspace/ant/dist/lib/ant-jmf.jar:/usr/local/gump/public/workspace/ant/dist/lib/ant-swing.jar:/usr/local/gump/public/workspace/ant/dist/lib/ant-apache-resolver.jar:/usr/local/gump/public/workspace/ant/dist/lib/ant-trax.jar:/usr/local/gump/public/workspace/ant/dist/lib/ant-junit.jar:/usr/local/gump/public/workspace/ant/dist/lib/ant-launcher.jar:/usr/local/gump/public/workspace/ant/dist/lib/ant-nodeps.jar:/usr/local/gump/public/workspace/ant/dist/lib/ant.jar:/usr/local/gump/public/workspace/avalon-trunk/runtime/framework/api/target/deliverables/jars/avalon-framework-api-04042005.jar:/usr/local/gump/public/workspace/avalon-trunk/runtime/framework/impl/target/deliverables/jars/avalon-framework-impl-04042005.jar:/usr/local/gump/public/workspace/jakarta-turbine-fulcrum/yaafi/target/fulcrum-yaafi-1.0.4-dev.jar:/usr/local/gump/public/workspace/jakarta-turbine-fulcrum/testcontainer/target/fulcrum-testcontainer-1.0.5-dev.jar:/usr/local/gump/public/workspace/jakarta-commons/lang/dist/commons-lang-04042005.jar:/usr/local/gump/public/workspace/jakarta-commons/logging/dist/commons-logging.jar:/usr/local/gump/public/workspace/jakarta-commons/logging/dist/commons-logging-api.jar:/usr/local/gump/public/workspace/quartz/lib/quartz.jar:/usr/local/gump/public/workspace/jakarta-jmeter/lib/xstream-1.1.jar
    ---------------------------------------------

    java:prepare-filesystem:
    [mkdir] Created dir: /home/gump/workspaces2/public/workspace/jakarta-turbine-fulcrum/quartz/target/classes

    java:compile:
    [echo] Compiling to /home/gump/workspaces2/public/workspace/jakarta-turbine-fulcrum/quartz/target/classes
    [echo]
    ==========================================================

    NOTE: Targetting JVM 1.4, classes
    will not run on earlier JVMs

    ==========================================================

    [javac] Compiling 4 source files to /home/gump/workspaces2/public/workspace/jakarta-turbine-fulcrum/quartz/target/classes
    Note: /home/gump/workspaces2/public/workspace/jakarta-turbine-fulcrum/quartz/src/java/org/apache/fulcrum/quartz/impl/DefaultQuartzScheduler.java uses or overrides a deprecated API.
    Note: Recompile with -deprecation for details.

    java:jar-resources:

    test:prepare-filesystem:
    [mkdir] Created dir: /home/gump/workspaces2/public/workspace/jakarta-turbine-fulcrum/quartz/target/test-classes
    [mkdir] Created dir: /home/gump/workspaces2/public/workspace/jakarta-turbine-fulcrum/quartz/target/test-reports

    test:test-resources:

    test:compile:
    [javac] Compiling 7 source files to /home/gump/workspaces2/public/workspace/jakarta-turbine-fulcrum/quartz/target/test-classes
    Note: /home/gump/workspaces2/public/workspace/jakarta-turbine-fulcrum/quartz/src/test/org/apache/fulcrum/quartz/SchedulerShutDownTest.java uses or overrides a deprecated API.
    Note: Recompile with -deprecation for details.

    test:test:
    [junit] Running org.apache.fulcrum.quartz.DefaultQuartzSchedulerImplTest
    [junit] Tests run: 8, Failures: 0, Errors: 8, Time elapsed: 1.295 sec
    [junit] [ERROR] TEST org.apache.fulcrum.quartz.DefaultQuartzSchedulerImplTest FAILED
    [junit] Running org.apache.fulcrum.quartz.SchedulerShutDownTest
    [junit] Tests run: 1, Failures: 0, Errors: 1, Time elapsed: 1.01 sec
    [junit] [ERROR] TEST org.apache.fulcrum.quartz.SchedulerShutDownTest FAILED
    [junit] Running org.apache.fulcrum.quartz.XStreamTest
    [junit] Tests run: 2, Failures: 0, Errors: 0, Time elapsed: 0.814 sec

    BUILD FAILED
    File...... /home/gump/.maven/cache/maven-test-plugin-1.6.2/plugin.jelly
    Element... fail
    Line...... 181
    Column.... 54
    There were test failures.
    Total time: 10 seconds
    Finished at: Mon Apr 04 03:07:03 PDT 2005

    ---------------------------------------------

    To subscribe to this information via syndicated feeds:
    - RSS: http://brutus.apache.org/gump/public/jakarta-turbine-fulcrum/fulcrum-quartz/rss.xml
    - Atom: http://brutus.apache.org/gump/public/jakarta-turbine-fulcrum/fulcrum-quartz/atom.xml

    ============================== Gump Tracking Only ===
    Produced by Gump version 2.2.
    Gump Run 26000004042005, brutus:brutus-public:26000004042005
    Gump E-mail Identifier (unique within run) #31.

    --
    Apache Gump
    http://gump.apache.org/ [Instance: brutus]

    ---------------------------------------------------------------------
    To unsubscribe, e-mail: turbine-dev-unsubscribe@jakarta.apache.org
    For additional commands, e-mail: turbine-dev-help@jakarta.apache.org
  • Fulcrum-quartz development at Apr 5, 2005 at 10:26 am
    To whom it may engage...

    This is an automated request, but not an unsolicited one. For
    more information please visit http://gump.apache.org/nagged.html,
    and/or contact the folk at general@gump.apache.org.

    Project fulcrum-quartz has an issue affecting its community integration.
    This issue affects 1 projects,
    and has been outstanding for 6 runs.
    The current state of this project is 'Failed', with reason 'Build Failed'.
    For reference only, the following projects are affected by this:
    - fulcrum-quartz : Services Framework


    Full details are available at:
    http://brutus.apache.org/gump/public/jakarta-turbine-fulcrum/fulcrum-quartz/index.html

    That said, some information snippets are provided here.

    The following annotations (debug/informational/warning/error messages) were provided:
    -DEBUG- Sole output [fulcrum-quartz-1.0.jar] identifier set to project name
    -DEBUG- (Gump generated) Maven Properties in: /usr/local/gump/public/workspace/jakarta-turbine-fulcrum/quartz/build.properties
    -INFO- Failed with reason build failed
    -DEBUG- Maven POM in: /usr/local/gump/public/workspace/jakarta-turbine-fulcrum/quartz/project.xml
    -INFO- Failed to extract fallback artifacts from Gump Repository



    The following work was performed:
    http://brutus.apache.org/gump/public/jakarta-turbine-fulcrum/fulcrum-quartz/gump_work/build_jakarta-turbine-fulcrum_fulcrum-quartz.html
    Work Name: build_jakarta-turbine-fulcrum_fulcrum-quartz (Type: Build)
    Work ended in a state of : Failed
    Elapsed: 12 secs
    Command Line: maven --offline jar
    [Working Directory: /usr/local/gump/public/workspace/jakarta-turbine-fulcrum/quartz]
    CLASSPATH: /opt/jdk1.4/lib/tools.jar:/usr/local/gump/public/workspace/jakarta-turbine-fulcrum/quartz/target/classes:/usr/local/gump/public/workspace/ant/dist/lib/ant-jmf.jar:/usr/local/gump/public/workspace/ant/dist/lib/ant-swing.jar:/usr/local/gump/public/workspace/ant/dist/lib/ant-apache-resolver.jar:/usr/local/gump/public/workspace/ant/dist/lib/ant-trax.jar:/usr/local/gump/public/workspace/ant/dist/lib/ant-junit.jar:/usr/local/gump/public/workspace/ant/dist/lib/ant-launcher.jar:/usr/local/gump/public/workspace/ant/dist/lib/ant-nodeps.jar:/usr/local/gump/public/workspace/ant/dist/lib/ant.jar:/usr/local/gump/public/workspace/avalon-trunk/runtime/framework/api/target/deliverables/jars/avalon-framework-api-05042005.jar:/usr/local/gump/public/workspace/avalon-trunk/runtime/framework/impl/target/deliverables/jars/avalon-framework-impl-05042005.jar:/usr/local/gump/public/workspace/jakarta-turbine-fulcrum/yaafi/target/fulcrum-yaafi-1.0.4-dev.jar:/usr/local/gump/public/workspace/jakarta-turbine-fulcrum/testcontainer/target/fulcrum-testcontainer-1.0.5-dev.jar:/usr/local/gump/public/workspace/jakarta-commons/lang/dist/commons-lang-05042005.jar:/usr/local/gump/public/workspace/jakarta-commons/logging/dist/commons-logging.jar:/usr/local/gump/public/workspace/jakarta-commons/logging/dist/commons-logging-api.jar:/usr/local/gump/public/workspace/quartz/lib/quartz.jar:/usr/local/gump/public/workspace/jakarta-jmeter/lib/xstream-1.1.jar
    ---------------------------------------------

    java:prepare-filesystem:
    [mkdir] Created dir: /home/gump/workspaces2/public/workspace/jakarta-turbine-fulcrum/quartz/target/classes

    java:compile:
    [echo] Compiling to /home/gump/workspaces2/public/workspace/jakarta-turbine-fulcrum/quartz/target/classes
    [echo]
    ==========================================================

    NOTE: Targetting JVM 1.4, classes
    will not run on earlier JVMs

    ==========================================================

    [javac] Compiling 4 source files to /home/gump/workspaces2/public/workspace/jakarta-turbine-fulcrum/quartz/target/classes
    Note: /home/gump/workspaces2/public/workspace/jakarta-turbine-fulcrum/quartz/src/java/org/apache/fulcrum/quartz/impl/DefaultQuartzScheduler.java uses or overrides a deprecated API.
    Note: Recompile with -deprecation for details.

    java:jar-resources:

    test:prepare-filesystem:
    [mkdir] Created dir: /home/gump/workspaces2/public/workspace/jakarta-turbine-fulcrum/quartz/target/test-classes
    [mkdir] Created dir: /home/gump/workspaces2/public/workspace/jakarta-turbine-fulcrum/quartz/target/test-reports

    test:test-resources:

    test:compile:
    [javac] Compiling 7 source files to /home/gump/workspaces2/public/workspace/jakarta-turbine-fulcrum/quartz/target/test-classes
    Note: /home/gump/workspaces2/public/workspace/jakarta-turbine-fulcrum/quartz/src/test/org/apache/fulcrum/quartz/SchedulerShutDownTest.java uses or overrides a deprecated API.
    Note: Recompile with -deprecation for details.

    test:test:
    [junit] Running org.apache.fulcrum.quartz.DefaultQuartzSchedulerImplTest
    [junit] Tests run: 8, Failures: 0, Errors: 8, Time elapsed: 1.581 sec
    [junit] [ERROR] TEST org.apache.fulcrum.quartz.DefaultQuartzSchedulerImplTest FAILED
    [junit] Running org.apache.fulcrum.quartz.SchedulerShutDownTest
    [junit] Tests run: 1, Failures: 0, Errors: 1, Time elapsed: 1.228 sec
    [junit] [ERROR] TEST org.apache.fulcrum.quartz.SchedulerShutDownTest FAILED
    [junit] Running org.apache.fulcrum.quartz.XStreamTest
    [junit] Tests run: 2, Failures: 0, Errors: 0, Time elapsed: 0.986 sec

    BUILD FAILED
    File...... /home/gump/.maven/cache/maven-test-plugin-1.6.2/plugin.jelly
    Element... fail
    Line...... 181
    Column.... 54
    There were test failures.
    Total time: 11 seconds
    Finished at: Tue Apr 05 03:26:15 PDT 2005

    ---------------------------------------------

    To subscribe to this information via syndicated feeds:
    - RSS: http://brutus.apache.org/gump/public/jakarta-turbine-fulcrum/fulcrum-quartz/rss.xml
    - Atom: http://brutus.apache.org/gump/public/jakarta-turbine-fulcrum/fulcrum-quartz/atom.xml

    ============================== Gump Tracking Only ===
    Produced by Gump version 2.2.
    Gump Run 23000005042005, brutus:brutus-public:23000005042005
    Gump E-mail Identifier (unique within run) #34.

    --
    Apache Gump
    http://gump.apache.org/ [Instance: brutus]

    ---------------------------------------------------------------------
    To unsubscribe, e-mail: turbine-dev-unsubscribe@jakarta.apache.org
    For additional commands, e-mail: turbine-dev-help@jakarta.apache.org
  • Fulcrum-quartz development at Apr 6, 2005 at 10:07 am
    To whom it may engage...

    This is an automated request, but not an unsolicited one. For
    more information please visit http://gump.apache.org/nagged.html,
    and/or contact the folk at general@gump.apache.org.

    Project fulcrum-quartz has an issue affecting its community integration.
    This issue affects 1 projects,
    and has been outstanding for 8 runs.
    The current state of this project is 'Failed', with reason 'Build Failed'.
    For reference only, the following projects are affected by this:
    - fulcrum-quartz : Services Framework


    Full details are available at:
    http://brutus.apache.org/gump/public/jakarta-turbine-fulcrum/fulcrum-quartz/index.html

    That said, some information snippets are provided here.

    The following annotations (debug/informational/warning/error messages) were provided:
    -DEBUG- Sole output [fulcrum-quartz-1.0.jar] identifier set to project name
    -DEBUG- (Gump generated) Maven Properties in: /usr/local/gump/public/workspace/jakarta-turbine-fulcrum/quartz/build.properties
    -INFO- Failed with reason build failed
    -DEBUG- Maven POM in: /usr/local/gump/public/workspace/jakarta-turbine-fulcrum/quartz/project.xml
    -INFO- Failed to extract fallback artifacts from Gump Repository



    The following work was performed:
    http://brutus.apache.org/gump/public/jakarta-turbine-fulcrum/fulcrum-quartz/gump_work/build_jakarta-turbine-fulcrum_fulcrum-quartz.html
    Work Name: build_jakarta-turbine-fulcrum_fulcrum-quartz (Type: Build)
    Work ended in a state of : Failed
    Elapsed: 10 secs
    Command Line: maven --offline jar
    [Working Directory: /usr/local/gump/public/workspace/jakarta-turbine-fulcrum/quartz]
    CLASSPATH: /opt/jdk1.4/lib/tools.jar:/usr/local/gump/public/workspace/jakarta-turbine-fulcrum/quartz/target/classes:/usr/local/gump/public/workspace/ant/dist/lib/ant-jmf.jar:/usr/local/gump/public/workspace/ant/dist/lib/ant-swing.jar:/usr/local/gump/public/workspace/ant/dist/lib/ant-apache-resolver.jar:/usr/local/gump/public/workspace/ant/dist/lib/ant-trax.jar:/usr/local/gump/public/workspace/ant/dist/lib/ant-junit.jar:/usr/local/gump/public/workspace/ant/dist/lib/ant-launcher.jar:/usr/local/gump/public/workspace/ant/dist/lib/ant-nodeps.jar:/usr/local/gump/public/workspace/ant/dist/lib/ant.jar:/usr/local/gump/public/workspace/avalon-trunk/runtime/framework/api/target/deliverables/jars/avalon-framework-api-06042005.jar:/usr/local/gump/public/workspace/avalon-trunk/runtime/framework/impl/target/deliverables/jars/avalon-framework-impl-06042005.jar:/usr/local/gump/public/workspace/jakarta-turbine-fulcrum/yaafi/target/fulcrum-yaafi-1.0.4-dev.jar:/usr/local/gump/public/workspace/jakarta-turbine-fulcrum/testcontainer/target/fulcrum-testcontainer-1.0.5-dev.jar:/usr/local/gump/public/workspace/jakarta-commons/lang/dist/commons-lang-06042005.jar:/usr/local/gump/public/workspace/jakarta-commons/logging/dist/commons-logging.jar:/usr/local/gump/public/workspace/jakarta-commons/logging/dist/commons-logging-api.jar:/usr/local/gump/public/workspace/quartz/lib/quartz.jar:/usr/local/gump/public/workspace/jakarta-jmeter/lib/xstream-1.1.jar
    ---------------------------------------------

    java:prepare-filesystem:
    [mkdir] Created dir: /home/gump/workspaces2/public/workspace/jakarta-turbine-fulcrum/quartz/target/classes

    java:compile:
    [echo] Compiling to /home/gump/workspaces2/public/workspace/jakarta-turbine-fulcrum/quartz/target/classes
    [echo]
    ==========================================================

    NOTE: Targetting JVM 1.4, classes
    will not run on earlier JVMs

    ==========================================================

    [javac] Compiling 4 source files to /home/gump/workspaces2/public/workspace/jakarta-turbine-fulcrum/quartz/target/classes
    Note: /home/gump/workspaces2/public/workspace/jakarta-turbine-fulcrum/quartz/src/java/org/apache/fulcrum/quartz/impl/DefaultQuartzScheduler.java uses or overrides a deprecated API.
    Note: Recompile with -deprecation for details.

    java:jar-resources:

    test:prepare-filesystem:
    [mkdir] Created dir: /home/gump/workspaces2/public/workspace/jakarta-turbine-fulcrum/quartz/target/test-classes
    [mkdir] Created dir: /home/gump/workspaces2/public/workspace/jakarta-turbine-fulcrum/quartz/target/test-reports

    test:test-resources:

    test:compile:
    [javac] Compiling 7 source files to /home/gump/workspaces2/public/workspace/jakarta-turbine-fulcrum/quartz/target/test-classes
    Note: /home/gump/workspaces2/public/workspace/jakarta-turbine-fulcrum/quartz/src/test/org/apache/fulcrum/quartz/SchedulerShutDownTest.java uses or overrides a deprecated API.
    Note: Recompile with -deprecation for details.

    test:test:
    [junit] Running org.apache.fulcrum.quartz.DefaultQuartzSchedulerImplTest
    [junit] Tests run: 8, Failures: 0, Errors: 8, Time elapsed: 1.315 sec
    [junit] [ERROR] TEST org.apache.fulcrum.quartz.DefaultQuartzSchedulerImplTest FAILED
    [junit] Running org.apache.fulcrum.quartz.SchedulerShutDownTest
    [junit] Tests run: 1, Failures: 0, Errors: 1, Time elapsed: 1.033 sec
    [junit] [ERROR] TEST org.apache.fulcrum.quartz.SchedulerShutDownTest FAILED
    [junit] Running org.apache.fulcrum.quartz.XStreamTest
    [junit] Tests run: 2, Failures: 0, Errors: 0, Time elapsed: 0.818 sec

    BUILD FAILED
    File...... /home/gump/.maven/cache/maven-test-plugin-1.6.2/plugin.jelly
    Element... fail
    Line...... 181
    Column.... 54
    There were test failures.
    Total time: 10 seconds
    Finished at: Wed Apr 06 03:07:38 PDT 2005

    ---------------------------------------------

    To subscribe to this information via syndicated feeds:
    - RSS: http://brutus.apache.org/gump/public/jakarta-turbine-fulcrum/fulcrum-quartz/rss.xml
    - Atom: http://brutus.apache.org/gump/public/jakarta-turbine-fulcrum/fulcrum-quartz/atom.xml

    ============================== Gump Tracking Only ===
    Produced by Gump version 2.2.
    Gump Run 25000006042005, brutus:brutus-public:25000006042005
    Gump E-mail Identifier (unique within run) #31.

    --
    Apache Gump
    http://gump.apache.org/ [Instance: brutus]

    ---------------------------------------------------------------------
    To unsubscribe, e-mail: turbine-dev-unsubscribe@jakarta.apache.org
    For additional commands, e-mail: turbine-dev-help@jakarta.apache.org
  • Fulcrum-quartz development at Apr 12, 2005 at 9:38 am
    To whom it may engage...

    This is an automated request, but not an unsolicited one. For
    more information please visit http://gump.apache.org/nagged.html,
    and/or contact the folk at general@gump.apache.org.

    Project fulcrum-quartz has an issue affecting its community integration.
    This issue affects 1 projects.
    The current state of this project is 'Failed', with reason 'Build Failed'.
    For reference only, the following projects are affected by this:
    - fulcrum-quartz : Services Framework


    Full details are available at:
    http://brutus.apache.org/gump/public/jakarta-turbine-fulcrum/fulcrum-quartz/index.html

    That said, some information snippets are provided here.

    The following annotations (debug/informational/warning/error messages) were provided:
    -DEBUG- Sole output [fulcrum-quartz-1.0.jar] identifier set to project name
    -DEBUG- (Gump generated) Maven Properties in: /usr/local/gump/public/workspace/jakarta-turbine-fulcrum/quartz/build.properties
    -INFO- Failed with reason build failed
    -DEBUG- Maven POM in: /usr/local/gump/public/workspace/jakarta-turbine-fulcrum/quartz/project.xml
    -INFO- Failed to extract fallback artifacts from Gump Repository



    The following work was performed:
    http://brutus.apache.org/gump/public/jakarta-turbine-fulcrum/fulcrum-quartz/gump_work/build_jakarta-turbine-fulcrum_fulcrum-quartz.html
    Work Name: build_jakarta-turbine-fulcrum_fulcrum-quartz (Type: Build)
    Work ended in a state of : Failed
    Elapsed: 9 secs
    Command Line: maven --offline jar
    [Working Directory: /usr/local/gump/public/workspace/jakarta-turbine-fulcrum/quartz]
    CLASSPATH: /opt/jdk1.4/lib/tools.jar:/usr/local/gump/public/workspace/jakarta-turbine-fulcrum/quartz/target/classes:/usr/local/gump/public/workspace/ant/dist/lib/ant-jmf.jar:/usr/local/gump/public/workspace/ant/dist/lib/ant-swing.jar:/usr/local/gump/public/workspace/ant/dist/lib/ant-apache-resolver.jar:/usr/local/gump/public/workspace/ant/dist/lib/ant-trax.jar:/usr/local/gump/public/workspace/ant/dist/lib/ant-junit.jar:/usr/local/gump/public/workspace/ant/dist/lib/ant-launcher.jar:/usr/local/gump/public/workspace/ant/dist/lib/ant-nodeps.jar:/usr/local/gump/public/workspace/ant/dist/lib/ant.jar:/usr/local/gump/public/workspace/avalon-trunk/runtime/framework/api/target/deliverables/jars/avalon-framework-api-12042005.jar:/usr/local/gump/public/workspace/avalon-trunk/runtime/framework/impl/target/deliverables/jars/avalon-framework-impl-12042005.jar:/usr/local/gump/public/workspace/jakarta-turbine-fulcrum/yaafi/target/fulcrum-yaafi-1.0.4-dev.jar:/usr/local/gump/public/workspace/jakarta-turbine-fulcrum/testcontainer/target/fulcrum-testcontainer-1.0.5-dev.jar:/usr/local/gump/public/workspace/jakarta-commons/lang/dist/commons-lang-12042005.jar:/usr/local/gump/public/workspace/jakarta-commons/logging/dist/commons-logging.jar:/usr/local/gump/public/workspace/jakarta-commons/logging/dist/commons-logging-api.jar:/usr/local/gump/public/workspace/quartz/lib/quartz.jar:/usr/local/gump/public/workspace/jakarta-jmeter/lib/xstream-1.1.jar
    ---------------------------------------------

    java:prepare-filesystem:
    [mkdir] Created dir: /home/gump/workspaces2/public/workspace/jakarta-turbine-fulcrum/quartz/target/classes

    java:compile:
    [echo] Compiling to /home/gump/workspaces2/public/workspace/jakarta-turbine-fulcrum/quartz/target/classes
    [echo]
    ==========================================================

    NOTE: Targetting JVM 1.4, classes
    will not run on earlier JVMs

    ==========================================================

    [javac] Compiling 4 source files to /home/gump/workspaces2/public/workspace/jakarta-turbine-fulcrum/quartz/target/classes
    Note: /home/gump/workspaces2/public/workspace/jakarta-turbine-fulcrum/quartz/src/java/org/apache/fulcrum/quartz/impl/DefaultQuartzScheduler.java uses or overrides a deprecated API.
    Note: Recompile with -deprecation for details.

    java:jar-resources:

    test:prepare-filesystem:
    [mkdir] Created dir: /home/gump/workspaces2/public/workspace/jakarta-turbine-fulcrum/quartz/target/test-classes
    [mkdir] Created dir: /home/gump/workspaces2/public/workspace/jakarta-turbine-fulcrum/quartz/target/test-reports

    test:test-resources:

    test:compile:
    [javac] Compiling 7 source files to /home/gump/workspaces2/public/workspace/jakarta-turbine-fulcrum/quartz/target/test-classes
    Note: /home/gump/workspaces2/public/workspace/jakarta-turbine-fulcrum/quartz/src/test/org/apache/fulcrum/quartz/SchedulerShutDownTest.java uses or overrides a deprecated API.
    Note: Recompile with -deprecation for details.

    test:test:
    [junit] Running org.apache.fulcrum.quartz.DefaultQuartzSchedulerImplTest
    [junit] Tests run: 8, Failures: 0, Errors: 8, Time elapsed: 1.276 sec
    [junit] [ERROR] TEST org.apache.fulcrum.quartz.DefaultQuartzSchedulerImplTest FAILED
    [junit] Running org.apache.fulcrum.quartz.SchedulerShutDownTest
    [junit] Tests run: 1, Failures: 0, Errors: 1, Time elapsed: 1.002 sec
    [junit] [ERROR] TEST org.apache.fulcrum.quartz.SchedulerShutDownTest FAILED
    [junit] Running org.apache.fulcrum.quartz.XStreamTest
    [junit] Tests run: 2, Failures: 0, Errors: 0, Time elapsed: 0.804 sec

    BUILD FAILED
    File...... /home/gump/.maven/cache/maven-test-plugin-1.6.2/plugin.jelly
    Element... fail
    Line...... 181
    Column.... 54
    There were test failures.
    Total time: 9 seconds
    Finished at: Tue Apr 12 02:38:23 PDT 2005

    ---------------------------------------------

    To subscribe to this information via syndicated feeds:
    - RSS: http://brutus.apache.org/gump/public/jakarta-turbine-fulcrum/fulcrum-quartz/rss.xml
    - Atom: http://brutus.apache.org/gump/public/jakarta-turbine-fulcrum/fulcrum-quartz/atom.xml

    ============================== Gump Tracking Only ===
    Produced by Gump version 2.2.
    Gump Run 24000012042005, brutus:brutus-public:24000012042005
    Gump E-mail Identifier (unique within run) #35.

    --
    Apache Gump
    http://gump.apache.org/ [Instance: brutus]

    ---------------------------------------------------------------------
    To unsubscribe, e-mail: turbine-dev-unsubscribe@jakarta.apache.org
    For additional commands, e-mail: turbine-dev-help@jakarta.apache.org
  • Fulcrum-quartz development at Apr 13, 2005 at 9:54 am
    To whom it may engage...

    This is an automated request, but not an unsolicited one. For
    more information please visit http://gump.apache.org/nagged.html,
    and/or contact the folk at general@gump.apache.org.

    Project fulcrum-quartz has an issue affecting its community integration.
    This issue affects 1 projects,
    and has been outstanding for 3 runs.
    The current state of this project is 'Failed', with reason 'Build Failed'.
    For reference only, the following projects are affected by this:
    - fulcrum-quartz : Services Framework


    Full details are available at:
    http://brutus.apache.org/gump/public/jakarta-turbine-fulcrum/fulcrum-quartz/index.html

    That said, some information snippets are provided here.

    The following annotations (debug/informational/warning/error messages) were provided:
    -DEBUG- Sole output [fulcrum-quartz-1.0.jar] identifier set to project name
    -DEBUG- (Gump generated) Maven Properties in: /usr/local/gump/public/workspace/jakarta-turbine-fulcrum/quartz/build.properties
    -INFO- Failed with reason build failed
    -DEBUG- Maven POM in: /usr/local/gump/public/workspace/jakarta-turbine-fulcrum/quartz/project.xml
    -INFO- Failed to extract fallback artifacts from Gump Repository



    The following work was performed:
    http://brutus.apache.org/gump/public/jakarta-turbine-fulcrum/fulcrum-quartz/gump_work/build_jakarta-turbine-fulcrum_fulcrum-quartz.html
    Work Name: build_jakarta-turbine-fulcrum_fulcrum-quartz (Type: Build)
    Work ended in a state of : Failed
    Elapsed: 9 secs
    Command Line: maven --offline jar
    [Working Directory: /usr/local/gump/public/workspace/jakarta-turbine-fulcrum/quartz]
    CLASSPATH: /opt/jdk1.4/lib/tools.jar:/usr/local/gump/public/workspace/jakarta-turbine-fulcrum/quartz/target/classes:/usr/local/gump/public/workspace/ant/dist/lib/ant-jmf.jar:/usr/local/gump/public/workspace/ant/dist/lib/ant-swing.jar:/usr/local/gump/public/workspace/ant/dist/lib/ant-apache-resolver.jar:/usr/local/gump/public/workspace/ant/dist/lib/ant-trax.jar:/usr/local/gump/public/workspace/ant/dist/lib/ant-junit.jar:/usr/local/gump/public/workspace/ant/dist/lib/ant-launcher.jar:/usr/local/gump/public/workspace/ant/dist/lib/ant-nodeps.jar:/usr/local/gump/public/workspace/ant/dist/lib/ant.jar:/usr/local/gump/public/workspace/avalon-trunk/runtime/framework/api/target/deliverables/jars/avalon-framework-api-13042005.jar:/usr/local/gump/public/workspace/avalon-trunk/runtime/framework/impl/target/deliverables/jars/avalon-framework-impl-13042005.jar:/usr/local/gump/public/workspace/jakarta-turbine-fulcrum/yaafi/target/fulcrum-yaafi-1.0.4-dev.jar:/usr/local/gump/public/workspace/jakarta-turbine-fulcrum/testcontainer/target/fulcrum-testcontainer-1.0.5-dev.jar:/usr/local/gump/public/workspace/jakarta-commons/lang/dist/commons-lang-13042005.jar:/usr/local/gump/public/workspace/jakarta-commons/logging/dist/commons-logging.jar:/usr/local/gump/public/workspace/jakarta-commons/logging/dist/commons-logging-api.jar:/usr/local/gump/public/workspace/quartz/lib/quartz.jar:/usr/local/gump/public/workspace/jakarta-jmeter/lib/xstream-1.1.jar
    ---------------------------------------------

    java:prepare-filesystem:
    [mkdir] Created dir: /home/gump/workspaces2/public/workspace/jakarta-turbine-fulcrum/quartz/target/classes

    java:compile:
    [echo] Compiling to /home/gump/workspaces2/public/workspace/jakarta-turbine-fulcrum/quartz/target/classes
    [echo]
    ==========================================================

    NOTE: Targetting JVM 1.4, classes
    will not run on earlier JVMs

    ==========================================================

    [javac] Compiling 4 source files to /home/gump/workspaces2/public/workspace/jakarta-turbine-fulcrum/quartz/target/classes
    Note: /home/gump/workspaces2/public/workspace/jakarta-turbine-fulcrum/quartz/src/java/org/apache/fulcrum/quartz/impl/DefaultQuartzScheduler.java uses or overrides a deprecated API.
    Note: Recompile with -deprecation for details.

    java:jar-resources:

    test:prepare-filesystem:
    [mkdir] Created dir: /home/gump/workspaces2/public/workspace/jakarta-turbine-fulcrum/quartz/target/test-classes
    [mkdir] Created dir: /home/gump/workspaces2/public/workspace/jakarta-turbine-fulcrum/quartz/target/test-reports

    test:test-resources:

    test:compile:
    [javac] Compiling 7 source files to /home/gump/workspaces2/public/workspace/jakarta-turbine-fulcrum/quartz/target/test-classes
    Note: /home/gump/workspaces2/public/workspace/jakarta-turbine-fulcrum/quartz/src/test/org/apache/fulcrum/quartz/SchedulerShutDownTest.java uses or overrides a deprecated API.
    Note: Recompile with -deprecation for details.

    test:test:
    [junit] Running org.apache.fulcrum.quartz.DefaultQuartzSchedulerImplTest
    [junit] Tests run: 8, Failures: 0, Errors: 8, Time elapsed: 1.265 sec
    [junit] [ERROR] TEST org.apache.fulcrum.quartz.DefaultQuartzSchedulerImplTest FAILED
    [junit] Running org.apache.fulcrum.quartz.SchedulerShutDownTest
    [junit] Tests run: 1, Failures: 0, Errors: 1, Time elapsed: 1.016 sec
    [junit] [ERROR] TEST org.apache.fulcrum.quartz.SchedulerShutDownTest FAILED
    [junit] Running org.apache.fulcrum.quartz.XStreamTest
    [junit] Tests run: 2, Failures: 0, Errors: 0, Time elapsed: 0.806 sec

    BUILD FAILED
    File...... /home/gump/.maven/cache/maven-test-plugin-1.6.2/plugin.jelly
    Element... fail
    Line...... 181
    Column.... 54
    There were test failures.
    Total time: 9 seconds
    Finished at: Wed Apr 13 02:54:18 PDT 2005

    ---------------------------------------------

    To subscribe to this information via syndicated feeds:
    - RSS: http://brutus.apache.org/gump/public/jakarta-turbine-fulcrum/fulcrum-quartz/rss.xml
    - Atom: http://brutus.apache.org/gump/public/jakarta-turbine-fulcrum/fulcrum-quartz/atom.xml

    ============================== Gump Tracking Only ===
    Produced by Gump version 2.2.
    Gump Run 21000013042005, brutus:brutus-public:21000013042005
    Gump E-mail Identifier (unique within run) #34.

    --
    Apache Gump
    http://gump.apache.org/ [Instance: brutus]

    ---------------------------------------------------------------------
    To unsubscribe, e-mail: turbine-dev-unsubscribe@jakarta.apache.org
    For additional commands, e-mail: turbine-dev-help@jakarta.apache.org
  • Fulcrum-quartz development at Apr 14, 2005 at 10:28 am
    To whom it may engage...

    This is an automated request, but not an unsolicited one. For
    more information please visit http://gump.apache.org/nagged.html,
    and/or contact the folk at general@gump.apache.org.

    Project fulcrum-quartz has an issue affecting its community integration.
    This issue affects 1 projects.
    The current state of this project is 'Failed', with reason 'Build Failed'.
    For reference only, the following projects are affected by this:
    - fulcrum-quartz : Services Framework


    Full details are available at:
    http://brutus.apache.org/gump/public/jakarta-turbine-fulcrum/fulcrum-quartz/index.html

    That said, some information snippets are provided here.

    The following annotations (debug/informational/warning/error messages) were provided:
    -DEBUG- Sole output [fulcrum-quartz-1.0.jar] identifier set to project name
    -DEBUG- (Gump generated) Maven Properties in: /usr/local/gump/public/workspace/jakarta-turbine-fulcrum/quartz/build.properties
    -INFO- Failed with reason build failed
    -DEBUG- Maven POM in: /usr/local/gump/public/workspace/jakarta-turbine-fulcrum/quartz/project.xml
    -INFO- Failed to extract fallback artifacts from Gump Repository



    The following work was performed:
    http://brutus.apache.org/gump/public/jakarta-turbine-fulcrum/fulcrum-quartz/gump_work/build_jakarta-turbine-fulcrum_fulcrum-quartz.html
    Work Name: build_jakarta-turbine-fulcrum_fulcrum-quartz (Type: Build)
    Work ended in a state of : Failed
    Elapsed: 12 secs
    Command Line: maven --offline jar
    [Working Directory: /usr/local/gump/public/workspace/jakarta-turbine-fulcrum/quartz]
    CLASSPATH: /opt/jdk1.4/lib/tools.jar:/usr/local/gump/public/workspace/jakarta-turbine-fulcrum/quartz/target/classes:/usr/local/gump/public/workspace/ant/dist/lib/ant-jmf.jar:/usr/local/gump/public/workspace/ant/dist/lib/ant-swing.jar:/usr/local/gump/public/workspace/ant/dist/lib/ant-apache-resolver.jar:/usr/local/gump/public/workspace/ant/dist/lib/ant-trax.jar:/usr/local/gump/public/workspace/ant/dist/lib/ant-junit.jar:/usr/local/gump/public/workspace/ant/dist/lib/ant-launcher.jar:/usr/local/gump/public/workspace/ant/dist/lib/ant-nodeps.jar:/usr/local/gump/public/workspace/ant/dist/lib/ant.jar:/usr/local/gump/public/workspace/avalon-trunk/runtime/framework/api/target/deliverables/jars/avalon-framework-api-14042005.jar:/usr/local/gump/public/workspace/avalon-trunk/runtime/framework/impl/target/deliverables/jars/avalon-framework-impl-14042005.jar:/usr/local/gump/public/workspace/jakarta-turbine-fulcrum/yaafi/target/fulcrum-yaafi-1.0.4-dev.jar:/usr/local/gump/public/workspace/jakarta-turbine-fulcrum/testcontainer/target/fulcrum-testcontainer-1.0.5-dev.jar:/usr/local/gump/public/workspace/jakarta-commons/lang/dist/commons-lang-14042005.jar:/usr/local/gump/public/workspace/jakarta-commons/logging/dist/commons-logging.jar:/usr/local/gump/public/workspace/jakarta-commons/logging/dist/commons-logging-api.jar:/usr/local/gump/public/workspace/quartz/lib/quartz.jar:/usr/local/gump/public/workspace/jakarta-jmeter/lib/xstream-1.1.jar
    ---------------------------------------------

    java:prepare-filesystem:
    [mkdir] Created dir: /home/gump/workspaces2/public/workspace/jakarta-turbine-fulcrum/quartz/target/classes

    java:compile:
    [echo] Compiling to /home/gump/workspaces2/public/workspace/jakarta-turbine-fulcrum/quartz/target/classes
    [echo]
    ==========================================================

    NOTE: Targetting JVM 1.4, classes
    will not run on earlier JVMs

    ==========================================================

    [javac] Compiling 4 source files to /home/gump/workspaces2/public/workspace/jakarta-turbine-fulcrum/quartz/target/classes
    Note: /home/gump/workspaces2/public/workspace/jakarta-turbine-fulcrum/quartz/src/java/org/apache/fulcrum/quartz/impl/DefaultQuartzScheduler.java uses or overrides a deprecated API.
    Note: Recompile with -deprecation for details.

    java:jar-resources:

    test:prepare-filesystem:
    [mkdir] Created dir: /home/gump/workspaces2/public/workspace/jakarta-turbine-fulcrum/quartz/target/test-classes
    [mkdir] Created dir: /home/gump/workspaces2/public/workspace/jakarta-turbine-fulcrum/quartz/target/test-reports

    test:test-resources:

    test:compile:
    [javac] Compiling 7 source files to /home/gump/workspaces2/public/workspace/jakarta-turbine-fulcrum/quartz/target/test-classes
    Note: /home/gump/workspaces2/public/workspace/jakarta-turbine-fulcrum/quartz/src/test/org/apache/fulcrum/quartz/SchedulerShutDownTest.java uses or overrides a deprecated API.
    Note: Recompile with -deprecation for details.

    test:test:
    [junit] Running org.apache.fulcrum.quartz.DefaultQuartzSchedulerImplTest
    [junit] Tests run: 8, Failures: 0, Errors: 8, Time elapsed: 1.555 sec
    [junit] [ERROR] TEST org.apache.fulcrum.quartz.DefaultQuartzSchedulerImplTest FAILED
    [junit] Running org.apache.fulcrum.quartz.SchedulerShutDownTest
    [junit] Tests run: 1, Failures: 0, Errors: 1, Time elapsed: 1.267 sec
    [junit] [ERROR] TEST org.apache.fulcrum.quartz.SchedulerShutDownTest FAILED
    [junit] Running org.apache.fulcrum.quartz.XStreamTest
    [junit] Tests run: 2, Failures: 0, Errors: 0, Time elapsed: 1.05 sec

    BUILD FAILED
    File...... /home/gump/.maven/cache/maven-test-plugin-1.6.2/plugin.jelly
    Element... fail
    Line...... 181
    Column.... 54
    There were test failures.
    Total time: 11 seconds
    Finished at: Thu Apr 14 03:27:59 PDT 2005

    ---------------------------------------------

    To subscribe to this information via syndicated feeds:
    - RSS: http://brutus.apache.org/gump/public/jakarta-turbine-fulcrum/fulcrum-quartz/rss.xml
    - Atom: http://brutus.apache.org/gump/public/jakarta-turbine-fulcrum/fulcrum-quartz/atom.xml

    ============================== Gump Tracking Only ===
    Produced by Gump version 2.2.
    Gump Run 23000014042005, brutus:brutus-public:23000014042005
    Gump E-mail Identifier (unique within run) #40.

    --
    Apache Gump
    http://gump.apache.org/ [Instance: brutus]

    ---------------------------------------------------------------------
    To unsubscribe, e-mail: turbine-dev-unsubscribe@jakarta.apache.org
    For additional commands, e-mail: turbine-dev-help@jakarta.apache.org
  • Fulcrum-quartz development at Apr 15, 2005 at 10:13 am
    To whom it may engage...

    This is an automated request, but not an unsolicited one. For
    more information please visit http://gump.apache.org/nagged.html,
    and/or contact the folk at general@gump.apache.org.

    Project fulcrum-quartz has an issue affecting its community integration.
    This issue affects 1 projects.
    The current state of this project is 'Failed', with reason 'Build Failed'.
    For reference only, the following projects are affected by this:
    - fulcrum-quartz : Services Framework


    Full details are available at:
    http://brutus.apache.org/gump/public/jakarta-turbine-fulcrum/fulcrum-quartz/index.html

    That said, some information snippets are provided here.

    The following annotations (debug/informational/warning/error messages) were provided:
    -DEBUG- Sole output [fulcrum-quartz-1.0.jar] identifier set to project name
    -DEBUG- (Gump generated) Maven Properties in: /usr/local/gump/public/workspace/jakarta-turbine-fulcrum/quartz/build.properties
    -INFO- Failed with reason build failed
    -DEBUG- Maven POM in: /usr/local/gump/public/workspace/jakarta-turbine-fulcrum/quartz/project.xml
    -INFO- Failed to extract fallback artifacts from Gump Repository



    The following work was performed:
    http://brutus.apache.org/gump/public/jakarta-turbine-fulcrum/fulcrum-quartz/gump_work/build_jakarta-turbine-fulcrum_fulcrum-quartz.html
    Work Name: build_jakarta-turbine-fulcrum_fulcrum-quartz (Type: Build)
    Work ended in a state of : Failed
    Elapsed: 9 secs
    Command Line: maven --offline jar
    [Working Directory: /usr/local/gump/public/workspace/jakarta-turbine-fulcrum/quartz]
    CLASSPATH: /opt/jdk1.4/lib/tools.jar:/usr/local/gump/public/workspace/jakarta-turbine-fulcrum/quartz/target/classes:/usr/local/gump/public/workspace/ant/dist/lib/ant-jmf.jar:/usr/local/gump/public/workspace/ant/dist/lib/ant-swing.jar:/usr/local/gump/public/workspace/ant/dist/lib/ant-apache-resolver.jar:/usr/local/gump/public/workspace/ant/dist/lib/ant-trax.jar:/usr/local/gump/public/workspace/ant/dist/lib/ant-junit.jar:/usr/local/gump/public/workspace/ant/dist/lib/ant-launcher.jar:/usr/local/gump/public/workspace/ant/dist/lib/ant-nodeps.jar:/usr/local/gump/public/workspace/ant/dist/lib/ant.jar:/usr/local/gump/public/workspace/avalon-trunk/runtime/framework/api/target/deliverables/jars/avalon-framework-api-15042005.jar:/usr/local/gump/public/workspace/avalon-trunk/runtime/framework/impl/target/deliverables/jars/avalon-framework-impl-15042005.jar:/usr/local/gump/public/workspace/jakarta-turbine-fulcrum/yaafi/target/fulcrum-yaafi-1.0.4-dev.jar:/usr/local/gump/public/workspace/jakarta-turbine-fulcrum/testcontainer/target/fulcrum-testcontainer-1.0.5-dev.jar:/usr/local/gump/public/workspace/jakarta-commons/lang/dist/commons-lang-15042005.jar:/usr/local/gump/public/workspace/jakarta-commons/logging/dist/commons-logging.jar:/usr/local/gump/public/workspace/jakarta-commons/logging/dist/commons-logging-api.jar:/usr/local/gump/public/workspace/quartz/lib/quartz.jar:/usr/local/gump/public/workspace/jakarta-jmeter/lib/xstream-1.1.jar
    ---------------------------------------------

    java:prepare-filesystem:
    [mkdir] Created dir: /home/gump/workspaces2/public/workspace/jakarta-turbine-fulcrum/quartz/target/classes

    java:compile:
    [echo] Compiling to /home/gump/workspaces2/public/workspace/jakarta-turbine-fulcrum/quartz/target/classes
    [echo]
    ==========================================================

    NOTE: Targetting JVM 1.4, classes
    will not run on earlier JVMs

    ==========================================================

    [javac] Compiling 4 source files to /home/gump/workspaces2/public/workspace/jakarta-turbine-fulcrum/quartz/target/classes
    Note: /home/gump/workspaces2/public/workspace/jakarta-turbine-fulcrum/quartz/src/java/org/apache/fulcrum/quartz/impl/DefaultQuartzScheduler.java uses or overrides a deprecated API.
    Note: Recompile with -deprecation for details.

    java:jar-resources:

    test:prepare-filesystem:
    [mkdir] Created dir: /home/gump/workspaces2/public/workspace/jakarta-turbine-fulcrum/quartz/target/test-classes
    [mkdir] Created dir: /home/gump/workspaces2/public/workspace/jakarta-turbine-fulcrum/quartz/target/test-reports

    test:test-resources:

    test:compile:
    [javac] Compiling 7 source files to /home/gump/workspaces2/public/workspace/jakarta-turbine-fulcrum/quartz/target/test-classes
    Note: /home/gump/workspaces2/public/workspace/jakarta-turbine-fulcrum/quartz/src/test/org/apache/fulcrum/quartz/SchedulerShutDownTest.java uses or overrides a deprecated API.
    Note: Recompile with -deprecation for details.

    test:test:
    [junit] Running org.apache.fulcrum.quartz.DefaultQuartzSchedulerImplTest
    [junit] Tests run: 8, Failures: 0, Errors: 8, Time elapsed: 1.28 sec
    [junit] [ERROR] TEST org.apache.fulcrum.quartz.DefaultQuartzSchedulerImplTest FAILED
    [junit] Running org.apache.fulcrum.quartz.SchedulerShutDownTest
    [junit] Tests run: 1, Failures: 0, Errors: 1, Time elapsed: 1.032 sec
    [junit] [ERROR] TEST org.apache.fulcrum.quartz.SchedulerShutDownTest FAILED
    [junit] Running org.apache.fulcrum.quartz.XStreamTest
    [junit] Tests run: 2, Failures: 0, Errors: 0, Time elapsed: 0.821 sec

    BUILD FAILED
    File...... /home/gump/.maven/cache/maven-test-plugin-1.6.2/plugin.jelly
    Element... fail
    Line...... 181
    Column.... 54
    There were test failures.
    Total time: 9 seconds
    Finished at: Fri Apr 15 03:12:35 PDT 2005

    ---------------------------------------------

    To subscribe to this information via syndicated feeds:
    - RSS: http://brutus.apache.org/gump/public/jakarta-turbine-fulcrum/fulcrum-quartz/rss.xml
    - Atom: http://brutus.apache.org/gump/public/jakarta-turbine-fulcrum/fulcrum-quartz/atom.xml

    ============================== Gump Tracking Only ===
    Produced by Gump version 2.2.
    Gump Run 23000015042005, brutus:brutus-public:23000015042005
    Gump E-mail Identifier (unique within run) #34.

    --
    Apache Gump
    http://gump.apache.org/ [Instance: brutus]

    ---------------------------------------------------------------------
    To unsubscribe, e-mail: turbine-dev-unsubscribe@jakarta.apache.org
    For additional commands, e-mail: turbine-dev-help@jakarta.apache.org
  • Fulcrum-quartz development at Apr 16, 2005 at 10:19 am
    To whom it may engage...

    This is an automated request, but not an unsolicited one. For
    more information please visit http://gump.apache.org/nagged.html,
    and/or contact the folk at general@gump.apache.org.

    Project fulcrum-quartz has an issue affecting its community integration.
    This issue affects 1 projects,
    and has been outstanding for 3 runs.
    The current state of this project is 'Failed', with reason 'Build Failed'.
    For reference only, the following projects are affected by this:
    - fulcrum-quartz : Services Framework


    Full details are available at:
    http://brutus.apache.org/gump/public/jakarta-turbine-fulcrum/fulcrum-quartz/index.html

    That said, some information snippets are provided here.

    The following annotations (debug/informational/warning/error messages) were provided:
    -DEBUG- Sole output [fulcrum-quartz-1.0.jar] identifier set to project name
    -DEBUG- (Gump generated) Maven Properties in: /usr/local/gump/public/workspace/jakarta-turbine-fulcrum/quartz/build.properties
    -INFO- Failed with reason build failed
    -DEBUG- Maven POM in: /usr/local/gump/public/workspace/jakarta-turbine-fulcrum/quartz/project.xml
    -INFO- Failed to extract fallback artifacts from Gump Repository



    The following work was performed:
    http://brutus.apache.org/gump/public/jakarta-turbine-fulcrum/fulcrum-quartz/gump_work/build_jakarta-turbine-fulcrum_fulcrum-quartz.html
    Work Name: build_jakarta-turbine-fulcrum_fulcrum-quartz (Type: Build)
    Work ended in a state of : Failed
    Elapsed: 12 secs
    Command Line: maven --offline jar
    [Working Directory: /usr/local/gump/public/workspace/jakarta-turbine-fulcrum/quartz]
    CLASSPATH: /opt/jdk1.4/lib/tools.jar:/usr/local/gump/public/workspace/jakarta-turbine-fulcrum/quartz/target/classes:/usr/local/gump/public/workspace/ant/dist/lib/ant-jmf.jar:/usr/local/gump/public/workspace/ant/dist/lib/ant-swing.jar:/usr/local/gump/public/workspace/ant/dist/lib/ant-apache-resolver.jar:/usr/local/gump/public/workspace/ant/dist/lib/ant-trax.jar:/usr/local/gump/public/workspace/ant/dist/lib/ant-junit.jar:/usr/local/gump/public/workspace/ant/dist/lib/ant-launcher.jar:/usr/local/gump/public/workspace/ant/dist/lib/ant-nodeps.jar:/usr/local/gump/public/workspace/ant/dist/lib/ant.jar:/usr/local/gump/public/workspace/avalon-trunk/runtime/framework/api/target/deliverables/jars/avalon-framework-api-16042005.jar:/usr/local/gump/public/workspace/avalon-trunk/runtime/framework/impl/target/deliverables/jars/avalon-framework-impl-16042005.jar:/usr/local/gump/public/workspace/jakarta-turbine-fulcrum/yaafi/target/fulcrum-yaafi-1.0.4-dev.jar:/usr/local/gump/public/workspace/jakarta-turbine-fulcrum/testcontainer/target/fulcrum-testcontainer-1.0.5-dev.jar:/usr/local/gump/public/workspace/jakarta-commons/lang/dist/commons-lang-16042005.jar:/usr/local/gump/public/workspace/jakarta-commons/logging/dist/commons-logging.jar:/usr/local/gump/public/workspace/jakarta-commons/logging/dist/commons-logging-api.jar:/usr/local/gump/public/workspace/quartz/lib/quartz.jar:/usr/local/gump/public/workspace/jakarta-jmeter/lib/xstream-1.1.jar
    ---------------------------------------------

    java:prepare-filesystem:
    [mkdir] Created dir: /home/gump/workspaces2/public/workspace/jakarta-turbine-fulcrum/quartz/target/classes

    java:compile:
    [echo] Compiling to /home/gump/workspaces2/public/workspace/jakarta-turbine-fulcrum/quartz/target/classes
    [echo]
    ==========================================================

    NOTE: Targetting JVM 1.4, classes
    will not run on earlier JVMs

    ==========================================================

    [javac] Compiling 4 source files to /home/gump/workspaces2/public/workspace/jakarta-turbine-fulcrum/quartz/target/classes
    Note: /home/gump/workspaces2/public/workspace/jakarta-turbine-fulcrum/quartz/src/java/org/apache/fulcrum/quartz/impl/DefaultQuartzScheduler.java uses or overrides a deprecated API.
    Note: Recompile with -deprecation for details.

    java:jar-resources:

    test:prepare-filesystem:
    [mkdir] Created dir: /home/gump/workspaces2/public/workspace/jakarta-turbine-fulcrum/quartz/target/test-classes
    [mkdir] Created dir: /home/gump/workspaces2/public/workspace/jakarta-turbine-fulcrum/quartz/target/test-reports

    test:test-resources:

    test:compile:
    [javac] Compiling 7 source files to /home/gump/workspaces2/public/workspace/jakarta-turbine-fulcrum/quartz/target/test-classes
    Note: /home/gump/workspaces2/public/workspace/jakarta-turbine-fulcrum/quartz/src/test/org/apache/fulcrum/quartz/SchedulerShutDownTest.java uses or overrides a deprecated API.
    Note: Recompile with -deprecation for details.

    test:test:
    [junit] Running org.apache.fulcrum.quartz.DefaultQuartzSchedulerImplTest
    [junit] Tests run: 8, Failures: 0, Errors: 8, Time elapsed: 1.794 sec
    [junit] [ERROR] TEST org.apache.fulcrum.quartz.DefaultQuartzSchedulerImplTest FAILED
    [junit] Running org.apache.fulcrum.quartz.SchedulerShutDownTest
    [junit] Tests run: 1, Failures: 0, Errors: 1, Time elapsed: 1.224 sec
    [junit] [ERROR] TEST org.apache.fulcrum.quartz.SchedulerShutDownTest FAILED
    [junit] Running org.apache.fulcrum.quartz.XStreamTest
    [junit] Tests run: 2, Failures: 0, Errors: 0, Time elapsed: 0.885 sec

    BUILD FAILED
    File...... /home/gump/.maven/cache/maven-test-plugin-1.6.2/plugin.jelly
    Element... fail
    Line...... 181
    Column.... 54
    There were test failures.
    Total time: 11 seconds
    Finished at: Sat Apr 16 03:19:04 PDT 2005

    ---------------------------------------------

    To subscribe to this information via syndicated feeds:
    - RSS: http://brutus.apache.org/gump/public/jakarta-turbine-fulcrum/fulcrum-quartz/rss.xml
    - Atom: http://brutus.apache.org/gump/public/jakarta-turbine-fulcrum/fulcrum-quartz/atom.xml

    ============================== Gump Tracking Only ===
    Produced by Gump version 2.2.
    Gump Run 21000016042005, brutus:brutus-public:21000016042005
    Gump E-mail Identifier (unique within run) #38.

    --
    Apache Gump
    http://gump.apache.org/ [Instance: brutus]

    ---------------------------------------------------------------------
    To unsubscribe, e-mail: turbine-dev-unsubscribe@jakarta.apache.org
    For additional commands, e-mail: turbine-dev-help@jakarta.apache.org
  • Fulcrum-quartz development at Apr 17, 2005 at 10:28 am
    To whom it may engage...

    This is an automated request, but not an unsolicited one. For
    more information please visit http://gump.apache.org/nagged.html,
    and/or contact the folk at general@gump.apache.org.

    Project fulcrum-quartz has an issue affecting its community integration.
    This issue affects 1 projects,
    and has been outstanding for 5 runs.
    The current state of this project is 'Failed', with reason 'Build Failed'.
    For reference only, the following projects are affected by this:
    - fulcrum-quartz : Services Framework


    Full details are available at:
    http://brutus.apache.org/gump/public/jakarta-turbine-fulcrum/fulcrum-quartz/index.html

    That said, some information snippets are provided here.

    The following annotations (debug/informational/warning/error messages) were provided:
    -DEBUG- Sole output [fulcrum-quartz-1.0.jar] identifier set to project name
    -DEBUG- (Gump generated) Maven Properties in: /usr/local/gump/public/workspace/jakarta-turbine-fulcrum/quartz/build.properties
    -INFO- Failed with reason build failed
    -DEBUG- Maven POM in: /usr/local/gump/public/workspace/jakarta-turbine-fulcrum/quartz/project.xml
    -INFO- Failed to extract fallback artifacts from Gump Repository



    The following work was performed:
    http://brutus.apache.org/gump/public/jakarta-turbine-fulcrum/fulcrum-quartz/gump_work/build_jakarta-turbine-fulcrum_fulcrum-quartz.html
    Work Name: build_jakarta-turbine-fulcrum_fulcrum-quartz (Type: Build)
    Work ended in a state of : Failed
    Elapsed: 12 secs
    Command Line: maven --offline jar
    [Working Directory: /usr/local/gump/public/workspace/jakarta-turbine-fulcrum/quartz]
    CLASSPATH: /opt/jdk1.4/lib/tools.jar:/usr/local/gump/public/workspace/jakarta-turbine-fulcrum/quartz/target/classes:/usr/local/gump/public/workspace/ant/dist/lib/ant-jmf.jar:/usr/local/gump/public/workspace/ant/dist/lib/ant-swing.jar:/usr/local/gump/public/workspace/ant/dist/lib/ant-apache-resolver.jar:/usr/local/gump/public/workspace/ant/dist/lib/ant-trax.jar:/usr/local/gump/public/workspace/ant/dist/lib/ant-junit.jar:/usr/local/gump/public/workspace/ant/dist/lib/ant-launcher.jar:/usr/local/gump/public/workspace/ant/dist/lib/ant-nodeps.jar:/usr/local/gump/public/workspace/ant/dist/lib/ant.jar:/usr/local/gump/public/workspace/avalon-trunk/runtime/framework/api/target/deliverables/jars/avalon-framework-api-17042005.jar:/usr/local/gump/public/workspace/avalon-trunk/runtime/framework/impl/target/deliverables/jars/avalon-framework-impl-17042005.jar:/usr/local/gump/public/workspace/jakarta-turbine-fulcrum/yaafi/target/fulcrum-yaafi-1.0.4-dev.jar:/usr/local/gump/public/workspace/jakarta-turbine-fulcrum/testcontainer/target/fulcrum-testcontainer-1.0.5-dev.jar:/usr/local/gump/public/workspace/jakarta-commons/lang/dist/commons-lang-17042005.jar:/usr/local/gump/public/workspace/jakarta-commons/logging/dist/commons-logging.jar:/usr/local/gump/public/workspace/jakarta-commons/logging/dist/commons-logging-api.jar:/usr/local/gump/public/workspace/quartz/lib/quartz.jar:/usr/local/gump/public/workspace/jakarta-jmeter/lib/xstream-1.1.jar
    ---------------------------------------------

    java:prepare-filesystem:
    [mkdir] Created dir: /home/gump/workspaces2/public/workspace/jakarta-turbine-fulcrum/quartz/target/classes

    java:compile:
    [echo] Compiling to /home/gump/workspaces2/public/workspace/jakarta-turbine-fulcrum/quartz/target/classes
    [echo]
    ==========================================================

    NOTE: Targetting JVM 1.4, classes
    will not run on earlier JVMs

    ==========================================================

    [javac] Compiling 4 source files to /home/gump/workspaces2/public/workspace/jakarta-turbine-fulcrum/quartz/target/classes
    Note: /home/gump/workspaces2/public/workspace/jakarta-turbine-fulcrum/quartz/src/java/org/apache/fulcrum/quartz/impl/DefaultQuartzScheduler.java uses or overrides a deprecated API.
    Note: Recompile with -deprecation for details.

    java:jar-resources:

    test:prepare-filesystem:
    [mkdir] Created dir: /home/gump/workspaces2/public/workspace/jakarta-turbine-fulcrum/quartz/target/test-classes
    [mkdir] Created dir: /home/gump/workspaces2/public/workspace/jakarta-turbine-fulcrum/quartz/target/test-reports

    test:test-resources:

    test:compile:
    [javac] Compiling 7 source files to /home/gump/workspaces2/public/workspace/jakarta-turbine-fulcrum/quartz/target/test-classes
    Note: /home/gump/workspaces2/public/workspace/jakarta-turbine-fulcrum/quartz/src/test/org/apache/fulcrum/quartz/SchedulerShutDownTest.java uses or overrides a deprecated API.
    Note: Recompile with -deprecation for details.

    test:test:
    [junit] Running org.apache.fulcrum.quartz.DefaultQuartzSchedulerImplTest
    [junit] Tests run: 8, Failures: 0, Errors: 8, Time elapsed: 1.563 sec
    [junit] [ERROR] TEST org.apache.fulcrum.quartz.DefaultQuartzSchedulerImplTest FAILED
    [junit] Running org.apache.fulcrum.quartz.SchedulerShutDownTest
    [junit] Tests run: 1, Failures: 0, Errors: 1, Time elapsed: 1.28 sec
    [junit] [ERROR] TEST org.apache.fulcrum.quartz.SchedulerShutDownTest FAILED
    [junit] Running org.apache.fulcrum.quartz.XStreamTest
    [junit] Tests run: 2, Failures: 0, Errors: 0, Time elapsed: 1.016 sec

    BUILD FAILED
    File...... /home/gump/.maven/cache/maven-test-plugin-1.6.2/plugin.jelly
    Element... fail
    Line...... 181
    Column.... 54
    There were test failures.
    Total time: 12 seconds
    Finished at: Sun Apr 17 03:27:24 PDT 2005

    ---------------------------------------------

    To subscribe to this information via syndicated feeds:
    - RSS: http://brutus.apache.org/gump/public/jakarta-turbine-fulcrum/fulcrum-quartz/rss.xml
    - Atom: http://brutus.apache.org/gump/public/jakarta-turbine-fulcrum/fulcrum-quartz/atom.xml

    ============================== Gump Tracking Only ===
    Produced by Gump version 2.2.
    Gump Run 23000017042005, brutus:brutus-public:23000017042005
    Gump E-mail Identifier (unique within run) #38.

    --
    Apache Gump
    http://gump.apache.org/ [Instance: brutus]

    ---------------------------------------------------------------------
    To unsubscribe, e-mail: turbine-dev-unsubscribe@jakarta.apache.org
    For additional commands, e-mail: turbine-dev-help@jakarta.apache.org
  • Fulcrum-quartz development at Apr 18, 2005 at 10:24 am
    To whom it may engage...

    This is an automated request, but not an unsolicited one. For
    more information please visit http://gump.apache.org/nagged.html,
    and/or contact the folk at general@gump.apache.org.

    Project fulcrum-quartz has an issue affecting its community integration.
    This issue affects 1 projects,
    and has been outstanding for 7 runs.
    The current state of this project is 'Failed', with reason 'Build Failed'.
    For reference only, the following projects are affected by this:
    - fulcrum-quartz : Services Framework


    Full details are available at:
    http://brutus.apache.org/gump/public/jakarta-turbine-fulcrum/fulcrum-quartz/index.html

    That said, some information snippets are provided here.

    The following annotations (debug/informational/warning/error messages) were provided:
    -DEBUG- Sole output [fulcrum-quartz-1.0.jar] identifier set to project name
    -DEBUG- (Gump generated) Maven Properties in: /usr/local/gump/public/workspace/jakarta-turbine-fulcrum/quartz/build.properties
    -INFO- Failed with reason build failed
    -DEBUG- Maven POM in: /usr/local/gump/public/workspace/jakarta-turbine-fulcrum/quartz/project.xml
    -INFO- Failed to extract fallback artifacts from Gump Repository



    The following work was performed:
    http://brutus.apache.org/gump/public/jakarta-turbine-fulcrum/fulcrum-quartz/gump_work/build_jakarta-turbine-fulcrum_fulcrum-quartz.html
    Work Name: build_jakarta-turbine-fulcrum_fulcrum-quartz (Type: Build)
    Work ended in a state of : Failed
    Elapsed: 12 secs
    Command Line: maven --offline jar
    [Working Directory: /usr/local/gump/public/workspace/jakarta-turbine-fulcrum/quartz]
    CLASSPATH: /opt/jdk1.4/lib/tools.jar:/usr/local/gump/public/workspace/jakarta-turbine-fulcrum/quartz/target/classes:/usr/local/gump/public/workspace/ant/dist/lib/ant-jmf.jar:/usr/local/gump/public/workspace/ant/dist/lib/ant-swing.jar:/usr/local/gump/public/workspace/ant/dist/lib/ant-apache-resolver.jar:/usr/local/gump/public/workspace/ant/dist/lib/ant-trax.jar:/usr/local/gump/public/workspace/ant/dist/lib/ant-junit.jar:/usr/local/gump/public/workspace/ant/dist/lib/ant-launcher.jar:/usr/local/gump/public/workspace/ant/dist/lib/ant-nodeps.jar:/usr/local/gump/public/workspace/ant/dist/lib/ant.jar:/usr/local/gump/public/workspace/avalon-trunk/runtime/framework/api/target/deliverables/jars/avalon-framework-api-18042005.jar:/usr/local/gump/public/workspace/avalon-trunk/runtime/framework/impl/target/deliverables/jars/avalon-framework-impl-18042005.jar:/usr/local/gump/public/workspace/jakarta-turbine-fulcrum/yaafi/target/fulcrum-yaafi-1.0.4-dev.jar:/usr/local/gump/public/workspace/jakarta-turbine-fulcrum/testcontainer/target/fulcrum-testcontainer-1.0.5-dev.jar:/usr/local/gump/public/workspace/jakarta-commons/lang/dist/commons-lang-18042005.jar:/usr/local/gump/public/workspace/jakarta-commons/logging/dist/commons-logging.jar:/usr/local/gump/public/workspace/jakarta-commons/logging/dist/commons-logging-api.jar:/usr/local/gump/public/workspace/quartz/lib/quartz.jar:/usr/local/gump/public/workspace/jakarta-jmeter/lib/xstream-1.1.jar
    ---------------------------------------------

    java:prepare-filesystem:
    [mkdir] Created dir: /home/gump/workspaces2/public/workspace/jakarta-turbine-fulcrum/quartz/target/classes

    java:compile:
    [echo] Compiling to /home/gump/workspaces2/public/workspace/jakarta-turbine-fulcrum/quartz/target/classes
    [echo]
    ==========================================================

    NOTE: Targetting JVM 1.4, classes
    will not run on earlier JVMs

    ==========================================================

    [javac] Compiling 4 source files to /home/gump/workspaces2/public/workspace/jakarta-turbine-fulcrum/quartz/target/classes
    Note: /home/gump/workspaces2/public/workspace/jakarta-turbine-fulcrum/quartz/src/java/org/apache/fulcrum/quartz/impl/DefaultQuartzScheduler.java uses or overrides a deprecated API.
    Note: Recompile with -deprecation for details.

    java:jar-resources:

    test:prepare-filesystem:
    [mkdir] Created dir: /home/gump/workspaces2/public/workspace/jakarta-turbine-fulcrum/quartz/target/test-classes
    [mkdir] Created dir: /home/gump/workspaces2/public/workspace/jakarta-turbine-fulcrum/quartz/target/test-reports

    test:test-resources:

    test:compile:
    [javac] Compiling 7 source files to /home/gump/workspaces2/public/workspace/jakarta-turbine-fulcrum/quartz/target/test-classes
    Note: /home/gump/workspaces2/public/workspace/jakarta-turbine-fulcrum/quartz/src/test/org/apache/fulcrum/quartz/SchedulerShutDownTest.java uses or overrides a deprecated API.
    Note: Recompile with -deprecation for details.

    test:test:
    [junit] Running org.apache.fulcrum.quartz.DefaultQuartzSchedulerImplTest
    [junit] Tests run: 8, Failures: 0, Errors: 8, Time elapsed: 1.499 sec
    [junit] [ERROR] TEST org.apache.fulcrum.quartz.DefaultQuartzSchedulerImplTest FAILED
    [junit] Running org.apache.fulcrum.quartz.SchedulerShutDownTest
    [junit] Tests run: 1, Failures: 0, Errors: 1, Time elapsed: 1.364 sec
    [junit] [ERROR] TEST org.apache.fulcrum.quartz.SchedulerShutDownTest FAILED
    [junit] Running org.apache.fulcrum.quartz.XStreamTest
    [junit] Tests run: 2, Failures: 0, Errors: 0, Time elapsed: 1.039 sec

    BUILD FAILED
    File...... /home/gump/.maven/cache/maven-test-plugin-1.6.2/plugin.jelly
    Element... fail
    Line...... 181
    Column.... 54
    There were test failures.
    Total time: 11 seconds
    Finished at: Mon Apr 18 03:24:05 PDT 2005

    ---------------------------------------------

    To subscribe to this information via syndicated feeds:
    - RSS: http://brutus.apache.org/gump/public/jakarta-turbine-fulcrum/fulcrum-quartz/rss.xml
    - Atom: http://brutus.apache.org/gump/public/jakarta-turbine-fulcrum/fulcrum-quartz/atom.xml

    ============================== Gump Tracking Only ===
    Produced by Gump version 2.2.
    Gump Run 22000018042005, brutus:brutus-public:22000018042005
    Gump E-mail Identifier (unique within run) #38.

    --
    Apache Gump
    http://gump.apache.org/ [Instance: brutus]

    ---------------------------------------------------------------------
    To unsubscribe, e-mail: turbine-dev-unsubscribe@jakarta.apache.org
    For additional commands, e-mail: turbine-dev-help@jakarta.apache.org
  • Fulcrum-quartz development at Apr 19, 2005 at 10:26 am
    To whom it may engage...

    This is an automated request, but not an unsolicited one. For
    more information please visit http://gump.apache.org/nagged.html,
    and/or contact the folk at general@gump.apache.org.

    Project fulcrum-quartz has an issue affecting its community integration.
    This issue affects 1 projects,
    and has been outstanding for 9 runs.
    The current state of this project is 'Failed', with reason 'Build Failed'.
    For reference only, the following projects are affected by this:
    - fulcrum-quartz : Services Framework


    Full details are available at:
    http://brutus.apache.org/gump/public/jakarta-turbine-fulcrum/fulcrum-quartz/index.html

    That said, some information snippets are provided here.

    The following annotations (debug/informational/warning/error messages) were provided:
    -DEBUG- Sole output [fulcrum-quartz-1.0.jar] identifier set to project name
    -DEBUG- (Gump generated) Maven Properties in: /usr/local/gump/public/workspace/jakarta-turbine-fulcrum/quartz/build.properties
    -INFO- Failed with reason build failed
    -DEBUG- Maven POM in: /usr/local/gump/public/workspace/jakarta-turbine-fulcrum/quartz/project.xml
    -INFO- Failed to extract fallback artifacts from Gump Repository



    The following work was performed:
    http://brutus.apache.org/gump/public/jakarta-turbine-fulcrum/fulcrum-quartz/gump_work/build_jakarta-turbine-fulcrum_fulcrum-quartz.html
    Work Name: build_jakarta-turbine-fulcrum_fulcrum-quartz (Type: Build)
    Work ended in a state of : Failed
    Elapsed: 12 secs
    Command Line: maven --offline jar
    [Working Directory: /usr/local/gump/public/workspace/jakarta-turbine-fulcrum/quartz]
    CLASSPATH: /opt/jdk1.4/lib/tools.jar:/usr/local/gump/public/workspace/jakarta-turbine-fulcrum/quartz/target/classes:/usr/local/gump/public/workspace/ant/dist/lib/ant-jmf.jar:/usr/local/gump/public/workspace/ant/dist/lib/ant-swing.jar:/usr/local/gump/public/workspace/ant/dist/lib/ant-apache-resolver.jar:/usr/local/gump/public/workspace/ant/dist/lib/ant-trax.jar:/usr/local/gump/public/workspace/ant/dist/lib/ant-junit.jar:/usr/local/gump/public/workspace/ant/dist/lib/ant-launcher.jar:/usr/local/gump/public/workspace/ant/dist/lib/ant-nodeps.jar:/usr/local/gump/public/workspace/ant/dist/lib/ant.jar:/usr/local/gump/public/workspace/avalon-trunk/runtime/framework/api/target/deliverables/jars/avalon-framework-api-19042005.jar:/usr/local/gump/public/workspace/avalon-trunk/runtime/framework/impl/target/deliverables/jars/avalon-framework-impl-19042005.jar:/usr/local/gump/public/workspace/jakarta-turbine-fulcrum/yaafi/target/fulcrum-yaafi-1.0.4-dev.jar:/usr/local/gump/public/workspace/jakarta-turbine-fulcrum/testcontainer/target/fulcrum-testcontainer-1.0.5-dev.jar:/usr/local/gump/public/workspace/jakarta-commons/lang/dist/commons-lang-19042005.jar:/usr/local/gump/public/workspace/jakarta-commons/logging/dist/commons-logging.jar:/usr/local/gump/public/workspace/jakarta-commons/logging/dist/commons-logging-api.jar:/usr/local/gump/public/workspace/quartz/lib/quartz.jar:/usr/local/gump/public/workspace/jakarta-jmeter/lib/xstream-1.1.jar
    ---------------------------------------------

    java:prepare-filesystem:
    [mkdir] Created dir: /home/gump/workspaces2/public/workspace/jakarta-turbine-fulcrum/quartz/target/classes

    java:compile:
    [echo] Compiling to /home/gump/workspaces2/public/workspace/jakarta-turbine-fulcrum/quartz/target/classes
    [echo]
    ==========================================================

    NOTE: Targetting JVM 1.4, classes
    will not run on earlier JVMs

    ==========================================================

    [javac] Compiling 4 source files to /home/gump/workspaces2/public/workspace/jakarta-turbine-fulcrum/quartz/target/classes
    Note: /home/gump/workspaces2/public/workspace/jakarta-turbine-fulcrum/quartz/src/java/org/apache/fulcrum/quartz/impl/DefaultQuartzScheduler.java uses or overrides a deprecated API.
    Note: Recompile with -deprecation for details.

    java:jar-resources:

    test:prepare-filesystem:
    [mkdir] Created dir: /home/gump/workspaces2/public/workspace/jakarta-turbine-fulcrum/quartz/target/test-classes
    [mkdir] Created dir: /home/gump/workspaces2/public/workspace/jakarta-turbine-fulcrum/quartz/target/test-reports

    test:test-resources:

    test:compile:
    [javac] Compiling 7 source files to /home/gump/workspaces2/public/workspace/jakarta-turbine-fulcrum/quartz/target/test-classes
    Note: /home/gump/workspaces2/public/workspace/jakarta-turbine-fulcrum/quartz/src/test/org/apache/fulcrum/quartz/SchedulerShutDownTest.java uses or overrides a deprecated API.
    Note: Recompile with -deprecation for details.

    test:test:
    [junit] Running org.apache.fulcrum.quartz.DefaultQuartzSchedulerImplTest
    [junit] Tests run: 8, Failures: 0, Errors: 8, Time elapsed: 1.641 sec
    [junit] [ERROR] TEST org.apache.fulcrum.quartz.DefaultQuartzSchedulerImplTest FAILED
    [junit] Running org.apache.fulcrum.quartz.SchedulerShutDownTest
    [junit] Tests run: 1, Failures: 0, Errors: 1, Time elapsed: 1.44 sec
    [junit] [ERROR] TEST org.apache.fulcrum.quartz.SchedulerShutDownTest FAILED
    [junit] Running org.apache.fulcrum.quartz.XStreamTest
    [junit] Tests run: 2, Failures: 0, Errors: 0, Time elapsed: 1.014 sec

    BUILD FAILED
    File...... /home/gump/.maven/cache/maven-test-plugin-1.6.2/plugin.jelly
    Element... fail
    Line...... 181
    Column.... 54
    There were test failures.
    Total time: 11 seconds
    Finished at: Tue Apr 19 03:25:54 PDT 2005

    ---------------------------------------------

    To subscribe to this information via syndicated feeds:
    - RSS: http://brutus.apache.org/gump/public/jakarta-turbine-fulcrum/fulcrum-quartz/rss.xml
    - Atom: http://brutus.apache.org/gump/public/jakarta-turbine-fulcrum/fulcrum-quartz/atom.xml

    ============================== Gump Tracking Only ===
    Produced by Gump version 2.2.
    Gump Run 23000019042005, brutus:brutus-public:23000019042005
    Gump E-mail Identifier (unique within run) #37.

    --
    Apache Gump
    http://gump.apache.org/ [Instance: brutus]

    ---------------------------------------------------------------------
    To unsubscribe, e-mail: turbine-dev-unsubscribe@jakarta.apache.org
    For additional commands, e-mail: turbine-dev-help@jakarta.apache.org
  • Fulcrum-quartz development at Apr 21, 2005 at 10:30 am
    To whom it may engage...

    This is an automated request, but not an unsolicited one. For
    more information please visit http://gump.apache.org/nagged.html,
    and/or contact the folk at general@gump.apache.org.

    Project fulcrum-quartz has an issue affecting its community integration.
    This issue affects 1 projects,
    and has been outstanding for 12 runs.
    The current state of this project is 'Failed', with reason 'Build Failed'.
    For reference only, the following projects are affected by this:
    - fulcrum-quartz : Services Framework


    Full details are available at:
    http://brutus.apache.org/gump/public/jakarta-turbine-fulcrum/fulcrum-quartz/index.html

    That said, some information snippets are provided here.

    The following annotations (debug/informational/warning/error messages) were provided:
    -DEBUG- Sole output [fulcrum-quartz-1.0.jar] identifier set to project name
    -DEBUG- (Gump generated) Maven Properties in: /usr/local/gump/public/workspace/jakarta-turbine-fulcrum/quartz/build.properties
    -INFO- Failed with reason build failed
    -DEBUG- Maven POM in: /usr/local/gump/public/workspace/jakarta-turbine-fulcrum/quartz/project.xml
    -INFO- Failed to extract fallback artifacts from Gump Repository



    The following work was performed:
    http://brutus.apache.org/gump/public/jakarta-turbine-fulcrum/fulcrum-quartz/gump_work/build_jakarta-turbine-fulcrum_fulcrum-quartz.html
    Work Name: build_jakarta-turbine-fulcrum_fulcrum-quartz (Type: Build)
    Work ended in a state of : Failed
    Elapsed: 12 secs
    Command Line: maven --offline jar
    [Working Directory: /usr/local/gump/public/workspace/jakarta-turbine-fulcrum/quartz]
    CLASSPATH: /opt/jdk1.4/lib/tools.jar:/usr/local/gump/public/workspace/jakarta-turbine-fulcrum/quartz/target/classes:/usr/local/gump/public/workspace/ant/dist/lib/ant-jmf.jar:/usr/local/gump/public/workspace/ant/dist/lib/ant-swing.jar:/usr/local/gump/public/workspace/ant/dist/lib/ant-apache-resolver.jar:/usr/local/gump/public/workspace/ant/dist/lib/ant-trax.jar:/usr/local/gump/public/workspace/ant/dist/lib/ant-junit.jar:/usr/local/gump/public/workspace/ant/dist/lib/ant-launcher.jar:/usr/local/gump/public/workspace/ant/dist/lib/ant-nodeps.jar:/usr/local/gump/public/workspace/ant/dist/lib/ant.jar:/usr/local/gump/public/workspace/avalon-trunk/runtime/framework/api/target/deliverables/jars/avalon-framework-api-21042005.jar:/usr/local/gump/public/workspace/avalon-trunk/runtime/framework/impl/target/deliverables/jars/avalon-framework-impl-21042005.jar:/usr/local/gump/public/workspace/jakarta-turbine-fulcrum/yaafi/target/fulcrum-yaafi-1.0.4-dev.jar:/usr/local/gump/public/workspace/jakarta-turbine-fulcrum/testcontainer/target/fulcrum-testcontainer-1.0.5-dev.jar:/usr/local/gump/public/workspace/jakarta-commons/lang/dist/commons-lang-21042005.jar:/usr/local/gump/public/workspace/jakarta-commons/logging/dist/commons-logging.jar:/usr/local/gump/public/workspace/jakarta-commons/logging/dist/commons-logging-api.jar:/usr/local/gump/public/workspace/quartz/lib/quartz.jar:/usr/local/gump/public/workspace/jakarta-jmeter/lib/xstream-1.1.jar
    ---------------------------------------------

    java:prepare-filesystem:
    [mkdir] Created dir: /home/gump/workspaces2/public/workspace/jakarta-turbine-fulcrum/quartz/target/classes

    java:compile:
    [echo] Compiling to /home/gump/workspaces2/public/workspace/jakarta-turbine-fulcrum/quartz/target/classes
    [echo]
    ==========================================================

    NOTE: Targetting JVM 1.4, classes
    will not run on earlier JVMs

    ==========================================================

    [javac] Compiling 4 source files to /home/gump/workspaces2/public/workspace/jakarta-turbine-fulcrum/quartz/target/classes
    Note: /home/gump/workspaces2/public/workspace/jakarta-turbine-fulcrum/quartz/src/java/org/apache/fulcrum/quartz/impl/DefaultQuartzScheduler.java uses or overrides a deprecated API.
    Note: Recompile with -deprecation for details.

    java:jar-resources:

    test:prepare-filesystem:
    [mkdir] Created dir: /home/gump/workspaces2/public/workspace/jakarta-turbine-fulcrum/quartz/target/test-classes
    [mkdir] Created dir: /home/gump/workspaces2/public/workspace/jakarta-turbine-fulcrum/quartz/target/test-reports

    test:test-resources:

    test:compile:
    [javac] Compiling 7 source files to /home/gump/workspaces2/public/workspace/jakarta-turbine-fulcrum/quartz/target/test-classes
    Note: /home/gump/workspaces2/public/workspace/jakarta-turbine-fulcrum/quartz/src/test/org/apache/fulcrum/quartz/SchedulerShutDownTest.java uses or overrides a deprecated API.
    Note: Recompile with -deprecation for details.

    test:test:
    [junit] Running org.apache.fulcrum.quartz.DefaultQuartzSchedulerImplTest
    [junit] Tests run: 8, Failures: 0, Errors: 8, Time elapsed: 1.651 sec
    [junit] [ERROR] TEST org.apache.fulcrum.quartz.DefaultQuartzSchedulerImplTest FAILED
    [junit] Running org.apache.fulcrum.quartz.SchedulerShutDownTest
    [junit] Tests run: 1, Failures: 0, Errors: 1, Time elapsed: 1.29 sec
    [junit] [ERROR] TEST org.apache.fulcrum.quartz.SchedulerShutDownTest FAILED
    [junit] Running org.apache.fulcrum.quartz.XStreamTest
    [junit] Tests run: 2, Failures: 0, Errors: 0, Time elapsed: 1.099 sec

    BUILD FAILED
    File...... /home/gump/.maven/cache/maven-test-plugin-1.6.2/plugin.jelly
    Element... fail
    Line...... 181
    Column.... 54
    There were test failures.
    Total time: 12 seconds
    Finished at: Thu Apr 21 03:30:23 PDT 2005

    ---------------------------------------------

    To subscribe to this information via syndicated feeds:
    - RSS: http://brutus.apache.org/gump/public/jakarta-turbine-fulcrum/fulcrum-quartz/rss.xml
    - Atom: http://brutus.apache.org/gump/public/jakarta-turbine-fulcrum/fulcrum-quartz/atom.xml

    ============================== Gump Tracking Only ===
    Produced by Gump version 2.2.
    Gump Run 23000021042005, brutus:brutus-public:23000021042005
    Gump E-mail Identifier (unique within run) #33.

    --
    Apache Gump
    http://gump.apache.org/ [Instance: brutus]

    ---------------------------------------------------------------------
    To unsubscribe, e-mail: turbine-dev-unsubscribe@jakarta.apache.org
    For additional commands, e-mail: turbine-dev-help@jakarta.apache.org
  • Fulcrum-quartz development at Apr 22, 2005 at 10:26 am
    To whom it may engage...

    This is an automated request, but not an unsolicited one. For
    more information please visit http://gump.apache.org/nagged.html,
    and/or contact the folk at general@gump.apache.org.

    Project fulcrum-quartz has an issue affecting its community integration.
    This issue affects 1 projects,
    and has been outstanding for 14 runs.
    The current state of this project is 'Failed', with reason 'Build Failed'.
    For reference only, the following projects are affected by this:
    - fulcrum-quartz : Services Framework


    Full details are available at:
    http://brutus.apache.org/gump/public/jakarta-turbine-fulcrum/fulcrum-quartz/index.html

    That said, some information snippets are provided here.

    The following annotations (debug/informational/warning/error messages) were provided:
    -DEBUG- Sole output [fulcrum-quartz-1.0.jar] identifier set to project name
    -DEBUG- (Gump generated) Maven Properties in: /usr/local/gump/public/workspace/jakarta-turbine-fulcrum/quartz/build.properties
    -INFO- Failed with reason build failed
    -DEBUG- Maven POM in: /usr/local/gump/public/workspace/jakarta-turbine-fulcrum/quartz/project.xml
    -INFO- Failed to extract fallback artifacts from Gump Repository



    The following work was performed:
    http://brutus.apache.org/gump/public/jakarta-turbine-fulcrum/fulcrum-quartz/gump_work/build_jakarta-turbine-fulcrum_fulcrum-quartz.html
    Work Name: build_jakarta-turbine-fulcrum_fulcrum-quartz (Type: Build)
    Work ended in a state of : Failed
    Elapsed: 12 secs
    Command Line: maven --offline jar
    [Working Directory: /usr/local/gump/public/workspace/jakarta-turbine-fulcrum/quartz]
    CLASSPATH: /opt/jdk1.4/lib/tools.jar:/usr/local/gump/public/workspace/jakarta-turbine-fulcrum/quartz/target/classes:/usr/local/gump/public/workspace/ant/dist/lib/ant-jmf.jar:/usr/local/gump/public/workspace/ant/dist/lib/ant-swing.jar:/usr/local/gump/public/workspace/ant/dist/lib/ant-apache-resolver.jar:/usr/local/gump/public/workspace/ant/dist/lib/ant-trax.jar:/usr/local/gump/public/workspace/ant/dist/lib/ant-junit.jar:/usr/local/gump/public/workspace/ant/dist/lib/ant-launcher.jar:/usr/local/gump/public/workspace/ant/dist/lib/ant-nodeps.jar:/usr/local/gump/public/workspace/ant/dist/lib/ant.jar:/usr/local/gump/public/workspace/avalon-trunk/runtime/framework/api/target/deliverables/jars/avalon-framework-api-22042005.jar:/usr/local/gump/public/workspace/avalon-trunk/runtime/framework/impl/target/deliverables/jars/avalon-framework-impl-22042005.jar:/usr/local/gump/public/workspace/jakarta-turbine-fulcrum/yaafi/target/fulcrum-yaafi-1.0.4-dev.jar:/usr/local/gump/public/workspace/jakarta-turbine-fulcrum/testcontainer/target/fulcrum-testcontainer-1.0.5-dev.jar:/usr/local/gump/public/workspace/jakarta-commons/lang/dist/commons-lang-22042005.jar:/usr/local/gump/public/workspace/jakarta-commons/logging/dist/commons-logging.jar:/usr/local/gump/public/workspace/jakarta-commons/logging/dist/commons-logging-api.jar:/usr/local/gump/public/workspace/quartz/lib/quartz.jar:/usr/local/gump/public/workspace/jakarta-jmeter/lib/xstream-1.1.jar
    ---------------------------------------------

    java:prepare-filesystem:
    [mkdir] Created dir: /home/gump/workspaces2/public/workspace/jakarta-turbine-fulcrum/quartz/target/classes

    java:compile:
    [echo] Compiling to /home/gump/workspaces2/public/workspace/jakarta-turbine-fulcrum/quartz/target/classes
    [echo]
    ==========================================================

    NOTE: Targetting JVM 1.4, classes
    will not run on earlier JVMs

    ==========================================================

    [javac] Compiling 4 source files to /home/gump/workspaces2/public/workspace/jakarta-turbine-fulcrum/quartz/target/classes
    Note: /home/gump/workspaces2/public/workspace/jakarta-turbine-fulcrum/quartz/src/java/org/apache/fulcrum/quartz/impl/DefaultQuartzScheduler.java uses or overrides a deprecated API.
    Note: Recompile with -deprecation for details.

    java:jar-resources:

    test:prepare-filesystem:
    [mkdir] Created dir: /home/gump/workspaces2/public/workspace/jakarta-turbine-fulcrum/quartz/target/test-classes
    [mkdir] Created dir: /home/gump/workspaces2/public/workspace/jakarta-turbine-fulcrum/quartz/target/test-reports

    test:test-resources:

    test:compile:
    [javac] Compiling 7 source files to /home/gump/workspaces2/public/workspace/jakarta-turbine-fulcrum/quartz/target/test-classes
    Note: /home/gump/workspaces2/public/workspace/jakarta-turbine-fulcrum/quartz/src/test/org/apache/fulcrum/quartz/SchedulerShutDownTest.java uses or overrides a deprecated API.
    Note: Recompile with -deprecation for details.

    test:test:
    [junit] Running org.apache.fulcrum.quartz.DefaultQuartzSchedulerImplTest
    [junit] Tests run: 8, Failures: 0, Errors: 8, Time elapsed: 1.439 sec
    [junit] [ERROR] TEST org.apache.fulcrum.quartz.DefaultQuartzSchedulerImplTest FAILED
    [junit] Running org.apache.fulcrum.quartz.SchedulerShutDownTest
    [junit] Tests run: 1, Failures: 0, Errors: 1, Time elapsed: 1.267 sec
    [junit] [ERROR] TEST org.apache.fulcrum.quartz.SchedulerShutDownTest FAILED
    [junit] Running org.apache.fulcrum.quartz.XStreamTest
    [junit] Tests run: 2, Failures: 0, Errors: 0, Time elapsed: 1.252 sec

    BUILD FAILED
    File...... /home/gump/.maven/cache/maven-test-plugin-1.6.2/plugin.jelly
    Element... fail
    Line...... 181
    Column.... 54
    There were test failures.
    Total time: 11 seconds
    Finished at: Fri Apr 22 03:26:25 PDT 2005

    ---------------------------------------------

    To subscribe to this information via syndicated feeds:
    - RSS: http://brutus.apache.org/gump/public/jakarta-turbine-fulcrum/fulcrum-quartz/rss.xml
    - Atom: http://brutus.apache.org/gump/public/jakarta-turbine-fulcrum/fulcrum-quartz/atom.xml

    ============================== Gump Tracking Only ===
    Produced by Gump version 2.2.
    Gump Run 26000022042005, brutus:brutus-public:26000022042005
    Gump E-mail Identifier (unique within run) #33.

    --
    Apache Gump
    http://gump.apache.org/ [Instance: brutus]

    ---------------------------------------------------------------------
    To unsubscribe, e-mail: turbine-dev-unsubscribe@jakarta.apache.org
    For additional commands, e-mail: turbine-dev-help@jakarta.apache.org
  • Fulcrum-quartz development at Apr 23, 2005 at 10:25 am
    To whom it may engage...

    This is an automated request, but not an unsolicited one. For
    more information please visit http://gump.apache.org/nagged.html,
    and/or contact the folk at general@gump.apache.org.

    Project fulcrum-quartz has an issue affecting its community integration.
    This issue affects 1 projects,
    and has been outstanding for 16 runs.
    The current state of this project is 'Failed', with reason 'Build Failed'.
    For reference only, the following projects are affected by this:
    - fulcrum-quartz : Services Framework


    Full details are available at:
    http://brutus.apache.org/gump/public/jakarta-turbine-fulcrum/fulcrum-quartz/index.html

    That said, some information snippets are provided here.

    The following annotations (debug/informational/warning/error messages) were provided:
    -DEBUG- Sole output [fulcrum-quartz-1.0.jar] identifier set to project name
    -DEBUG- (Gump generated) Maven Properties in: /usr/local/gump/public/workspace/jakarta-turbine-fulcrum/quartz/build.properties
    -INFO- Failed with reason build failed
    -DEBUG- Maven POM in: /usr/local/gump/public/workspace/jakarta-turbine-fulcrum/quartz/project.xml
    -INFO- Failed to extract fallback artifacts from Gump Repository



    The following work was performed:
    http://brutus.apache.org/gump/public/jakarta-turbine-fulcrum/fulcrum-quartz/gump_work/build_jakarta-turbine-fulcrum_fulcrum-quartz.html
    Work Name: build_jakarta-turbine-fulcrum_fulcrum-quartz (Type: Build)
    Work ended in a state of : Failed
    Elapsed: 12 secs
    Command Line: maven --offline jar
    [Working Directory: /usr/local/gump/public/workspace/jakarta-turbine-fulcrum/quartz]
    CLASSPATH: /opt/jdk1.4/lib/tools.jar:/usr/local/gump/public/workspace/jakarta-turbine-fulcrum/quartz/target/classes:/usr/local/gump/public/workspace/ant/dist/lib/ant-jmf.jar:/usr/local/gump/public/workspace/ant/dist/lib/ant-swing.jar:/usr/local/gump/public/workspace/ant/dist/lib/ant-apache-resolver.jar:/usr/local/gump/public/workspace/ant/dist/lib/ant-trax.jar:/usr/local/gump/public/workspace/ant/dist/lib/ant-junit.jar:/usr/local/gump/public/workspace/ant/dist/lib/ant-launcher.jar:/usr/local/gump/public/workspace/ant/dist/lib/ant-nodeps.jar:/usr/local/gump/public/workspace/ant/dist/lib/ant.jar:/usr/local/gump/public/workspace/avalon-trunk/runtime/framework/api/target/deliverables/jars/avalon-framework-api-23042005.jar:/usr/local/gump/public/workspace/avalon-trunk/runtime/framework/impl/target/deliverables/jars/avalon-framework-impl-23042005.jar:/usr/local/gump/public/workspace/jakarta-turbine-fulcrum/yaafi/target/fulcrum-yaafi-1.0.4-dev.jar:/usr/local/gump/public/workspace/jakarta-turbine-fulcrum/testcontainer/target/fulcrum-testcontainer-1.0.5-dev.jar:/usr/local/gump/public/workspace/jakarta-commons/lang/dist/commons-lang-23042005.jar:/usr/local/gump/public/workspace/jakarta-commons/logging/dist/commons-logging.jar:/usr/local/gump/public/workspace/jakarta-commons/logging/dist/commons-logging-api.jar:/usr/local/gump/public/workspace/quartz/lib/quartz.jar:/usr/local/gump/public/workspace/jakarta-jmeter/lib/xstream-1.1.jar
    ---------------------------------------------

    java:prepare-filesystem:
    [mkdir] Created dir: /home/gump/workspaces2/public/workspace/jakarta-turbine-fulcrum/quartz/target/classes

    java:compile:
    [echo] Compiling to /home/gump/workspaces2/public/workspace/jakarta-turbine-fulcrum/quartz/target/classes
    [echo]
    ==========================================================

    NOTE: Targetting JVM 1.4, classes
    will not run on earlier JVMs

    ==========================================================

    [javac] Compiling 4 source files to /home/gump/workspaces2/public/workspace/jakarta-turbine-fulcrum/quartz/target/classes
    Note: /home/gump/workspaces2/public/workspace/jakarta-turbine-fulcrum/quartz/src/java/org/apache/fulcrum/quartz/impl/DefaultQuartzScheduler.java uses or overrides a deprecated API.
    Note: Recompile with -deprecation for details.

    java:jar-resources:

    test:prepare-filesystem:
    [mkdir] Created dir: /home/gump/workspaces2/public/workspace/jakarta-turbine-fulcrum/quartz/target/test-classes
    [mkdir] Created dir: /home/gump/workspaces2/public/workspace/jakarta-turbine-fulcrum/quartz/target/test-reports

    test:test-resources:

    test:compile:
    [javac] Compiling 7 source files to /home/gump/workspaces2/public/workspace/jakarta-turbine-fulcrum/quartz/target/test-classes
    Note: /home/gump/workspaces2/public/workspace/jakarta-turbine-fulcrum/quartz/src/test/org/apache/fulcrum/quartz/SchedulerShutDownTest.java uses or overrides a deprecated API.
    Note: Recompile with -deprecation for details.

    test:test:
    [junit] Running org.apache.fulcrum.quartz.DefaultQuartzSchedulerImplTest
    [junit] Tests run: 8, Failures: 0, Errors: 8, Time elapsed: 1.434 sec
    [junit] [ERROR] TEST org.apache.fulcrum.quartz.DefaultQuartzSchedulerImplTest FAILED
    [junit] Running org.apache.fulcrum.quartz.SchedulerShutDownTest
    [junit] Tests run: 1, Failures: 0, Errors: 1, Time elapsed: 1.268 sec
    [junit] [ERROR] TEST org.apache.fulcrum.quartz.SchedulerShutDownTest FAILED
    [junit] Running org.apache.fulcrum.quartz.XStreamTest
    [junit] Tests run: 2, Failures: 0, Errors: 0, Time elapsed: 0.843 sec

    BUILD FAILED
    File...... /home/gump/.maven/cache/maven-test-plugin-1.6.2/plugin.jelly
    Element... fail
    Line...... 181
    Column.... 54
    There were test failures.
    Total time: 12 seconds
    Finished at: Sat Apr 23 03:24:51 PDT 2005

    ---------------------------------------------

    To subscribe to this information via syndicated feeds:
    - RSS: http://brutus.apache.org/gump/public/jakarta-turbine-fulcrum/fulcrum-quartz/rss.xml
    - Atom: http://brutus.apache.org/gump/public/jakarta-turbine-fulcrum/fulcrum-quartz/atom.xml

    ============================== Gump Tracking Only ===
    Produced by Gump version 2.2.
    Gump Run 22000023042005, brutus:brutus-public:22000023042005
    Gump E-mail Identifier (unique within run) #36.

    --
    Apache Gump
    http://gump.apache.org/ [Instance: brutus]

    ---------------------------------------------------------------------
    To unsubscribe, e-mail: turbine-dev-unsubscribe@jakarta.apache.org
    For additional commands, e-mail: turbine-dev-help@jakarta.apache.org
  • Fulcrum-quartz development at Apr 24, 2005 at 10:23 am
    To whom it may engage...

    This is an automated request, but not an unsolicited one. For
    more information please visit http://gump.apache.org/nagged.html,
    and/or contact the folk at general@gump.apache.org.

    Project fulcrum-quartz has an issue affecting its community integration.
    This issue affects 1 projects,
    and has been outstanding for 18 runs.
    The current state of this project is 'Failed', with reason 'Build Failed'.
    For reference only, the following projects are affected by this:
    - fulcrum-quartz : Services Framework


    Full details are available at:
    http://brutus.apache.org/gump/public/jakarta-turbine-fulcrum/fulcrum-quartz/index.html

    That said, some information snippets are provided here.

    The following annotations (debug/informational/warning/error messages) were provided:
    -DEBUG- Sole output [fulcrum-quartz-1.0.jar] identifier set to project name
    -DEBUG- (Gump generated) Maven Properties in: /usr/local/gump/public/workspace/jakarta-turbine-fulcrum/quartz/build.properties
    -INFO- Failed with reason build failed
    -DEBUG- Maven POM in: /usr/local/gump/public/workspace/jakarta-turbine-fulcrum/quartz/project.xml
    -INFO- Failed to extract fallback artifacts from Gump Repository



    The following work was performed:
    http://brutus.apache.org/gump/public/jakarta-turbine-fulcrum/fulcrum-quartz/gump_work/build_jakarta-turbine-fulcrum_fulcrum-quartz.html
    Work Name: build_jakarta-turbine-fulcrum_fulcrum-quartz (Type: Build)
    Work ended in a state of : Failed
    Elapsed: 12 secs
    Command Line: maven --offline jar
    [Working Directory: /usr/local/gump/public/workspace/jakarta-turbine-fulcrum/quartz]
    CLASSPATH: /opt/jdk1.4/lib/tools.jar:/usr/local/gump/public/workspace/jakarta-turbine-fulcrum/quartz/target/classes:/usr/local/gump/public/workspace/ant/dist/lib/ant-jmf.jar:/usr/local/gump/public/workspace/ant/dist/lib/ant-swing.jar:/usr/local/gump/public/workspace/ant/dist/lib/ant-apache-resolver.jar:/usr/local/gump/public/workspace/ant/dist/lib/ant-trax.jar:/usr/local/gump/public/workspace/ant/dist/lib/ant-junit.jar:/usr/local/gump/public/workspace/ant/dist/lib/ant-launcher.jar:/usr/local/gump/public/workspace/ant/dist/lib/ant-nodeps.jar:/usr/local/gump/public/workspace/ant/dist/lib/ant.jar:/usr/local/gump/public/workspace/avalon-trunk/runtime/framework/api/target/deliverables/jars/avalon-framework-api-24042005.jar:/usr/local/gump/public/workspace/avalon-trunk/runtime/framework/impl/target/deliverables/jars/avalon-framework-impl-24042005.jar:/usr/local/gump/public/workspace/jakarta-turbine-fulcrum/yaafi/target/fulcrum-yaafi-1.0.4-dev.jar:/usr/local/gump/public/workspace/jakarta-turbine-fulcrum/testcontainer/target/fulcrum-testcontainer-1.0.5-dev.jar:/usr/local/gump/public/workspace/jakarta-commons/lang/dist/commons-lang-24042005.jar:/usr/local/gump/public/workspace/jakarta-commons/logging/dist/commons-logging.jar:/usr/local/gump/public/workspace/jakarta-commons/logging/dist/commons-logging-api.jar:/usr/local/gump/public/workspace/quartz/lib/quartz.jar:/usr/local/gump/public/workspace/jakarta-jmeter/lib/xstream-1.1.jar
    ---------------------------------------------

    java:prepare-filesystem:
    [mkdir] Created dir: /home/gump/workspaces2/public/workspace/jakarta-turbine-fulcrum/quartz/target/classes

    java:compile:
    [echo] Compiling to /home/gump/workspaces2/public/workspace/jakarta-turbine-fulcrum/quartz/target/classes
    [echo]
    ==========================================================

    NOTE: Targetting JVM 1.4, classes
    will not run on earlier JVMs

    ==========================================================

    [javac] Compiling 4 source files to /home/gump/workspaces2/public/workspace/jakarta-turbine-fulcrum/quartz/target/classes
    Note: /home/gump/workspaces2/public/workspace/jakarta-turbine-fulcrum/quartz/src/java/org/apache/fulcrum/quartz/impl/DefaultQuartzScheduler.java uses or overrides a deprecated API.
    Note: Recompile with -deprecation for details.

    java:jar-resources:

    test:prepare-filesystem:
    [mkdir] Created dir: /home/gump/workspaces2/public/workspace/jakarta-turbine-fulcrum/quartz/target/test-classes
    [mkdir] Created dir: /home/gump/workspaces2/public/workspace/jakarta-turbine-fulcrum/quartz/target/test-reports

    test:test-resources:

    test:compile:
    [javac] Compiling 7 source files to /home/gump/workspaces2/public/workspace/jakarta-turbine-fulcrum/quartz/target/test-classes
    Note: /home/gump/workspaces2/public/workspace/jakarta-turbine-fulcrum/quartz/src/test/org/apache/fulcrum/quartz/SchedulerShutDownTest.java uses or overrides a deprecated API.
    Note: Recompile with -deprecation for details.

    test:test:
    [junit] Running org.apache.fulcrum.quartz.DefaultQuartzSchedulerImplTest
    [junit] Tests run: 8, Failures: 0, Errors: 8, Time elapsed: 1.354 sec
    [junit] [ERROR] TEST org.apache.fulcrum.quartz.DefaultQuartzSchedulerImplTest FAILED
    [junit] Running org.apache.fulcrum.quartz.SchedulerShutDownTest
    [junit] Tests run: 1, Failures: 0, Errors: 1, Time elapsed: 1.468 sec
    [junit] [ERROR] TEST org.apache.fulcrum.quartz.SchedulerShutDownTest FAILED
    [junit] Running org.apache.fulcrum.quartz.XStreamTest
    [junit] Tests run: 2, Failures: 0, Errors: 0, Time elapsed: 0.849 sec

    BUILD FAILED
    File...... /home/gump/.maven/cache/maven-test-plugin-1.6.2/plugin.jelly
    Element... fail
    Line...... 181
    Column.... 54
    There were test failures.
    Total time: 11 seconds
    Finished at: Sun Apr 24 03:23:33 PDT 2005

    ---------------------------------------------

    To subscribe to this information via syndicated feeds:
    - RSS: http://brutus.apache.org/gump/public/jakarta-turbine-fulcrum/fulcrum-quartz/rss.xml
    - Atom: http://brutus.apache.org/gump/public/jakarta-turbine-fulcrum/fulcrum-quartz/atom.xml

    ============================== Gump Tracking Only ===
    Produced by Gump version 2.2.
    Gump Run 21000024042005, brutus:brutus-public:21000024042005
    Gump E-mail Identifier (unique within run) #32.

    --
    Apache Gump
    http://gump.apache.org/ [Instance: brutus]

    ---------------------------------------------------------------------
    To unsubscribe, e-mail: turbine-dev-unsubscribe@jakarta.apache.org
    For additional commands, e-mail: turbine-dev-help@jakarta.apache.org
  • Fulcrum-quartz development at Apr 25, 2005 at 10:31 am
    To whom it may engage...

    This is an automated request, but not an unsolicited one. For
    more information please visit http://gump.apache.org/nagged.html,
    and/or contact the folk at general@gump.apache.org.

    Project fulcrum-quartz has an issue affecting its community integration.
    This issue affects 1 projects,
    and has been outstanding for 20 runs.
    The current state of this project is 'Failed', with reason 'Build Failed'.
    For reference only, the following projects are affected by this:
    - fulcrum-quartz : Services Framework


    Full details are available at:
    http://brutus.apache.org/gump/public/jakarta-turbine-fulcrum/fulcrum-quartz/index.html

    That said, some information snippets are provided here.

    The following annotations (debug/informational/warning/error messages) were provided:
    -DEBUG- Sole output [fulcrum-quartz-1.0.jar] identifier set to project name
    -DEBUG- (Gump generated) Maven Properties in: /usr/local/gump/public/workspace/jakarta-turbine-fulcrum/quartz/build.properties
    -INFO- Failed with reason build failed
    -DEBUG- Maven POM in: /usr/local/gump/public/workspace/jakarta-turbine-fulcrum/quartz/project.xml
    -INFO- Failed to extract fallback artifacts from Gump Repository



    The following work was performed:
    http://brutus.apache.org/gump/public/jakarta-turbine-fulcrum/fulcrum-quartz/gump_work/build_jakarta-turbine-fulcrum_fulcrum-quartz.html
    Work Name: build_jakarta-turbine-fulcrum_fulcrum-quartz (Type: Build)
    Work ended in a state of : Failed
    Elapsed: 12 secs
    Command Line: maven --offline jar
    [Working Directory: /usr/local/gump/public/workspace/jakarta-turbine-fulcrum/quartz]
    CLASSPATH: /opt/jdk1.4/lib/tools.jar:/usr/local/gump/public/workspace/jakarta-turbine-fulcrum/quartz/target/classes:/usr/local/gump/public/workspace/ant/dist/lib/ant-jmf.jar:/usr/local/gump/public/workspace/ant/dist/lib/ant-swing.jar:/usr/local/gump/public/workspace/ant/dist/lib/ant-apache-resolver.jar:/usr/local/gump/public/workspace/ant/dist/lib/ant-trax.jar:/usr/local/gump/public/workspace/ant/dist/lib/ant-junit.jar:/usr/local/gump/public/workspace/ant/dist/lib/ant-launcher.jar:/usr/local/gump/public/workspace/ant/dist/lib/ant-nodeps.jar:/usr/local/gump/public/workspace/ant/dist/lib/ant.jar:/usr/local/gump/public/workspace/avalon-trunk/runtime/framework/api/target/deliverables/jars/avalon-framework-api-25042005.jar:/usr/local/gump/public/workspace/avalon-trunk/runtime/framework/impl/target/deliverables/jars/avalon-framework-impl-25042005.jar:/usr/local/gump/public/workspace/jakarta-turbine-fulcrum/yaafi/target/fulcrum-yaafi-1.0.4-dev.jar:/usr/local/gump/public/workspace/jakarta-turbine-fulcrum/testcontainer/target/fulcrum-testcontainer-1.0.5-dev.jar:/usr/local/gump/public/workspace/jakarta-commons/lang/dist/commons-lang-25042005.jar:/usr/local/gump/public/workspace/jakarta-commons/logging/dist/commons-logging.jar:/usr/local/gump/public/workspace/jakarta-commons/logging/dist/commons-logging-api.jar:/usr/local/gump/public/workspace/quartz/lib/quartz.jar:/usr/local/gump/public/workspace/jakarta-jmeter/lib/xstream-1.1.jar
    ---------------------------------------------

    java:prepare-filesystem:
    [mkdir] Created dir: /home/gump/workspaces2/public/workspace/jakarta-turbine-fulcrum/quartz/target/classes

    java:compile:
    [echo] Compiling to /home/gump/workspaces2/public/workspace/jakarta-turbine-fulcrum/quartz/target/classes
    [echo]
    ==========================================================

    NOTE: Targetting JVM 1.4, classes
    will not run on earlier JVMs

    ==========================================================

    [javac] Compiling 4 source files to /home/gump/workspaces2/public/workspace/jakarta-turbine-fulcrum/quartz/target/classes
    Note: /home/gump/workspaces2/public/workspace/jakarta-turbine-fulcrum/quartz/src/java/org/apache/fulcrum/quartz/impl/DefaultQuartzScheduler.java uses or overrides a deprecated API.
    Note: Recompile with -deprecation for details.

    java:jar-resources:

    test:prepare-filesystem:
    [mkdir] Created dir: /home/gump/workspaces2/public/workspace/jakarta-turbine-fulcrum/quartz/target/test-classes
    [mkdir] Created dir: /home/gump/workspaces2/public/workspace/jakarta-turbine-fulcrum/quartz/target/test-reports

    test:test-resources:

    test:compile:
    [javac] Compiling 7 source files to /home/gump/workspaces2/public/workspace/jakarta-turbine-fulcrum/quartz/target/test-classes
    Note: /home/gump/workspaces2/public/workspace/jakarta-turbine-fulcrum/quartz/src/test/org/apache/fulcrum/quartz/SchedulerShutDownTest.java uses or overrides a deprecated API.
    Note: Recompile with -deprecation for details.

    test:test:
    [junit] Running org.apache.fulcrum.quartz.DefaultQuartzSchedulerImplTest
    [junit] Tests run: 8, Failures: 0, Errors: 8, Time elapsed: 1.589 sec
    [junit] [ERROR] TEST org.apache.fulcrum.quartz.DefaultQuartzSchedulerImplTest FAILED
    [junit] Running org.apache.fulcrum.quartz.SchedulerShutDownTest
    [junit] Tests run: 1, Failures: 0, Errors: 1, Time elapsed: 1.301 sec
    [junit] [ERROR] TEST org.apache.fulcrum.quartz.SchedulerShutDownTest FAILED
    [junit] Running org.apache.fulcrum.quartz.XStreamTest
    [junit] Tests run: 2, Failures: 0, Errors: 0, Time elapsed: 0.964 sec

    BUILD FAILED
    File...... /home/gump/.maven/cache/maven-test-plugin-1.6.2/plugin.jelly
    Element... fail
    Line...... 181
    Column.... 54
    There were test failures.
    Total time: 11 seconds
    Finished at: Mon Apr 25 03:30:49 PDT 2005

    ---------------------------------------------

    To subscribe to this information via syndicated feeds:
    - RSS: http://brutus.apache.org/gump/public/jakarta-turbine-fulcrum/fulcrum-quartz/rss.xml
    - Atom: http://brutus.apache.org/gump/public/jakarta-turbine-fulcrum/fulcrum-quartz/atom.xml

    ============================== Gump Tracking Only ===
    Produced by Gump version 2.2.
    Gump Run 21000025042005, brutus:brutus-public:21000025042005
    Gump E-mail Identifier (unique within run) #32.

    --
    Apache Gump
    http://gump.apache.org/ [Instance: brutus]

    ---------------------------------------------------------------------
    To unsubscribe, e-mail: turbine-dev-unsubscribe@jakarta.apache.org
    For additional commands, e-mail: turbine-dev-help@jakarta.apache.org
  • Fulcrum-quartz development at Apr 27, 2005 at 10:25 am
    To whom it may engage...

    This is an automated request, but not an unsolicited one. For
    more information please visit http://gump.apache.org/nagged.html,
    and/or contact the folk at general@gump.apache.org.

    Project fulcrum-quartz has an issue affecting its community integration.
    This issue affects 1 projects.
    The current state of this project is 'Failed', with reason 'Build Failed'.
    For reference only, the following projects are affected by this:
    - fulcrum-quartz : Services Framework


    Full details are available at:
    http://brutus.apache.org/gump/public/jakarta-turbine-fulcrum/fulcrum-quartz/index.html

    That said, some information snippets are provided here.

    The following annotations (debug/informational/warning/error messages) were provided:
    -DEBUG- Sole output [fulcrum-quartz-1.0.jar] identifier set to project name
    -DEBUG- (Gump generated) Maven Properties in: /usr/local/gump/public/workspace/jakarta-turbine-fulcrum/quartz/build.properties
    -INFO- Failed with reason build failed
    -DEBUG- Maven POM in: /usr/local/gump/public/workspace/jakarta-turbine-fulcrum/quartz/project.xml
    -INFO- Failed to extract fallback artifacts from Gump Repository



    The following work was performed:
    http://brutus.apache.org/gump/public/jakarta-turbine-fulcrum/fulcrum-quartz/gump_work/build_jakarta-turbine-fulcrum_fulcrum-quartz.html
    Work Name: build_jakarta-turbine-fulcrum_fulcrum-quartz (Type: Build)
    Work ended in a state of : Failed
    Elapsed: 12 secs
    Command Line: maven --offline jar
    [Working Directory: /usr/local/gump/public/workspace/jakarta-turbine-fulcrum/quartz]
    CLASSPATH: /opt/jdk1.4/lib/tools.jar:/usr/local/gump/public/workspace/jakarta-turbine-fulcrum/quartz/target/classes:/usr/local/gump/public/workspace/ant/dist/lib/ant-jmf.jar:/usr/local/gump/public/workspace/ant/dist/lib/ant-swing.jar:/usr/local/gump/public/workspace/ant/dist/lib/ant-apache-resolver.jar:/usr/local/gump/public/workspace/ant/dist/lib/ant-trax.jar:/usr/local/gump/public/workspace/ant/dist/lib/ant-junit.jar:/usr/local/gump/public/workspace/ant/dist/lib/ant-launcher.jar:/usr/local/gump/public/workspace/ant/dist/lib/ant-nodeps.jar:/usr/local/gump/public/workspace/ant/dist/lib/ant.jar:/usr/local/gump/public/workspace/avalon-trunk/runtime/framework/api/target/deliverables/jars/avalon-framework-api-27042005.jar:/usr/local/gump/public/workspace/avalon-trunk/runtime/framework/impl/target/deliverables/jars/avalon-framework-impl-27042005.jar:/usr/local/gump/public/workspace/jakarta-turbine-fulcrum/yaafi/target/fulcrum-yaafi-1.0.4-dev.jar:/usr/local/gump/public/workspace/jakarta-turbine-fulcrum/testcontainer/target/fulcrum-testcontainer-1.0.5-dev.jar:/usr/local/gump/public/workspace/jakarta-commons/lang/dist/commons-lang-27042005.jar:/usr/local/gump/public/workspace/jakarta-commons/logging/dist/commons-logging.jar:/usr/local/gump/public/workspace/jakarta-commons/logging/dist/commons-logging-api.jar:/usr/local/gump/public/workspace/quartz/lib/quartz.jar:/usr/local/gump/public/workspace/jakarta-jmeter/lib/xstream-1.1.jar
    ---------------------------------------------

    java:prepare-filesystem:
    [mkdir] Created dir: /home/gump/workspaces2/public/workspace/jakarta-turbine-fulcrum/quartz/target/classes

    java:compile:
    [echo] Compiling to /home/gump/workspaces2/public/workspace/jakarta-turbine-fulcrum/quartz/target/classes
    [echo]
    ==========================================================

    NOTE: Targetting JVM 1.4, classes
    will not run on earlier JVMs

    ==========================================================

    [javac] Compiling 4 source files to /home/gump/workspaces2/public/workspace/jakarta-turbine-fulcrum/quartz/target/classes
    Note: /home/gump/workspaces2/public/workspace/jakarta-turbine-fulcrum/quartz/src/java/org/apache/fulcrum/quartz/impl/DefaultQuartzScheduler.java uses or overrides a deprecated API.
    Note: Recompile with -deprecation for details.

    java:jar-resources:

    test:prepare-filesystem:
    [mkdir] Created dir: /home/gump/workspaces2/public/workspace/jakarta-turbine-fulcrum/quartz/target/test-classes
    [mkdir] Created dir: /home/gump/workspaces2/public/workspace/jakarta-turbine-fulcrum/quartz/target/test-reports

    test:test-resources:

    test:compile:
    [javac] Compiling 7 source files to /home/gump/workspaces2/public/workspace/jakarta-turbine-fulcrum/quartz/target/test-classes
    Note: /home/gump/workspaces2/public/workspace/jakarta-turbine-fulcrum/quartz/src/test/org/apache/fulcrum/quartz/SchedulerShutDownTest.java uses or overrides a deprecated API.
    Note: Recompile with -deprecation for details.

    test:test:
    [junit] Running org.apache.fulcrum.quartz.DefaultQuartzSchedulerImplTest
    [junit] Tests run: 8, Failures: 0, Errors: 8, Time elapsed: 1.804 sec
    [junit] [ERROR] TEST org.apache.fulcrum.quartz.DefaultQuartzSchedulerImplTest FAILED
    [junit] Running org.apache.fulcrum.quartz.SchedulerShutDownTest
    [junit] Tests run: 1, Failures: 0, Errors: 1, Time elapsed: 1.288 sec
    [junit] [ERROR] TEST org.apache.fulcrum.quartz.SchedulerShutDownTest FAILED
    [junit] Running org.apache.fulcrum.quartz.XStreamTest
    [junit] Tests run: 2, Failures: 0, Errors: 0, Time elapsed: 1.099 sec

    BUILD FAILED
    File...... /home/gump/.maven/cache/maven-test-plugin-1.6.2/plugin.jelly
    Element... fail
    Line...... 181
    Column.... 54
    There were test failures.
    Total time: 12 seconds
    Finished at: Wed Apr 27 03:24:59 PDT 2005

    ---------------------------------------------

    To subscribe to this information via syndicated feeds:
    - RSS: http://brutus.apache.org/gump/public/jakarta-turbine-fulcrum/fulcrum-quartz/rss.xml
    - Atom: http://brutus.apache.org/gump/public/jakarta-turbine-fulcrum/fulcrum-quartz/atom.xml

    ============================== Gump Tracking Only ===
    Produced by Gump version 2.2.
    Gump Run 22000027042005, brutus:brutus-public:22000027042005
    Gump E-mail Identifier (unique within run) #32.

    --
    Apache Gump
    http://gump.apache.org/ [Instance: brutus]

    ---------------------------------------------------------------------
    To unsubscribe, e-mail: turbine-dev-unsubscribe@jakarta.apache.org
    For additional commands, e-mail: turbine-dev-help@jakarta.apache.org
  • Fulcrum-quartz development at Apr 28, 2005 at 10:35 am
    To whom it may engage...

    This is an automated request, but not an unsolicited one. For
    more information please visit http://gump.apache.org/nagged.html,
    and/or contact the folk at general@gump.apache.org.

    Project fulcrum-quartz has an issue affecting its community integration.
    This issue affects 1 projects,
    and has been outstanding for 3 runs.
    The current state of this project is 'Failed', with reason 'Build Failed'.
    For reference only, the following projects are affected by this:
    - fulcrum-quartz : Services Framework


    Full details are available at:
    http://brutus.apache.org/gump/public/jakarta-turbine-fulcrum/fulcrum-quartz/index.html

    That said, some information snippets are provided here.

    The following annotations (debug/informational/warning/error messages) were provided:
    -DEBUG- Sole output [fulcrum-quartz-1.0.jar] identifier set to project name
    -DEBUG- (Gump generated) Maven Properties in: /usr/local/gump/public/workspace/jakarta-turbine-fulcrum/quartz/build.properties
    -INFO- Failed with reason build failed
    -DEBUG- Maven POM in: /usr/local/gump/public/workspace/jakarta-turbine-fulcrum/quartz/project.xml
    -INFO- Failed to extract fallback artifacts from Gump Repository



    The following work was performed:
    http://brutus.apache.org/gump/public/jakarta-turbine-fulcrum/fulcrum-quartz/gump_work/build_jakarta-turbine-fulcrum_fulcrum-quartz.html
    Work Name: build_jakarta-turbine-fulcrum_fulcrum-quartz (Type: Build)
    Work ended in a state of : Failed
    Elapsed: 9 secs
    Command Line: maven --offline jar
    [Working Directory: /usr/local/gump/public/workspace/jakarta-turbine-fulcrum/quartz]
    CLASSPATH: /opt/jdk1.4/lib/tools.jar:/usr/local/gump/public/workspace/jakarta-turbine-fulcrum/quartz/target/classes:/usr/local/gump/public/workspace/ant/dist/lib/ant-jmf.jar:/usr/local/gump/public/workspace/ant/dist/lib/ant-swing.jar:/usr/local/gump/public/workspace/ant/dist/lib/ant-apache-resolver.jar:/usr/local/gump/public/workspace/ant/dist/lib/ant-trax.jar:/usr/local/gump/public/workspace/ant/dist/lib/ant-junit.jar:/usr/local/gump/public/workspace/ant/dist/lib/ant-launcher.jar:/usr/local/gump/public/workspace/ant/dist/lib/ant-nodeps.jar:/usr/local/gump/public/workspace/ant/dist/lib/ant.jar:/usr/local/gump/public/workspace/avalon-trunk/runtime/framework/api/target/deliverables/jars/avalon-framework-api-28042005.jar:/usr/local/gump/public/workspace/avalon-trunk/runtime/framework/impl/target/deliverables/jars/avalon-framework-impl-28042005.jar:/usr/local/gump/public/workspace/jakarta-turbine-fulcrum/yaafi/target/fulcrum-yaafi-1.0.4-dev.jar:/usr/local/gump/public/workspace/jakarta-turbine-fulcrum/testcontainer/target/fulcrum-testcontainer-1.0.5-dev.jar:/usr/local/gump/public/workspace/jakarta-commons/lang/dist/commons-lang-28042005.jar:/usr/local/gump/public/workspace/jakarta-commons/logging/dist/commons-logging.jar:/usr/local/gump/public/workspace/jakarta-commons/logging/dist/commons-logging-api.jar:/usr/local/gump/public/workspace/quartz/lib/quartz.jar:/usr/local/gump/public/workspace/jakarta-jmeter/lib/xstream-1.1.jar
    ---------------------------------------------

    java:prepare-filesystem:
    [mkdir] Created dir: /home/gump/workspaces2/public/workspace/jakarta-turbine-fulcrum/quartz/target/classes

    java:compile:
    [echo] Compiling to /home/gump/workspaces2/public/workspace/jakarta-turbine-fulcrum/quartz/target/classes
    [echo]
    ==========================================================

    NOTE: Targetting JVM 1.4, classes
    will not run on earlier JVMs

    ==========================================================

    [javac] Compiling 4 source files to /home/gump/workspaces2/public/workspace/jakarta-turbine-fulcrum/quartz/target/classes
    Note: /home/gump/workspaces2/public/workspace/jakarta-turbine-fulcrum/quartz/src/java/org/apache/fulcrum/quartz/impl/DefaultQuartzScheduler.java uses or overrides a deprecated API.
    Note: Recompile with -deprecation for details.

    java:jar-resources:

    test:prepare-filesystem:
    [mkdir] Created dir: /home/gump/workspaces2/public/workspace/jakarta-turbine-fulcrum/quartz/target/test-classes
    [mkdir] Created dir: /home/gump/workspaces2/public/workspace/jakarta-turbine-fulcrum/quartz/target/test-reports

    test:test-resources:

    test:compile:
    [javac] Compiling 7 source files to /home/gump/workspaces2/public/workspace/jakarta-turbine-fulcrum/quartz/target/test-classes
    Note: /home/gump/workspaces2/public/workspace/jakarta-turbine-fulcrum/quartz/src/test/org/apache/fulcrum/quartz/SchedulerShutDownTest.java uses or overrides a deprecated API.
    Note: Recompile with -deprecation for details.

    test:test:
    [junit] Running org.apache.fulcrum.quartz.DefaultQuartzSchedulerImplTest
    [junit] Tests run: 8, Failures: 0, Errors: 8, Time elapsed: 1.278 sec
    [junit] [ERROR] TEST org.apache.fulcrum.quartz.DefaultQuartzSchedulerImplTest FAILED
    [junit] Running org.apache.fulcrum.quartz.SchedulerShutDownTest
    [junit] Tests run: 1, Failures: 0, Errors: 1, Time elapsed: 1.017 sec
    [junit] [ERROR] TEST org.apache.fulcrum.quartz.SchedulerShutDownTest FAILED
    [junit] Running org.apache.fulcrum.quartz.XStreamTest
    [junit] Tests run: 2, Failures: 0, Errors: 0, Time elapsed: 0.817 sec

    BUILD FAILED
    File...... /home/gump/.maven/cache/maven-test-plugin-1.6.2/plugin.jelly
    Element... fail
    Line...... 181
    Column.... 54
    There were test failures.
    Total time: 9 seconds
    Finished at: Thu Apr 28 03:35:22 PDT 2005

    ---------------------------------------------

    To subscribe to this information via syndicated feeds:
    - RSS: http://brutus.apache.org/gump/public/jakarta-turbine-fulcrum/fulcrum-quartz/rss.xml
    - Atom: http://brutus.apache.org/gump/public/jakarta-turbine-fulcrum/fulcrum-quartz/atom.xml

    ============================== Gump Tracking Only ===
    Produced by Gump version 2.2.
    Gump Run 27000028042005, brutus:brutus-public:27000028042005
    Gump E-mail Identifier (unique within run) #30.

    --
    Apache Gump
    http://gump.apache.org/ [Instance: brutus]

    ---------------------------------------------------------------------
    To unsubscribe, e-mail: turbine-dev-unsubscribe@jakarta.apache.org
    For additional commands, e-mail: turbine-dev-help@jakarta.apache.org
  • Fulcrum-quartz development at Apr 30, 2005 at 10:34 am
    To whom it may engage...

    This is an automated request, but not an unsolicited one. For
    more information please visit http://gump.apache.org/nagged.html,
    and/or contact the folk at general@gump.apache.org.

    Project fulcrum-quartz has an issue affecting its community integration.
    This issue affects 1 projects.
    The current state of this project is 'Failed', with reason 'Build Failed'.
    For reference only, the following projects are affected by this:
    - fulcrum-quartz : Services Framework


    Full details are available at:
    http://brutus.apache.org/gump/public/jakarta-turbine-fulcrum/fulcrum-quartz/index.html

    That said, some information snippets are provided here.

    The following annotations (debug/informational/warning/error messages) were provided:
    -DEBUG- Sole output [fulcrum-quartz-1.0.jar] identifier set to project name
    -DEBUG- (Gump generated) Maven Properties in: /usr/local/gump/public/workspace/jakarta-turbine-fulcrum/quartz/build.properties
    -INFO- Failed with reason build failed
    -DEBUG- Maven POM in: /usr/local/gump/public/workspace/jakarta-turbine-fulcrum/quartz/project.xml
    -INFO- Failed to extract fallback artifacts from Gump Repository



    The following work was performed:
    http://brutus.apache.org/gump/public/jakarta-turbine-fulcrum/fulcrum-quartz/gump_work/build_jakarta-turbine-fulcrum_fulcrum-quartz.html
    Work Name: build_jakarta-turbine-fulcrum_fulcrum-quartz (Type: Build)
    Work ended in a state of : Failed
    Elapsed: 10 secs
    Command Line: maven --offline jar
    [Working Directory: /usr/local/gump/public/workspace/jakarta-turbine-fulcrum/quartz]
    CLASSPATH: /opt/jdk1.4/lib/tools.jar:/usr/local/gump/public/workspace/jakarta-turbine-fulcrum/quartz/target/classes:/usr/local/gump/public/workspace/ant/dist/lib/ant-jmf.jar:/usr/local/gump/public/workspace/ant/dist/lib/ant-swing.jar:/usr/local/gump/public/workspace/ant/dist/lib/ant-apache-resolver.jar:/usr/local/gump/public/workspace/ant/dist/lib/ant-trax.jar:/usr/local/gump/public/workspace/ant/dist/lib/ant-junit.jar:/usr/local/gump/public/workspace/ant/dist/lib/ant-launcher.jar:/usr/local/gump/public/workspace/ant/dist/lib/ant-nodeps.jar:/usr/local/gump/public/workspace/ant/dist/lib/ant.jar:/usr/local/gump/public/workspace/avalon-trunk/runtime/framework/api/target/deliverables/jars/avalon-framework-api-30042005.jar:/usr/local/gump/public/workspace/avalon-trunk/runtime/framework/impl/target/deliverables/jars/avalon-framework-impl-30042005.jar:/usr/local/gump/public/workspace/jakarta-turbine-fulcrum/yaafi/target/fulcrum-yaafi-1.0.4-dev.jar:/usr/local/gump/public/workspace/jakarta-turbine-fulcrum/testcontainer/target/fulcrum-testcontainer-1.0.5-dev.jar:/usr/local/gump/public/workspace/jakarta-commons/lang/dist/commons-lang-30042005.jar:/usr/local/gump/public/workspace/jakarta-commons/logging/dist/commons-logging.jar:/usr/local/gump/public/workspace/jakarta-commons/logging/dist/commons-logging-api.jar:/usr/local/gump/public/workspace/quartz/lib/quartz.jar:/usr/local/gump/public/workspace/jakarta-jmeter/lib/xstream-1.1.jar
    ---------------------------------------------

    java:prepare-filesystem:
    [mkdir] Created dir: /home/gump/workspaces2/public/workspace/jakarta-turbine-fulcrum/quartz/target/classes

    java:compile:
    [echo] Compiling to /home/gump/workspaces2/public/workspace/jakarta-turbine-fulcrum/quartz/target/classes
    [echo]
    ==========================================================

    NOTE: Targetting JVM 1.4, classes
    will not run on earlier JVMs

    ==========================================================

    [javac] Compiling 4 source files to /home/gump/workspaces2/public/workspace/jakarta-turbine-fulcrum/quartz/target/classes
    Note: /home/gump/workspaces2/public/workspace/jakarta-turbine-fulcrum/quartz/src/java/org/apache/fulcrum/quartz/impl/DefaultQuartzScheduler.java uses or overrides a deprecated API.
    Note: Recompile with -deprecation for details.

    java:jar-resources:

    test:prepare-filesystem:
    [mkdir] Created dir: /home/gump/workspaces2/public/workspace/jakarta-turbine-fulcrum/quartz/target/test-classes
    [mkdir] Created dir: /home/gump/workspaces2/public/workspace/jakarta-turbine-fulcrum/quartz/target/test-reports

    test:test-resources:

    test:compile:
    [javac] Compiling 7 source files to /home/gump/workspaces2/public/workspace/jakarta-turbine-fulcrum/quartz/target/test-classes
    Note: /home/gump/workspaces2/public/workspace/jakarta-turbine-fulcrum/quartz/src/test/org/apache/fulcrum/quartz/SchedulerShutDownTest.java uses or overrides a deprecated API.
    Note: Recompile with -deprecation for details.

    test:test:
    [junit] Running org.apache.fulcrum.quartz.DefaultQuartzSchedulerImplTest
    [junit] Tests run: 8, Failures: 0, Errors: 8, Time elapsed: 1.288 sec
    [junit] [ERROR] TEST org.apache.fulcrum.quartz.DefaultQuartzSchedulerImplTest FAILED
    [junit] Running org.apache.fulcrum.quartz.SchedulerShutDownTest
    [junit] Tests run: 1, Failures: 0, Errors: 1, Time elapsed: 1.017 sec
    [junit] [ERROR] TEST org.apache.fulcrum.quartz.SchedulerShutDownTest FAILED
    [junit] Running org.apache.fulcrum.quartz.XStreamTest
    [junit] Tests run: 2, Failures: 0, Errors: 0, Time elapsed: 0.819 sec

    BUILD FAILED
    File...... /home/gump/.maven/cache/maven-test-plugin-1.6.2/plugin.jelly
    Element... fail
    Line...... 181
    Column.... 54
    There were test failures.
    Total time: 9 seconds
    Finished at: Sat Apr 30 03:34:09 PDT 2005

    ---------------------------------------------

    To subscribe to this information via syndicated feeds:
    - RSS: http://brutus.apache.org/gump/public/jakarta-turbine-fulcrum/fulcrum-quartz/rss.xml
    - Atom: http://brutus.apache.org/gump/public/jakarta-turbine-fulcrum/fulcrum-quartz/atom.xml

    ============================== Gump Tracking Only ===
    Produced by Gump version 2.2.
    Gump Run 23000030042005, brutus:brutus-public:23000030042005
    Gump E-mail Identifier (unique within run) #27.

    --
    Apache Gump
    http://gump.apache.org/ [Instance: brutus]

    ---------------------------------------------------------------------
    To unsubscribe, e-mail: turbine-dev-unsubscribe@jakarta.apache.org
    For additional commands, e-mail: turbine-dev-help@jakarta.apache.org

Related Discussions

Discussion Navigation
viewthread | post
Discussion Overview
groupdev @
categoriesturbine
postedApr 2, '05 at 11:00a
activeApr 30, '05 at 10:34a
posts21
users1
websiteturbine.apache.org

1 user in discussion

Fulcrum-quartz development: 21 posts

People

Translate

site design / logo © 2019 Grokbase