FAQ
The Buildbot has detected a new failure of sparc solaris10 gcc 3.x.
Full details are available at:
http://www.python.org/dev/buildbot/all/sparc%20solaris10%20gcc%203.x/builds/457

Buildbot URL: http://www.python.org/dev/buildbot/all/

Buildslave for this Build: loewis-sun

Build Reason:
Build Source Stamp: [branch branches/py3k] HEAD
Blamelist: brett.cannon

BUILD FAILED: failed test

Excerpt from the test logfile:
2 tests failed:
test_importlib test_urllib2net

Traceback (most recent call last):
File "./Lib/test/regrtest.py", line 620, in runtest_inner
indirect_test()
File "/home2/buildbot/slave/3.x.loewis-sun/build/Lib/test/test_importlib.py", line 6, in test_main
run_unittest(importlib.test.test_suite('importlib.test'))
File "/home2/buildbot/slave/3.x.loewis-sun/build/Lib/importlib/test/__init__.py", line 22, in test_suite
package_tests = getattr(sys.modules[package_name], 'test_suite')()
File "/home2/buildbot/slave/3.x.loewis-sun/build/Lib/importlib/test/source/__init__.py", line 8, in test_suite
return importlib.test.test_suite('importlib.test.source', directory)
File "/home2/buildbot/slave/3.x.loewis-sun/build/Lib/importlib/test/__init__.py", line 16, in test_suite
__import__(module_name, level=0)
File "/home2/buildbot/slave/3.x.loewis-sun/build/Lib/importlib/test/source/test_case_sensitivity.py", line 12, in <module>
class CaseSensitivityTest(unittest.TestCase):
File "/home2/buildbot/slave/3.x.loewis-sun/build/Lib/importlib/test/util.py", line 13, in case_insensitive_tests
original_name = os.path.listdir('.')[0]
AttributeError: 'module' object has no attribute 'listdir'

======================================================================
ERROR: test_http_basic (test.test_urllib2net.TimeoutTest)
----------------------------------------------------------------------

Traceback (most recent call last):
File "/home2/buildbot/slave/3.x.loewis-sun/build/Lib/test/test_urllib2net.py", line 198, in test_http_basic
self.assertTrue(u.fp.fp.raw._sock.gettimeout() is None)
AttributeError: '_io.BufferedReader' object has no attribute 'fp'

======================================================================
ERROR: test_http_default_timeout (test.test_urllib2net.TimeoutTest)
----------------------------------------------------------------------

Traceback (most recent call last):
File "/home2/buildbot/slave/3.x.loewis-sun/build/Lib/test/test_urllib2net.py", line 207, in test_http_default_timeout
self.assertEqual(u.fp.fp.raw._sock.gettimeout(), 60)
AttributeError: '_io.BufferedReader' object has no attribute 'fp'

======================================================================
ERROR: test_http_no_timeout (test.test_urllib2net.TimeoutTest)
----------------------------------------------------------------------

Traceback (most recent call last):
File "/home2/buildbot/slave/3.x.loewis-sun/build/Lib/test/test_urllib2net.py", line 216, in test_http_no_timeout
self.assertTrue(u.fp.fp.raw._sock.gettimeout() is None)
AttributeError: '_io.BufferedReader' object has no attribute 'fp'

======================================================================
ERROR: test_http_timeout (test.test_urllib2net.TimeoutTest)
----------------------------------------------------------------------

Traceback (most recent call last):
File "/home2/buildbot/slave/3.x.loewis-sun/build/Lib/test/test_urllib2net.py", line 220, in test_http_timeout
self.assertEqual(u.fp.fp.raw._sock.gettimeout(), 120)
AttributeError: '_io.BufferedReader' object has no attribute 'fp'

sincerely,
-The Buildbot

Search Discussions

  • Buildbot at Apr 4, 2009 at 4:20 am
    The Buildbot has detected a new failure of sparc solaris10 gcc 3.x.
    Full details are available at:
    http://www.python.org/dev/buildbot/all/sparc%20solaris10%20gcc%203.x/builds/472

    Buildbot URL: http://www.python.org/dev/buildbot/all/

    Buildslave for this Build: loewis-sun

    Build Reason:
    Build Source Stamp: [branch branches/py3k] HEAD
    Blamelist: benjamin.peterson

    BUILD FAILED: failed test

    Excerpt from the test logfile:
    1 test failed:
    test_posix

    ======================================================================
    ERROR: test_getcwd_long_pathnames (test.test_posix.PosixTester)
    ----------------------------------------------------------------------

    Traceback (most recent call last):
    File "/home2/buildbot/slave/3.x.loewis-sun/build/Lib/test/test_posix.py", line 249, in test_getcwd_long_pathnames
    support.rmtree(base_path)
    File "/home2/buildbot/slave/3.x.loewis-sun/build/Lib/test/support.py", line 102, in rmtree
    shutil.rmtree(path)
    File "/home2/buildbot/slave/3.x.loewis-sun/build/Lib/shutil.py", line 225, in rmtree
    onerror(os.rmdir, path, sys.exc_info())
    File "/home2/buildbot/slave/3.x.loewis-sun/build/Lib/shutil.py", line 223, in rmtree
    os.rmdir(path)
    OSError: [Errno 22] Invalid argument: '/home2/buildbot/slave/3.x.loewis-sun/build/@test.getcwd/@test.getcwd'

    sincerely,
    -The Buildbot
  • Buildbot at Apr 4, 2009 at 9:44 am
    The Buildbot has detected a new failure of sparc solaris10 gcc 3.x.
    Full details are available at:
    http://www.python.org/dev/buildbot/all/sparc%20solaris10%20gcc%203.x/builds/474

    Buildbot URL: http://www.python.org/dev/buildbot/all/

    Buildslave for this Build: loewis-sun

    Build Reason:
    Build Source Stamp: [branch branches/py3k] HEAD
    Blamelist: raymond.hettinger

    BUILD FAILED: failed test

    Excerpt from the test logfile:
    1 test failed:
    test_posix

    ======================================================================
    ERROR: test_getcwd_long_pathnames (test.test_posix.PosixTester)
    ----------------------------------------------------------------------

    Traceback (most recent call last):
    File "/home2/buildbot/slave/3.x.loewis-sun/build/Lib/test/test_posix.py", line 249, in test_getcwd_long_pathnames
    support.rmtree(base_path)
    File "/home2/buildbot/slave/3.x.loewis-sun/build/Lib/test/support.py", line 102, in rmtree
    shutil.rmtree(path)
    File "/home2/buildbot/slave/3.x.loewis-sun/build/Lib/shutil.py", line 225, in rmtree
    onerror(os.rmdir, path, sys.exc_info())
    File "/home2/buildbot/slave/3.x.loewis-sun/build/Lib/shutil.py", line 223, in rmtree
    os.rmdir(path)
    OSError: [Errno 22] Invalid argument: '/home2/buildbot/slave/3.x.loewis-sun/build/@test.getcwd/@test.getcwd'

    sincerely,
    -The Buildbot
  • Buildbot at Apr 4, 2009 at 2:43 pm
    The Buildbot has detected a new failure of sparc solaris10 gcc 3.x.
    Full details are available at:
    http://www.python.org/dev/buildbot/all/sparc%20solaris10%20gcc%203.x/builds/476

    Buildbot URL: http://www.python.org/dev/buildbot/all/

    Buildslave for this Build: loewis-sun

    Build Reason:
    Build Source Stamp: [branch branches/py3k] HEAD
    Blamelist: benjamin.peterson

    BUILD FAILED: failed test

    Excerpt from the test logfile:
    2 tests failed:
    test_importlib test_posix

    Traceback (most recent call last):
    File "./Lib/test/regrtest.py", line 620, in runtest_inner
    File "/home2/buildbot/slave/3.x.loewis-sun/build/Lib/test/test_importlib.py", line 6, in test_main
    run_unittest(importlib.test.test_suite('importlib.test'))
    File "/home2/buildbot/slave/3.x.loewis-sun/build/Lib/importlib/test/__init__.py", line 22, in test_suite
    package_tests = getattr(sys.modules[package_name], 'test_suite')()
    File "/home2/buildbot/slave/3.x.loewis-sun/build/Lib/importlib/test/source/__init__.py", line 8, in test_suite
    return importlib.test.test_suite('importlib.test.source', directory)
    File "/home2/buildbot/slave/3.x.loewis-sun/build/Lib/importlib/test/__init__.py", line 16, in test_suite
    __import__(module_name, level=0)
    File "/home2/buildbot/slave/3.x.loewis-sun/build/Lib/importlib/test/source/test_case_sensitivity.py", line 12, in <module>
    class CaseSensitivityTest(unittest.TestCase):
    File "/home2/buildbot/slave/3.x.loewis-sun/build/Lib/importlib/test/util.py", line 13, in case_insensitive_tests
    original_name = os.listdir('.')[0]
    IndexError: list index out of range

    ======================================================================
    ERROR: test_getcwd_long_pathnames (test.test_posix.PosixTester)
    ----------------------------------------------------------------------

    Traceback (most recent call last):
    File "/home2/buildbot/slave/3.x.loewis-sun/build/Lib/test/test_posix.py", line 249, in test_getcwd_long_pathnames
    support.rmtree(base_path)
    File "/home2/buildbot/slave/3.x.loewis-sun/build/Lib/test/support.py", line 102, in rmtree
    shutil.rmtree(path)
    File "/home2/buildbot/slave/3.x.loewis-sun/build/Lib/shutil.py", line 225, in rmtree
    onerror(os.rmdir, path, sys.exc_info())
    File "/home2/buildbot/slave/3.x.loewis-sun/build/Lib/shutil.py", line 223, in rmtree
    os.rmdir(path)
    OSError: [Errno 22] Invalid argument: '/home2/buildbot/slave/3.x.loewis-sun/build/@test.getcwd/@test.getcwd'

    sincerely,
    -The Buildbot
  • Buildbot at Apr 4, 2009 at 6:27 pm
    The Buildbot has detected a new failure of sparc solaris10 gcc 3.x.
    Full details are available at:
    http://www.python.org/dev/buildbot/all/sparc%20solaris10%20gcc%203.x/builds/478

    Buildbot URL: http://www.python.org/dev/buildbot/all/

    Buildslave for this Build: loewis-sun

    Build Reason:
    Build Source Stamp: [branch branches/py3k] HEAD
    Blamelist: benjamin.peterson,matthias.klose

    BUILD FAILED: failed test

    Excerpt from the test logfile:
    3 tests failed:
    test_collections test_importlib test_posix

    ======================================================================
    FAIL: test_equality (test.test_collections.TestOrderedDict)
    ----------------------------------------------------------------------

    Traceback (most recent call last):
    File "/home2/buildbot/slave/3.x.loewis-sun/build/Lib/test/test_collections.py", line 714, in test_equality
    self.assertNotEqual(od1, od2) # different order implies inequality
    AssertionError: OrderedDict([('d', 4), ('f', 6), ('c', 1), ('a', 3), ('e', 5), ('b', 2)]) == OrderedDict([('c', 1), ('a', 3), ('e', 5), ('b', 2), ('d', 4), ('f', 6)])

    Traceback (most recent call last):
    File "./Lib/test/regrtest.py", line 620, in runtest_inner
    File "/home2/buildbot/slave/3.x.loewis-sun/build/Lib/test/test_importlib.py", line 6, in test_main
    run_unittest(importlib.test.test_suite('importlib.test'))
    File "/home2/buildbot/slave/3.x.loewis-sun/build/Lib/importlib/test/__init__.py", line 22, in test_suite
    package_tests = getattr(sys.modules[package_name], 'test_suite')()
    File "/home2/buildbot/slave/3.x.loewis-sun/build/Lib/importlib/test/source/__init__.py", line 8, in test_suite
    return importlib.test.test_suite('importlib.test.source', directory)
    File "/home2/buildbot/slave/3.x.loewis-sun/build/Lib/importlib/test/__init__.py", line 16, in test_suite
    __import__(module_name, level=0)
    File "/home2/buildbot/slave/3.x.loewis-sun/build/Lib/importlib/test/source/test_case_sensitivity.py", line 12, in <module>
    class CaseSensitivityTest(unittest.TestCase):
    File "/home2/buildbot/slave/3.x.loewis-sun/build/Lib/importlib/test/util.py", line 13, in case_insensitive_tests
    original_name = os.listdir('.')[0]
    IndexError: list index out of range

    ======================================================================
    ERROR: test_getcwd_long_pathnames (test.test_posix.PosixTester)
    ----------------------------------------------------------------------

    Traceback (most recent call last):
    File "/home2/buildbot/slave/3.x.loewis-sun/build/Lib/test/test_posix.py", line 249, in test_getcwd_long_pathnames
    support.rmtree(base_path)
    File "/home2/buildbot/slave/3.x.loewis-sun/build/Lib/test/support.py", line 102, in rmtree
    shutil.rmtree(path)
    File "/home2/buildbot/slave/3.x.loewis-sun/build/Lib/shutil.py", line 225, in rmtree
    onerror(os.rmdir, path, sys.exc_info())
    File "/home2/buildbot/slave/3.x.loewis-sun/build/Lib/shutil.py", line 223, in rmtree
    os.rmdir(path)
    OSError: [Errno 22] Invalid argument: '/home2/buildbot/slave/3.x.loewis-sun/build/@test.getcwd/@test.getcwd'

    sincerely,
    -The Buildbot
  • Buildbot at Apr 4, 2009 at 10:57 pm
    The Buildbot has detected a new failure of sparc solaris10 gcc 3.x.
    Full details are available at:
    http://www.python.org/dev/buildbot/all/sparc%20solaris10%20gcc%203.x/builds/480

    Buildbot URL: http://www.python.org/dev/buildbot/all/

    Buildslave for this Build: loewis-sun

    Build Reason:
    Build Source Stamp: [branch branches/py3k] HEAD
    Blamelist: eric.smith,martin.v.loewis,michael.foord

    BUILD FAILED: failed test

    Excerpt from the test logfile:
    1 test failed:
    test_posix

    ======================================================================
    ERROR: test_getcwd_long_pathnames (test.test_posix.PosixTester)
    ----------------------------------------------------------------------

    Traceback (most recent call last):
    File "/home2/buildbot/slave/3.x.loewis-sun/build/Lib/test/test_posix.py", line 249, in test_getcwd_long_pathnames
    support.rmtree(base_path)
    File "/home2/buildbot/slave/3.x.loewis-sun/build/Lib/test/support.py", line 102, in rmtree
    shutil.rmtree(path)
    File "/home2/buildbot/slave/3.x.loewis-sun/build/Lib/shutil.py", line 225, in rmtree
    onerror(os.rmdir, path, sys.exc_info())
    File "/home2/buildbot/slave/3.x.loewis-sun/build/Lib/shutil.py", line 223, in rmtree
    os.rmdir(path)
    OSError: [Errno 22] Invalid argument: '/home2/buildbot/slave/3.x.loewis-sun/build/@test.getcwd/@test.getcwd'

    sincerely,
    -The Buildbot
  • Buildbot at Apr 5, 2009 at 12:17 am
    The Buildbot has detected a new failure of sparc solaris10 gcc 3.x.
    Full details are available at:
    http://www.python.org/dev/buildbot/all/sparc%20solaris10%20gcc%203.x/builds/482

    Buildbot URL: http://www.python.org/dev/buildbot/all/

    Buildslave for this Build: loewis-sun

    Build Reason:
    Build Source Stamp: [branch branches/py3k] HEAD
    Blamelist: benjamin.peterson

    BUILD FAILED: failed test

    Excerpt from the test logfile:
    3 tests failed:
    test_import test_posix test_smtplib

    ======================================================================
    ERROR: test_getcwd_long_pathnames (test.test_posix.PosixTester)
    ----------------------------------------------------------------------

    Traceback (most recent call last):
    File "/home2/buildbot/slave/3.x.loewis-sun/build/Lib/test/test_posix.py", line 249, in test_getcwd_long_pathnames
    support.rmtree(base_path)
    File "/home2/buildbot/slave/3.x.loewis-sun/build/Lib/test/support.py", line 102, in rmtree
    shutil.rmtree(path)
    File "/home2/buildbot/slave/3.x.loewis-sun/build/Lib/shutil.py", line 225, in rmtree
    onerror(os.rmdir, path, sys.exc_info())
    File "/home2/buildbot/slave/3.x.loewis-sun/build/Lib/shutil.py", line 223, in rmtree
    os.rmdir(path)
    OSError: [Errno 22] Invalid argument: '/home2/buildbot/slave/3.x.loewis-sun/build/@test.getcwd/@test.getcwd'

    sincerely,
    -The Buildbot
  • Buildbot at Apr 5, 2009 at 3:13 am
    The Buildbot has detected a new failure of sparc solaris10 gcc 3.x.
    Full details are available at:
    http://www.python.org/dev/buildbot/all/sparc%20solaris10%20gcc%203.x/builds/484

    Buildbot URL: http://www.python.org/dev/buildbot/all/

    Buildslave for this Build: loewis-sun

    Build Reason:
    Build Source Stamp: [branch branches/py3k] HEAD
    Blamelist: alexandre.vassalotti,benjamin.peterson

    BUILD FAILED: failed test

    Excerpt from the test logfile:
    1 test failed:
    test_posix

    ======================================================================
    ERROR: test_getcwd_long_pathnames (test.test_posix.PosixTester)
    ----------------------------------------------------------------------

    Traceback (most recent call last):
    File "/home2/buildbot/slave/3.x.loewis-sun/build/Lib/test/test_posix.py", line 249, in test_getcwd_long_pathnames
    support.rmtree(base_path)
    File "/home2/buildbot/slave/3.x.loewis-sun/build/Lib/test/support.py", line 102, in rmtree
    shutil.rmtree(path)
    File "/home2/buildbot/slave/3.x.loewis-sun/build/Lib/shutil.py", line 225, in rmtree
    onerror(os.rmdir, path, sys.exc_info())
    File "/home2/buildbot/slave/3.x.loewis-sun/build/Lib/shutil.py", line 223, in rmtree
    os.rmdir(path)
    OSError: [Errno 22] Invalid argument: '/home2/buildbot/slave/3.x.loewis-sun/build/@test.getcwd/@test.getcwd'

    sincerely,
    -The Buildbot
  • Buildbot at Apr 5, 2009 at 2:44 pm
    The Buildbot has detected a new failure of sparc solaris10 gcc 3.x.
    Full details are available at:
    http://www.python.org/dev/buildbot/all/sparc%20solaris10%20gcc%203.x/builds/486

    Buildbot URL: http://www.python.org/dev/buildbot/all/

    Buildslave for this Build: loewis-sun

    Build Reason:
    Build Source Stamp: [branch branches/py3k] HEAD
    Blamelist: georg.brandl

    BUILD FAILED: failed test

    Excerpt from the test logfile:
    1 test failed:
    test_posix

    ======================================================================
    ERROR: test_getcwd_long_pathnames (test.test_posix.PosixTester)
    ----------------------------------------------------------------------

    Traceback (most recent call last):
    File "/home2/buildbot/slave/3.x.loewis-sun/build/Lib/test/test_posix.py", line 249, in test_getcwd_long_pathnames
    support.rmtree(base_path)
    File "/home2/buildbot/slave/3.x.loewis-sun/build/Lib/test/support.py", line 102, in rmtree
    shutil.rmtree(path)
    File "/home2/buildbot/slave/3.x.loewis-sun/build/Lib/shutil.py", line 225, in rmtree
    onerror(os.rmdir, path, sys.exc_info())
    File "/home2/buildbot/slave/3.x.loewis-sun/build/Lib/shutil.py", line 223, in rmtree
    os.rmdir(path)
    OSError: [Errno 22] Invalid argument: '/home2/buildbot/slave/3.x.loewis-sun/build/@test.getcwd/@test.getcwd'

    sincerely,
    -The Buildbot
  • Buildbot at Apr 5, 2009 at 6:29 pm
    The Buildbot has detected a new failure of sparc solaris10 gcc 3.x.
    Full details are available at:
    http://www.python.org/dev/buildbot/all/sparc%20solaris10%20gcc%203.x/builds/488

    Buildbot URL: http://www.python.org/dev/buildbot/all/

    Buildslave for this Build: loewis-sun

    Build Reason:
    Build Source Stamp: [branch branches/py3k] HEAD
    Blamelist: georg.brandl

    BUILD FAILED: failed test

    Excerpt from the test logfile:
    1 test failed:
    test_posix

    ======================================================================
    ERROR: test_getcwd_long_pathnames (test.test_posix.PosixTester)
    ----------------------------------------------------------------------

    Traceback (most recent call last):
    File "/home2/buildbot/slave/3.x.loewis-sun/build/Lib/test/test_posix.py", line 249, in test_getcwd_long_pathnames
    support.rmtree(base_path)
    File "/home2/buildbot/slave/3.x.loewis-sun/build/Lib/test/support.py", line 102, in rmtree
    shutil.rmtree(path)
    File "/home2/buildbot/slave/3.x.loewis-sun/build/Lib/shutil.py", line 225, in rmtree
    onerror(os.rmdir, path, sys.exc_info())
    File "/home2/buildbot/slave/3.x.loewis-sun/build/Lib/shutil.py", line 223, in rmtree
    os.rmdir(path)
    OSError: [Errno 22] Invalid argument: '/home2/buildbot/slave/3.x.loewis-sun/build/@test.getcwd/@test.getcwd'

    sincerely,
    -The Buildbot
  • Buildbot at Apr 6, 2009 at 4:57 am
    The Buildbot has detected a new failure of sparc solaris10 gcc 3.x.
    Full details are available at:
    http://www.python.org/dev/buildbot/all/sparc%20solaris10%20gcc%203.x/builds/492

    Buildbot URL: http://www.python.org/dev/buildbot/all/

    Buildslave for this Build: loewis-sun

    Build Reason:
    Build Source Stamp: [branch branches/py3k] HEAD
    Blamelist: georg.brandl,tarek.ziade

    BUILD FAILED: failed test

    Excerpt from the test logfile:
    1 test failed:
    test_posix

    ======================================================================
    ERROR: test_getcwd_long_pathnames (test.test_posix.PosixTester)
    ----------------------------------------------------------------------

    Traceback (most recent call last):
    File "/home2/buildbot/slave/3.x.loewis-sun/build/Lib/test/test_posix.py", line 249, in test_getcwd_long_pathnames
    support.rmtree(base_path)
    File "/home2/buildbot/slave/3.x.loewis-sun/build/Lib/test/support.py", line 102, in rmtree
    shutil.rmtree(path)
    File "/home2/buildbot/slave/3.x.loewis-sun/build/Lib/shutil.py", line 225, in rmtree
    onerror(os.rmdir, path, sys.exc_info())
    File "/home2/buildbot/slave/3.x.loewis-sun/build/Lib/shutil.py", line 223, in rmtree
    os.rmdir(path)
    OSError: [Errno 22] Invalid argument: '/home2/buildbot/slave/3.x.loewis-sun/build/@test.getcwd/@test.getcwd'

    sincerely,
    -The Buildbot
  • Buildbot at Apr 7, 2009 at 12:38 pm
    The Buildbot has detected a new failure of sparc solaris10 gcc 3.x.
    Full details are available at:
    http://www.python.org/dev/buildbot/all/sparc%20solaris10%20gcc%203.x/builds/496

    Buildbot URL: http://www.python.org/dev/buildbot/all/

    Buildslave for this Build: loewis-sun

    Build Reason:
    Build Source Stamp: [branch branches/py3k] HEAD
    Blamelist: mark.dickinson,raymond.hettinger

    BUILD FAILED: failed test

    Excerpt from the test logfile:
    1 test failed:
    test_posix

    ======================================================================
    ERROR: test_getcwd_long_pathnames (test.test_posix.PosixTester)
    ----------------------------------------------------------------------

    Traceback (most recent call last):
    File "/home2/buildbot/slave/3.x.loewis-sun/build/Lib/test/test_posix.py", line 249, in test_getcwd_long_pathnames
    support.rmtree(base_path)
    File "/home2/buildbot/slave/3.x.loewis-sun/build/Lib/test/support.py", line 102, in rmtree
    shutil.rmtree(path)
    File "/home2/buildbot/slave/3.x.loewis-sun/build/Lib/shutil.py", line 225, in rmtree
    onerror(os.rmdir, path, sys.exc_info())
    File "/home2/buildbot/slave/3.x.loewis-sun/build/Lib/shutil.py", line 223, in rmtree
    os.rmdir(path)
    OSError: [Errno 22] Invalid argument: '/home2/buildbot/slave/3.x.loewis-sun/build/@test.getcwd/@test.getcwd'

    sincerely,
    -The Buildbot
  • Buildbot at Apr 7, 2009 at 2:00 pm
    The Buildbot has detected a new failure of sparc solaris10 gcc 3.x.
    Full details are available at:
    http://www.python.org/dev/buildbot/all/sparc%20solaris10%20gcc%203.x/builds/498

    Buildbot URL: http://www.python.org/dev/buildbot/all/

    Buildslave for this Build: loewis-sun

    Build Reason:
    Build Source Stamp: [branch branches/py3k] HEAD
    Blamelist: matthias.klose

    BUILD FAILED: failed compile

    sincerely,
    -The Buildbot
  • Buildbot at Apr 8, 2009 at 12:56 am
    The Buildbot has detected a new failure of sparc solaris10 gcc 3.x.
    Full details are available at:
    http://www.python.org/dev/buildbot/all/sparc%20solaris10%20gcc%203.x/builds/501

    Buildbot URL: http://www.python.org/dev/buildbot/all/

    Buildslave for this Build: loewis-sun

    Build Reason:
    Build Source Stamp: [branch branches/py3k] HEAD
    Blamelist: benjamin.peterson,georg.brandl,raymond.hettinger

    BUILD FAILED: failed test

    Excerpt from the test logfile:
    2 tests failed:
    test_importlib test_posix

    Traceback (most recent call last):
    File "./Lib/test/regrtest.py", line 620, in runtest_inner
    File "/home2/buildbot/slave/3.x.loewis-sun/build/Lib/test/test_importlib.py", line 6, in test_main
    run_unittest(importlib.test.test_suite('importlib.test'))
    File "/home2/buildbot/slave/3.x.loewis-sun/build/Lib/importlib/test/__init__.py", line 22, in test_suite
    package_tests = getattr(sys.modules[package_name], 'test_suite')()
    File "/home2/buildbot/slave/3.x.loewis-sun/build/Lib/importlib/test/source/__init__.py", line 8, in test_suite
    return importlib.test.test_suite('importlib.test.source', directory)
    File "/home2/buildbot/slave/3.x.loewis-sun/build/Lib/importlib/test/__init__.py", line 16, in test_suite
    __import__(module_name, level=0)
    File "/home2/buildbot/slave/3.x.loewis-sun/build/Lib/importlib/test/source/test_case_sensitivity.py", line 12, in <module>
    class CaseSensitivityTest(unittest.TestCase):
    File "/home2/buildbot/slave/3.x.loewis-sun/build/Lib/importlib/test/util.py", line 13, in case_insensitive_tests
    original_name = os.listdir('.')[0]
    IndexError: list index out of range

    ======================================================================
    ERROR: test_getcwd_long_pathnames (test.test_posix.PosixTester)
    ----------------------------------------------------------------------

    Traceback (most recent call last):
    File "/home2/buildbot/slave/3.x.loewis-sun/build/Lib/test/test_posix.py", line 249, in test_getcwd_long_pathnames
    support.rmtree(base_path)
    File "/home2/buildbot/slave/3.x.loewis-sun/build/Lib/test/support.py", line 102, in rmtree
    shutil.rmtree(path)
    File "/home2/buildbot/slave/3.x.loewis-sun/build/Lib/shutil.py", line 225, in rmtree
    onerror(os.rmdir, path, sys.exc_info())
    File "/home2/buildbot/slave/3.x.loewis-sun/build/Lib/shutil.py", line 223, in rmtree
    os.rmdir(path)
    OSError: [Errno 22] Invalid argument: '/home2/buildbot/slave/3.x.loewis-sun/build/@test.getcwd/@test.getcwd'

    sincerely,
    -The Buildbot
  • Buildbot at Apr 8, 2009 at 3:06 am
    The Buildbot has detected a new failure of sparc solaris10 gcc 3.x.
    Full details are available at:
    http://www.python.org/dev/buildbot/all/sparc%20solaris10%20gcc%203.x/builds/503

    Buildbot URL: http://www.python.org/dev/buildbot/all/

    Buildslave for this Build: loewis-sun

    Build Reason:
    Build Source Stamp: [branch branches/py3k] HEAD
    Blamelist: raymond.hettinger

    BUILD FAILED: failed test

    Excerpt from the test logfile:
    1 test failed:
    test_posix

    ======================================================================
    ERROR: test_getcwd_long_pathnames (test.test_posix.PosixTester)
    ----------------------------------------------------------------------

    Traceback (most recent call last):
    File "/home2/buildbot/slave/3.x.loewis-sun/build/Lib/test/test_posix.py", line 249, in test_getcwd_long_pathnames
    support.rmtree(base_path)
    File "/home2/buildbot/slave/3.x.loewis-sun/build/Lib/test/support.py", line 102, in rmtree
    shutil.rmtree(path)
    File "/home2/buildbot/slave/3.x.loewis-sun/build/Lib/shutil.py", line 225, in rmtree
    onerror(os.rmdir, path, sys.exc_info())
    File "/home2/buildbot/slave/3.x.loewis-sun/build/Lib/shutil.py", line 223, in rmtree
    os.rmdir(path)
    OSError: [Errno 22] Invalid argument: '/home2/buildbot/slave/3.x.loewis-sun/build/@test.getcwd/@test.getcwd'

    sincerely,
    -The Buildbot
  • Buildbot at Apr 8, 2009 at 10:26 pm
    The Buildbot has detected a new failure of sparc solaris10 gcc 3.x.
    Full details are available at:
    http://www.python.org/dev/buildbot/all/sparc%20solaris10%20gcc%203.x/builds/505

    Buildbot URL: http://www.python.org/dev/buildbot/all/

    Buildslave for this Build: loewis-sun

    Build Reason:
    Build Source Stamp: [branch branches/py3k] HEAD
    Blamelist: benjamin.peterson,raymond.hettinger

    BUILD FAILED: failed test

    Excerpt from the test logfile:
    2 tests failed:
    test_importlib test_posix

    Traceback (most recent call last):
    File "./Lib/test/regrtest.py", line 620, in runtest_inner
    File "/home2/buildbot/slave/3.x.loewis-sun/build/Lib/test/test_importlib.py", line 6, in test_main
    run_unittest(importlib.test.test_suite('importlib.test'))
    File "/home2/buildbot/slave/3.x.loewis-sun/build/Lib/importlib/test/__init__.py", line 22, in test_suite
    package_tests = getattr(sys.modules[package_name], 'test_suite')()
    File "/home2/buildbot/slave/3.x.loewis-sun/build/Lib/importlib/test/source/__init__.py", line 8, in test_suite
    return importlib.test.test_suite('importlib.test.source', directory)
    File "/home2/buildbot/slave/3.x.loewis-sun/build/Lib/importlib/test/__init__.py", line 16, in test_suite
    __import__(module_name, level=0)
    File "/home2/buildbot/slave/3.x.loewis-sun/build/Lib/importlib/test/source/test_case_sensitivity.py", line 12, in <module>
    class CaseSensitivityTest(unittest.TestCase):
    File "/home2/buildbot/slave/3.x.loewis-sun/build/Lib/importlib/test/util.py", line 13, in case_insensitive_tests
    original_name = os.listdir('.')[0]
    IndexError: list index out of range

    ======================================================================
    ERROR: test_getcwd_long_pathnames (test.test_posix.PosixTester)
    ----------------------------------------------------------------------

    Traceback (most recent call last):
    File "/home2/buildbot/slave/3.x.loewis-sun/build/Lib/test/test_posix.py", line 249, in test_getcwd_long_pathnames
    support.rmtree(base_path)
    File "/home2/buildbot/slave/3.x.loewis-sun/build/Lib/test/support.py", line 102, in rmtree
    shutil.rmtree(path)
    File "/home2/buildbot/slave/3.x.loewis-sun/build/Lib/shutil.py", line 225, in rmtree
    onerror(os.rmdir, path, sys.exc_info())
    File "/home2/buildbot/slave/3.x.loewis-sun/build/Lib/shutil.py", line 223, in rmtree
    os.rmdir(path)
    OSError: [Errno 22] Invalid argument: '/home2/buildbot/slave/3.x.loewis-sun/build/@test.getcwd/@test.getcwd'

    sincerely,
    -The Buildbot
  • Buildbot at Apr 10, 2009 at 2:35 am
    The Buildbot has detected a new failure of sparc solaris10 gcc 3.x.
    Full details are available at:
    http://www.python.org/dev/buildbot/all/sparc%20solaris10%20gcc%203.x/builds/507

    Buildbot URL: http://www.python.org/dev/buildbot/all/

    Buildslave for this Build: loewis-sun

    Build Reason:
    Build Source Stamp: [branch branches/py3k] HEAD
    Blamelist: r.david.murray

    BUILD FAILED: failed test

    Excerpt from the test logfile:
    1 test failed:
    test_posix

    ======================================================================
    ERROR: test_getcwd_long_pathnames (test.test_posix.PosixTester)
    ----------------------------------------------------------------------

    Traceback (most recent call last):
    File "/home2/buildbot/slave/3.x.loewis-sun/build/Lib/test/test_posix.py", line 249, in test_getcwd_long_pathnames
    support.rmtree(base_path)
    File "/home2/buildbot/slave/3.x.loewis-sun/build/Lib/test/support.py", line 102, in rmtree
    shutil.rmtree(path)
    File "/home2/buildbot/slave/3.x.loewis-sun/build/Lib/shutil.py", line 225, in rmtree
    onerror(os.rmdir, path, sys.exc_info())
    File "/home2/buildbot/slave/3.x.loewis-sun/build/Lib/shutil.py", line 223, in rmtree
    os.rmdir(path)
    OSError: [Errno 22] Invalid argument: '/home2/buildbot/slave/3.x.loewis-sun/build/@test.getcwd/@test.getcwd'

    sincerely,
    -The Buildbot
  • Buildbot at Apr 10, 2009 at 7:49 am
    The Buildbot has detected a new failure of sparc solaris10 gcc 3.x.
    Full details are available at:
    http://www.python.org/dev/buildbot/all/sparc%20solaris10%20gcc%203.x/builds/509

    Buildbot URL: http://www.python.org/dev/buildbot/all/

    Buildslave for this Build: loewis-sun

    Build Reason:
    Build Source Stamp: [branch branches/py3k] HEAD
    Blamelist: georg.brandl

    BUILD FAILED: failed test

    Excerpt from the test logfile:
    2 tests failed:
    test_posix test_smtplib

    ======================================================================
    ERROR: test_getcwd_long_pathnames (test.test_posix.PosixTester)
    ----------------------------------------------------------------------

    Traceback (most recent call last):
    File "/home2/buildbot/slave/3.x.loewis-sun/build/Lib/test/test_posix.py", line 249, in test_getcwd_long_pathnames
    support.rmtree(base_path)
    File "/home2/buildbot/slave/3.x.loewis-sun/build/Lib/test/support.py", line 102, in rmtree
    shutil.rmtree(path)
    File "/home2/buildbot/slave/3.x.loewis-sun/build/Lib/shutil.py", line 225, in rmtree
    onerror(os.rmdir, path, sys.exc_info())
    File "/home2/buildbot/slave/3.x.loewis-sun/build/Lib/shutil.py", line 223, in rmtree
    os.rmdir(path)
    OSError: [Errno 22] Invalid argument: '/home2/buildbot/slave/3.x.loewis-sun/build/@test.getcwd/@test.getcwd'

    sincerely,
    -The Buildbot
  • Buildbot at Apr 10, 2009 at 11:51 am
    The Buildbot has detected a new failure of sparc solaris10 gcc 3.x.
    Full details are available at:
    http://www.python.org/dev/buildbot/all/sparc%20solaris10%20gcc%203.x/builds/511

    Buildbot URL: http://www.python.org/dev/buildbot/all/

    Buildslave for this Build: loewis-sun

    Build Reason:
    Build Source Stamp: [branch branches/py3k] HEAD
    Blamelist: georg.brandl

    BUILD FAILED: failed test

    Excerpt from the test logfile:
    1 test failed:
    test_posix

    ======================================================================
    ERROR: test_getcwd_long_pathnames (test.test_posix.PosixTester)
    ----------------------------------------------------------------------

    Traceback (most recent call last):
    File "/home2/buildbot/slave/3.x.loewis-sun/build/Lib/test/test_posix.py", line 249, in test_getcwd_long_pathnames
    support.rmtree(base_path)
    File "/home2/buildbot/slave/3.x.loewis-sun/build/Lib/test/support.py", line 102, in rmtree
    shutil.rmtree(path)
    File "/home2/buildbot/slave/3.x.loewis-sun/build/Lib/shutil.py", line 225, in rmtree
    onerror(os.rmdir, path, sys.exc_info())
    File "/home2/buildbot/slave/3.x.loewis-sun/build/Lib/shutil.py", line 223, in rmtree
    os.rmdir(path)
    OSError: [Errno 22] Invalid argument: '/home2/buildbot/slave/3.x.loewis-sun/build/@test.getcwd/@test.getcwd'

    sincerely,
    -The Buildbot
  • Buildbot at Apr 11, 2009 at 4:02 pm
    The Buildbot has detected a new failure of sparc solaris10 gcc 3.x.
    Full details are available at:
    http://www.python.org/dev/buildbot/all/sparc%20solaris10%20gcc%203.x/builds/513

    Buildbot URL: http://www.python.org/dev/buildbot/all/

    Buildslave for this Build: loewis-sun

    Build Reason:
    Build Source Stamp: [branch branches/py3k] HEAD
    Blamelist: nick.coghlan,tarek.ziade

    BUILD FAILED: failed test

    Excerpt from the test logfile:
    2 tests failed:
    test_importlib test_posix

    Traceback (most recent call last):
    File "./Lib/test/regrtest.py", line 620, in runtest_inner
    File "/home2/buildbot/slave/3.x.loewis-sun/build/Lib/test/test_importlib.py", line 6, in test_main
    run_unittest(importlib.test.test_suite('importlib.test'))
    File "/home2/buildbot/slave/3.x.loewis-sun/build/Lib/importlib/test/__init__.py", line 22, in test_suite
    package_tests = getattr(sys.modules[package_name], 'test_suite')()
    File "/home2/buildbot/slave/3.x.loewis-sun/build/Lib/importlib/test/source/__init__.py", line 8, in test_suite
    return importlib.test.test_suite('importlib.test.source', directory)
    File "/home2/buildbot/slave/3.x.loewis-sun/build/Lib/importlib/test/__init__.py", line 16, in test_suite
    __import__(module_name, level=0)
    File "/home2/buildbot/slave/3.x.loewis-sun/build/Lib/importlib/test/source/test_case_sensitivity.py", line 12, in <module>
    class CaseSensitivityTest(unittest.TestCase):
    File "/home2/buildbot/slave/3.x.loewis-sun/build/Lib/importlib/test/util.py", line 13, in case_insensitive_tests
    original_name = os.listdir('.')[0]
    IndexError: list index out of range

    ======================================================================
    ERROR: test_getcwd_long_pathnames (test.test_posix.PosixTester)
    ----------------------------------------------------------------------

    Traceback (most recent call last):
    File "/home2/buildbot/slave/3.x.loewis-sun/build/Lib/test/test_posix.py", line 249, in test_getcwd_long_pathnames
    support.rmtree(base_path)
    File "/home2/buildbot/slave/3.x.loewis-sun/build/Lib/test/support.py", line 143, in rmtree
    shutil.rmtree(path)
    File "/home2/buildbot/slave/3.x.loewis-sun/build/Lib/shutil.py", line 225, in rmtree
    onerror(os.rmdir, path, sys.exc_info())
    File "/home2/buildbot/slave/3.x.loewis-sun/build/Lib/shutil.py", line 223, in rmtree
    os.rmdir(path)
    OSError: [Errno 22] Invalid argument: '/home2/buildbot/slave/3.x.loewis-sun/build/@test.getcwd/@test.getcwd'

    sincerely,
    -The Buildbot
  • Buildbot at Apr 11, 2009 at 9:46 pm
    The Buildbot has detected a new failure of sparc solaris10 gcc 3.x.
    Full details are available at:
    http://www.python.org/dev/buildbot/all/sparc%20solaris10%20gcc%203.x/builds/515

    Buildbot URL: http://www.python.org/dev/buildbot/all/

    Buildslave for this Build: loewis-sun

    Build Reason:
    Build Source Stamp: [branch branches/py3k] HEAD
    Blamelist: benjamin.peterson,georg.brandl

    BUILD FAILED: failed test

    Excerpt from the test logfile:
    1 test failed:
    test_posix

    ======================================================================
    ERROR: test_getcwd_long_pathnames (test.test_posix.PosixTester)
    ----------------------------------------------------------------------

    Traceback (most recent call last):
    File "/home2/buildbot/slave/3.x.loewis-sun/build/Lib/test/test_posix.py", line 249, in test_getcwd_long_pathnames
    support.rmtree(base_path)
    File "/home2/buildbot/slave/3.x.loewis-sun/build/Lib/test/support.py", line 143, in rmtree
    shutil.rmtree(path)
    File "/home2/buildbot/slave/3.x.loewis-sun/build/Lib/shutil.py", line 225, in rmtree
    onerror(os.rmdir, path, sys.exc_info())
    File "/home2/buildbot/slave/3.x.loewis-sun/build/Lib/shutil.py", line 223, in rmtree
    os.rmdir(path)
    OSError: [Errno 22] Invalid argument: '/home2/buildbot/slave/3.x.loewis-sun/build/@test.getcwd/@test.getcwd'

    sincerely,
    -The Buildbot
  • Buildbot at Apr 13, 2009 at 5:48 am
    The Buildbot has detected a new failure of sparc solaris10 gcc 3.x.
    Full details are available at:
    http://www.python.org/dev/buildbot/all/sparc%20solaris10%20gcc%203.x/builds/523

    Buildbot URL: http://www.python.org/dev/buildbot/all/

    Buildslave for this Build: loewis-sun

    Build Reason:
    Build Source Stamp: [branch branches/py3k] HEAD
    Blamelist: r.david.murray

    BUILD FAILED: failed test

    Excerpt from the test logfile:
    2 tests failed:
    test_posix test_posixpath

    ======================================================================
    ERROR: test_getcwd_long_pathnames (test.test_posix.PosixTester)
    ----------------------------------------------------------------------

    Traceback (most recent call last):
    File "/home2/buildbot/slave/3.x.loewis-sun/build/Lib/test/test_posix.py", line 249, in test_getcwd_long_pathnames
    support.rmtree(base_path)
    File "/home2/buildbot/slave/3.x.loewis-sun/build/Lib/test/support.py", line 143, in rmtree
    shutil.rmtree(path)
    File "/home2/buildbot/slave/3.x.loewis-sun/build/Lib/shutil.py", line 225, in rmtree
    onerror(os.rmdir, path, sys.exc_info())
    File "/home2/buildbot/slave/3.x.loewis-sun/build/Lib/shutil.py", line 223, in rmtree
    os.rmdir(path)
    OSError: [Errno 22] Invalid argument: '/home2/buildbot/slave/3.x.loewis-sun/build/@test.getcwd/@test.getcwd'

    ======================================================================
    ERROR: test_realpath_basic (test.test_posixpath.PosixPathTest)
    ----------------------------------------------------------------------

    Traceback (most recent call last):
    File "/home2/buildbot/slave/3.x.loewis-sun/build/Lib/test/test_posixpath.py", line 504, in test_realpath_basic
    os.symlink(ABSTFN+"1", ABSTFN)
    OSError: [Errno 17] File exists

    sincerely,
    -The Buildbot
  • Buildbot at Apr 22, 2009 at 2:27 am
    The Buildbot has detected a new failure of sparc solaris10 gcc 3.x.
    Full details are available at:
    http://www.python.org/dev/buildbot/all/sparc%20solaris10%20gcc%203.x/builds/560

    Buildbot URL: http://www.python.org/dev/buildbot/all/

    Buildslave for this Build: loewis-sun

    Build Reason:
    Build Source Stamp: [branch branches/py3k] HEAD
    Blamelist: eric.smith

    BUILD FAILED: failed test

    Excerpt from the test logfile:
    2 tests failed:
    test_posix test_posixpath

    ======================================================================
    ERROR: test_getcwd_long_pathnames (test.test_posix.PosixTester)
    ----------------------------------------------------------------------

    Traceback (most recent call last):
    File "/home2/buildbot/slave/3.x.loewis-sun/build/Lib/test/test_posix.py", line 249, in test_getcwd_long_pathnames
    support.rmtree(base_path)
    File "/home2/buildbot/slave/3.x.loewis-sun/build/Lib/test/support.py", line 143, in rmtree
    shutil.rmtree(path)
    File "/home2/buildbot/slave/3.x.loewis-sun/build/Lib/shutil.py", line 225, in rmtree
    onerror(os.rmdir, path, sys.exc_info())
    File "/home2/buildbot/slave/3.x.loewis-sun/build/Lib/shutil.py", line 223, in rmtree
    os.rmdir(path)
    OSError: [Errno 22] Invalid argument: '/home2/buildbot/slave/3.x.loewis-sun/build/@test.getcwd/@test.getcwd'

    ======================================================================
    ERROR: test_realpath_basic (test.test_posixpath.PosixPathTest)
    ----------------------------------------------------------------------

    Traceback (most recent call last):
    File "/home2/buildbot/slave/3.x.loewis-sun/build/Lib/test/test_posixpath.py", line 504, in test_realpath_basic
    os.symlink(ABSTFN+"1", ABSTFN)
    OSError: [Errno 17] File exists

    sincerely,
    -The Buildbot
  • Buildbot at Apr 25, 2009 at 7:19 pm
    The Buildbot has detected a new failure of sparc solaris10 gcc 3.x.
    Full details are available at:
    http://www.python.org/dev/buildbot/all/sparc%20solaris10%20gcc%203.x/builds/574

    Buildbot URL: http://www.python.org/dev/buildbot/all/

    Buildslave for this Build: loewis-sun

    Build Reason:
    Build Source Stamp: [branch branches/py3k] HEAD
    Blamelist: tarek.ziade,walter.doerwald

    BUILD FAILED: failed test

    Excerpt from the test logfile:
    3 tests failed:
    test_os test_posix test_posixpath

    ======================================================================
    ERROR: test_getcwd_long_pathnames (test.test_posix.PosixTester)
    ----------------------------------------------------------------------

    Traceback (most recent call last):
    File "/home2/buildbot/slave/3.x.loewis-sun/build/Lib/test/test_posix.py", line 251, in test_getcwd_long_pathnames
    support.rmtree(base_path)
    File "/home2/buildbot/slave/3.x.loewis-sun/build/Lib/test/support.py", line 177, in rmtree
    shutil.rmtree(path)
    File "/home2/buildbot/slave/3.x.loewis-sun/build/Lib/shutil.py", line 225, in rmtree
    onerror(os.rmdir, path, sys.exc_info())
    File "/home2/buildbot/slave/3.x.loewis-sun/build/Lib/shutil.py", line 223, in rmtree
    os.rmdir(path)
    OSError: [Errno 22] Invalid argument: '/home2/buildbot/slave/3.x.loewis-sun/build/@test.getcwd/@test.getcwd'

    ======================================================================
    ERROR: test_expanduser (test.test_posixpath.PosixPathTest)
    ----------------------------------------------------------------------

    Traceback (most recent call last):
    File "/home2/buildbot/slave/3.x.loewis-sun/build/Lib/test/test_posixpath.py", line 422, in test_expanduser
    orig_home = os.environ['HOME']
    File "/home2/buildbot/slave/3.x.loewis-sun/build/Lib/os.py", line 391, in __getitem__
    return self.data[self.keymap(key)]
    KeyError: 'HOME'

    ======================================================================
    ERROR: test_realpath_basic (test.test_posixpath.PosixPathTest)
    ----------------------------------------------------------------------

    Traceback (most recent call last):
    File "/home2/buildbot/slave/3.x.loewis-sun/build/Lib/test/test_posixpath.py", line 504, in test_realpath_basic
    os.symlink(ABSTFN+"1", ABSTFN)
    OSError: [Errno 17] File exists

    sincerely,
    -The Buildbot
  • Buildbot at Apr 27, 2009 at 7:05 am
    The Buildbot has detected a new failure of sparc solaris10 gcc 3.x.
    Full details are available at:
    http://www.python.org/dev/buildbot/all/sparc%20solaris10%20gcc%203.x/builds/584

    Buildbot URL: http://www.python.org/dev/buildbot/all/

    Buildslave for this Build: loewis-sun

    Build Reason:
    Build Source Stamp: [branch branches/py3k] HEAD
    Blamelist: jeroen.ruigrok

    BUILD FAILED: failed test

    Excerpt from the test logfile:
    2 tests failed:
    test_importlib test_posix

    Traceback (most recent call last):
    File "./Lib/test/regrtest.py", line 620, in runtest_inner
    File "/home2/buildbot/slave/3.x.loewis-sun/build/Lib/test/test_importlib.py", line 6, in test_main
    run_unittest(importlib.test.test_suite('importlib.test'))
    File "/home2/buildbot/slave/3.x.loewis-sun/build/Lib/importlib/test/__init__.py", line 22, in test_suite
    package_tests = getattr(sys.modules[package_name], 'test_suite')()
    File "/home2/buildbot/slave/3.x.loewis-sun/build/Lib/importlib/test/source/__init__.py", line 8, in test_suite
    return importlib.test.test_suite('importlib.test.source', directory)
    File "/home2/buildbot/slave/3.x.loewis-sun/build/Lib/importlib/test/__init__.py", line 16, in test_suite
    __import__(module_name, level=0)
    File "/home2/buildbot/slave/3.x.loewis-sun/build/Lib/importlib/test/source/test_case_sensitivity.py", line 12, in <module>
    class CaseSensitivityTest(unittest.TestCase):
    File "/home2/buildbot/slave/3.x.loewis-sun/build/Lib/importlib/test/util.py", line 13, in case_insensitive_tests
    original_name = os.listdir('.')[0]
    IndexError: list index out of range

    ======================================================================
    ERROR: test_getcwd_long_pathnames (test.test_posix.PosixTester)
    ----------------------------------------------------------------------

    Traceback (most recent call last):
    File "/home2/buildbot/slave/3.x.loewis-sun/build/Lib/test/test_posix.py", line 251, in test_getcwd_long_pathnames
    support.rmtree(base_path)
    File "/home2/buildbot/slave/3.x.loewis-sun/build/Lib/test/support.py", line 177, in rmtree
    shutil.rmtree(path)
    File "/home2/buildbot/slave/3.x.loewis-sun/build/Lib/shutil.py", line 225, in rmtree
    onerror(os.rmdir, path, sys.exc_info())
    File "/home2/buildbot/slave/3.x.loewis-sun/build/Lib/shutil.py", line 223, in rmtree
    os.rmdir(path)
    OSError: [Errno 22] Invalid argument: '/home2/buildbot/slave/3.x.loewis-sun/build/@test.getcwd/@test.getcwd'

    sincerely,
    -The Buildbot
  • Buildbot at Apr 27, 2009 at 5:43 pm
    The Buildbot has detected a new failure of sparc solaris10 gcc 3.x.
    Full details are available at:
    http://www.python.org/dev/buildbot/all/sparc%20solaris10%20gcc%203.x/builds/588

    Buildbot URL: http://www.python.org/dev/buildbot/all/

    Buildslave for this Build: loewis-sun

    Build Reason:
    Build Source Stamp: [branch branches/py3k] HEAD
    Blamelist: georg.brandl

    BUILD FAILED: failed test

    Excerpt from the test logfile:
    4 tests failed:
    test_importlib test_os test_posix test_time

    Traceback (most recent call last):
    File "./Lib/test/regrtest.py", line 620, in runtest_inner
    File "/home2/buildbot/slave/3.x.loewis-sun/build/Lib/test/test_importlib.py", line 6, in test_main
    run_unittest(importlib.test.test_suite('importlib.test'))
    File "/home2/buildbot/slave/3.x.loewis-sun/build/Lib/importlib/test/__init__.py", line 22, in test_suite
    package_tests = getattr(sys.modules[package_name], 'test_suite')()
    File "/home2/buildbot/slave/3.x.loewis-sun/build/Lib/importlib/test/source/__init__.py", line 8, in test_suite
    return importlib.test.test_suite('importlib.test.source', directory)
    File "/home2/buildbot/slave/3.x.loewis-sun/build/Lib/importlib/test/__init__.py", line 16, in test_suite
    __import__(module_name, level=0)
    File "/home2/buildbot/slave/3.x.loewis-sun/build/Lib/importlib/test/source/test_case_sensitivity.py", line 12, in <module>
    class CaseSensitivityTest(unittest.TestCase):
    File "/home2/buildbot/slave/3.x.loewis-sun/build/Lib/importlib/test/util.py", line 13, in case_insensitive_tests
    original_name = os.listdir('.')[0]
    IndexError: list index out of range

    =====================================================================FAIL: test_update2 (test.test_os.EnvironTests)
    ----------------------------------------------------------------------

    Traceback (most recent call last):
    File "/home2/buildbot/slave/3.x.loewis-sun/build/Lib/test/test_os.py", line 382, in test_update2
    self.assertEquals(value, "World")
    AssertionError: '' != 'World'

    =====================================================================ERROR: test_getcwd_long_pathnames (test.test_posix.PosixTester)
    ----------------------------------------------------------------------

    Traceback (most recent call last):
    File "/home2/buildbot/slave/3.x.loewis-sun/build/Lib/test/test_posix.py", line 251, in test_getcwd_long_pathnames
    support.rmtree(base_path)
    File "/home2/buildbot/slave/3.x.loewis-sun/build/Lib/test/support.py", line 177, in rmtree
    shutil.rmtree(path)
    File "/home2/buildbot/slave/3.x.loewis-sun/build/Lib/shutil.py", line 225, in rmtree
    onerror(os.rmdir, path, sys.exc_info())
    File "/home2/buildbot/slave/3.x.loewis-sun/build/Lib/shutil.py", line 223, in rmtree
    os.rmdir(path)
    OSError: [Errno 22] Invalid argument: '/home2/buildbot/slave/3.x.loewis-sun/build/@test.getcwd/@test.getcwd'

    =====================================================================FAIL: test_tzset (test.test_time.TimeTestCase)
    ----------------------------------------------------------------------

    Traceback (most recent call last):
    File "/home2/buildbot/slave/3.x.loewis-sun/build/Lib/test/test_time.py", line 157, in test_tzset
    time.gmtime(xmas2002), time.localtime(xmas2002)
    AssertionError: time.struct_time(tm_year 02, tm_mon, tm_mday%, tm_hour=0, tm_min=0, tm_sec=0, tm_wday=2, tm_yday59, tm_isdst=0) != time.struct_time(tm_year 02, tm_mon, tm_mday%, tm_hour=1, tm_min=0, tm_sec=0, tm_wday=2, tm_yday59, tm_isdst=0)

    sincerely,
    -The Buildbot
  • Buildbot at Apr 27, 2009 at 9:53 pm
    The Buildbot has detected a new failure of sparc solaris10 gcc 3.x.
    Full details are available at:
    http://www.python.org/dev/buildbot/all/sparc%20solaris10%20gcc%203.x/builds/590

    Buildbot URL: http://www.python.org/dev/buildbot/all/

    Buildslave for this Build: loewis-sun

    Build Reason:
    Build Source Stamp: [branch branches/py3k] HEAD
    Blamelist: mark.dickinson

    BUILD FAILED: failed test

    Excerpt from the test logfile:
    2 tests failed:
    test_posix test_time

    =====================================================================ERROR: test_getcwd_long_pathnames (test.test_posix.PosixTester)
    ----------------------------------------------------------------------

    Traceback (most recent call last):
    File "/home2/buildbot/slave/3.x.loewis-sun/build/Lib/test/test_posix.py", line 251, in test_getcwd_long_pathnames
    support.rmtree(base_path)
    File "/home2/buildbot/slave/3.x.loewis-sun/build/Lib/test/support.py", line 177, in rmtree
    shutil.rmtree(path)
    File "/home2/buildbot/slave/3.x.loewis-sun/build/Lib/shutil.py", line 225, in rmtree
    onerror(os.rmdir, path, sys.exc_info())
    File "/home2/buildbot/slave/3.x.loewis-sun/build/Lib/shutil.py", line 223, in rmtree
    os.rmdir(path)
    OSError: [Errno 22] Invalid argument: '/home2/buildbot/slave/3.x.loewis-sun/build/@test.getcwd/@test.getcwd'

    =====================================================================FAIL: test_tzset (test.test_time.TimeTestCase)
    ----------------------------------------------------------------------

    Traceback (most recent call last):
    File "/home2/buildbot/slave/3.x.loewis-sun/build/Lib/test/test_time.py", line 157, in test_tzset
    time.gmtime(xmas2002), time.localtime(xmas2002)
    AssertionError: time.struct_time(tm_year 02, tm_mon, tm_mday%, tm_hour=0, tm_min=0, tm_sec=0, tm_wday=2, tm_yday59, tm_isdst=0) != time.struct_time(tm_year 02, tm_mon, tm_mday%, tm_hour=1, tm_min=0, tm_sec=0, tm_wday=2, tm_yday59, tm_isdst=0)

    sincerely,
    -The Buildbot
  • Buildbot at Apr 28, 2009 at 4:07 am
    The Buildbot has detected a new failure of sparc solaris10 gcc 3.x.
    Full details are available at:
    http://www.python.org/dev/buildbot/all/sparc%20solaris10%20gcc%203.x/builds/592

    Buildbot URL: http://www.python.org/dev/buildbot/all/

    Buildslave for this Build: loewis-sun

    Build Reason:
    Build Source Stamp: [branch branches/py3k] HEAD
    Blamelist: antoine.pitrou

    BUILD FAILED: failed test

    Excerpt from the test logfile:
    2 tests failed:
    test_os test_posix

    ======================================================================
    ERROR: test_getcwd_long_pathnames (test.test_posix.PosixTester)
    ----------------------------------------------------------------------

    Traceback (most recent call last):
    File "/home2/buildbot/slave/3.x.loewis-sun/build/Lib/test/test_posix.py", line 251, in test_getcwd_long_pathnames
    support.rmtree(base_path)
    File "/home2/buildbot/slave/3.x.loewis-sun/build/Lib/test/support.py", line 177, in rmtree
    shutil.rmtree(path)
    File "/home2/buildbot/slave/3.x.loewis-sun/build/Lib/shutil.py", line 225, in rmtree
    onerror(os.rmdir, path, sys.exc_info())
    File "/home2/buildbot/slave/3.x.loewis-sun/build/Lib/shutil.py", line 223, in rmtree
    os.rmdir(path)
    OSError: [Errno 22] Invalid argument: '/home2/buildbot/slave/3.x.loewis-sun/build/@test.getcwd/@test.getcwd'

    sincerely,
    -The Buildbot
  • Buildbot at Apr 29, 2009 at 12:41 am
    The Buildbot has detected a new failure of sparc solaris10 gcc 3.x.
    Full details are available at:
    http://www.python.org/dev/buildbot/all/sparc%20solaris10%20gcc%203.x/builds/596

    Buildbot URL: http://www.python.org/dev/buildbot/all/

    Buildslave for this Build: loewis-sun

    Build Reason:
    Build Source Stamp: [branch branches/py3k] HEAD
    Blamelist: raymond.hettinger

    BUILD FAILED: failed compile

    sincerely,
    -The Buildbot
  • Buildbot at Apr 29, 2009 at 7:38 pm
    The Buildbot has detected a new failure of sparc solaris10 gcc 3.x.
    Full details are available at:
    http://www.python.org/dev/buildbot/all/sparc%20solaris10%20gcc%203.x/builds/601

    Buildbot URL: http://www.python.org/dev/buildbot/all/

    Buildslave for this Build: loewis-sun

    Build Reason:
    Build Source Stamp: [branch branches/py3k] HEAD
    Blamelist: mark.dickinson

    BUILD FAILED: failed test

    Excerpt from the test logfile:
    2 tests failed:
    test_posix test_time

    ======================================================================
    ERROR: test_getcwd_long_pathnames (test.test_posix.PosixTester)
    ----------------------------------------------------------------------

    Traceback (most recent call last):
    File "/home2/buildbot/slave/3.x.loewis-sun/build/Lib/test/test_posix.py", line 251, in test_getcwd_long_pathnames
    support.rmtree(base_path)
    File "/home2/buildbot/slave/3.x.loewis-sun/build/Lib/test/support.py", line 177, in rmtree
    shutil.rmtree(path)
    File "/home2/buildbot/slave/3.x.loewis-sun/build/Lib/shutil.py", line 225, in rmtree
    onerror(os.rmdir, path, sys.exc_info())
    File "/home2/buildbot/slave/3.x.loewis-sun/build/Lib/shutil.py", line 223, in rmtree
    os.rmdir(path)
    OSError: [Errno 22] Invalid argument: '/home2/buildbot/slave/3.x.loewis-sun/build/@test.getcwd/@test.getcwd'

    sincerely,
    -The Buildbot
  • Buildbot at Apr 30, 2009 at 2:33 am
    The Buildbot has detected a new failure of sparc solaris10 gcc 3.x.
    Full details are available at:
    http://www.python.org/dev/buildbot/all/sparc%20solaris10%20gcc%203.x/builds/603

    Buildbot URL: http://www.python.org/dev/buildbot/all/

    Buildslave for this Build: loewis-sun

    Build Reason:
    Build Source Stamp: [branch branches/py3k] HEAD
    Blamelist: benjamin.peterson,mark.dickinson,r.david.murray

    BUILD FAILED: failed test

    Excerpt from the test logfile:
    2 tests failed:
    test_importlib test_posix

    Traceback (most recent call last):
    File "./Lib/test/regrtest.py", line 620, in runtest_inner
    File "/home2/buildbot/slave/3.x.loewis-sun/build/Lib/test/test_importlib.py", line 6, in test_main
    run_unittest(importlib.test.test_suite('importlib.test'))
    File "/home2/buildbot/slave/3.x.loewis-sun/build/Lib/importlib/test/__init__.py", line 22, in test_suite
    package_tests = getattr(sys.modules[package_name], 'test_suite')()
    File "/home2/buildbot/slave/3.x.loewis-sun/build/Lib/importlib/test/source/__init__.py", line 8, in test_suite
    return importlib.test.test_suite('importlib.test.source', directory)
    File "/home2/buildbot/slave/3.x.loewis-sun/build/Lib/importlib/test/__init__.py", line 16, in test_suite
    __import__(module_name, level=0)
    File "/home2/buildbot/slave/3.x.loewis-sun/build/Lib/importlib/test/source/test_case_sensitivity.py", line 12, in <module>
    class CaseSensitivityTest(unittest.TestCase):
    File "/home2/buildbot/slave/3.x.loewis-sun/build/Lib/importlib/test/util.py", line 13, in case_insensitive_tests
    original_name = os.listdir('.')[0]
    IndexError: list index out of range

    ======================================================================
    ERROR: test_getcwd_long_pathnames (test.test_posix.PosixTester)
    ----------------------------------------------------------------------

    Traceback (most recent call last):
    File "/home2/buildbot/slave/3.x.loewis-sun/build/Lib/test/test_posix.py", line 251, in test_getcwd_long_pathnames
    support.rmtree(base_path)
    File "/home2/buildbot/slave/3.x.loewis-sun/build/Lib/test/support.py", line 177, in rmtree
    shutil.rmtree(path)
    File "/home2/buildbot/slave/3.x.loewis-sun/build/Lib/shutil.py", line 225, in rmtree
    onerror(os.rmdir, path, sys.exc_info())
    File "/home2/buildbot/slave/3.x.loewis-sun/build/Lib/shutil.py", line 223, in rmtree
    os.rmdir(path)
    OSError: [Errno 22] Invalid argument: '/home2/buildbot/slave/3.x.loewis-sun/build/@test.getcwd/@test.getcwd'

    sincerely,
    -The Buildbot

Related Discussions

Discussion Navigation
viewthread | post
Discussion Overview
grouppython-checkins @
categoriespython
postedApr 2, '09 at 7:15p
activeApr 30, '09 at 2:33a
posts31
users1
websitepython.org

1 user in discussion

Buildbot: 31 posts

People

Translate

site design / logo © 2019 Grokbase