FAQ
The Buildbot has detected a new failure of amd64 gentoo trunk.
Full details are available at:
http://www.python.org/dev/buildbot/all/amd64%20gentoo%20trunk/builds/2057

Buildbot URL: http://www.python.org/dev/buildbot/all/

Buildslave for this Build: norwitz-amd64

Build Reason:
Build Source Stamp: [branch trunk] HEAD
Blamelist: brett.cannon

BUILD FAILED: failed test

Excerpt from the test logfile:
1 test failed:
test_asyncore

======================================================================
FAIL: test_readwrite (test.test_asyncore.HelperFunctionTests)
----------------------------------------------------------------------

Traceback (most recent call last):
File "/home/buildbot/slave/py-build/trunk.norwitz-amd64/build/Lib/test/test_asyncore.py", line 144, in test_readwrite
self.assertEqual(tobj.read, True)
AssertionError: False != True

make: *** [buildbottest] Error 1

sincerely,
-The Buildbot

Search Discussions

  • Buildbot at Apr 6, 2009 at 12:08 am
    The Buildbot has detected a new failure of amd64 gentoo trunk.
    Full details are available at:
    http://www.python.org/dev/buildbot/all/amd64%20gentoo%20trunk/builds/2103

    Buildbot URL: http://www.python.org/dev/buildbot/all/

    Buildslave for this Build: norwitz-amd64

    Build Reason:
    Build Source Stamp: [branch trunk] HEAD
    Blamelist: tarek.ziade

    BUILD FAILED: failed test

    Excerpt from the test logfile:
    Traceback (most recent call last):
    File "/home/buildbot/slave/py-build/trunk.norwitz-amd64/build/Lib/threading.py", line 524, in __bootstrap_inner
    self.run()
    File "/home/buildbot/slave/py-build/trunk.norwitz-amd64/build/Lib/threading.py", line 477, in run
    self.__target(*self.__args, **self.__kwargs)
    File "/home/buildbot/slave/py-build/trunk.norwitz-amd64/build/Lib/bsddb/test/test_thread.py", line 306, in readerThread
    rec = dbutils.DeadlockWrap(c.next, max_retries)
    File "/home/buildbot/slave/py-build/trunk.norwitz-amd64/build/Lib/bsddb/dbutils.py", line 68, in DeadlockWrap
    return function(*_args, **_kwargs)
    DBLockDeadlockError: (-30995, 'DB_LOCK_DEADLOCK: Locker killed to resolve a deadlock')

    4 tests failed:
    test_asyncore test_generators test_genexps test_syntax

    =====================================================================FAIL: test_readwrite (test.test_asyncore.HelperFunctionTests)
    ----------------------------------------------------------------------

    Traceback (most recent call last):
    File "/home/buildbot/slave/py-build/trunk.norwitz-amd64/build/Lib/test/test_asyncore.py", line 144, in test_readwrite
    self.assertEqual(tobj.read, True)
    AssertionError: False != True

    make: *** [buildbottest] Error 1

    sincerely,
    -The Buildbot

Related Discussions

Discussion Navigation
viewthread | post
Discussion Overview
grouppython-checkins @
categoriespython
postedApr 1, '09 at 6:39p
activeApr 6, '09 at 12:08a
posts2
users1
websitepython.org

1 user in discussion

Buildbot: 2 posts

People

Translate

site design / logo © 2019 Grokbase