FAQ
The Buildbot has detected a new failure of g4 osx.4 2.5.
Full details are available at:
http://www.python.org/dev/buildbot/all/g4%20osx.4%202.5/builds/574

Buildbot URL: http://www.python.org/dev/buildbot/all/

Buildslave for this Build: psf-g4

Build Reason:
Build Source Stamp: [branch branches/release25-maint] HEAD
Blamelist: ronald.oussoren

BUILD FAILED: failed test

Excerpt from the test logfile:
1 test failed:
test_socket_ssl

make: *** [buildbottest] Error 1

sincerely,
-The Buildbot

Search Discussions

  • Buildbot at May 23, 2008 at 3:19 pm
    The Buildbot has detected a new failure of g4 osx.4 2.5.
    Full details are available at:
    http://www.python.org/dev/buildbot/all/g4%20osx.4%202.5/builds/581

    Buildbot URL: http://www.python.org/dev/buildbot/all/

    Buildslave for this Build: psf-g4

    Build Reason:
    Build Source Stamp: [branch branches/release25-maint] HEAD
    Blamelist: martin.v.loewis

    BUILD FAILED: failed test

    Excerpt from the test logfile:
    Traceback (most recent call last):
    File "/Users/buildslave/bb/2.5.psf-g4/build/Lib/threading.py", line 486, in __bootstrap_inner
    self.run()
    File "/Users/buildslave/bb/2.5.psf-g4/build/Lib/threading.py", line 446, in run
    self.__target(*self.__args, **self.__kwargs)
    File "/Users/buildslave/bb/2.5.psf-g4/build/Lib/bsddb/test/test_thread.py", line 281, in readerThread
    rec = dbutils.DeadlockWrap(c.next, max_retries)
    File "/Users/buildslave/bb/2.5.psf-g4/build/Lib/bsddb/dbutils.py", line 62, in DeadlockWrap
    return function(*_args, **_kwargs)
    DBLockDeadlockError: (-30995, 'DB_LOCK_DEADLOCK: Locker killed to resolve a deadlock')

    Traceback (most recent call last):
    File "/Users/buildslave/bb/2.5.psf-g4/build/Lib/threading.py", line 486, in __bootstrap_inner
    self.run()
    File "/Users/buildslave/bb/2.5.psf-g4/build/Lib/threading.py", line 446, in run
    self.__target(*self.__args, **self.__kwargs)
    File "/Users/buildslave/bb/2.5.psf-g4/build/Lib/bsddb/test/test_thread.py", line 281, in readerThread
    rec = dbutils.DeadlockWrap(c.next, max_retries)
    File "/Users/buildslave/bb/2.5.psf-g4/build/Lib/bsddb/dbutils.py", line 62, in DeadlockWrap
    return function(*_args, **_kwargs)
    DBLockDeadlockError: (-30995, 'DB_LOCK_DEADLOCK: Locker killed to resolve a deadlock')

    1 test failed:
    test_socket_ssl

    make: *** [buildbottest] Error 1

    sincerely,
    -The Buildbot

Related Discussions

Discussion Navigation
viewthread | post
Discussion Overview
grouppython-checkins @
categoriespython
postedMay 2, '08 at 10:57p
activeMay 23, '08 at 3:19p
posts2
users1
websitepython.org

1 user in discussion

Buildbot: 2 posts

People

Translate

site design / logo © 2019 Grokbase