FAQ
The Buildbot has detected a new failure of amd64 XP 3.0.
Full details are available at:
http://www.python.org/dev/buildbot/all/amd64%20XP%203.0/builds/813

Buildbot URL: http://www.python.org/dev/buildbot/all/

Buildslave for this Build: heller-windows-amd64

Build Reason:
Build Source Stamp: [branch branches/py3k] HEAD
Blamelist: mark.dickinson

BUILD FAILED: failed compile

sincerely,
-The Buildbot

Search Discussions

  • Buildbot at May 3, 2008 at 10:14 pm
    The Buildbot has detected a new failure of amd64 XP 3.0.
    Full details are available at:
    http://www.python.org/dev/buildbot/all/amd64%20XP%203.0/builds/820

    Buildbot URL: http://www.python.org/dev/buildbot/all/

    Buildslave for this Build: heller-windows-amd64

    Build Reason:
    Build Source Stamp: [branch branches/py3k] HEAD
    Blamelist: georg.brandl,mark.dickinson

    BUILD FAILED: failed compile

    sincerely,
    -The Buildbot
  • Buildbot at May 4, 2008 at 11:57 pm
    The Buildbot has detected a new failure of amd64 XP 3.0.
    Full details are available at:
    http://www.python.org/dev/buildbot/all/amd64%20XP%203.0/builds/824

    Buildbot URL: http://www.python.org/dev/buildbot/all/

    Buildslave for this Build: heller-windows-amd64

    Build Reason:
    Build Source Stamp: [branch branches/py3k] HEAD
    Blamelist: benjamin.peterson

    BUILD FAILED: failed compile

    sincerely,
    -The Buildbot
  • Buildbot at May 5, 2008 at 7:04 pm
    The Buildbot has detected a new failure of amd64 XP 3.0.
    Full details are available at:
    http://www.python.org/dev/buildbot/all/amd64%20XP%203.0/builds/828

    Buildbot URL: http://www.python.org/dev/buildbot/all/

    Buildslave for this Build: heller-windows-amd64

    Build Reason:
    Build Source Stamp: [branch branches/py3k] HEAD
    Blamelist: martin.v.loewis

    BUILD FAILED: failed compile

    sincerely,
    -The Buildbot
  • Buildbot at May 6, 2008 at 2:53 pm
    The Buildbot has detected a new failure of amd64 XP 3.0.
    Full details are available at:
    http://www.python.org/dev/buildbot/all/amd64%20XP%203.0/builds/831

    Buildbot URL: http://www.python.org/dev/buildbot/all/

    Buildslave for this Build: heller-windows-amd64

    Build Reason:
    Build Source Stamp: [branch branches/py3k] HEAD
    Blamelist: christian.heimes

    BUILD FAILED: failed compile

    sincerely,
    -The Buildbot
  • Buildbot at May 7, 2008 at 12:59 am
    The Buildbot has detected a new failure of amd64 XP 3.0.
    Full details are available at:
    http://www.python.org/dev/buildbot/all/amd64%20XP%203.0/builds/835

    Buildbot URL: http://www.python.org/dev/buildbot/all/

    Buildslave for this Build: heller-windows-amd64

    Build Reason:
    Build Source Stamp: [branch branches/py3k] HEAD
    Blamelist: alexandre.vassalotti,brett.cannon,christian.heimes

    BUILD FAILED: failed compile

    sincerely,
    -The Buildbot
  • Buildbot at May 7, 2008 at 4:06 am
    The Buildbot has detected a new failure of amd64 XP 3.0.
    Full details are available at:
    http://www.python.org/dev/buildbot/all/amd64%20XP%203.0/builds/837

    Buildbot URL: http://www.python.org/dev/buildbot/all/

    Buildslave for this Build: heller-windows-amd64

    Build Reason:
    Build Source Stamp: [branch branches/py3k] HEAD
    Blamelist: alexandre.vassalotti,benjamin.peterson

    BUILD FAILED: failed compile

    sincerely,
    -The Buildbot
  • Buildbot at May 8, 2008 at 4:52 am
    The Buildbot has detected a new failure of amd64 XP 3.0.
    Full details are available at:
    http://www.python.org/dev/buildbot/all/amd64%20XP%203.0/builds/840

    Buildbot URL: http://www.python.org/dev/buildbot/all/

    Buildslave for this Build: heller-windows-amd64

    Build Reason:
    Build Source Stamp: [branch branches/py3k] HEAD
    Blamelist: barry.warsaw

    BUILD FAILED: failed compile

    sincerely,
    -The Buildbot
  • Buildbot at May 8, 2008 at 3:00 pm
    The Buildbot has detected a new failure of amd64 XP 3.0.
    Full details are available at:
    http://www.python.org/dev/buildbot/all/amd64%20XP%203.0/builds/842

    Buildbot URL: http://www.python.org/dev/buildbot/all/

    Buildslave for this Build: heller-windows-amd64

    Build Reason:
    Build Source Stamp: [branch branches/py3k] HEAD
    Blamelist: barry.warsaw,christian.heimes

    BUILD FAILED: failed compile

    sincerely,
    -The Buildbot
  • Buildbot at May 9, 2008 at 12:38 am
    The Buildbot has detected a new failure of amd64 XP 3.0.
    Full details are available at:
    http://www.python.org/dev/buildbot/all/amd64%20XP%203.0/builds/850

    Buildbot URL: http://www.python.org/dev/buildbot/all/

    Buildslave for this Build: heller-windows-amd64

    Build Reason:
    Build Source Stamp: [branch branches/py3k] HEAD
    Blamelist: benjamin.peterson

    BUILD FAILED: failed compile

    sincerely,
    -The Buildbot
  • Buildbot at May 9, 2008 at 8:23 am
    The Buildbot has detected a new failure of amd64 XP 3.0.
    Full details are available at:
    http://www.python.org/dev/buildbot/all/amd64%20XP%203.0/builds/853

    Buildbot URL: http://www.python.org/dev/buildbot/all/

    Buildslave for this Build: heller-windows-amd64

    Build Reason:
    Build Source Stamp: [branch branches/py3k] HEAD
    Blamelist: brett.cannon

    BUILD FAILED: failed compile

    sincerely,
    -The Buildbot
  • Buildbot at May 9, 2008 at 3:11 pm
    The Buildbot has detected a new failure of amd64 XP 3.0.
    Full details are available at:
    http://www.python.org/dev/buildbot/all/amd64%20XP%203.0/builds/855

    Buildbot URL: http://www.python.org/dev/buildbot/all/

    Buildslave for this Build: heller-windows-amd64

    Build Reason:
    Build Source Stamp: [branch branches/py3k] HEAD
    Blamelist: mark.dickinson

    BUILD FAILED: failed compile

    sincerely,
    -The Buildbot
  • Buildbot at May 9, 2008 at 8:52 pm
    The Buildbot has detected a new failure of amd64 XP 3.0.
    Full details are available at:
    http://www.python.org/dev/buildbot/all/amd64%20XP%203.0/builds/858

    Buildbot URL: http://www.python.org/dev/buildbot/all/

    Buildslave for this Build: heller-windows-amd64

    Build Reason:
    Build Source Stamp: [branch branches/py3k] HEAD
    Blamelist: alexandre.vassalotti

    BUILD FAILED: failed compile

    sincerely,
    -The Buildbot
  • Buildbot at May 9, 2008 at 11:17 pm
    The Buildbot has detected a new failure of amd64 XP 3.0.
    Full details are available at:
    http://www.python.org/dev/buildbot/all/amd64%20XP%203.0/builds/860

    Buildbot URL: http://www.python.org/dev/buildbot/all/

    Buildslave for this Build: heller-windows-amd64

    Build Reason:
    Build Source Stamp: [branch branches/py3k] HEAD
    Blamelist: alexandre.vassalotti

    BUILD FAILED: failed compile

    sincerely,
    -The Buildbot
  • Buildbot at May 10, 2008 at 3:46 am
    The Buildbot has detected a new failure of amd64 XP 3.0.
    Full details are available at:
    http://www.python.org/dev/buildbot/all/amd64%20XP%203.0/builds/862

    Buildbot URL: http://www.python.org/dev/buildbot/all/

    Buildslave for this Build: heller-windows-amd64

    Build Reason:
    Build Source Stamp: [branch branches/py3k] HEAD
    Blamelist: brett.cannon

    BUILD FAILED: failed compile

    sincerely,
    -The Buildbot
  • Buildbot at May 11, 2008 at 5:10 am
    The Buildbot has detected a new failure of amd64 XP 3.0.
    Full details are available at:
    http://www.python.org/dev/buildbot/all/amd64%20XP%203.0/builds/867

    Buildbot URL: http://www.python.org/dev/buildbot/all/

    Buildslave for this Build: heller-windows-amd64

    Build Reason:
    Build Source Stamp: [branch branches/py3k] HEAD
    Blamelist: brett.cannon

    BUILD FAILED: failed compile

    sincerely,
    -The Buildbot
  • Buildbot at May 11, 2008 at 6:51 pm
    The Buildbot has detected a new failure of amd64 XP 3.0.
    Full details are available at:
    http://www.python.org/dev/buildbot/all/amd64%20XP%203.0/builds/871

    Buildbot URL: http://www.python.org/dev/buildbot/all/

    Buildslave for this Build: heller-windows-amd64

    Build Reason:
    Build Source Stamp: [branch branches/py3k] HEAD
    Blamelist: benjamin.peterson,georg.brandl

    BUILD FAILED: failed compile

    sincerely,
    -The Buildbot
  • Buildbot at May 12, 2008 at 12:17 am
    The Buildbot has detected a new failure of amd64 XP 3.0.
    Full details are available at:
    http://www.python.org/dev/buildbot/all/amd64%20XP%203.0/builds/876

    Buildbot URL: http://www.python.org/dev/buildbot/all/

    Buildslave for this Build: heller-windows-amd64

    Build Reason:
    Build Source Stamp: [branch branches/py3k] HEAD
    Blamelist: alexandre.vassalotti,brett.cannon

    BUILD FAILED: failed compile

    sincerely,
    -The Buildbot
  • Buildbot at May 12, 2008 at 3:01 pm
    The Buildbot has detected a new failure of amd64 XP 3.0.
    Full details are available at:
    http://www.python.org/dev/buildbot/all/amd64%20XP%203.0/builds/884

    Buildbot URL: http://www.python.org/dev/buildbot/all/

    Buildslave for this Build: heller-windows-amd64

    Build Reason:
    Build Source Stamp: [branch branches/py3k] HEAD
    Blamelist: amaury.forgeotdarc

    BUILD FAILED: failed compile

    sincerely,
    -The Buildbot
  • Buildbot at May 13, 2008 at 12:43 am
    The Buildbot has detected a new failure of amd64 XP 3.0.
    Full details are available at:
    http://www.python.org/dev/buildbot/all/amd64%20XP%203.0/builds/889

    Buildbot URL: http://www.python.org/dev/buildbot/all/

    Buildslave for this Build: heller-windows-amd64

    Build Reason:
    Build Source Stamp: [branch branches/py3k] HEAD
    Blamelist: benjamin.peterson

    BUILD FAILED: failed compile

    sincerely,
    -The Buildbot
  • Buildbot at May 13, 2008 at 3:16 am
    The Buildbot has detected a new failure of amd64 XP 3.0.
    Full details are available at:
    http://www.python.org/dev/buildbot/all/amd64%20XP%203.0/builds/891

    Buildbot URL: http://www.python.org/dev/buildbot/all/

    Buildslave for this Build: heller-windows-amd64

    Build Reason:
    Build Source Stamp: [branch branches/py3k] HEAD
    Blamelist: benjamin.peterson

    BUILD FAILED: failed compile

    sincerely,
    -The Buildbot
  • Buildbot at May 15, 2008 at 1:06 am
    The Buildbot has detected a new failure of amd64 XP 3.0.
    Full details are available at:
    http://www.python.org/dev/buildbot/all/amd64%20XP%203.0/builds/897

    Buildbot URL: http://www.python.org/dev/buildbot/all/

    Buildslave for this Build: heller-windows-amd64

    Build Reason:
    Build Source Stamp: [branch branches/py3k] HEAD
    Blamelist: alexandre.vassalotti

    BUILD FAILED: failed compile

    sincerely,
    -The Buildbot
  • Buildbot at May 15, 2008 at 6:06 am
    The Buildbot has detected a new failure of amd64 XP 3.0.
    Full details are available at:
    http://www.python.org/dev/buildbot/all/amd64%20XP%203.0/builds/900

    Buildbot URL: http://www.python.org/dev/buildbot/all/

    Buildslave for this Build: heller-windows-amd64

    Build Reason:
    Build Source Stamp: [branch branches/py3k] HEAD
    Blamelist: brett.cannon

    BUILD FAILED: failed compile

    sincerely,
    -The Buildbot
  • Buildbot at May 15, 2008 at 11:15 pm
    The Buildbot has detected a new failure of amd64 XP 3.0.
    Full details are available at:
    http://www.python.org/dev/buildbot/all/amd64%20XP%203.0/builds/904

    Buildbot URL: http://www.python.org/dev/buildbot/all/

    Buildslave for this Build: heller-windows-amd64

    Build Reason:
    Build Source Stamp: [branch branches/py3k] HEAD
    Blamelist: alexandre.vassalotti

    BUILD FAILED: failed compile

    sincerely,
    -The Buildbot
  • Buildbot at May 16, 2008 at 5:05 am
    The Buildbot has detected a new failure of amd64 XP 3.0.
    Full details are available at:
    http://www.python.org/dev/buildbot/all/amd64%20XP%203.0/builds/907

    Buildbot URL: http://www.python.org/dev/buildbot/all/

    Buildslave for this Build: heller-windows-amd64

    Build Reason:
    Build Source Stamp: [branch branches/py3k] HEAD
    Blamelist: alexandre.vassalotti

    BUILD FAILED: failed compile

    sincerely,
    -The Buildbot
  • Buildbot at May 16, 2008 at 9:00 am
    The Buildbot has detected a new failure of amd64 XP 3.0.
    Full details are available at:
    http://www.python.org/dev/buildbot/all/amd64%20XP%203.0/builds/910

    Buildbot URL: http://www.python.org/dev/buildbot/all/

    Buildslave for this Build: heller-windows-amd64

    Build Reason:
    Build Source Stamp: [branch branches/py3k] HEAD
    Blamelist: alexandre.vassalotti

    BUILD FAILED: failed svn

    sincerely,
    -The Buildbot
  • Buildbot at May 16, 2008 at 7:01 pm
    The Buildbot has detected a new failure of amd64 XP 3.0.
    Full details are available at:
    http://www.python.org/dev/buildbot/all/amd64%20XP%203.0/builds/914

    Buildbot URL: http://www.python.org/dev/buildbot/all/

    Buildslave for this Build: heller-windows-amd64

    Build Reason:
    Build Source Stamp: [branch branches/py3k] HEAD
    Blamelist: alexandre.vassalotti,georg.brandl

    BUILD FAILED: failed svn

    sincerely,
    -The Buildbot
  • Buildbot at May 17, 2008 at 9:15 pm
    The Buildbot has detected a new failure of amd64 XP 3.0.
    Full details are available at:
    http://www.python.org/dev/buildbot/all/amd64%20XP%203.0/builds/918

    Buildbot URL: http://www.python.org/dev/buildbot/all/

    Buildslave for this Build: heller-windows-amd64

    Build Reason:
    Build Source Stamp: [branch branches/py3k] HEAD
    Blamelist: benjamin.peterson,fred.drake,georg.brandl

    BUILD FAILED: failed compile

    sincerely,
    -The Buildbot
  • Buildbot at May 18, 2008 at 2:27 am
    The Buildbot has detected a new failure of amd64 XP 3.0.
    Full details are available at:
    http://www.python.org/dev/buildbot/all/amd64%20XP%203.0/builds/920

    Buildbot URL: http://www.python.org/dev/buildbot/all/

    Buildslave for this Build: heller-windows-amd64

    Build Reason:
    Build Source Stamp: [branch branches/py3k] HEAD
    Blamelist: fred.drake,georg.brandl

    BUILD FAILED: failed compile

    sincerely,
    -The Buildbot
  • Buildbot at May 18, 2008 at 8:42 am
    The Buildbot has detected a new failure of amd64 XP 3.0.
    Full details are available at:
    http://www.python.org/dev/buildbot/all/amd64%20XP%203.0/builds/922

    Buildbot URL: http://www.python.org/dev/buildbot/all/

    Buildslave for this Build: heller-windows-amd64

    Build Reason:
    Build Source Stamp: [branch branches/py3k] HEAD
    Blamelist: georg.brandl

    BUILD FAILED: failed compile

    sincerely,
    -The Buildbot
  • Buildbot at May 19, 2008 at 12:10 am
    The Buildbot has detected a new failure of amd64 XP 3.0.
    Full details are available at:
    http://www.python.org/dev/buildbot/all/amd64%20XP%203.0/builds/927

    Buildbot URL: http://www.python.org/dev/buildbot/all/

    Buildslave for this Build: heller-windows-amd64

    Build Reason:
    Build Source Stamp: [branch branches/py3k] HEAD
    Blamelist: benjamin.peterson

    BUILD FAILED: failed compile

    sincerely,
    -The Buildbot
  • Buildbot at May 23, 2008 at 6:19 am
    The Buildbot has detected a new failure of amd64 XP 3.0.
    Full details are available at:
    http://www.python.org/dev/buildbot/all/amd64%20XP%203.0/builds/935

    Buildbot URL: http://www.python.org/dev/buildbot/all/

    Buildslave for this Build: heller-windows-amd64

    Build Reason:
    Build Source Stamp: [branch branches/py3k] HEAD
    Blamelist: brett.cannon

    BUILD FAILED: failed failed slave lost

    sincerely,
    -The Buildbot
  • Buildbot at May 25, 2008 at 9:17 am
    The Buildbot has detected a new failure of amd64 XP 3.0.
    Full details are available at:
    http://www.python.org/dev/buildbot/all/amd64%20XP%203.0/builds/939

    Buildbot URL: http://www.python.org/dev/buildbot/all/

    Buildslave for this Build: heller-windows-amd64

    Build Reason:
    Build Source Stamp: [branch branches/py3k] HEAD
    Blamelist: georg.brandl

    BUILD FAILED: failed compile

    sincerely,
    -The Buildbot
  • Buildbot at May 25, 2008 at 11:17 am
    The Buildbot has detected a new failure of amd64 XP 3.0.
    Full details are available at:
    http://www.python.org/dev/buildbot/all/amd64%20XP%203.0/builds/941

    Buildbot URL: http://www.python.org/dev/buildbot/all/

    Buildslave for this Build: heller-windows-amd64

    Build Reason:
    Build Source Stamp: [branch branches/py3k] HEAD
    Blamelist: georg.brandl

    BUILD FAILED: failed compile

    sincerely,
    -The Buildbot
  • Buildbot at May 25, 2008 at 4:53 pm
    The Buildbot has detected a new failure of amd64 XP 3.0.
    Full details are available at:
    http://www.python.org/dev/buildbot/all/amd64%20XP%203.0/builds/944

    Buildbot URL: http://www.python.org/dev/buildbot/all/

    Buildslave for this Build: heller-windows-amd64

    Build Reason:
    Build Source Stamp: [branch branches/py3k] HEAD
    Blamelist: guilherme.polo,martin.v.loewis

    BUILD FAILED: failed compile

    sincerely,
    -The Buildbot
  • Buildbot at May 25, 2008 at 7:28 pm
    The Buildbot has detected a new failure of amd64 XP 3.0.
    Full details are available at:
    http://www.python.org/dev/buildbot/all/amd64%20XP%203.0/builds/946

    Buildbot URL: http://www.python.org/dev/buildbot/all/

    Buildslave for this Build: heller-windows-amd64

    Build Reason:
    Build Source Stamp: [branch branches/py3k] HEAD
    Blamelist: christian.heimes,georg.brandl,martin.v.loewis

    BUILD FAILED: failed compile

    sincerely,
    -The Buildbot
  • Buildbot at May 26, 2008 at 3:07 pm
    The Buildbot has detected a new failure of amd64 XP 3.0.
    Full details are available at:
    http://www.python.org/dev/buildbot/all/amd64%20XP%203.0/builds/952

    Buildbot URL: http://www.python.org/dev/buildbot/all/

    Buildslave for this Build: heller-windows-amd64

    Build Reason:
    Build Source Stamp: [branch branches/py3k] HEAD
    Blamelist: benjamin.peterson,christian.heimes

    BUILD FAILED: failed compile

    sincerely,
    -The Buildbot
  • Buildbot at May 26, 2008 at 6:16 pm
    The Buildbot has detected a new failure of amd64 XP 3.0.
    Full details are available at:
    http://www.python.org/dev/buildbot/all/amd64%20XP%203.0/builds/954

    Buildbot URL: http://www.python.org/dev/buildbot/all/

    Buildslave for this Build: heller-windows-amd64

    Build Reason:
    Build Source Stamp: [branch branches/py3k] HEAD
    Blamelist: benjamin.peterson,georg.brandl

    BUILD FAILED: failed compile

    sincerely,
    -The Buildbot
  • Buildbot at May 26, 2008 at 9:54 pm
    The Buildbot has detected a new failure of amd64 XP 3.0.
    Full details are available at:
    http://www.python.org/dev/buildbot/all/amd64%20XP%203.0/builds/956

    Buildbot URL: http://www.python.org/dev/buildbot/all/

    Buildslave for this Build: heller-windows-amd64

    Build Reason:
    Build Source Stamp: [branch branches/py3k] HEAD
    Blamelist: benjamin.peterson,brett.cannon,georg.brandl

    BUILD FAILED: failed compile

    sincerely,
    -The Buildbot
  • Buildbot at May 27, 2008 at 3:31 am
    The Buildbot has detected a new failure of amd64 XP 3.0.
    Full details are available at:
    http://www.python.org/dev/buildbot/all/amd64%20XP%203.0/builds/960

    Buildbot URL: http://www.python.org/dev/buildbot/all/

    Buildslave for this Build: heller-windows-amd64

    Build Reason:
    Build Source Stamp: [branch branches/py3k] HEAD
    Blamelist: benjamin.peterson

    BUILD FAILED: failed compile

    sincerely,
    -The Buildbot
  • Buildbot at May 28, 2008 at 6:34 pm
    The Buildbot has detected a new failure of amd64 XP 3.0.
    Full details are available at:
    http://www.python.org/dev/buildbot/all/amd64%20XP%203.0/builds/963

    Buildbot URL: http://www.python.org/dev/buildbot/all/

    Buildslave for this Build: heller-windows-amd64

    Build Reason:
    Build Source Stamp: [branch branches/py3k] HEAD
    Blamelist: georg.brandl

    BUILD FAILED: failed test

    Excerpt from the test logfile:
    Traceback (most recent call last):
    File "C:\buildbot\3.0.heller-windows-amd64\build\lib\socketserver.py", line 281, in _handle_request_noblock
    self.process_request(request, client_address)
    File "C:\buildbot\3.0.heller-windows-amd64\build\lib\socketserver.py", line 307, in process_request
    self.finish_request(request, client_address)
    File "C:\buildbot\3.0.heller-windows-amd64\build\lib\socketserver.py", line 320, in finish_request
    self.RequestHandlerClass(request, client_address, self)
    File "C:\buildbot\3.0.heller-windows-amd64\build\lib\socketserver.py", line 614, in __init__
    self.handle()
    File "C:\buildbot\3.0.heller-windows-amd64\build\lib\http\server.py", line 364, in handle
    self.handle_one_request()
    File "C:\buildbot\3.0.heller-windows-amd64\build\lib\http\server.py", line 358, in handle_one_request
    method()
    File "C:\buildbot\3.0.heller-windows-amd64\build\lib\http\server.py", line 617, in do_GET
    f = self.send_head()
    File "C:\buildbot\3.0.heller-windows-amd64\build\lib\http\server.py", line 849, in send_head
    return self.run_cgi()
    File "C:\buildbot\3.0.heller-windows-amd64\build\lib\http\server.py", line 1102, in run_cgi
    exec(open(scriptfile).read(), {"__name__": "__main__"})
    File "<string>", line 3, in <module>
    File "C:\buildbot\3.0.heller-windows-amd64\build\lib\socket.py", line 222, in write
    return self._sock.send(b)
    TypeError: send() argument 1 must be bytes or read-only buffer, not str

    Traceback (most recent call last):
    File "C:\buildbot\3.0.heller-windows-amd64\build\lib\socketserver.py", line 281, in _handle_request_noblock
    self.process_request(request, client_address)
    File "C:\buildbot\3.0.heller-windows-amd64\build\lib\socketserver.py", line 307, in process_request
    self.finish_request(request, client_address)
    File "C:\buildbot\3.0.heller-windows-amd64\build\lib\socketserver.py", line 320, in finish_request
    self.RequestHandlerClass(request, client_address, self)
    File "C:\buildbot\3.0.heller-windows-amd64\build\lib\socketserver.py", line 614, in __init__
    self.handle()
    File "C:\buildbot\3.0.heller-windows-amd64\build\lib\http\server.py", line 364, in handle
    self.handle_one_request()
    File "C:\buildbot\3.0.heller-windows-amd64\build\lib\http\server.py", line 358, in handle_one_request
    method()
    File "C:\buildbot\3.0.heller-windows-amd64\build\lib\http\server.py", line 617, in do_GET
    f = self.send_head()
    File "C:\buildbot\3.0.heller-windows-amd64\build\lib\http\server.py", line 849, in send_head
    return self.run_cgi()
    File "C:\buildbot\3.0.heller-windows-amd64\build\lib\http\server.py", line 1102, in run_cgi
    exec(open(scriptfile).read(), {"__name__": "__main__"})
    File "<string>", line 3, in <module>
    File "C:\buildbot\3.0.heller-windows-amd64\build\lib\socket.py", line 222, in write
    return self._sock.send(b)
    TypeError: send() argument 1 must be bytes or read-only buffer, not str

    Traceback (most recent call last):
    File "C:\buildbot\3.0.heller-windows-amd64\build\lib\socketserver.py", line 281, in _handle_request_noblock
    self.process_request(request, client_address)
    File "C:\buildbot\3.0.heller-windows-amd64\build\lib\socketserver.py", line 307, in process_request
    self.finish_request(request, client_address)
    File "C:\buildbot\3.0.heller-windows-amd64\build\lib\socketserver.py", line 320, in finish_request
    self.RequestHandlerClass(request, client_address, self)
    File "C:\buildbot\3.0.heller-windows-amd64\build\lib\socketserver.py", line 614, in __init__
    self.handle()
    File "C:\buildbot\3.0.heller-windows-amd64\build\lib\http\server.py", line 364, in handle
    self.handle_one_request()
    File "C:\buildbot\3.0.heller-windows-amd64\build\lib\http\server.py", line 358, in handle_one_request
    method()
    File "C:\buildbot\3.0.heller-windows-amd64\build\lib\http\server.py", line 842, in do_POST
    self.run_cgi()
    File "C:\buildbot\3.0.heller-windows-amd64\build\lib\http\server.py", line 1102, in run_cgi
    exec(open(scriptfile).read(), {"__name__": "__main__"})
    File "<string>", line 4, in <module>
    File "C:\buildbot\3.0.heller-windows-amd64\build\lib\socket.py", line 222, in write
    return self._sock.send(b)
    TypeError: send() argument 1 must be bytes or read-only buffer, not str

    Traceback (most recent call last):
    File "C:\buildbot\3.0.heller-windows-amd64\build\lib\threading.py", line 488, in _bootstrap_inner
    self.run()
    File "C:\buildbot\3.0.heller-windows-amd64\build\lib\threading.py", line 444, in run
    self._target(*self._args, **self._kwargs)
    File "C:\buildbot\3.0.heller-windows-amd64\build\lib\bsddb\test\test_thread.py", line 89, in writerThread
    self._writerThread(*args, **kwargs)
    File "C:\buildbot\3.0.heller-windows-amd64\build\lib\bsddb\test\test_thread.py", line 278, in _writerThread
    self.assertEqual(data, self.makeData(key))
    File "C:\buildbot\3.0.heller-windows-amd64\build\lib\unittest.py", line 325, in failUnlessEqual
    raise self.failureException(msg or '%r != %r' % (first, second))
    AssertionError: None != b'1004-1004-1004-1004-1004'

    Traceback (most recent call last):
    File "C:\buildbot\3.0.heller-windows-amd64\build\lib\threading.py", line 488, in _bootstrap_inner
    self.run()
    File "C:\buildbot\3.0.heller-windows-amd64\build\lib\threading.py", line 444, in run
    self._target(*self._args, **self._kwargs)
    File "C:\buildbot\3.0.heller-windows-amd64\build\lib\bsddb\test\test_thread.py", line 89, in writerThread
    self._writerThread(*args, **kwargs)
    File "C:\buildbot\3.0.heller-windows-amd64\build\lib\bsddb\test\test_thread.py", line 278, in _writerThread
    self.assertEqual(data, self.makeData(key))
    File "C:\buildbot\3.0.heller-windows-amd64\build\lib\unittest.py", line 325, in failUnlessEqual
    raise self.failureException(msg or '%r != %r' % (first, second))
    AssertionError: None != b'0007-0007-0007-0007-0007'

    Traceback (most recent call last):
    File "C:\buildbot\3.0.heller-windows-amd64\build\lib\threading.py", line 488, in _bootstrap_inner
    self.run()
    File "C:\buildbot\3.0.heller-windows-amd64\build\lib\threading.py", line 444, in run
    self._target(*self._args, **self._kwargs)
    File "C:\buildbot\3.0.heller-windows-amd64\build\lib\bsddb\test\test_thread.py", line 89, in writerThread
    self._writerThread(*args, **kwargs)
    File "C:\buildbot\3.0.heller-windows-amd64\build\lib\bsddb\test\test_thread.py", line 278, in _writerThread
    self.assertEqual(data, self.makeData(key))
    File "C:\buildbot\3.0.heller-windows-amd64\build\lib\unittest.py", line 325, in failUnlessEqual
    raise self.failureException(msg or '%r != %r' % (first, second))
    AssertionError: None != b'2001-2001-2001-2001-2001'

    4 tests failed:
    test_httpservers test_pydoc test_site test_winsound

    ======================================================================
    ERROR: test_post (test.test_httpservers.CGIHTTPServerTestCase)
    ----------------------------------------------------------------------

    Traceback (most recent call last):
    File "C:\buildbot\3.0.heller-windows-amd64\build\lib\test\test_httpservers.py", line 325, in test_post
    res = self.request('/cgi-bin/file2.py', 'POST', params, headers)
    File "C:\buildbot\3.0.heller-windows-amd64\build\lib\test\test_httpservers.py", line 63, in request
    return self.connection.getresponse()
    File "C:\buildbot\3.0.heller-windows-amd64\build\lib\http\client.py", line 975, in getresponse
    response.begin()
    File "C:\buildbot\3.0.heller-windows-amd64\build\lib\http\client.py", line 395, in begin
    version, status, reason = self._read_status()
    File "C:\buildbot\3.0.heller-windows-amd64\build\lib\http\client.py", line 351, in _read_status
    line = str(self.fp.readline(), "iso-8859-1")
    File "C:\buildbot\3.0.heller-windows-amd64\build\lib\io.py", line 510, in readline
    b = self.read(nreadahead())
    File "C:\buildbot\3.0.heller-windows-amd64\build\lib\io.py", line 577, in read
    n = self.readinto(b)
    File "C:\buildbot\3.0.heller-windows-amd64\build\lib\socket.py", line 217, in readinto
    return self._sock.recv_into(b)
    socket.error: [Errno 10053] An established connection was aborted by the software in your host machine

    ======================================================================
    FAIL: test_authorization (test.test_httpservers.CGIHTTPServerTestCase)
    ----------------------------------------------------------------------

    Traceback (most recent call last):
    File "C:\buildbot\3.0.heller-windows-amd64\build\lib\test\test_httpservers.py", line 339, in test_authorization
    (res.read(), res.getheader('Content-type'), res.status))
    AssertionError: (b'Hello World\n', 'text/html', 200) != (b'', None, 200)

    ======================================================================
    FAIL: test_headers_and_content (test.test_httpservers.CGIHTTPServerTestCase)
    ----------------------------------------------------------------------

    Traceback (most recent call last):
    File "C:\buildbot\3.0.heller-windows-amd64\build\lib\test\test_httpservers.py", line 320, in test_headers_and_content
    (res.read(), res.getheader('Content-type'), res.status))
    AssertionError: (b'Hello World\n', 'text/html', 200) != (b'', None, 200)

    ======================================================================
    FAIL: test_html_doc (test.test_pydoc.PyDocDocTest)
    ----------------------------------------------------------------------

    Traceback (most recent call last):
    File "C:\buildbot\3.0.heller-windows-amd64\build\lib\test\test_pydoc.py", line 237, in test_html_doc
    self.fail("outputs are not equal, see diff above")
    AssertionError: outputs are not equal, see diff above

    ======================================================================
    FAIL: test_s_option (test.test_site.HelperFunctionsTests)
    ----------------------------------------------------------------------

    Traceback (most recent call last):
    File "C:\buildbot\3.0.heller-windows-amd64\build\lib\test\test_site.py", line 105, in test_s_option
    self.assertEqual(rc, 1)
    AssertionError: 0 != 1

    ======================================================================
    ERROR: test_alias_asterisk (test.test_winsound.PlaySoundTest)
    ----------------------------------------------------------------------

    Traceback (most recent call last):
    File "C:\buildbot\3.0.heller-windows-amd64\build\lib\test\test_winsound.py", line 87, in test_alias_asterisk
    winsound.PlaySound('SystemAsterisk', winsound.SND_ALIAS)
    RuntimeError: Failed to play sound

    ======================================================================
    ERROR: test_alias_exclamation (test.test_winsound.PlaySoundTest)
    ----------------------------------------------------------------------

    Traceback (most recent call last):
    File "C:\buildbot\3.0.heller-windows-amd64\build\lib\test\test_winsound.py", line 97, in test_alias_exclamation
    winsound.PlaySound('SystemExclamation', winsound.SND_ALIAS)
    RuntimeError: Failed to play sound

    ======================================================================
    ERROR: test_alias_exit (test.test_winsound.PlaySoundTest)
    ----------------------------------------------------------------------

    Traceback (most recent call last):
    File "C:\buildbot\3.0.heller-windows-amd64\build\lib\test\test_winsound.py", line 107, in test_alias_exit
    winsound.PlaySound('SystemExit', winsound.SND_ALIAS)
    RuntimeError: Failed to play sound

    ======================================================================
    ERROR: test_alias_hand (test.test_winsound.PlaySoundTest)
    ----------------------------------------------------------------------

    Traceback (most recent call last):
    File "C:\buildbot\3.0.heller-windows-amd64\build\lib\test\test_winsound.py", line 117, in test_alias_hand
    winsound.PlaySound('SystemHand', winsound.SND_ALIAS)
    RuntimeError: Failed to play sound

    ======================================================================
    ERROR: test_alias_question (test.test_winsound.PlaySoundTest)
    ----------------------------------------------------------------------

    Traceback (most recent call last):
    File "C:\buildbot\3.0.heller-windows-amd64\build\lib\test\test_winsound.py", line 127, in test_alias_question
    winsound.PlaySound('SystemQuestion', winsound.SND_ALIAS)
    RuntimeError: Failed to play sound

    Traceback (most recent call last):
    File "C:\buildbot\3.0.heller-windows-amd64\build\lib\socketserver.py", line 281, in _handle_request_noblock
    self.process_request(request, client_address)
    File "C:\buildbot\3.0.heller-windows-amd64\build\lib\socketserver.py", line 307, in process_request
    self.finish_request(request, client_address)
    File "C:\buildbot\3.0.heller-windows-amd64\build\lib\socketserver.py", line 320, in finish_request
    self.RequestHandlerClass(request, client_address, self)
    File "C:\buildbot\3.0.heller-windows-amd64\build\lib\socketserver.py", line 614, in __init__
    self.handle()
    File "C:\buildbot\3.0.heller-windows-amd64\build\lib\http\server.py", line 364, in handle
    self.handle_one_request()
    File "C:\buildbot\3.0.heller-windows-amd64\build\lib\http\server.py", line 358, in handle_one_request
    method()
    File "C:\buildbot\3.0.heller-windows-amd64\build\lib\http\server.py", line 617, in do_GET
    f = self.send_head()
    File "C:\buildbot\3.0.heller-windows-amd64\build\lib\http\server.py", line 849, in send_head
    return self.run_cgi()
    File "C:\buildbot\3.0.heller-windows-amd64\build\lib\http\server.py", line 1102, in run_cgi
    exec(open(scriptfile).read(), {"__name__": "__main__"})
    File "<string>", line 3, in <module>
    File "C:\buildbot\3.0.heller-windows-amd64\build\lib\socket.py", line 222, in write
    return self._sock.send(b)
    TypeError: send() argument 1 must be bytes or read-only buffer, not str

    Traceback (most recent call last):
    File "C:\buildbot\3.0.heller-windows-amd64\build\lib\socketserver.py", line 281, in _handle_request_noblock
    self.process_request(request, client_address)
    File "C:\buildbot\3.0.heller-windows-amd64\build\lib\socketserver.py", line 307, in process_request
    self.finish_request(request, client_address)
    File "C:\buildbot\3.0.heller-windows-amd64\build\lib\socketserver.py", line 320, in finish_request
    self.RequestHandlerClass(request, client_address, self)
    File "C:\buildbot\3.0.heller-windows-amd64\build\lib\socketserver.py", line 614, in __init__
    self.handle()
    File "C:\buildbot\3.0.heller-windows-amd64\build\lib\http\server.py", line 364, in handle
    self.handle_one_request()
    File "C:\buildbot\3.0.heller-windows-amd64\build\lib\http\server.py", line 358, in handle_one_request
    method()
    File "C:\buildbot\3.0.heller-windows-amd64\build\lib\http\server.py", line 617, in do_GET
    f = self.send_head()
    File "C:\buildbot\3.0.heller-windows-amd64\build\lib\http\server.py", line 849, in send_head
    return self.run_cgi()
    File "C:\buildbot\3.0.heller-windows-amd64\build\lib\http\server.py", line 1102, in run_cgi
    exec(open(scriptfile).read(), {"__name__": "__main__"})
    File "<string>", line 3, in <module>
    File "C:\buildbot\3.0.heller-windows-amd64\build\lib\socket.py", line 222, in write
    return self._sock.send(b)
    TypeError: send() argument 1 must be bytes or read-only buffer, not str

    Traceback (most recent call last):
    File "C:\buildbot\3.0.heller-windows-amd64\build\lib\socketserver.py", line 281, in _handle_request_noblock
    self.process_request(request, client_address)
    File "C:\buildbot\3.0.heller-windows-amd64\build\lib\socketserver.py", line 307, in process_request
    self.finish_request(request, client_address)
    File "C:\buildbot\3.0.heller-windows-amd64\build\lib\socketserver.py", line 320, in finish_request
    self.RequestHandlerClass(request, client_address, self)
    File "C:\buildbot\3.0.heller-windows-amd64\build\lib\socketserver.py", line 614, in __init__
    self.handle()
    File "C:\buildbot\3.0.heller-windows-amd64\build\lib\http\server.py", line 364, in handle
    self.handle_one_request()
    File "C:\buildbot\3.0.heller-windows-amd64\build\lib\http\server.py", line 358, in handle_one_request
    method()
    File "C:\buildbot\3.0.heller-windows-amd64\build\lib\http\server.py", line 842, in do_POST
    self.run_cgi()
    File "C:\buildbot\3.0.heller-windows-amd64\build\lib\http\server.py", line 1102, in run_cgi
    exec(open(scriptfile).read(), {"__name__": "__main__"})
    File "<string>", line 4, in <module>
    File "C:\buildbot\3.0.heller-windows-amd64\build\lib\socket.py", line 222, in write
    return self._sock.send(b)
    TypeError: send() argument 1 must be bytes or read-only buffer, not str

    sincerely,
    -The Buildbot
  • Buildbot at May 29, 2008 at 8:52 am
    The Buildbot has detected a new failure of amd64 XP 3.0.
    Full details are available at:
    http://www.python.org/dev/buildbot/all/amd64%20XP%203.0/builds/965

    Buildbot URL: http://www.python.org/dev/buildbot/all/

    Buildslave for this Build: heller-windows-amd64

    Build Reason:
    Build Source Stamp: [branch branches/py3k] HEAD
    Blamelist: georg.brandl

    BUILD FAILED: failed compile

    sincerely,
    -The Buildbot
  • Buildbot at May 30, 2008 at 12:53 pm
    The Buildbot has detected a new failure of amd64 XP 3.0.
    Full details are available at:
    http://www.python.org/dev/buildbot/all/amd64%20XP%203.0/builds/970

    Buildbot URL: http://www.python.org/dev/buildbot/all/

    Buildslave for this Build: heller-windows-amd64

    Build Reason:
    Build Source Stamp: [branch branches/py3k] HEAD
    Blamelist: georg.brandl

    BUILD FAILED: failed failed slave lost

    sincerely,
    -The Buildbot

Related Discussions

Discussion Navigation
viewthread | post
Discussion Overview
grouppython-checkins @
categoriespython
postedMay 1, '08 at 2:28a
activeMay 30, '08 at 12:53p
posts43
users1
websitepython.org

1 user in discussion

Buildbot: 43 posts

People

Translate

site design / logo © 2019 Grokbase