Grokbase Groups Pig dev November 2010
FAQ
See <https://hudson.apache.org/hudson/job/Pig-trunk-commit/602/changes>

Changes:

[nigel] Add some comments to commitBuild.sh and put artifacts in a single directory that can be cleaned up.

------------------------------------------
[...truncated 5858 lines...]
---------------------------------------------------------------------
[ivy:retrieve] :: retrieving :: org.apache.pig#Pig
[ivy:retrieve] confs: [test]
[ivy:retrieve] 1 artifacts copied, 38 already retrieved (288kB/19ms)

compile-test:
[echo] *** Building Test Sources ***
[echo] *** To compile with all warnings enabled, supply -Dall.warnings=1 on command line ***
[echo] *** If all.warnings property is supplied, compile-sources-all-warnings target will be executed ***
[echo] *** Else, compile-sources (which only warns about deprecations) target will be executed ***

compile-sources:
[javac] Compiling 250 source files to <https://hudson.apache.org/hudson/job/Pig-trunk-commit/ws/trunk/build/test/classes>
[clover] Clover Version 3.0.2, built on April 13 2010 (build-790)
[clover] Loaded from: /homes/hudson/tools/clover/latest/lib/clover.jar
[clover] Clover: Open Source License registered to Apache.
[clover] Updating existing database at '<https://hudson.apache.org/hudson/job/Pig-trunk-commit/ws/trunk/build/test/clover/db/pig_coverage.db'.>
[clover] Processing files at 1.5 source level.
[clover] Clover all over. Instrumented 0 files (0 packages).
[clover] Elapsed time = 0.001 secs. (0 files/sec, 0 srclines/sec)
[javac] Note: Some input files use or override a deprecated API.
[javac] Note: Recompile with -Xlint:deprecation for details.
[javac] Note: Some input files use unchecked or unsafe operations.
[javac] Note: Recompile with -Xlint:unchecked for details.

compile-sources-all-warnings:
[copy] Copying 1 file to <https://hudson.apache.org/hudson/job/Pig-trunk-commit/ws/trunk/build/test/classes>

jar-withouthadoop:

jar-withouthadoopWithSvn:

ivy-download:
[get] Getting: http://repo2.maven.org/maven2/org/apache/ivy/ivy/2.2.0-rc1/ivy-2.2.0-rc1.jar
[get] To: <https://hudson.apache.org/hudson/job/Pig-trunk-commit/ws/trunk/ivy/ivy-2.2.0-rc1.jar>
[get] Not modified - so not downloaded

ivy-init-dirs:

ivy-probe-antlib:

ivy-init-antlib:

ivy-init:

ivy-buildJar:
[ivy:resolve] :: resolving dependencies :: org.apache.pig#Pig;0.9.0-SNAPSHOT
[ivy:resolve] confs: [buildJar]
[ivy:resolve] found commons-el#commons-el;1.0 in default
[ivy:resolve] found log4j#log4j;1.2.14 in maven2
[ivy:resolve] found org.apache.hadoop#hadoop-core;0.20.2 in maven2
[ivy:resolve] found commons-cli#commons-cli;1.2 in default
[ivy:resolve] found xmlenc#xmlenc;0.52 in default
[ivy:resolve] found commons-httpclient#commons-httpclient;3.0.1 in default
[ivy:resolve] found commons-codec#commons-codec;1.3 in default
[ivy:resolve] found commons-net#commons-net;1.4.1 in default
[ivy:resolve] found oro#oro;2.0.8 in default
[ivy:resolve] found org.mortbay.jetty#jetty;6.1.14 in default
[ivy:resolve] found org.mortbay.jetty#jetty-util;6.1.14 in default
[ivy:resolve] found org.mortbay.jetty#servlet-api-2.5;6.1.14 in default
[ivy:resolve] found tomcat#jasper-runtime;5.5.12 in default
[ivy:resolve] found tomcat#jasper-compiler;5.5.12 in default
[ivy:resolve] found org.mortbay.jetty#jsp-api-2.1;6.1.14 in default
[ivy:resolve] found org.mortbay.jetty#jsp-2.1;6.1.14 in default
[ivy:resolve] found org.eclipse.jdt#core;3.1.1 in default
[ivy:resolve] found ant#ant;1.6.5 in default
[ivy:resolve] found net.java.dev.jets3t#jets3t;0.7.1 in default
[ivy:resolve] found commons-logging#commons-logging;1.1.1 in default
[ivy:resolve] found net.sf.kosmosfs#kfs;0.3 in default
[ivy:resolve] found junit#junit;4.5 in default
[ivy:resolve] found hsqldb#hsqldb;1.8.0.10 in default
[ivy:resolve] found org.apache.hadoop#hadoop-test;0.20.2 in maven2
[ivy:resolve] found org.apache.ftpserver#ftplet-api;1.0.0 in default
[ivy:resolve] found org.apache.mina#mina-core;2.0.0-M5 in default
[ivy:resolve] found org.slf4j#slf4j-api;1.5.2 in maven2
[ivy:resolve] found org.apache.ftpserver#ftpserver-core;1.0.0 in default
[ivy:resolve] found org.apache.ftpserver#ftpserver-deprecated;1.0.0-M2 in default
[ivy:resolve] found org.slf4j#slf4j-log4j12;1.4.3 in maven2
[ivy:resolve] found com.jcraft#jsch;0.1.38 in default
[ivy:resolve] found jline#jline;0.9.94 in default
[ivy:resolve] found net.java.dev.javacc#javacc;4.2 in default
[ivy:resolve] found org.codehaus.jackson#jackson-mapper-asl;1.0.1 in default
[ivy:resolve] found org.codehaus.jackson#jackson-core-asl;1.0.1 in default
[ivy:resolve] found joda-time#joda-time;1.6 in maven2
[ivy:resolve] found commons-lang#commons-lang;2.4 in default
[ivy:resolve] found com.google.guava#guava;r06 in maven2
[ivy:resolve] found org.python#jython;2.5.0 in maven2
[ivy:resolve] :: resolution report :: resolve 558ms :: artifacts dl 30ms
[ivy:resolve] :: evicted modules:
[ivy:resolve] junit#junit;3.8.1 by [junit#junit;4.5] in [buildJar]
[ivy:resolve] commons-logging#commons-logging;1.0.3 by [commons-logging#commons-logging;1.1.1] in [buildJar]
[ivy:resolve] commons-codec#commons-codec;1.2 by [commons-codec#commons-codec;1.3] in [buildJar]
[ivy:resolve] commons-httpclient#commons-httpclient;3.1 by [commons-httpclient#commons-httpclient;3.0.1] in [buildJar]
[ivy:resolve] org.apache.mina#mina-core;2.0.0-M4 by [org.apache.mina#mina-core;2.0.0-M5] in [buildJar]
[ivy:resolve] org.apache.ftpserver#ftplet-api;1.0.0-M2 by [org.apache.ftpserver#ftplet-api;1.0.0] in [buildJar]
[ivy:resolve] org.apache.ftpserver#ftpserver-core;1.0.0-M2 by [org.apache.ftpserver#ftpserver-core;1.0.0] in [buildJar]
[ivy:resolve] org.apache.mina#mina-core;2.0.0-M2 by [org.apache.mina#mina-core;2.0.0-M5] in [buildJar]
---------------------------------------------------------------------
modules || artifacts |
conf | number| search|dwnlded|evicted|| number|dwnlded|
---------------------------------------------------------------------
buildJar | 47 | 0 | 0 | 8 || 39 | 0 |
---------------------------------------------------------------------
[ivy:retrieve] :: retrieving :: org.apache.pig#Pig
[ivy:retrieve] confs: [buildJar]
[ivy:retrieve] 0 artifacts copied, 39 already retrieved (0kB/12ms)

buildJar-withouthadoop:
[echo] svnString 1037119
[jar] Building jar: <https://hudson.apache.org/hudson/job/Pig-trunk-commit/ws/trunk/build/pig-0.9.0-SNAPSHOT-core.jar>
[jar] Building jar: <https://hudson.apache.org/hudson/job/Pig-trunk-commit/ws/trunk/build/pig-0.9.0-SNAPSHOT-withouthadoop.jar>
[copy] Copying 1 file to <https://hudson.apache.org/hudson/job/Pig-trunk-commit/ws/trunk>

jar-withouthadoopWithOutSvn:

test-commit:
[mkdir] Created dir: <https://hudson.apache.org/hudson/job/Pig-trunk-commit/ws/trunk/build/test/logs>
[mkdir] Created dir: /tmp/pig_junit_tmp1259510305
[junit] WARNING: multiple versions of ant detected in path for junit
[junit] jar:file:/homes/hudson/tools/ant/latest/lib/ant.jar!/org/apache/tools/ant/Project.class
[junit] and jar:file:/homes/hudson/.ivy2/cache/ant/ant/jars/ant-1.6.5.jar!/org/apache/tools/ant/Project.class
[junit] Running org.apache.pig.test.TestAdd
[junit] Tests run: 1, Failures: 0, Errors: 0, Time elapsed: 0.085 sec
[junit] Running org.apache.pig.test.TestBagFormat
[junit] Tests run: 1, Failures: 0, Errors: 0, Time elapsed: 0.232 sec
[junit] Running org.apache.pig.test.TestBoolean
[junit] Tests run: 13, Failures: 0, Errors: 0, Time elapsed: 0.233 sec
[junit] Running org.apache.pig.test.TestBuiltin
[junit] Tests run: 38, Failures: 0, Errors: 0, Time elapsed: 60.84 sec
[junit] Running org.apache.pig.test.TestCmdLineParser
[junit] Tests run: 17, Failures: 0, Errors: 0, Time elapsed: 0.111 sec
[junit] Running org.apache.pig.test.TestCommit
[junit] Tests run: 2, Failures: 0, Errors: 0, Time elapsed: 215.876 sec
[junit] Running org.apache.pig.test.TestConstExpr
[junit] Tests run: 10, Failures: 0, Errors: 0, Time elapsed: 0.082 sec
[junit] Running org.apache.pig.test.TestConversions
[junit] Tests run: 20, Failures: 0, Errors: 0, Time elapsed: 0.387 sec
[junit] Running org.apache.pig.test.TestDataBag
[junit] Tests run: 29, Failures: 0, Errors: 0, Time elapsed: 0.959 sec
[junit] Running org.apache.pig.test.TestDataModel
[junit] Tests run: 22, Failures: 0, Errors: 0, Time elapsed: 0.271 sec
[junit] Running org.apache.pig.test.TestDeleteOnFail
[junit] Tests run: 5, Failures: 0, Errors: 0, Time elapsed: 0.089 sec
[junit] Running org.apache.pig.test.TestDivide
[junit] Tests run: 1, Failures: 0, Errors: 0, Time elapsed: 0.083 sec
[junit] Running org.apache.pig.test.TestEqualTo
[junit] Tests run: 22, Failures: 0, Errors: 0, Time elapsed: 0.258 sec
[junit] Running org.apache.pig.test.TestExampleGenerator
[junit] Tests run: 7, Failures: 0, Errors: 0, Time elapsed: 4.88 sec
[junit] Running org.apache.pig.test.TestForEach
[junit] Tests run: 1, Failures: 0, Errors: 0, Time elapsed: 0.27 sec
[junit] Running org.apache.pig.test.TestFuncSpec
[junit] Tests run: 4, Failures: 0, Errors: 0, Time elapsed: 0.226 sec
[junit] Running org.apache.pig.test.TestGTOrEqual
[junit] Tests run: 24, Failures: 0, Errors: 0, Time elapsed: 0.246 sec
[junit] Running org.apache.pig.test.TestGreaterThan
[junit] Tests run: 24, Failures: 0, Errors: 0, Time elapsed: 0.262 sec
[junit] Running org.apache.pig.test.TestInputOutputFileValidator
[junit] Tests run: 7, Failures: 0, Errors: 0, Time elapsed: 56.102 sec
[junit] Running org.apache.pig.test.TestInstantiateFunc
[junit] Tests run: 5, Failures: 0, Errors: 0, Time elapsed: 0.142 sec
[junit] Running org.apache.pig.test.TestLTOrEqual
[junit] Tests run: 24, Failures: 0, Errors: 0, Time elapsed: 0.266 sec
[junit] Running org.apache.pig.test.TestLessThan
[junit] Tests run: 24, Failures: 0, Errors: 0, Time elapsed: 0.271 sec
[junit] Running org.apache.pig.test.TestLoad
[junit] Tests run: 15, Failures: 0, Errors: 1, Time elapsed: 69.299 sec
[junit] Test org.apache.pig.test.TestLoad FAILED
[junit] Running org.apache.pig.test.TestLocalPOSplit
[junit] Tests run: 2, Failures: 0, Errors: 0, Time elapsed: 0.658 sec
[junit] Running org.apache.pig.test.TestLocalRearrange
[junit] Tests run: 3, Failures: 0, Errors: 0, Time elapsed: 31.655 sec
[junit] Running org.apache.pig.test.TestLogToPhyCompiler
[junit] Tests run: 23, Failures: 0, Errors: 0, Time elapsed: 1.491 sec
[junit] Running org.apache.pig.test.TestLogicalOptimizer
[junit] Tests run: 18, Failures: 0, Errors: 0, Time elapsed: 2.114 sec
[junit] Running org.apache.pig.test.TestLogicalPlanBuilder
[junit] Tests run: 156, Failures: 0, Errors: 0, Time elapsed: 10.666 sec
[junit] Running org.apache.pig.test.TestMRCompiler
[junit] Tests run: 25, Failures: 0, Errors: 0, Time elapsed: 0.773 sec
[junit] Running org.apache.pig.test.TestMod
[junit] Tests run: 1, Failures: 0, Errors: 0, Time elapsed: 0.075 sec
[junit] Running org.apache.pig.test.TestMultiQueryLocal
[junit] Tests run: 15, Failures: 0, Errors: 0, Time elapsed: 142.248 sec
[junit] Running org.apache.pig.test.TestMultiply
[junit] Tests run: 1, Failures: 0, Errors: 0, Time elapsed: 0.081 sec
[junit] Running org.apache.pig.test.TestNotEqualTo
[junit] Tests run: 22, Failures: 0, Errors: 0, Time elapsed: 0.257 sec
[junit] Running org.apache.pig.test.TestNull
[junit] Tests run: 1, Failures: 0, Errors: 0, Time elapsed: 0.288 sec
[junit] Running org.apache.pig.test.TestOperatorPlan
[junit] Tests run: 44, Failures: 0, Errors: 0, Time elapsed: 0.859 sec
[junit] Running org.apache.pig.test.TestPOBinCond
[junit] Tests run: 7, Failures: 0, Errors: 0, Time elapsed: 0.113 sec
[junit] Running org.apache.pig.test.TestPOCast
[junit] Tests run: 12, Failures: 0, Errors: 0, Time elapsed: 0.324 sec
[junit] Running org.apache.pig.test.TestPOCogroup
[junit] Tests run: 2, Failures: 0, Errors: 0, Time elapsed: 0.285 sec
[junit] Running org.apache.pig.test.TestPODistinct
[junit] Tests run: 6, Failures: 0, Errors: 0, Time elapsed: 0.097 sec
[junit] Running org.apache.pig.test.TestPOGenerate
[junit] Tests run: 3, Failures: 0, Errors: 0, Time elapsed: 0.115 sec
[junit] Running org.apache.pig.test.TestPOMapLookUp
[junit] Tests run: 1, Failures: 0, Errors: 0, Time elapsed: 0.249 sec
[junit] Running org.apache.pig.test.TestPOSort
[junit] Tests run: 14, Failures: 0, Errors: 0, Time elapsed: 0.3 sec
[junit] Running org.apache.pig.test.TestPOUserFunc
[junit] Tests run: 6, Failures: 0, Errors: 0, Time elapsed: 0.281 sec
[junit] Running org.apache.pig.test.TestParamSubPreproc
[junit] Tests run: 30, Failures: 0, Errors: 0, Time elapsed: 0.376 sec
[junit] Running org.apache.pig.test.TestPhyOp
[junit] Tests run: 1, Failures: 0, Errors: 0, Time elapsed: 0.271 sec
[junit] Running org.apache.pig.test.TestPigScriptParser
[junit] Tests run: 2, Failures: 0, Errors: 0, Time elapsed: 8.51 sec
[junit] Running org.apache.pig.test.TestPigServer
[junit] Tests run: 20, Failures: 0, Errors: 0, Time elapsed: 29.051 sec
[junit] Running org.apache.pig.test.TestPoissonSampleLoader
[junit] Tests run: 2, Failures: 0, Errors: 0, Time elapsed: 20.424 sec
[junit] Running org.apache.pig.test.TestRegexp
[junit] Tests run: 2, Failures: 0, Errors: 0, Time elapsed: 0.204 sec
[junit] Running org.apache.pig.test.TestSchema
[junit] Tests run: 14, Failures: 0, Errors: 0, Time elapsed: 36.598 sec
[junit] Running org.apache.pig.test.TestSchemaParser
[junit] Tests run: 4, Failures: 0, Errors: 0, Time elapsed: 0.292 sec
[junit] Running org.apache.pig.test.TestSchemaUtil
[junit] Tests run: 2, Failures: 0, Errors: 0, Time elapsed: 0.229 sec
[junit] Running org.apache.pig.test.TestStore
[junit] Tests run: 17, Failures: 1, Errors: 2, Time elapsed: 265.187 sec
[junit] Test org.apache.pig.test.TestStore FAILED
[junit] Running org.apache.pig.test.TestStringUDFs
[junit] Tests run: 6, Failures: 0, Errors: 0, Time elapsed: 0.101 sec
[junit] Running org.apache.pig.test.TestTypeChecking
[junit] Tests run: 8, Failures: 0, Errors: 0, Time elapsed: 0.806 sec
[junit] Running org.apache.pig.test.TestTypeCheckingValidatorNoSchema
[junit] Tests run: 13, Failures: 0, Errors: 0, Time elapsed: 0.357 sec
[delete] Deleting directory /tmp/pig_junit_tmp1259510305

BUILD FAILED
<https://hudson.apache.org/hudson/job/Pig-trunk-commit/ws/trunk/build.xml>:641: The following error occurred while executing this line:
<https://hudson.apache.org/hudson/job/Pig-trunk-commit/ws/trunk/build.xml>:718: Tests failed!

Total time: 21 minutes 20 seconds
[FINDBUGS] Skipping publisher since build result is FAILURE
Publishing Javadoc
Archiving artifacts
Recording test results
Recording fingerprints
Publishing Clover coverage report...
No Clover report will be published due to a Build Failure

Search Discussions

Related Discussions

Discussion Navigation
viewthread | post
Discussion Overview
groupdev @
categoriespig, hadoop
postedNov 20, '10 at 6:51a
activeNov 20, '10 at 7:33a
posts2
users1
websitepig.apache.org

1 user in discussion

Apache Hudson Server: 2 posts

People

Translate

site design / logo © 2022 Grokbase