Grokbase Groups Pig dev August 2008
FAQ
See http://hudson.zones.apache.org/hudson/job/Pig-trunk/267/changes

------------------------------------------
[...truncated 527 lines...]

compile-sources:
[javac] Compiling 241 source files to /zonestorage/hudson/home/hudson/hudson/jobs/Pig-trunk/workspace/trunk/build/classes
[javac] Note: Some input files use or override a deprecated API.
[javac] Note: Recompile with -Xlint:deprecation for details.
[javac] Note: Some input files use unchecked or unsafe operations.
[javac] Note: Recompile with -Xlint:unchecked for details.

jar:

jarWithSvn:

buildJar:
[echo] svnString 687246
[jar] Building jar: /zonestorage/hudson/home/hudson/hudson/jobs/Pig-trunk/workspace/trunk/build/pig-2008-08-20_05-42-21-core.jar
[jar] Building jar: /zonestorage/hudson/home/hudson/hudson/jobs/Pig-trunk/workspace/trunk/build/pig-2008-08-20_05-42-21.jar
[copy] Copying 1 file to /zonestorage/hudson/home/hudson/hudson/jobs/Pig-trunk/workspace/trunk

jarWithOutSvn:

javadoc:
[mkdir] Created dir: /zonestorage/hudson/home/hudson/hudson/jobs/Pig-trunk/workspace/trunk/build/docs/api
[javadoc] Generating Javadoc
[javadoc] Javadoc execution
[javadoc] Loading source files for package org.apache.pig...
[javadoc] Loading source files for package org.apache.pig.backend.datastorage...
[javadoc] Loading source files for package org.apache.pig.backend.executionengine...
[javadoc] Loading source files for package org.apache.pig.backend.hadoop.datastorage...
[javadoc] Loading source files for package org.apache.pig.backend.hadoop.executionengine...
[javadoc] Loading source files for package org.apache.pig.backend.hadoop.executionengine.mapreduceExec...
[javadoc] Loading source files for package org.apache.pig.backend.hadoop.streaming...
[javadoc] Loading source files for package org.apache.pig.backend.local.datastorage...
[javadoc] Loading source files for package org.apache.pig.backend.local.executionengine...
[javadoc] Loading source files for package org.apache.pig.builtin...
[javadoc] Loading source files for package org.apache.pig.data...
[javadoc] Loading source files for package org.apache.pig.impl...
[javadoc] Loading source files for package org.apache.pig.impl.builtin...
[javadoc] Loading source files for package org.apache.pig.impl.eval...
[javadoc] Loading source files for package org.apache.pig.impl.eval.collector...
[javadoc] Loading source files for package org.apache.pig.impl.eval.cond...
[javadoc] Loading source files for package org.apache.pig.impl.eval.window...
[javadoc] Loading source files for package org.apache.pig.impl.io...
[javadoc] Loading source files for package org.apache.pig.impl.logicalLayer...
[javadoc] Loading source files for package org.apache.pig.impl.logicalLayer.optimizer...
[javadoc] Loading source files for package org.apache.pig.impl.logicalLayer.optimizer.streaming...
[javadoc] Loading source files for package org.apache.pig.impl.logicalLayer.parser...
[javadoc] Loading source files for package org.apache.pig.impl.logicalLayer.schema...
[javadoc] Loading source files for package org.apache.pig.impl.physicalLayer...
[javadoc] Loading source files for package org.apache.pig.impl.streaming...
[javadoc] Loading source files for package org.apache.pig.impl.util...
[javadoc] Loading source files for package org.apache.pig.pen...
[javadoc] Loading source files for package org.apache.pig.tools.cmdline...
[javadoc] Loading source files for package org.apache.pig.tools.grunt...
[javadoc] Loading source files for package org.apache.pig.tools.parameters...
[javadoc] Loading source files for package org.apache.pig.tools.streams...
[javadoc] Loading source files for package org.apache.pig.tools.timer...
[javadoc] Constructing Javadoc information...
[javadoc] javadoc: warning - Multiple sources of package comments found for package "org.apache.commons.logging"
[javadoc] Standard Doclet version 1.6.0_06
[javadoc] Building tree for all the packages and classes...
[javadoc] /zonestorage/hudson/home/hudson/hudson/jobs/Pig-trunk/workspace/trunk/src/org/apache/pig/EvalFunc.java:156: warning - @return tag has no arguments.
[javadoc] /zonestorage/hudson/home/hudson/hudson/jobs/Pig-trunk/workspace/trunk/src/org/apache/pig/PigServer.java:469: warning - @return tag has no arguments.
[javadoc] /zonestorage/hudson/home/hudson/hudson/jobs/Pig-trunk/workspace/trunk/src/org/apache/pig/PigServer.java:183: warning - @param argument "aliases" is not a parameter name.
[javadoc] /zonestorage/hudson/home/hudson/hudson/jobs/Pig-trunk/workspace/trunk/src/org/apache/pig/PigServer.java:261: warning - @return tag cannot be used in method with void return type.
[javadoc] /zonestorage/hudson/home/hudson/hudson/jobs/Pig-trunk/workspace/trunk/src/org/apache/pig/PigServer.java:354: warning - @param argument "id:" is not a parameter name.
[javadoc] /zonestorage/hudson/home/hudson/hudson/jobs/Pig-trunk/workspace/trunk/src/org/apache/pig/PigServer.java:354: warning - @param argument "filename:" is not a parameter name.
[javadoc] /zonestorage/hudson/home/hudson/hudson/jobs/Pig-trunk/workspace/trunk/src/org/apache/pig/backend/datastorage/ElementDescriptor.java:119: warning - @param argument "name" is not a parameter name.
[javadoc] /zonestorage/hudson/home/hudson/hudson/jobs/Pig-trunk/workspace/trunk/src/org/apache/pig/backend/executionengine/ExecJob.java:72: warning - @return tag has no arguments.
[javadoc] /zonestorage/hudson/home/hudson/hudson/jobs/Pig-trunk/workspace/trunk/src/org/apache/pig/backend/executionengine/ExecJob.java:65: warning - @return tag has no arguments.
[javadoc] /zonestorage/hudson/home/hudson/hudson/jobs/Pig-trunk/workspace/trunk/src/org/apache/pig/backend/executionengine/ExecJob.java:81: warning - @return tag has no arguments.
[javadoc] /zonestorage/hudson/home/hudson/hudson/jobs/Pig-trunk/workspace/trunk/src/org/apache/pig/backend/executionengine/ExecJob.java:56: warning - @return tag has no arguments.
[javadoc] /zonestorage/hudson/home/hudson/hudson/jobs/Pig-trunk/workspace/trunk/src/org/apache/pig/backend/executionengine/ExecutionEngine.java:126: warning - @return tag has no arguments.
[javadoc] /zonestorage/hudson/home/hudson/hudson/jobs/Pig-trunk/workspace/trunk/src/org/apache/pig/backend/executionengine/ExecutionEngine.java:103: warning - @throws tag has no arguments.
[javadoc] /zonestorage/hudson/home/hudson/hudson/jobs/Pig-trunk/workspace/trunk/src/org/apache/pig/backend/executionengine/ExecutionEngine.java:118: warning - @return tag has no arguments.
[javadoc] /zonestorage/hudson/home/hudson/hudson/jobs/Pig-trunk/workspace/trunk/src/org/apache/pig/backend/executionengine/ExecutionEngine.java:90: warning - @param argument "logical" is not a parameter name.
[javadoc] /zonestorage/hudson/home/hudson/hudson/jobs/Pig-trunk/workspace/trunk/src/org/apache/pig/backend/hadoop/executionengine/mapreduceExec/MapReduceLauncher.java:133: warning - @param argument "mapFuncs" is not a parameter name.
[javadoc] /zonestorage/hudson/home/hudson/hudson/jobs/Pig-trunk/workspace/trunk/src/org/apache/pig/backend/hadoop/executionengine/mapreduceExec/MapReduceLauncher.java:133: warning - @param argument "groupFuncs" is not a parameter name.
[javadoc] /zonestorage/hudson/home/hudson/hudson/jobs/Pig-trunk/workspace/trunk/src/org/apache/pig/backend/hadoop/executionengine/mapreduceExec/MapReduceLauncher.java:133: warning - @param argument "reduceFunc" is not a parameter name.
[javadoc] /zonestorage/hudson/home/hudson/hudson/jobs/Pig-trunk/workspace/trunk/src/org/apache/pig/backend/hadoop/executionengine/mapreduceExec/MapReduceLauncher.java:133: warning - @param argument "mapTasks" is not a parameter name.
[javadoc] /zonestorage/hudson/home/hudson/hudson/jobs/Pig-trunk/workspace/trunk/src/org/apache/pig/backend/hadoop/executionengine/mapreduceExec/MapReduceLauncher.java:133: warning - @param argument "reduceTasks" is not a parameter name.
[javadoc] /zonestorage/hudson/home/hudson/hudson/jobs/Pig-trunk/workspace/trunk/src/org/apache/pig/backend/hadoop/executionengine/mapreduceExec/MapReduceLauncher.java:133: warning - @param argument "input" is not a parameter name.
[javadoc] /zonestorage/hudson/home/hudson/hudson/jobs/Pig-trunk/workspace/trunk/src/org/apache/pig/backend/hadoop/executionengine/mapreduceExec/MapReduceLauncher.java:133: warning - @param argument "output" is not a parameter name.
[javadoc] /zonestorage/hudson/home/hudson/hudson/jobs/Pig-trunk/workspace/trunk/src/org/apache/pig/backend/hadoop/executionengine/mapreduceExec/PigOutputFormat.java:99: warning - Tag @see: can't find write(org.apache.hadoop.io.WritableComparable,
[javadoc] org.apache.hadoop.io.Writable) in org.apache.hadoop.mapred.RecordWriter
[javadoc] /zonestorage/hudson/home/hudson/hudson/jobs/Pig-trunk/workspace/trunk/src/org/apache/pig/impl/streaming/ExecutableManager.java:296: warning - Tag @link: reference not found: ProcessErrorThread
[javadoc] /zonestorage/hudson/home/hudson/hudson/jobs/Pig-trunk/workspace/trunk/src/org/apache/pig/data/DataMap.java:95: warning - @return tag has no arguments.
[javadoc] /zonestorage/hudson/home/hudson/hudson/jobs/Pig-trunk/workspace/trunk/src/org/apache/pig/impl/PigContext.java:351: warning - @return tag has no arguments.
[javadoc] /zonestorage/hudson/home/hudson/hudson/jobs/Pig-trunk/workspace/trunk/src/org/apache/pig/impl/PigContext.java:322: warning - @param argument "aliases" is not a parameter name.
[javadoc] /zonestorage/hudson/home/hudson/hudson/jobs/Pig-trunk/workspace/trunk/src/org/apache/pig/impl/eval/EvalSpec.java:153: warning - @return tag has no arguments.
[javadoc] /zonestorage/hudson/home/hudson/hudson/jobs/Pig-trunk/workspace/trunk/src/org/apache/pig/impl/eval/EvalSpec.java:169: warning - @return tag has no arguments.
[javadoc] /zonestorage/hudson/home/hudson/hudson/jobs/Pig-trunk/workspace/trunk/src/org/apache/pig/impl/eval/EvalSpec.java:143: warning - @return tag has no arguments.
[javadoc] /zonestorage/hudson/home/hudson/hudson/jobs/Pig-trunk/workspace/trunk/src/org/apache/pig/impl/eval/EvalSpec.java:201: warning - @return tag has no arguments.
[javadoc] /zonestorage/hudson/home/hudson/hudson/jobs/Pig-trunk/workspace/trunk/src/org/apache/pig/impl/eval/EvalSpec.java:220: warning - @return tag has no arguments.
[javadoc] /zonestorage/hudson/home/hudson/hudson/jobs/Pig-trunk/workspace/trunk/src/org/apache/pig/impl/eval/EvalSpec.java:169: warning - @param argument "input" is not a parameter name.
[javadoc] /zonestorage/hudson/home/hudson/hudson/jobs/Pig-trunk/workspace/trunk/src/org/apache/pig/impl/eval/FuncEvalSpec.java:234: warning - @param argument "in" is not a parameter name.
[javadoc] /zonestorage/hudson/home/hudson/hudson/jobs/Pig-trunk/workspace/trunk/src/org/apache/pig/impl/eval/FuncEvalSpec.java:294: warning - @param argument "finalTuplePos" is not a parameter name.
[javadoc] /zonestorage/hudson/home/hudson/hudson/jobs/Pig-trunk/workspace/trunk/src/org/apache/pig/impl/streaming/DefaultInputHandler.java:33: warning - Tag @link: reference not found: InputType#SYNCHRONOUS
[javadoc] /zonestorage/hudson/home/hudson/hudson/jobs/Pig-trunk/workspace/trunk/src/org/apache/pig/impl/streaming/DefaultOutputHandler.java:33: warning - Tag @link: reference not found: OutputType#SYNCHRONOUS
[javadoc] /zonestorage/hudson/home/hudson/hudson/jobs/Pig-trunk/workspace/trunk/src/org/apache/pig/impl/streaming/ExecutableManager.java:296: warning - Tag @link: reference not found: ProcessErrorThread
[javadoc] /zonestorage/hudson/home/hudson/hudson/jobs/Pig-trunk/workspace/trunk/src/org/apache/pig/impl/streaming/FileInputHandler.java:35: warning - Tag @link: reference not found: InputType#ASYNCHRONOUS
[javadoc] /zonestorage/hudson/home/hudson/hudson/jobs/Pig-trunk/workspace/trunk/src/org/apache/pig/impl/streaming/FileOutputHandler.java:35: warning - Tag @link: reference not found: OutputType#ASYNCHRONOUS
[javadoc] /zonestorage/hudson/home/hudson/hudson/jobs/Pig-trunk/workspace/trunk/src/org/apache/pig/impl/streaming/StreamingCommand.java:92: warning - @param argument "command" is not a parameter name.
[javadoc] /zonestorage/hudson/home/hudson/hudson/jobs/Pig-trunk/workspace/trunk/src/org/apache/pig/impl/util/JarManager.java:98: warning - @return tag cannot be used in method with void return type.
[javadoc] /zonestorage/hudson/home/hudson/hudson/jobs/Pig-trunk/workspace/trunk/src/org/apache/pig/impl/util/JarManager.java:267: warning - Tag @author cannot be used in method documentation. It can only be used in the following types of documentation: overview, package, class/interface.
[javadoc] /zonestorage/hudson/home/hudson/hudson/jobs/Pig-trunk/workspace/trunk/src/org/apache/pig/impl/util/Spillable.java:28: warning - @returns is an unknown tag.
[javadoc] /zonestorage/hudson/home/hudson/hudson/jobs/Pig-trunk/workspace/trunk/src/org/apache/pig/impl/util/Spillable.java:33: warning - @returns is an unknown tag.
[javadoc] /zonestorage/hudson/home/hudson/hudson/jobs/Pig-trunk/workspace/trunk/src/org/apache/pig/tools/cmdline/CmdLineParser.java:64: warning - @param argument "valueExpected" is not a parameter name.
[javadoc] /zonestorage/hudson/home/hudson/hudson/jobs/Pig-trunk/workspace/trunk/src/org/apache/pig/tools/parameters/PreprocessorContext.java:120: warning - @param argument "overwide" is not a parameter name.
[javadoc] /zonestorage/hudson/home/hudson/hudson/jobs/Pig-trunk/workspace/trunk/src/org/apache/pig/impl/streaming/DefaultInputHandler.java:33: warning - Tag @link: reference not found: InputType#SYNCHRONOUS
[javadoc] /zonestorage/hudson/home/hudson/hudson/jobs/Pig-trunk/workspace/trunk/src/org/apache/pig/impl/streaming/DefaultOutputHandler.java:33: warning - Tag @link: reference not found: OutputType#SYNCHRONOUS
[javadoc] /zonestorage/hudson/home/hudson/hudson/jobs/Pig-trunk/workspace/trunk/src/org/apache/pig/impl/streaming/FileInputHandler.java:35: warning - Tag @link: reference not found: InputType#ASYNCHRONOUS
[javadoc] /zonestorage/hudson/home/hudson/hudson/jobs/Pig-trunk/workspace/trunk/src/org/apache/pig/impl/streaming/FileOutputHandler.java:35: warning - Tag @link: reference not found: OutputType#ASYNCHRONOUS
[javadoc] /zonestorage/hudson/home/hudson/hudson/jobs/Pig-trunk/workspace/trunk/src/org/apache/pig/impl/streaming/DefaultOutputHandler.java:33: warning - Tag @link: reference not found: OutputType#SYNCHRONOUS
[javadoc] /zonestorage/hudson/home/hudson/hudson/jobs/Pig-trunk/workspace/trunk/src/org/apache/pig/impl/streaming/FileOutputHandler.java:35: warning - Tag @link: reference not found: OutputType#ASYNCHRONOUS
[javadoc] /zonestorage/hudson/home/hudson/hudson/jobs/Pig-trunk/workspace/trunk/src/org/apache/pig/impl/streaming/DefaultInputHandler.java:33: warning - Tag @link: reference not found: InputType#SYNCHRONOUS
[javadoc] /zonestorage/hudson/home/hudson/hudson/jobs/Pig-trunk/workspace/trunk/src/org/apache/pig/impl/streaming/FileInputHandler.java:35: warning - Tag @link: reference not found: InputType#ASYNCHRONOUS
[javadoc] Building index for all the packages and classes...
[javadoc] /zonestorage/hudson/home/hudson/hudson/jobs/Pig-trunk/workspace/trunk/src/org/apache/pig/impl/streaming/DefaultInputHandler.java:33: warning - Tag @link: reference not found: InputType#SYNCHRONOUS
[javadoc] /zonestorage/hudson/home/hudson/hudson/jobs/Pig-trunk/workspace/trunk/src/org/apache/pig/impl/streaming/DefaultOutputHandler.java:33: warning - Tag @link: reference not found: OutputType#SYNCHRONOUS
[javadoc] /zonestorage/hudson/home/hudson/hudson/jobs/Pig-trunk/workspace/trunk/src/org/apache/pig/impl/streaming/FileInputHandler.java:35: warning - Tag @link: reference not found: InputType#ASYNCHRONOUS
[javadoc] /zonestorage/hudson/home/hudson/hudson/jobs/Pig-trunk/workspace/trunk/src/org/apache/pig/impl/streaming/FileOutputHandler.java:35: warning - Tag @link: reference not found: OutputType#ASYNCHRONOUS
[javadoc] Building index for all classes...
[javadoc] Generating /zonestorage/hudson/home/hudson/hudson/jobs/Pig-trunk/workspace/trunk/build/docs/api/stylesheet.css...
[javadoc] 60 warnings

doc:

init:

cc-compile:

compile:
[echo] *** Building Main Sources ***

compile-sources:
[javac] Compiling 1 source file to /zonestorage/hudson/home/hudson/hudson/jobs/Pig-trunk/workspace/trunk/build/classes

jar:

jarWithSvn:

buildJar:
[echo] svnString 687246

jarWithOutSvn:

init:

cc-compile:

compile:
[echo] *** Building Main Sources ***

compile-sources:
[javac] Compiling 1 source file to /zonestorage/hudson/home/hudson/hudson/jobs/Pig-trunk/workspace/trunk/build/classes

compile-test:
[echo] *** Building Test Sources ***

compile-sources:
[javac] Compiling 43 source files to /zonestorage/hudson/home/hudson/hudson/jobs/Pig-trunk/workspace/trunk/build/test/classes
[javac] Note: /zonestorage/hudson/home/hudson/hudson/jobs/Pig-trunk/workspace/trunk/test/org/apache/pig/test/MiniCluster.java uses or overrides a deprecated API.
[javac] Note: Recompile with -Xlint:deprecation for details.

jar:

jarWithSvn:

buildJar:
[echo] svnString 687246

jarWithOutSvn:

test-local:

testOneMode:
[mkdir] Created dir: /zonestorage/hudson/home/hudson/hudson/jobs/Pig-trunk/workspace/trunk/build/test/logs-local
[junit] Running org.apache.pig.test.TestAlgebraicEval
[junit] Tests run: 5, Failures: 0, Errors: 0, Time elapsed: 34.759 sec
[junit] Running org.apache.pig.test.TestBinaryStorage
[junit] Tests run: 2, Failures: 0, Errors: 0, Time elapsed: 39.277 sec
[junit] Running org.apache.pig.test.TestBuiltin
[junit] Tests run: 21, Failures: 0, Errors: 0, Time elapsed: 40.743 sec
[junit] Running org.apache.pig.test.TestCmdLineParser
[junit] Tests run: 17, Failures: 0, Errors: 0, Time elapsed: 13.648 sec
[junit] Running org.apache.pig.test.TestCombiner
[junit] Tests run: 1, Failures: 0, Errors: 0, Time elapsed: 29.675 sec
[junit] Running org.apache.pig.test.TestCompressedFiles
[junit] Tests run: 1, Failures: 0, Errors: 0, Time elapsed: 15.233 sec
[junit] Running org.apache.pig.test.TestCustomSlicer
[junit] Tests run: 1, Failures: 0, Errors: 0, Time elapsed: 14.525 sec
[junit] Running org.apache.pig.test.TestDataBag
[junit] Tests run: 18, Failures: 0, Errors: 0, Time elapsed: 23.593 sec
[junit] Running org.apache.pig.test.TestDataModel
[junit] Tests run: 4, Failures: 0, Errors: 0, Time elapsed: 16.166 sec
[junit] Running org.apache.pig.test.TestEvalPipeline
[junit] Tests run: 7, Failures: 0, Errors: 0, Time elapsed: 30.281 sec
[junit] Running org.apache.pig.test.TestExGenCogroup
[junit] Tests run: 4, Failures: 0, Errors: 0, Time elapsed: 20.291 sec
[junit] Running org.apache.pig.test.TestExGenEval
[junit] Tests run: 3, Failures: 0, Errors: 0, Time elapsed: 25.969 sec
[junit] Running org.apache.pig.test.TestFilterOpNumeric
[junit] Tests run: 8, Failures: 0, Errors: 0, Time elapsed: 22.9 sec
[junit] Running org.apache.pig.test.TestFilterOpString
[junit] Tests run: 6, Failures: 0, Errors: 0, Time elapsed: 20.251 sec
[junit] Running org.apache.pig.test.TestGrunt
[junit] Tests run: 1, Failures: 0, Errors: 0, Time elapsed: 4.186 sec
[junit] Running org.apache.pig.test.TestInfixArithmetic
[junit] Tests run: 4, Failures: 0, Errors: 0, Time elapsed: 638.721 sec
[junit] Running org.apache.pig.test.TestInstantiateFunc
[junit] Tests run: 5, Failures: 0, Errors: 0, Time elapsed: 12.463 sec
[junit] Running org.apache.pig.test.TestLogicalPlanBuilder
[junit] Tests run: 49, Failures: 0, Errors: 0, Time elapsed: 22.337 sec
[junit] Running org.apache.pig.test.TestMapReduce
[junit] Running org.apache.pig.test.TestMapReduce
[junit] Tests run: 1, Failures: 0, Errors: 1, Time elapsed: 0 sec
[junit] Test org.apache.pig.test.TestMapReduce FAILED (timeout)
[junit] Running org.apache.pig.test.TestMapReduceResultRecycling
[junit] Tests run: 1, Failures: 0, Errors: 0, Time elapsed: 35.308 sec
[junit] Running org.apache.pig.test.TestParamSubPreproc
[junit] Tests run: 28, Failures: 0, Errors: 0, Time elapsed: 30.162 sec
[junit] Running org.apache.pig.test.TestParser
[junit] Tests run: 1, Failures: 0, Errors: 0, Time elapsed: 16.218 sec
[junit] Running org.apache.pig.test.TestPigContext
[junit] Tests run: 3, Failures: 0, Errors: 0, Time elapsed: 17.541 sec
[junit] Running org.apache.pig.test.TestPigFile
[junit] Tests run: 3, Failures: 0, Errors: 0, Time elapsed: 18.687 sec
[junit] Running org.apache.pig.test.TestPigScriptParser
[junit] Tests run: 1, Failures: 0, Errors: 0, Time elapsed: 36.94 sec
[junit] Running org.apache.pig.test.TestPigServer
[junit] Tests run: 4, Failures: 0, Errors: 0, Time elapsed: 109.01 sec
[junit] Running org.apache.pig.test.TestPigSplit
[junit] Tests run: 1, Failures: 0, Errors: 0, Time elapsed: 31.859 sec
[junit] Running org.apache.pig.test.TestReversibleLoadStore
[junit] Tests run: 2, Failures: 0, Errors: 0, Time elapsed: 28.684 sec
[junit] Running org.apache.pig.test.TestStore
[junit] Tests run: 4, Failures: 0, Errors: 0, Time elapsed: 26.627 sec
[junit] Running org.apache.pig.test.TestStreaming
[junit] Tests run: 10, Failures: 0, Errors: 0, Time elapsed: 33.03 sec
[junit] Running org.apache.pig.test.TestUDF
[junit] Tests run: 1, Failures: 0, Errors: 0, Time elapsed: 626.998 sec

BUILD FAILED
/zonestorage/hudson/home/hudson/hudson/jobs/Pig-trunk/workspace/trunk/build.xml:293: The following error occurred while executing this line:
/zonestorage/hudson/home/hudson/hudson/jobs/Pig-trunk/workspace/trunk/build.xml:333: Tests failed!

Total time: 80 minutes 15 seconds
Publishing Javadoc
Recording test results

Search Discussions

  • Apache Hudson Server at Aug 20, 2008 at 10:15 am
    See http://hudson.zones.apache.org/hudson/job/Pig-trunk/268/changes

    ------------------------------------------
    started
    ERROR: svn: timed out waiting for server
    svn: OPTIONS request failed on '/repos/asf/incubator/pig/trunk'
    org.tmatesoft.svn.core.SVNException: svn: timed out waiting for server
    svn: OPTIONS request failed on '/repos/asf/incubator/pig/trunk'
    at org.tmatesoft.svn.core.internal.wc.SVNErrorManager.error(SVNErrorManager.java:102)
    at org.tmatesoft.svn.core.internal.wc.SVNErrorManager.error(SVNErrorManager.java:86)
    at org.tmatesoft.svn.core.internal.io.dav.http.HTTPConnection.request(HTTPConnection.java:545)
    at org.tmatesoft.svn.core.internal.io.dav.http.HTTPConnection.request(HTTPConnection.java:255)
    at org.tmatesoft.svn.core.internal.io.dav.http.HTTPConnection.request(HTTPConnection.java:243)
    at org.tmatesoft.svn.core.internal.io.dav.DAVConnection.exchangeCapabilities(DAVConnection.java:452)
    at org.tmatesoft.svn.core.internal.io.dav.DAVConnection.open(DAVConnection.java:95)
    at org.tmatesoft.svn.core.internal.io.dav.DAVRepository.openConnection(DAVRepository.java:642)
    at org.tmatesoft.svn.core.internal.io.dav.DAVRepository.testConnection(DAVRepository.java:95)
    at hudson.scm.SubversionSCM$DescriptorImpl.checkRepositoryPath(SubversionSCM.java:1308)
    at hudson.scm.SubversionSCM.repositoryLocationsExist(SubversionSCM.java:1369)
    at hudson.scm.SubversionSCM.checkout(SubversionSCM.java:357)
    at hudson.scm.SubversionSCM.checkout(SubversionSCM.java:321)
    at hudson.model.AbstractProject.checkout(AbstractProject.java:631)
    at hudson.model.AbstractBuild$AbstractRunner.checkout(AbstractBuild.java:260)
    at hudson.model.AbstractBuild$AbstractRunner.run(AbstractBuild.java:234)
    at hudson.model.Run.run(Run.java:791)
    at hudson.model.Build.run(Build.java:84)
    at hudson.model.ResourceController.execute(ResourceController.java:70)
    at hudson.model.Executor.run(Executor.java:88)
    Caused by: java.net.SocketTimeoutException: connect timed out
    at java.net.PlainSocketImpl.socketConnect(Native Method)
    at java.net.PlainSocketImpl.doConnect(PlainSocketImpl.java:333)
    at java.net.PlainSocketImpl.connectToAddress(PlainSocketImpl.java:195)
    at java.net.PlainSocketImpl.connect(PlainSocketImpl.java:182)
    at java.net.SocksSocketImpl.connect(SocksSocketImpl.java:366)
    at java.net.Socket.connect(Socket.java:519)
    at org.tmatesoft.svn.core.internal.util.SVNSocketFactory.createPlainSocket(SVNSocketFactory.java:53)
    at org.tmatesoft.svn.core.internal.io.dav.http.HTTPConnection.connect(HTTPConnection.java:165)
    at org.tmatesoft.svn.core.internal.io.dav.http.HTTPConnection.request(HTTPConnection.java:302)
    ... 17 more
    Publishing Javadoc
    Recording test results
  • Apache Hudson Server at Aug 20, 2008 at 9:52 pm

Related Discussions

Discussion Navigation
viewthread | post
Discussion Overview
groupdev @
categoriespig, hadoop
postedAug 20, '08 at 7:23a
activeAug 20, '08 at 9:52p
posts3
users1
websitepig.apache.org

1 user in discussion

Apache Hudson Server: 3 posts

People

Translate

site design / logo © 2022 Grokbase