FAQ
So I tried to build 5.10 out of the box using

sh Configure -Dprefix==/home/szabgab/perl/510 -de

I know. I should not put two = signs there but with all the discussion
about == changing values, I got carried away.

Anyway, the test reported 3 failures:

Failed 3 tests out of 1385, 99.78% okay.
../lib/ExtUtils/t/INST_PREFIX.t
../lib/ExtUtils/t/basic.t
../lib/ExtUtils/t/prefixify.t

I don't know if it indicates any real issue.

Gabor

Search Discussions

  • Michael G Schwern at Dec 29, 2007 at 10:00 pm

    Gabor Szabo wrote:
    So I tried to build 5.10 out of the box using

    sh Configure -Dprefix==/home/szabgab/perl/510 -de

    I know. I should not put two = signs there but with all the discussion
    about == changing values, I got carried away.

    Anyway, the test reported 3 failures:

    Failed 3 tests out of 1385, 99.78% okay.
    ../lib/ExtUtils/t/INST_PREFIX.t
    ../lib/ExtUtils/t/basic.t
    ../lib/ExtUtils/t/prefixify.t

    I don't know if it indicates any real issue.
    I'd need to see the failure diagnostics to know.


    --
    There will be snacks.
  • Gabor Szabo at Dec 30, 2007 at 2:53 am

    On Dec 29, 2007 11:59 PM, Michael G Schwern wrote:
    Gabor Szabo wrote:
    So I tried to build 5.10 out of the box using

    sh Configure -Dprefix==/home/szabgab/perl/510 -de

    I know. I should not put two = signs there but with all the discussion
    about == changing values, I got carried away.

    Anyway, the test reported 3 failures:

    Failed 3 tests out of 1385, 99.78% okay.
    ../lib/ExtUtils/t/INST_PREFIX.t
    ../lib/ExtUtils/t/basic.t
    ../lib/ExtUtils/t/prefixify.t

    I don't know if it indicates any real issue.
    I'd need to see the failure diagnostics to know.

    Do you mean this part?


    lib/ExtUtils/t/basic..........................................#
    Failed test ' install dir created'
    # at ../lib/ExtUtils/t/basic.t line 138.
    Can't stat ../dummy-install: No such file or directory
    at ../lib/ExtUtils/t/basic.t line 148
    # Failed test ' Dummy.pm installed'
    # at ../lib/ExtUtils/t/basic.t line 149.
    FAILED at test 31

    lib/ExtUtils/t/INST_PREFIX....................................#
    Failed test '$(SITEPREFIX) + sitearch'
    # at ../lib/ExtUtils/t/INST_PREFIX.t line 142.
    # '=/home/szabgab/perl/510/lib/site_perl/5.10.0/i686-linux'
    # doesn't match '(?-xism:^\$\(SITEPREFIX\))'
    FAILED at test 19

    lib/ExtUtils/t/prefixify......................................#
    Failed test 'prefixify w/defaults and PREFIX'
    # at ../lib/ExtUtils/t/prefixify.t line 38.
    # got: '=/home/szabgab/perl/510/bin'
    # expected: 'something/this/that'
    FAILED at test 2


    Gabor

Related Discussions

Discussion Navigation
viewthread | post
Discussion Overview
groupperl5-porters @
categoriesperl
postedDec 29, '07 at 8:56p
activeDec 30, '07 at 2:53a
posts3
users2
websiteperl.org

2 users in discussion

Gabor Szabo: 2 posts Michael G Schwern: 1 post

People

Translate

site design / logo © 2021 Grokbase