FAQ
The Term::ReadLine::Gnu tests have failed on blead for a long time now, and
still do:

{{{{{{{{{{{{{{{{{{{{{{{{{{{{{

CPAN Terminal> install Term::ReadLine::Gnu

Installing Term::ReadLine::Gnu (1.16)
Running
[/home/cpan/apps/perl-blead/bin/perl5.9.5 /home/cpan/apps/perl-blead/bin/cpanp-run-perl5.9.5 /home/cpan/.cpanplus/5.9.5/build/Term-ReadLine-Gnu-1.16/Makefile.PL ]...
Found `/lib/libtermcap.so'.
cc -fno-strict-aliasing -pipe -I/usr/local/include -D_LARGEFILE_SOURCE -D_FILE_OFFSET_BITS=64 -I/usr/include/gdbm -DHAVE_STRING_H
rlver.c -o rlver -L/usr/local/lib -lreadline -ltermcap
It seems that you have the GNU Readline Library version 5.2.
Checking if your kit is complete...
Looks good
Writing Makefile for Term::ReadLine::Gnu
Running [/usr/bin/make test ]...
PERL_DL_NONLAZY=1 /home/cpan/apps/perl-blead/bin/perl5.9.5 "-MExtUtils::Command::MM" "-e" "test_harness(0, 'blib/lib', 'blib/arch')"
t/*.t
t/callback....Use of uninitialized value in pattern match (m//) at
t/callback.t line 37.
ok
t/history.....Use of uninitialized value in pattern match (m//) at t/history.t
line 74.
Use of uninitialized value in numeric eq (==) at t/history.t line 86.
Use of uninitialized value in numeric eq (==) at t/history.t line 88.
Use of uninitialized value in numeric eq (==) at t/history.t line 90.
Use of uninitialized value in string eq at t/history.t line 92.
Use of uninitialized value in string eq at t/history.t line 94.
Use of uninitialized value in string eq at t/history.t line 96.
Use of uninitialized value $version in numeric gt (>) at t/history.t line 98.
Use of uninitialized value in string eq at t/history.t line 105.
Use of uninitialized value in numeric eq (==) at t/history.t line 109.
Use of uninitialized value $history_length in addition (+)
at /home/cpan/.cpanplus/5.9.5/build/Term-ReadLine-Gnu-1.16/blib/lib/Term/ReadLine/Gnu/XS.pm
line 325.
Use of uninitialized value $history_base in addition (+)
at /home/cpan/.cpanplus/5.9.5/build/Term-ReadLine-Gnu-1.16/blib/lib/Term/ReadLine/Gnu/XS.pm
line 325.
Use of uninitialized value $i in numeric lt (<)
at /home/cpan/.cpanplus/5.9.5/build/Term-ReadLine-Gnu-1.16/blib/lib/Term/ReadLine/Gnu/XS.pm
line 325.
Use of uninitialized value $history_length in addition (+)
at /home/cpan/.cpanplus/5.9.5/build/Term-ReadLine-Gnu-1.16/blib/lib/Term/ReadLine/Gnu/XS.pm
line 325.
Use of uninitialized value $history_base in addition (+)
at /home/cpan/.cpanplus/5.9.5/build/Term-ReadLine-Gnu-1.16/blib/lib/Term/ReadLine/Gnu/XS.pm
line 325.
Use of uninitialized value $i in numeric lt (<)
at /home/cpan/.cpanplus/5.9.5/build/Term-ReadLine-Gnu-1.16/blib/lib/Term/ReadLine/Gnu/XS.pm
line 325.
Use of uninitialized value $history_length in addition (+)
at /home/cpan/.cpanplus/5.9.5/build/Term-ReadLine-Gnu-1.16/blib/lib/Term/ReadLine/Gnu/XS.pm
line 325.
Use of uninitialized value $history_base in addition (+)
at /home/cpan/.cpanplus/5.9.5/build/Term-ReadLine-Gnu-1.16/blib/lib/Term/ReadLine/Gnu/XS.pm
line 325.
Use of uninitialized value $i in numeric lt (<)
at /home/cpan/.cpanplus/5.9.5/build/Term-ReadLine-Gnu-1.16/blib/lib/Term/ReadLine/Gnu/XS.pm
line 325.
Use of uninitialized value $history_length in addition (+)
at /home/cpan/.cpanplus/5.9.5/build/Term-ReadLine-Gnu-1.16/blib/lib/Term/ReadLine/Gnu/XS.pm
line 325.
Use of uninitialized value $history_base in addition (+)
at /home/cpan/.cpanplus/5.9.5/build/Term-ReadLine-Gnu-1.16/blib/lib/Term/ReadLine/Gnu/XS.pm
line 325.
Use of uninitialized value $i in numeric lt (<)
at /home/cpan/.cpanplus/5.9.5/build/Term-ReadLine-Gnu-1.16/blib/lib/Term/ReadLine/Gnu/XS.pm
line 325.
Use of uninitialized value in numeric eq (==) at t/history.t line 148.
Use of uninitialized value in numeric eq (==) at t/history.t line 156.
Use of uninitialized value in numeric eq (==) at t/history.t line 162.
Use of uninitialized value in numeric eq (==) at t/history.t line 169.
Use of uninitialized value in numeric eq (==) at t/history.t line 175.
Use of uninitialized value $history_length in addition (+)
at /home/cpan/.cpanplus/5.9.5/build/Term-ReadLine-Gnu-1.16/blib/lib/Term/ReadLine/Gnu/XS.pm
line 325.
Use of uninitialized value $history_length in addition (+)
at /home/cpan/.cpanplus/5.9.5/build/Term-ReadLine-Gnu-1.16/blib/lib/Term/ReadLine/Gnu/XS.pm
line 325.
Use of uninitialized value $history_length in addition (+)
at /home/cpan/.cpanplus/5.9.5/build/Term-ReadLine-Gnu-1.16/blib/lib/Term/ReadLine/Gnu/XS.pm
line 325.
Use of uninitialized value $history_length in addition (+)
at /home/cpan/.cpanplus/5.9.5/build/Term-ReadLine-Gnu-1.16/blib/lib/Term/ReadLine/Gnu/XS.pm
line 325.
Use of uninitialized value $history_length in addition (+)
at /home/cpan/.cpanplus/5.9.5/build/Term-ReadLine-Gnu-1.16/blib/lib/Term/ReadLine/Gnu/XS.pm
line 325.
Use of uninitialized value $history_length in addition (+)
at /home/cpan/.cpanplus/5.9.5/build/Term-ReadLine-Gnu-1.16/blib/lib/Term/ReadLine/Gnu/XS.pm
line 325.
Use of uninitialized value $history_length in addition (+)
at /home/cpan/.cpanplus/5.9.5/build/Term-ReadLine-Gnu-1.16/blib/lib/Term/ReadLine/Gnu/XS.pm
line 325.
Use of uninitialized value $history_length in addition (+)
at /home/cpan/.cpanplus/5.9.5/build/Term-ReadLine-Gnu-1.16/blib/lib/Term/ReadLine/Gnu/XS.pm
line 325.
Use of uninitialized value $history_length in addition (+)
at /home/cpan/.cpanplus/5.9.5/build/Term-ReadLine-Gnu-1.16/blib/lib/Term/ReadLine/Gnu/XS.pm
line 325.
FAILED tests 5, 8-10, 12, 16-19, 21-24, 26, 63-67, 80
Failed 20/82 tests, 75.61% okay
t/readline....Compilation failed in require at t/readline.t line 27.
BEGIN failed--compilation aborted at t/readline.t line 27.
dubious
Test returned status 9 (wstat 2304, 0x900)
DIED. FAILED tests 1-104
Failed 104/104 tests, 0.00% okay
Failed Test Stat Wstat Total Fail List of Failed
-------------------------------------------------------------------------------
t/history.t 82 20 5 8-10 12 16-19 21-24 26 63-67 80
t/readline.t 9 2304 104 207 1-104
Failed 2/3 test scripts. 124/193 subtests failed.
Files=3, Tests=193, 1 wallclock secs ( 0.14 cusr + 0.02 csys = 0.16 CPU)
Failed 2/3 test programs. 124/193 subtests failed.
make: *** [test_dynamic] Error 9
[ERROR] MAKE TEST failed: Illegal seek
PERL_DL_NONLAZY=1 /home/cpan/apps/perl-blead/bin/perl5.9.5 "-MExtUtils::Command::MM" "-e" "test_harness(0, 'blib/lib', 'blib/arch')"
t/*.t
t/callback....Use of uninitialized value in pattern match (m//) at
t/callback.t line 37.
ok
t/history.....Use of uninitialized value in pattern match (m//) at t/history.t
line 74.
Use of uninitialized value in numeric eq (==) at t/history.t line 86.
Use of uninitialized value in numeric eq (==) at t/history.t line 88.
Use of uninitialized value in numeric eq (==) at t/history.t line 90.
Use of uninitialized value in string eq at t/history.t line 92.
Use of uninitialized value in string eq at t/history.t line 94.
Use of uninitialized value in string eq at t/history.t line 96.
Use of uninitialized value $version in numeric gt (>) at t/history.t line 98.
Use of uninitialized value in string eq at t/history.t line 105.
Use of uninitialized value in numeric eq (==) at t/history.t line 109.
Use of uninitialized value $history_length in addition (+)
at /home/cpan/.cpanplus/5.9.5/build/Term-ReadLine-Gnu-1.16/blib/lib/Term/ReadLine/Gnu/XS.pm
line 325.
Use of uninitialized value $history_base in addition (+)
at /home/cpan/.cpanplus/5.9.5/build/Term-ReadLine-Gnu-1.16/blib/lib/Term/ReadLine/Gnu/XS.pm
line 325.
Use of uninitialized value $i in numeric lt (<)
at /home/cpan/.cpanplus/5.9.5/build/Term-ReadLine-Gnu-1.16/blib/lib/Term/ReadLine/Gnu/XS.pm
line 325.
Use of uninitialized value $history_length in addition (+)
at /home/cpan/.cpanplus/5.9.5/build/Term-ReadLine-Gnu-1.16/blib/lib/Term/ReadLine/Gnu/XS.pm
line 325.
Use of uninitialized value $history_base in addition (+)
at /home/cpan/.cpanplus/5.9.5/build/Term-ReadLine-Gnu-1.16/blib/lib/Term/ReadLine/Gnu/XS.pm
line 325.
Use of uninitialized value $i in numeric lt (<)
at /home/cpan/.cpanplus/5.9.5/build/Term-ReadLine-Gnu-1.16/blib/lib/Term/ReadLine/Gnu/XS.pm
line 325.
Use of uninitialized value $history_length in addition (+)
at /home/cpan/.cpanplus/5.9.5/build/Term-ReadLine-Gnu-1.16/blib/lib/Term/ReadLine/Gnu/XS.pm
line 325.
Use of uninitialized value $history_base in addition (+)
at /home/cpan/.cpanplus/5.9.5/build/Term-ReadLine-Gnu-1.16/blib/lib/Term/ReadLine/Gnu/XS.pm
line 325.
Use of uninitialized value $i in numeric lt (<)
at /home/cpan/.cpanplus/5.9.5/build/Term-ReadLine-Gnu-1.16/blib/lib/Term/ReadLine/Gnu/XS.pm
line 325.
Use of uninitialized value $history_length in addition (+)
at /home/cpan/.cpanplus/5.9.5/build/Term-ReadLine-Gnu-1.16/blib/lib/Term/ReadLine/Gnu/XS.pm
line 325.
Use of uninitialized value $history_base in addition (+)
at /home/cpan/.cpanplus/5.9.5/build/Term-ReadLine-Gnu-1.16/blib/lib/Term/ReadLine/Gnu/XS.pm
line 325.
Use of uninitialized value $i in numeric lt (<)
at /home/cpan/.cpanplus/5.9.5/build/Term-ReadLine-Gnu-1.16/blib/lib/Term/ReadLine/Gnu/XS.pm
line 325.
Use of uninitialized value in numeric eq (==) at t/history.t line 148.
Use of uninitialized value in numeric eq (==) at t/history.t line 156.
Use of uninitialized value in numeric eq (==) at t/history.t line 162.
Use of uninitialized value in numeric eq (==) at t/history.t line 169.
Use of uninitialized value in numeric eq (==) at t/history.t line 175.
Use of uninitialized value $history_length in addition (+)
at /home/cpan/.cpanplus/5.9.5/build/Term-ReadLine-Gnu-1.16/blib/lib/Term/ReadLine/Gnu/XS.pm
line 325.
Use of uninitialized value $history_length in addition (+)
at /home/cpan/.cpanplus/5.9.5/build/Term-ReadLine-Gnu-1.16/blib/lib/Term/ReadLine/Gnu/XS.pm
line 325.
Use of uninitialized value $history_length in addition (+)
at /home/cpan/.cpanplus/5.9.5/build/Term-ReadLine-Gnu-1.16/blib/lib/Term/ReadLine/Gnu/XS.pm
line 325.
Use of uninitialized value $history_length in addition (+)
at /home/cpan/.cpanplus/5.9.5/build/Term-ReadLine-Gnu-1.16/blib/lib/Term/ReadLine/Gnu/XS.pm
line 325.
Use of uninitialized value $history_length in addition (+)
at /home/cpan/.cpanplus/5.9.5/build/Term-ReadLine-Gnu-1.16/blib/lib/Term/ReadLine/Gnu/XS.pm
line 325.
Use of uninitialized value $history_length in addition (+)
at /home/cpan/.cpanplus/5.9.5/build/Term-ReadLine-Gnu-1.16/blib/lib/Term/ReadLine/Gnu/XS.pm
line 325.
Use of uninitialized value $history_length in addition (+)
at /home/cpan/.cpanplus/5.9.5/build/Term-ReadLine-Gnu-1.16/blib/lib/Term/ReadLine/Gnu/XS.pm
line 325.
Use of uninitialized value $history_length in addition (+)
at /home/cpan/.cpanplus/5.9.5/build/Term-ReadLine-Gnu-1.16/blib/lib/Term/ReadLine/Gnu/XS.pm
line 325.
Use of uninitialized value $history_length in addition (+)
at /home/cpan/.cpanplus/5.9.5/build/Term-ReadLine-Gnu-1.16/blib/lib/Term/ReadLine/Gnu/XS.pm
line 325.
FAILED tests 5, 8-10, 12, 16-19, 21-24, 26, 63-67, 80
Failed 20/82 tests, 75.61% okay
t/readline....Compilation failed in require at t/readline.t line 27.
BEGIN failed--compilation aborted at t/readline.t line 27.
dubious
Test returned status 9 (wstat 2304, 0x900)
DIED. FAILED tests 1-104
Failed 104/104 tests, 0.00% okay
Failed Test Stat Wstat Total Fail List of Failed
-------------------------------------------------------------------------------
t/history.t 82 20 5 8-10 12 16-19 21-24 26 63-67 80
t/readline.t 9 2304 104 207 1-104
Failed 2/3 test scripts. 124/193 subtests failed.
Files=3, Tests=193, 1 wallclock secs ( 0.14 cusr + 0.02 csys = 0.16 CPU)
Failed 2/3 test programs. 124/193 subtests failed.
make: *** [test_dynamic] Error 9



The tests for 'Term::ReadLine::Gnu' failed. Would you like me to proceed
anyway or should we abort?

}}}}}}}}}}}}}}}}}}}}}}}}}}

Regards,

Shlomi Fish

---------------------------------------------------------------------
Shlomi Fish shlomif@iglu.org.il
Homepage: http://www.shlomifish.org/

If it's not in my E-mail it doesn't happen. And if my E-mail is saying
one thing, and everything else says something else - E-mail will conquer.
-- An Israeli Linuxer

Search Discussions

  • Steffen Schwigon at Aug 21, 2007 at 4:15 pm
    Hi!

    Shouldn't this subject be reserved to Andreas König's amazing binary
    search? :-) I really expected his typical details about the bleadperl
    patch that led to the break when I saw the subject "BBC".

    I admit, it's "IMHO", with a strong "H".

    Steffen
    --
    Steffen Schwigon <schwigon@webit.de>
    Dresden Perl Mongers <http://dresden-pm.org/>
    Deutscher Perl-Workshop <http://www.perl-workshop.de/>
  • Andreas J. Koenig at Aug 21, 2007 at 7:33 pm

    On Tue, 21 Aug 2007 16:58:23 +0200, Steffen Schwigon said:
    Hi!
    Shouldn't this subject be reserved to Andreas König's amazing binary
    search? :-) I really expected his typical details about the bleadperl
    patch that led to the break when I saw the subject "BBC".
    It should not be reserved for me but it would be nice if somebody
    could dig out my posting about T:R:G that had these details. (my
    current internet connectivity does not allow me to do it myself)

    Best:)
    --
    andreas
  • Offer Kaye at Aug 22, 2007 at 6:06 am

    On 8/21/07, Andreas J. Koenig wrote:
    It should not be reserved for me but it would be nice if somebody
    could dig out my posting about T:R:G that had these details. (my
    current internet connectivity does not allow me to do it myself)

    Best:)
    --
    andreas
    I found a thread beginning here:
    http://www.xray.mpe.mpg.de/mailing-lists/perl5-porters/2006-11/msg00464.html
    and ending at:
    http://www.xray.mpe.mpg.de/mailing-lists/perl5-porters/2006-11/msg00549.html

    Is that the one you wanted?

    Cheers,
    --
    Offer Kaye
  • Andreas J. Koenig at Aug 22, 2007 at 1:10 pm

    On Wed, 22 Aug 2007 09:06:10 +0300, "Offer Kaye" <offer.kaye@gmail.com> said:
    I found a thread beginning here:
    http://www.xray.mpe.mpg.de/mailing-lists/perl5-porters/2006-11/msg00464.html
    and ending at:
    http://www.xray.mpe.mpg.de/mailing-lists/perl5-porters/2006-11/msg00549.html
    Is that the one you wanted?
    Yes, perfect, thanks! Next: a fix, please :))

    --
    andreas
  • Steve Peters at Aug 22, 2007 at 2:15 pm

    On Wed, Aug 22, 2007 at 03:10:00PM +0200, Andreas J. Koenig wrote:
    On Wed, 22 Aug 2007 09:06:10 +0300, "Offer Kaye" <offer.kaye@gmail.com> said:
    I found a thread beginning here:
    http://www.xray.mpe.mpg.de/mailing-lists/perl5-porters/2006-11/msg00464.html
    and ending at:
    http://www.xray.mpe.mpg.de/mailing-lists/perl5-porters/2006-11/msg00549.html
    Is that the one you wanted?
    Yes, perfect, thanks! Next: a fix, please :))
    Well, a fix in as far as the only failures should be what shows up in 5.8.8.
    There, on a fairly standard Linux box, I see...

    Failed Test Stat Wstat Total Fail List of Failed
    ---------------------------------------------------------------------------
    t/history.t 82 2 73-74

    Steve Peters
    steve@fisharerojo.org

Related Discussions

Discussion Navigation
viewthread | post
Discussion Overview
groupperl5-porters @
categoriesperl
postedAug 15, '07 at 6:39p
activeAug 22, '07 at 2:15p
posts6
users5
websiteperl.org

People

Translate

site design / logo © 2022 Grokbase