FAQ
Hi to all.
I'm back home, and ready to test perl. Curently, its very bad. I've only
tested one configuration, due to core dumps. On Cwd\taint.t & Command.t, perl fails
and windows is polite enough to notify me about that with one pop-up.
Problem is, while pop-up window is there, testing if frozen, and I cant
sit by the computer all day long.
This is bad day for me too. Something is wrong with my monitor, so until
I buy another one, there is no chance for me to investigate the problem
with taint.t further.
Not to forgot, this is report:

Automated smoke report for patch 12036
on MSWin32
Machine description: K5 W95,AMD K5,Win95,4NT,VC5 SP3;

O = OK
F = Failure(s), extended report at the bottom
? = still running or test results not (yet) available
/ = Not built
Build failures during:
- = unknown, m = make, t = make test-prep

Configuration
------- --------------------------------------------------------------------
F F / / USE_PERLCRT=undef USE_MULTI=define USE_ITHREADS=define USE_IMP_SYS=define
+- PERLIO = perlio CFG=DEBUG
+--- PERLIO = stdio CFG=DEBUG
+----- PERLIO = perlio
+------- PERLIO = stdio

Failures:

K5 W95 : stdio USE_PERLCRT=undef USE_MULTI=define USE_ITHREADS=define USE_IMP_SYS=define
comp/require....................FAILED tests 22-23
io/fs...........................FAILED test 25
io/open.........................FAILED tests 4, 36
io/tell.........................FAILED tests 7, 10
op/fork.........................FAILED tests 8-10
op/magic........................FAILED tests 1, 30
..\ext/Cwd/t/taint..............dubious
..\ext/Filter/t/call............FAILED test 24
..\lib/English..................dubious
..\lib/ExtUtils.................FAILED test 27
..\lib/ExtUtils/Command.........dubious
..\lib/ExtUtils/Manifest........dubious
..\lib/File/Find/t/taint........dubious
..\lib/Net/hostent..............dubious
..\lib/Net/t/hostname...........FAILED test 1
..\lib/Search/Dict..............FAILED test 2
..\lib/Tie/Handle/stdhandle.....FAILED test 5
..\lib/Unicode/UCD..............FAILED tests 1-34, 52-118, 122-137

K5 W95 : perlio USE_PERLCRT=undef USE_MULTI=define USE_ITHREADS=define USE_IMP_SYS=define
base/term....................FAILED test 2
comp/multiline...............FAILED test 5
io/fs........................dubious
op/fork......................FAILED tests 2, 6, 8-10, 12
op/magic.....................dubious
op/write.....................FAILED tests 1-3, 6, 9-11
..\ext/Cwd/t/cwd.............FAILED tests 3-6
..\ext/Cwd/t/taint...........dubious
..\ext/XS/Typemap/Typemap....FAILED tests 81-82
..\lib/ExtUtils..............FAILED test 27
..\lib/ExtUtils/Command......dubious
..\lib/ExtUtils/Manifest.....dubious
..\lib/File/Find/t/taint.....dubious
..\lib/Net/hostent...........dubious
..\lib/Net/t/hostname........FAILED test 1
..\lib/warnings..............FAILED tests 381-383



--
. `\!,
. <. .>
[=======oOo==( ^ )==oOo========[ indy@hemo.net ]=======]
--- _ - --- [ member of ]--- |
[========( )======_==============[ .counter attack. ]==]
. () ( )
. ()

Search Discussions

Related Discussions

Discussion Navigation
viewthread | post
Discussion Overview
groupdaily-build @
categoriesperl
postedSep 17, '01 at 3:07p
activeSep 17, '01 at 3:07p
posts1
users1
websiteperl.org

1 user in discussion

Nikola Knezevic: 1 post

People

Translate

site design / logo © 2019 Grokbase