Automated smoke report for branch blead 5.21.10 patch 19eeb8f3f538405239ec8f4cff95421b9d9a3bfb v5.21.9-167-g19eeb8f
x2: ia64 (ia64/2 cpu)
     on HP-UX - B.11.31/64
     using ccache cc version B3910B A.06.26
     smoketime 8 hours 11 minutes (average 1 hour 1 minute)

Summary: FAIL(F)

O = OK F = Failure(s), extended report at the bottom
X = Failure(s) under TEST but not under harness
? = still running or test results not (yet) available
Build failures during: - = unknown or N/A
c = Configure, m = make, M = make (after miniperl), t = make test-prep

v5.21.9-167-g19eeb8f Configuration (common) none
----------- ---------------------------------------------------------
O O O O O O
O O O F F F -Duse64bitall
O O O O O O -Duseithreads
O O O F F F -Duseithreads -Duse64bitall
+- LC_ALL = univ.utf8 -DDEBUGGING
+--- PERLIO = perlio -DDEBUGGING
+----- PERLIO = stdio -DDEBUGGING
+------- LC_ALL = univ.utf8
+--------- PERLIO = perlio
+----------- PERLIO = stdio

Locally applied patches:
     SMOKE19eeb8f3f538405239ec8f4cff95421b9d9a3bfb

Testsuite was run only with 'harness'

Failures: (common-args) none
[stdio] -DDEBUGGING -Duse64bitall
../t/io/layers.t............................................FAILED
     No plan found in TAP output
../t/re/fold_grind.t........................................FAILED
     No plan found in TAP output
../t/re/pat_re_eval.t.......................................FAILED
     Bad plan. You planned 527 tests but ran 290.
../t/re/pat_rt_report.t.....................................FAILED
     2523
../t/op/concat2.t...........................................FAILED
     1
../t/op/tr.t................................................FAILED
     Bad plan. You planned 138 tests but ran 130.
../t/uni/chomp.t............................................FAILED
     No plan found in TAP output
../t/uni/chr.t..............................................FAILED
     No plan found in TAP output
../t/uni/greek.t............................................FAILED
     No plan found in TAP output
../t/uni/gv.t...............................................FAILED
     Bad plan. You planned 206 tests but ran 77.
../t/uni/labels.t...........................................FAILED
     Bad plan. You planned 10 tests but ran 1.
../t/uni/latin2.t...........................................FAILED
     No plan found in TAP output
../t/uni/method.t...........................................FAILED
     Bad plan. You planned 62 tests but ran 24.
../t/uni/tr_7jis.t..........................................FAILED
     No plan found in TAP output
../t/uni/tr_eucjp.t.........................................FAILED
     No plan found in TAP output
../t/uni/tr_sjis.t..........................................FAILED
     No plan found in TAP output
../t/uni/tr_utf8.t..........................................FAILED
     No plan found in TAP output
../t/mro/package_aliases_utf8.t.............................FAILED
     11-34
../t/porting/regen.t........................................FAILED
     Non-zero exit status: 255
     Bad plan. You planned 43 tests but ran 9.
../t/porting/podcheck.t.....................................FAILED
     Bad plan. You planned 1450 tests but ran 0.
../cpan/Archive-Tar/t/08_ptargrep.t.........................FAILED
     1
     Non-zero exit status: 1
../cpan/CPAN-Meta-YAML/t/10_read.t..........................FAILED
     No plan found in TAP output
../cpan/CPAN-Meta-YAML/t/12_write.t.........................FAILED
     No plan found in TAP output
../cpan/CPAN-Meta-YAML/t/21_yamlpm_compat.t.................FAILED
     No plan found in TAP output
../cpan/CPAN-Meta-YAML/t/30_yaml_spec_tml.t.................FAILED
     No plan found in TAP output
../cpan/CPAN-Meta-YAML/t/31_local_tml.t.....................FAILED
     No plan found in TAP output
../cpan/CPAN-Meta-YAML/t/32_world_tml.t.....................FAILED
     No plan found in TAP output
../cpan/CPAN-Meta/t/converter-bad.t.........................FAILED
     No plan found in TAP output
../cpan/CPAN-Meta/t/converter-fail.t........................FAILED
     No plan found in TAP output
../cpan/CPAN-Meta/t/converter.t.............................FAILED
     No plan found in TAP output
../cpan/CPAN-Meta/t/load-bad.t..............................FAILED
     No plan found in TAP output
../cpan/CPAN/t/01loadme.t...................................FAILED
     Bad plan. You planned 1 tests but ran 0.
../cpan/CPAN/t/02nox.t......................................FAILED
     Bad plan. You planned 8 tests but ran 0.
../cpan/CPAN/t/03pkgs.t.....................................FAILED
     Bad plan. You planned 11 tests but ran 0.
../cpan/CPAN/t/11mirroredby.t...............................FAILED
     Bad plan. You planned 6 tests but ran 0.
../cpan/CPAN-Meta/t/save-load.t.............................FAILED
     No plan found in TAP output
../cpan/CPAN-Meta/t/validator.t.............................FAILED
     No plan found in TAP output
../cpan/Digest-MD5/t/utf8.t.................................FAILED
     Bad plan. You planned 5 tests but ran 3.
../cpan/Encode/t/Aliases.t..................................FAILED
     No plan found in TAP output
../cpan/Encode/t/at-cn.t....................................FAILED
     Bad plan. You planned 29 tests but ran 0.
../cpan/Encode/t/at-tw.t....................................FAILED
     Bad plan. You planned 17 tests but ran 0.
../cpan/Encode/t/CJKT.t.....................................FAILED
     Bad plan. You planned 60 tests but ran 0.
../cpan/Encode/t/cow.t......................................FAILED
     No plan found in TAP output
../cpan/Encode/t/decode.t...................................FAILED
     No plan found in TAP output
../cpan/Encode/t/enc_data.t.................................FAILED
     No plan found in TAP output
../cpan/Encode/t/enc_eucjp.t................................FAILED
     No plan found in TAP output
../cpan/Encode/t/enc_module.t...............................FAILED
     No plan found in TAP output
../cpan/Encode/t/enc_utf8.t.................................FAILED
     No plan found in TAP output
../cpan/Encode/t/Encode.t...................................FAILED
     No plan found in TAP output
../cpan/Encode/t/Encoder.t..................................FAILED
     Bad plan. You planned 516 tests but ran 0.
../cpan/Encode/t/encoding.t.................................FAILED
     No plan found in TAP output
../cpan/Encode/t/fallback.t.................................FAILED
     Bad plan. You planned 50 tests but ran 0.
../cpan/Encode/t/from_to.t..................................FAILED
     Bad plan. You planned 3 tests but ran 0.
../cpan/Encode/t/grow.t.....................................FAILED
     No plan found in TAP output
../cpan/Encode/t/gsm0338.t..................................FAILED
     Bad plan. You planned 780 tests but ran 0.
../cpan/Encode/t/guess.t....................................FAILED
     No plan found in TAP output
../cpan/Encode/t/jis7-fallback.t............................FAILED
     No plan found in TAP output
../cpan/Encode/t/jperl.t....................................FAILED
     Bad plan. You planned 15 tests but ran 0.
../cpan/Encode/t/mime-header.t..............................FAILED
     Bad plan. You planned 14 tests but ran 0.
../cpan/Encode/t/mime-name.t................................FAILED
     No plan found in TAP output
../cpan/Encode/t/mime_header_iso2022jp.t....................FAILED
     Bad plan. You planned 14 tests but ran 0.
../cpan/Encode/t/perlio.t...................................FAILED
     Bad plan. You planned 38 tests but ran 0.
../cpan/Encode/t/taint.t....................................FAILED
     No plan found in TAP output
../cpan/Encode/t/Unicode.t..................................FAILED
     Bad plan. You planned 56 tests but ran 0.
../cpan/Encode/t/utf8ref.t..................................FAILED
     No plan found in TAP output
../cpan/Encode/t/utf8strict.t...............................FAILED
     No plan found in TAP output
../cpan/Encode/t/utf8warnings.t.............................FAILED
     No plan found in TAP output
../cpan/ExtUtils-Constant/t/Constant.t......................FAILED
     No plan found in TAP output
../cpan/ExtUtils-Install/t/Install.t........................FAILED
     Bad plan. You planned 60 tests but ran 0.
../cpan/ExtUtils-Install/t/Installapi2.t....................FAILED
     Bad plan. You planned 70 tests but ran 0.
../cpan/ExtUtils-Install/t/Installed.t......................FAILED
     Bad plan. You planned 73 tests but ran 0.
../cpan/ExtUtils-MakeMaker/t/arch_check.t...................FAILED
     No plan found in TAP output
../cpan/ExtUtils-Install/t/InstallWithMM.t..................FAILED
     No plan found in TAP output
../cpan/ExtUtils-MakeMaker/t/backwards.t....................FAILED
     Bad plan. You planned 2 tests but ran 0.
../cpan/ExtUtils-MakeMaker/t/basic.t........................FAILED
     No plan found in TAP output
../cpan/ExtUtils-MakeMaker/t/build_man.t....................FAILED
     Bad plan. You planned 9 tests but ran 0.
../cpan/ExtUtils-MakeMaker/t/cd.t...........................FAILED
     Bad plan. You planned 4 tests but ran 0.
../cpan/ExtUtils-MakeMaker/t/dir_target.t...................FAILED
     Bad plan. You planned 1 tests but ran 0.
../cpan/ExtUtils-MakeMaker/t/echo.t.........................FAILED
     No plan found in TAP output
../cpan/ExtUtils-MakeMaker/t/FIRST_MAKEFILE.t...............FAILED
     Bad plan. You planned 7 tests but ran 0.
../cpan/ExtUtils-MakeMaker/t/fix_libs.t.....................FAILED
     No plan found in TAP output
../cpan/ExtUtils-MakeMaker/t/fixin.t........................FAILED
     Bad plan. You planned 22 tests but ran 0.
../cpan/ExtUtils-MakeMaker/t/hints.t........................FAILED
     Bad plan. You planned 3 tests but ran 0.
../cpan/ExtUtils-MakeMaker/t/INST.t.........................FAILED
     Bad plan. You planned 26 tests but ran 0.
../cpan/ExtUtils-MakeMaker/t/INST_PREFIX.t..................FAILED
     Bad plan. You planned 52 tests but ran 0.
../cpan/ExtUtils-MakeMaker/t/INSTALL_BASE.t.................FAILED
     No plan found in TAP output
../cpan/ExtUtils-MakeMaker/t/installed_file.t...............FAILED
     No plan found in TAP output
../cpan/ExtUtils-MakeMaker/t/is_of_type.t...................FAILED
     No plan found in TAP output
../cpan/ExtUtils-MakeMaker/t/make.t.........................FAILED
     Bad plan. You planned 3 tests but ran 0.
../cpan/ExtUtils-MakeMaker/t/MakeMaker_Parameters.t.........FAILED
     No plan found in TAP output
../cpan/ExtUtils-MakeMaker/t/maketext_filter.t..............FAILED
     Bad plan. You planned 6 tests but ran 0.
../cpan/ExtUtils-MakeMaker/t/meta_convert.t.................FAILED
     No plan found in TAP output
../cpan/ExtUtils-MakeMaker/t/metafile_data.t................FAILED
     Bad plan. You planned 31 tests but ran 0.
../cpan/ExtUtils-MakeMaker/t/metafile_file.t................FAILED
     Bad plan. You planned 16 tests but ran 0.
../cpan/ExtUtils-MakeMaker/t/min_perl_version.t.............FAILED
     No plan found in TAP output
../cpan/ExtUtils-MakeMaker/t/miniperl.t.....................FAILED
     3-4
     Non-zero exit status: 2
../cpan/ExtUtils-MakeMaker/t/MM_Any.t.......................FAILED
     Bad plan. You planned 7 tests but ran 0.
../cpan/ExtUtils-MakeMaker/t/MM_Unix.t......................FAILED
     Bad plan. You planned 110 tests but ran 0.
../cpan/ExtUtils-MakeMaker/t/oneliner.t.....................FAILED
     No plan found in TAP output
../cpan/ExtUtils-MakeMaker/t/parse_abstract.t...............FAILED
     No plan found in TAP output
../cpan/ExtUtils-MakeMaker/t/parse_version.t................FAILED
     No plan found in TAP output
../cpan/ExtUtils-MakeMaker/t/PL_FILES.t.....................FAILED
     No plan found in TAP output
../cpan/ExtUtils-MakeMaker/t/pm.t...........................FAILED
     Bad plan. You planned 6 tests but ran 0.
../cpan/ExtUtils-MakeMaker/t/pm_to_blib.t...................FAILED
     No plan found in TAP output
../cpan/ExtUtils-MakeMaker/t/pod2man.t......................FAILED
     Bad plan. You planned 3 tests but ran 0.
../cpan/ExtUtils-MakeMaker/t/postamble.t....................FAILED
     Bad plan. You planned 8 tests but ran 0.
../cpan/ExtUtils-MakeMaker/t/prefixify.t....................FAILED
     No plan found in TAP output
../cpan/ExtUtils-MakeMaker/t/prereq.t.......................FAILED
     Bad plan. You planned 16 tests but ran 0.
../cpan/ExtUtils-MakeMaker/t/prereq_print.t.................FAILED
     No plan found in TAP output
../cpan/ExtUtils-MakeMaker/t/problems.t.....................FAILED
     Bad plan. You planned 6 tests but ran 0.
../cpan/ExtUtils-MakeMaker/t/prompt.t.......................FAILED
     Bad plan. You planned 11 tests but ran 0.
../cpan/ExtUtils-MakeMaker/t/recurs.t.......................FAILED
     No plan found in TAP output
../cpan/ExtUtils-MakeMaker/t/revision.t.....................FAILED
     Bad plan. You planned 4 tests but ran 0.
../cpan/ExtUtils-MakeMaker/t/several_authors.t..............FAILED
     No plan found in TAP output
../cpan/ExtUtils-MakeMaker/t/split_command.t................FAILED
     No plan found in TAP output
../cpan/ExtUtils-MakeMaker/t/test_boilerplate.t.............FAILED
     No plan found in TAP output
../cpan/ExtUtils-MakeMaker/t/unicode.t......................FAILED
     Bad plan. You planned 9 tests but ran 0.
../cpan/ExtUtils-MakeMaker/t/VERSION_FROM.t.................FAILED
     Bad plan. You planned 1 tests but ran 0.
../cpan/ExtUtils-MakeMaker/t/vstrings.t.....................FAILED
     No plan found in TAP output
../cpan/ExtUtils-MakeMaker/t/WriteEmptyMakefile.t...........FAILED
     Bad plan. You planned 5 tests but ran 0.
../cpan/ExtUtils-MakeMaker/t/writemakefile_args.t...........FAILED
     Bad plan. You planned 43 tests but ran 0.
../cpan/ExtUtils-MakeMaker/t/xs.t...........................FAILED
     No plan found in TAP output
../cpan/IPC-Cmd/t/01_IPC-Cmd.t..............................FAILED
     No plan found in TAP output
../cpan/IPC-Cmd/t/03_run-forked.t...........................FAILED
     No plan found in TAP output
../cpan/IO-Compress/t/110encode-bzip2.t.....................FAILED
     No plan found in TAP output
../cpan/IO-Compress/t/110encode-deflate.t...................FAILED
     No plan found in TAP output
../cpan/IO-Compress/t/110encode-gzip.t......................FAILED
     No plan found in TAP output
../cpan/IO-Compress/t/110encode-rawdeflate.t................FAILED
     No plan found in TAP output
../cpan/IO-Compress/t/110encode-zip.t.......................FAILED
     No plan found in TAP output
../cpan/IO-Compress/t/cz-08encoding.t.......................FAILED
     No plan found in TAP output
../cpan/Module-Metadata/t/encoding.t........................FAILED
     Bad plan. You planned 12 tests but ran 0.
../cpan/Parse-CPAN-Meta/t/02_api.t..........................FAILED
     No plan found in TAP output
../cpan/Pod-Perldoc/t/load.t................................FAILED
     Bad plan. You planned 12 tests but ran 0.
../cpan/Pod-Perldoc/t/man/_get_columns.t....................FAILED
     No plan found in TAP output
../cpan/Pod-Simple/t/00about.t..............................FAILED
     Bad plan. You planned 27 tests but ran 24.
../cpan/Pod-Simple/t/corpus.t...............................FAILED
     Bad plan. You planned 61 tests but ran 1.
../cpan/Pod-Simple/t/enc-chars.t............................FAILED
     Bad plan. You planned 5 tests but ran 3.
../cpan/Pod-Simple/t/encod01.t..............................FAILED
     Bad plan. You planned 6 tests but ran 0.
../cpan/Pod-Simple/t/encod02.t..............................FAILED
     Bad plan. You planned 4 tests but ran 1.
../cpan/Pod-Simple/t/encod03.t..............................FAILED
     Bad plan. You planned 4 tests but ran 1.
../cpan/Pod-Simple/t/encod04.t..............................FAILED
     Bad plan. You planned 5 tests but ran 1.
../cpan/Pod-Usage/t/pod/pod2usage2.t........................FAILED
     Bad plan. You planned 34 tests but ran 0.
../cpan/Pod-Simple/t/htmlbat.t..............................FAILED
     Bad plan. You planned 17 tests but ran 2.
../cpan/Pod-Simple/t/pulltitl.t.............................FAILED
     Bad plan. You planned 117 tests but ran 69.
../cpan/Pod-Simple/t/xhtml01.t..............................FAILED
     Bad plan. You planned 62 tests but ran 40.
../cpan/Test-Simple/t/Test-Stream-API.t.....................FAILED
     No plan found in TAP output
../cpan/Test-Simple/t/Test-Stream-IOSets.t..................FAILED
     No plan found in TAP output
../cpan/Test-Simple/t/Behavior/encoding_test.t..............FAILED
     No plan found in TAP output
../cpan/Test-Harness/t/unicode.t............................FAILED
     No plan found in TAP output
../cpan/Test-Simple/t/Legacy/utf8.t.........................FAILED
     No plan found in TAP output
../cpan/encoding-warnings/t/1-warning.t.....................FAILED
     No plan found in TAP output
../cpan/encoding-warnings/t/2-fatal.t.......................FAILED
     No plan found in TAP output
../cpan/encoding-warnings/t/3-normal.t......................FAILED
     Bad plan. You planned 2 tests but ran 0.
../cpan/encoding-warnings/t/4-lexical.t.....................FAILED
     Bad plan. You planned 3 tests but ran 0.
../cpan/podlators/t/basic.t.................................FAILED
     Bad plan. You planned 15 tests but ran 0.
../cpan/podlators/t/color.t.................................FAILED
     Bad plan. You planned 4 tests but ran 0.
../cpan/podlators/t/devise-date.t...........................FAILED
     Bad plan. You planned 1 tests but ran 0.
../cpan/podlators/t/filehandle.t............................FAILED
     Bad plan. You planned 6 tests but ran 0.
../cpan/podlators/t/man-empty.t.............................FAILED
     Bad plan. You planned 8 tests but ran 0.
../cpan/podlators/t/man-heading.t...........................FAILED
     Bad plan. You planned 7 tests but ran 0.
../cpan/podlators/t/man-options.t...........................FAILED
     Bad plan. You planned 28 tests but ran 0.
../cpan/podlators/t/man-perlio.t............................FAILED
     Bad plan. You planned 7 tests but ran 0.
../cpan/podlators/t/man-utf8.t..............................FAILED
     Bad plan. You planned 7 tests but ran 0.
../cpan/podlators/t/man.t...................................FAILED
     Bad plan. You planned 34 tests but ran 0.
../cpan/autodie/t/utf8_open.t...............................FAILED
     No plan found in TAP output
../cpan/podlators/t/overstrike.t............................FAILED
     Bad plan. You planned 4 tests but ran 0.
../cpan/podlators/t/pod-parser.t............................FAILED
     Bad plan. You planned 7 tests but ran 0.
../cpan/podlators/t/termcap.t...............................FAILED
     Bad plan. You planned 4 tests but ran 0.
../cpan/podlators/t/text-empty.t............................FAILED
     Bad plan. You planned 8 tests but ran 0.
../cpan/podlators/t/text-encoding.t.........................FAILED
     Bad plan. You planned 5 tests but ran 0.
../cpan/podlators/t/text-options.t..........................FAILED
     Bad plan. You planned 34 tests but ran 0.
../cpan/podlators/t/text-perlio.t...........................FAILED
     Bad plan. You planned 4 tests but ran 0.
../cpan/podlators/t/text-utf8.t.............................FAILED
     Bad plan. You planned 4 tests but ran 0.
../cpan/podlators/t/text.t..................................FAILED
     Bad plan. You planned 9 tests but ran 0.
../dist/Data-Dumper/t/bugs.t................................FAILED
     Bad plan. You planned 15 tests but ran 6.
../ext/PerlIO-encoding/t/encoding.t.........................FAILED
     No plan found in TAP output
../ext/PerlIO-encoding/t/fallback.t.........................FAILED
     No plan found in TAP output
../ext/PerlIO-encoding/t/nolooping.t........................FAILED
     Bad plan. You planned 1 tests but ran 0.
../ext/XS-APItest/t/fetch_pad_names.t.......................FAILED
     No plan found in TAP output
../ext/XS-APItest/t/utf16_to_utf8.t.........................FAILED
     No plan found in TAP output
../lib/DBM_Filter/t/encode.t................................FAILED
     No plan found in TAP output
../lib/DBM_Filter/t/utf8.t..................................FAILED
     No plan found in TAP output
../lib/ExtUtils/t/Embed.t...................................FAILED
     Bad plan. You planned 10 tests but ran 0.
../lib/Pod/t/Usage.t........................................FAILED
     Bad plan. You planned 8 tests but ran 0.
../lib/open.t...............................................FAILED
     Bad plan. You planned 23 tests but ran 21.

[perlio] -DDEBUGGING -Duse64bitall
../t/io/layers.t............................................FAILED
     No plan found in TAP output
../t/re/pat_rt_report.t.....................................FAILED
     2523
../t/re/pat_re_eval.t.......................................FAILED
     Bad plan. You planned 527 tests but ran 290.
../t/re/fold_grind.t........................................FAILED
     No plan found in TAP output
../t/op/tr.t................................................FAILED
     Bad plan. You planned 138 tests but ran 107.
../t/op/concat2.t...........................................FAILED
     1
../t/uni/labels.t...........................................FAILED
     No plan found in TAP output
../t/uni/gv.t...............................................FAILED
     Bad plan. You planned 206 tests but ran 77.
../t/uni/tr_sjis.t..........................................FAILED
     No plan found in TAP output
../t/uni/method.t...........................................FAILED
     Bad plan. You planned 62 tests but ran 24.
../t/uni/tr_7jis.t..........................................FAILED
     No plan found in TAP output
../t/uni/chr.t..............................................FAILED
     No plan found in TAP output
../t/uni/tr_utf8.t..........................................FAILED
     No plan found in TAP output
../t/uni/greek.t............................................FAILED
     No plan found in TAP output
../t/uni/latin2.t...........................................FAILED
     No plan found in TAP output
../t/uni/tr_eucjp.t.........................................FAILED
     No plan found in TAP output
../t/uni/chomp.t............................................FAILED
     No plan found in TAP output
../t/mro/package_aliases_utf8.t.............................FAILED
     11-34
../t/porting/regen.t........................................FAILED
     Non-zero exit status: 255
     Bad plan. You planned 43 tests but ran 9.
../t/porting/podcheck.t.....................................FAILED
     No plan found in TAP output
../cpan/IO-Compress/t/110encode-bzip2.t.....................FAILED
     No plan found in TAP output
../cpan/IO-Compress/t/110encode-deflate.t...................FAILED
     No plan found in TAP output
../cpan/IO-Compress/t/110encode-gzip.t......................FAILED
     No plan found in TAP output
../cpan/IO-Compress/t/110encode-rawdeflate.t................FAILED
     No plan found in TAP output
../cpan/IO-Compress/t/110encode-zip.t.......................FAILED
     No plan found in TAP output
../cpan/IO-Compress/t/cz-08encoding.t.......................FAILED
     No plan found in TAP output
../ext/XS-APItest/t/fetch_pad_names.t.......................FAILED
     No plan found in TAP output
../cpan/ExtUtils-MakeMaker/t/arch_check.t...................FAILED
     No plan found in TAP output
../cpan/ExtUtils-MakeMaker/t/backwards.t....................FAILED
     Bad plan. You planned 2 tests but ran 0.
../cpan/ExtUtils-MakeMaker/t/basic.t........................FAILED
     No plan found in TAP output
../cpan/ExtUtils-MakeMaker/t/build_man.t....................FAILED
     Bad plan. You planned 9 tests but ran 0.
../cpan/ExtUtils-MakeMaker/t/cd.t...........................FAILED
     Bad plan. You planned 4 tests but ran 0.
../cpan/ExtUtils-MakeMaker/t/dir_target.t...................FAILED
     Bad plan. You planned 1 tests but ran 0.
../cpan/ExtUtils-MakeMaker/t/echo.t.........................FAILED
     No plan found in TAP output
../cpan/ExtUtils-MakeMaker/t/FIRST_MAKEFILE.t...............FAILED
     Bad plan. You planned 7 tests but ran 0.
../cpan/ExtUtils-MakeMaker/t/fix_libs.t.....................FAILED
     No plan found in TAP output
../cpan/ExtUtils-MakeMaker/t/fixin.t........................FAILED
     Bad plan. You planned 22 tests but ran 0.
../cpan/ExtUtils-MakeMaker/t/hints.t........................FAILED
     Bad plan. You planned 3 tests but ran 0.
../cpan/ExtUtils-MakeMaker/t/INST.t.........................FAILED
     Bad plan. You planned 26 tests but ran 0.
../cpan/ExtUtils-MakeMaker/t/INST_PREFIX.t..................FAILED
     Bad plan. You planned 52 tests but ran 0.
../cpan/ExtUtils-MakeMaker/t/INSTALL_BASE.t.................FAILED
     No plan found in TAP output
../cpan/ExtUtils-MakeMaker/t/installed_file.t...............FAILED
     No plan found in TAP output
../cpan/ExtUtils-MakeMaker/t/is_of_type.t...................FAILED
     No plan found in TAP output
../cpan/ExtUtils-MakeMaker/t/make.t.........................FAILED
     Bad plan. You planned 3 tests but ran 0.
../cpan/ExtUtils-MakeMaker/t/MakeMaker_Parameters.t.........FAILED
     No plan found in TAP output
../cpan/ExtUtils-MakeMaker/t/maketext_filter.t..............FAILED
     Bad plan. You planned 6 tests but ran 0.
../cpan/ExtUtils-MakeMaker/t/meta_convert.t.................FAILED
     No plan found in TAP output
../cpan/ExtUtils-MakeMaker/t/metafile_data.t................FAILED
     Bad plan. You planned 31 tests but ran 0.
../cpan/ExtUtils-MakeMaker/t/metafile_file.t................FAILED
     Bad plan. You planned 16 tests but ran 0.
../cpan/ExtUtils-MakeMaker/t/min_perl_version.t.............FAILED
     No plan found in TAP output
../cpan/ExtUtils-MakeMaker/t/miniperl.t.....................FAILED
     3-4
     Non-zero exit status: 2
../cpan/ExtUtils-MakeMaker/t/MM_Any.t.......................FAILED
     Bad plan. You planned 7 tests but ran 0.
../cpan/ExtUtils-MakeMaker/t/MM_Unix.t......................FAILED
     Bad plan. You planned 110 tests but ran 0.
../cpan/ExtUtils-MakeMaker/t/oneliner.t.....................FAILED
     No plan found in TAP output
../cpan/ExtUtils-MakeMaker/t/parse_abstract.t...............FAILED
     No plan found in TAP output
../cpan/ExtUtils-MakeMaker/t/parse_version.t................FAILED
     No plan found in TAP output
../cpan/ExtUtils-MakeMaker/t/PL_FILES.t.....................FAILED
     No plan found in TAP output
../cpan/ExtUtils-MakeMaker/t/pm.t...........................FAILED
     Bad plan. You planned 6 tests but ran 0.
../cpan/ExtUtils-MakeMaker/t/pm_to_blib.t...................FAILED
     No plan found in TAP output
../cpan/ExtUtils-MakeMaker/t/pod2man.t......................FAILED
     Bad plan. You planned 3 tests but ran 0.
../cpan/ExtUtils-MakeMaker/t/postamble.t....................FAILED
     Bad plan. You planned 8 tests but ran 0.
../cpan/ExtUtils-MakeMaker/t/prefixify.t....................FAILED
     No plan found in TAP output
../cpan/ExtUtils-MakeMaker/t/prereq.t.......................FAILED
     Bad plan. You planned 16 tests but ran 0.
../cpan/ExtUtils-MakeMaker/t/prereq_print.t.................FAILED
     No plan found in TAP output
../cpan/ExtUtils-MakeMaker/t/problems.t.....................FAILED
     Bad plan. You planned 6 tests but ran 0.
../cpan/ExtUtils-MakeMaker/t/prompt.t.......................FAILED
     Bad plan. You planned 11 tests but ran 0.
../cpan/ExtUtils-MakeMaker/t/recurs.t.......................FAILED
     No plan found in TAP output
../cpan/ExtUtils-MakeMaker/t/revision.t.....................FAILED
     Bad plan. You planned 4 tests but ran 0.
../cpan/ExtUtils-MakeMaker/t/several_authors.t..............FAILED
     No plan found in TAP output
../cpan/ExtUtils-MakeMaker/t/split_command.t................FAILED
     No plan found in TAP output
../cpan/ExtUtils-MakeMaker/t/test_boilerplate.t.............FAILED
     No plan found in TAP output
../cpan/ExtUtils-MakeMaker/t/unicode.t......................FAILED
     Bad plan. You planned 9 tests but ran 0.
../cpan/ExtUtils-MakeMaker/t/VERSION_FROM.t.................FAILED
     Bad plan. You planned 1 tests but ran 0.
../cpan/ExtUtils-MakeMaker/t/vstrings.t.....................FAILED
     No plan found in TAP output
../cpan/ExtUtils-MakeMaker/t/WriteEmptyMakefile.t...........FAILED
     Bad plan. You planned 5 tests but ran 0.
../cpan/ExtUtils-MakeMaker/t/writemakefile_args.t...........FAILED
     Bad plan. You planned 43 tests but ran 0.
../cpan/ExtUtils-MakeMaker/t/xs.t...........................FAILED
     No plan found in TAP output
../ext/XS-APItest/t/utf16_to_utf8.t.........................FAILED
     No plan found in TAP output
../cpan/Pod-Simple/t/00about.t..............................FAILED
     Bad plan. You planned 27 tests but ran 24.
../cpan/Pod-Simple/t/corpus.t...............................FAILED
     Bad plan. You planned 61 tests but ran 1.
../cpan/Pod-Simple/t/enc-chars.t............................FAILED
     Bad plan. You planned 5 tests but ran 3.
../cpan/Pod-Simple/t/encod01.t..............................FAILED
     Bad plan. You planned 6 tests but ran 0.
../cpan/Pod-Simple/t/encod02.t..............................FAILED
     Bad plan. You planned 4 tests but ran 1.
../cpan/Pod-Simple/t/encod03.t..............................FAILED
     Bad plan. You planned 4 tests but ran 1.
../cpan/Pod-Simple/t/encod04.t..............................FAILED
     Bad plan. You planned 5 tests but ran 1.
../cpan/Pod-Simple/t/htmlbat.t..............................FAILED
     Bad plan. You planned 17 tests but ran 2.
../cpan/Pod-Simple/t/pulltitl.t.............................FAILED
     Bad plan. You planned 117 tests but ran 69.
../cpan/Pod-Simple/t/xhtml01.t..............................FAILED
     Bad plan. You planned 62 tests but ran 40.
../cpan/Test-Harness/t/unicode.t............................FAILED
     No plan found in TAP output
../cpan/Encode/t/Aliases.t..................................FAILED
     No plan found in TAP output
../cpan/Encode/t/at-cn.t....................................FAILED
     Bad plan. You planned 29 tests but ran 0.
../cpan/Encode/t/at-tw.t....................................FAILED
     Bad plan. You planned 17 tests but ran 0.
../cpan/Encode/t/CJKT.t.....................................FAILED
     Bad plan. You planned 60 tests but ran 0.
../cpan/Encode/t/cow.t......................................FAILED
     No plan found in TAP output
../cpan/Encode/t/decode.t...................................FAILED
     No plan found in TAP output
../cpan/Encode/t/enc_data.t.................................FAILED
     No plan found in TAP output
../cpan/Encode/t/enc_eucjp.t................................FAILED
     No plan found in TAP output
../cpan/Encode/t/enc_module.t...............................FAILED
     No plan found in TAP output
../cpan/Encode/t/enc_utf8.t.................................FAILED
     No plan found in TAP output
../cpan/Encode/t/Encode.t...................................FAILED
     No plan found in TAP output
../cpan/Encode/t/Encoder.t..................................FAILED
     Bad plan. You planned 516 tests but ran 0.
../cpan/Encode/t/encoding.t.................................FAILED
     No plan found in TAP output
../cpan/Encode/t/fallback.t.................................FAILED
     Bad plan. You planned 50 tests but ran 0.
../cpan/Encode/t/from_to.t..................................FAILED
     Bad plan. You planned 3 tests but ran 0.
../cpan/Encode/t/grow.t.....................................FAILED
     No plan found in TAP output
../cpan/Encode/t/gsm0338.t..................................FAILED
     Bad plan. You planned 780 tests but ran 0.
../cpan/Encode/t/guess.t....................................FAILED
     No plan found in TAP output
../cpan/Encode/t/jis7-fallback.t............................FAILED
     No plan found in TAP output
../cpan/Encode/t/jperl.t....................................FAILED
     Bad plan. You planned 15 tests but ran 0.
../cpan/Encode/t/mime-header.t..............................FAILED
     Bad plan. You planned 14 tests but ran 0.
../cpan/Encode/t/mime-name.t................................FAILED
     No plan found in TAP output
../cpan/Encode/t/mime_header_iso2022jp.t....................FAILED
     Bad plan. You planned 14 tests but ran 0.
../cpan/Encode/t/perlio.t...................................FAILED
     Bad plan. You planned 38 tests but ran 0.
../cpan/Encode/t/taint.t....................................FAILED
     No plan found in TAP output
../cpan/Encode/t/Unicode.t..................................FAILED
     Bad plan. You planned 56 tests but ran 0.
../cpan/Encode/t/utf8ref.t..................................FAILED
     No plan found in TAP output
../cpan/Encode/t/utf8strict.t...............................FAILED
     No plan found in TAP output
../cpan/Encode/t/utf8warnings.t.............................FAILED
     No plan found in TAP output
../cpan/podlators/t/basic.t.................................FAILED
     Bad plan. You planned 15 tests but ran 0.
../cpan/podlators/t/color.t.................................FAILED
     Bad plan. You planned 4 tests but ran 0.
../cpan/podlators/t/devise-date.t...........................FAILED
     Bad plan. You planned 1 tests but ran 0.
../cpan/podlators/t/filehandle.t............................FAILED
     Bad plan. You planned 6 tests but ran 0.
../cpan/podlators/t/man-empty.t.............................FAILED
     Bad plan. You planned 8 tests but ran 0.
../cpan/podlators/t/man-heading.t...........................FAILED
     Bad plan. You planned 7 tests but ran 0.
../cpan/podlators/t/man-options.t...........................FAILED
     Bad plan. You planned 28 tests but ran 0.
../cpan/podlators/t/man-perlio.t............................FAILED
     Bad plan. You planned 7 tests but ran 0.
../cpan/podlators/t/man-utf8.t..............................FAILED
     Bad plan. You planned 7 tests but ran 0.
../cpan/podlators/t/man.t...................................FAILED
     Bad plan. You planned 34 tests but ran 0.
../cpan/podlators/t/overstrike.t............................FAILED
     Bad plan. You planned 4 tests but ran 0.
../cpan/podlators/t/pod-parser.t............................FAILED
     Bad plan. You planned 7 tests but ran 0.
../cpan/podlators/t/termcap.t...............................FAILED
     Bad plan. You planned 4 tests but ran 0.
../cpan/podlators/t/text-empty.t............................FAILED
     Bad plan. You planned 8 tests but ran 0.
../cpan/podlators/t/text-encoding.t.........................FAILED
     Bad plan. You planned 5 tests but ran 0.
../cpan/podlators/t/text-options.t..........................FAILED
     Bad plan. You planned 34 tests but ran 0.
../cpan/podlators/t/text-perlio.t...........................FAILED
     Bad plan. You planned 4 tests but ran 0.
../cpan/podlators/t/text-utf8.t.............................FAILED
     Bad plan. You planned 4 tests but ran 0.
../cpan/podlators/t/text.t..................................FAILED
     Bad plan. You planned 9 tests but ran 0.
../cpan/Test-Simple/t/Legacy/utf8.t.........................FAILED
     No plan found in TAP output
../cpan/CPAN-Meta/t/converter-bad.t.........................FAILED
     No plan found in TAP output
../cpan/CPAN-Meta/t/converter-fail.t........................FAILED
     No plan found in TAP output
../cpan/CPAN-Meta-YAML/t/10_read.t..........................FAILED
     No plan found in TAP output
../cpan/CPAN-Meta/t/converter.t.............................FAILED
     No plan found in TAP output
../cpan/CPAN-Meta-YAML/t/12_write.t.........................FAILED
     No plan found in TAP output
../cpan/CPAN-Meta/t/load-bad.t..............................FAILED
     No plan found in TAP output
../cpan/CPAN-Meta-YAML/t/21_yamlpm_compat.t.................FAILED
     No plan found in TAP output
../cpan/CPAN-Meta-YAML/t/30_yaml_spec_tml.t.................FAILED
     No plan found in TAP output
../cpan/CPAN-Meta-YAML/t/31_local_tml.t.....................FAILED
     No plan found in TAP output
../cpan/CPAN-Meta-YAML/t/32_world_tml.t.....................FAILED
     No plan found in TAP output
../cpan/CPAN-Meta/t/save-load.t.............................FAILED
     No plan found in TAP output
../cpan/CPAN-Meta/t/validator.t.............................FAILED
     No plan found in TAP output
../cpan/autodie/t/utf8_open.t...............................FAILED
     No plan found in TAP output
../cpan/CPAN/t/01loadme.t...................................FAILED
     No plan found in TAP output
../cpan/CPAN/t/02nox.t......................................FAILED
     Bad plan. You planned 8 tests but ran 0.
../cpan/CPAN/t/03pkgs.t.....................................FAILED
     Bad plan. You planned 11 tests but ran 0.
../cpan/ExtUtils-Install/t/Install.t........................FAILED
     Bad plan. You planned 60 tests but ran 0.
../cpan/CPAN/t/11mirroredby.t...............................FAILED
     Bad plan. You planned 6 tests but ran 0.
../cpan/ExtUtils-Install/t/Installapi2.t....................FAILED
     Bad plan. You planned 70 tests but ran 0.
../cpan/ExtUtils-Install/t/Installed.t......................FAILED
     Bad plan. You planned 73 tests but ran 0.
../cpan/ExtUtils-Install/t/InstallWithMM.t..................FAILED
     No plan found in TAP output
../ext/PerlIO-encoding/t/encoding.t.........................FAILED
     No plan found in TAP output
../ext/PerlIO-encoding/t/fallback.t.........................FAILED
     No plan found in TAP output
../ext/PerlIO-encoding/t/nolooping.t........................FAILED
     Bad plan. You planned 1 tests but ran 0.
../cpan/Archive-Tar/t/08_ptargrep.t.........................FAILED
     1
     Non-zero exit status: 1
../cpan/encoding-warnings/t/1-warning.t.....................FAILED
     No plan found in TAP output
../cpan/encoding-warnings/t/2-fatal.t.......................FAILED
     No plan found in TAP output
../cpan/encoding-warnings/t/3-normal.t......................FAILED
     Bad plan. You planned 2 tests but ran 0.
../cpan/encoding-warnings/t/4-lexical.t.....................FAILED
     Bad plan. You planned 3 tests but ran 0.
../cpan/IPC-Cmd/t/01_IPC-Cmd.t..............................FAILED
     No plan found in TAP output
../cpan/Test-Simple/t/Test-Stream-API.t.....................FAILED
     No plan found in TAP output
../cpan/IPC-Cmd/t/03_run-forked.t...........................FAILED
     No plan found in TAP output
../cpan/Test-Simple/t/Test-Stream-IOSets.t..................FAILED
     No plan found in TAP output
../dist/Data-Dumper/t/bugs.t................................FAILED
     Bad plan. You planned 15 tests but ran 6.
../lib/DBM_Filter/t/encode.t................................FAILED
     No plan found in TAP output
../lib/DBM_Filter/t/utf8.t..................................FAILED
     No plan found in TAP output
../cpan/Module-Metadata/t/encoding.t........................FAILED
     Bad plan. You planned 12 tests but ran 0.
../cpan/Test-Simple/t/Behavior/encoding_test.t..............FAILED
     No plan found in TAP output
../cpan/Pod-Perldoc/t/man/_get_columns.t....................FAILED
     No plan found in TAP output
../lib/ExtUtils/t/Embed.t...................................FAILED
     Bad plan. You planned 10 tests but ran 0.
../cpan/Parse-CPAN-Meta/t/02_api.t..........................FAILED
     No plan found in TAP output
../lib/Pod/t/Usage.t........................................FAILED
     Bad plan. You planned 8 tests but ran 0.
../cpan/Pod-Perldoc/t/load.t................................FAILED
     Bad plan. You planned 12 tests but ran 0.
../cpan/ExtUtils-Constant/t/Constant.t......................FAILED
     No plan found in TAP output
../cpan/Pod-Usage/t/pod/pod2usage2.t........................FAILED
     Bad plan. You planned 34 tests but ran 0.
../cpan/Digest-MD5/t/utf8.t.................................FAILED
     No plan found in TAP output
../lib/open.t...............................................FAILED
     No plan found in TAP output

[univ.utf8] -DDEBUGGING -Duse64bitall
../t/io/layers.t............................................FAILED
     No plan found in TAP output
../t/re/pat_rt_report.t.....................................FAILED
     2523
../t/re/fold_grind.t........................................FAILED
     No plan found in TAP output
../t/re/pat_re_eval.t.......................................FAILED
     Bad plan. You planned 527 tests but ran 290.
../t/op/tr.t................................................FAILED
     Bad plan. You planned 138 tests but ran 107.
../t/op/concat2.t...........................................FAILED
     1
../t/uni/gv.t...............................................FAILED
     Bad plan. You planned 206 tests but ran 77.
../t/uni/labels.t...........................................FAILED
     No plan found in TAP output
../t/uni/chr.t..............................................FAILED
     No plan found in TAP output
../t/uni/method.t...........................................FAILED
     Bad plan. You planned 62 tests but ran 24.
../t/uni/tr_7jis.t..........................................FAILED
     No plan found in TAP output
../t/uni/tr_eucjp.t.........................................FAILED
     No plan found in TAP output
../t/uni/chomp.t............................................FAILED
     No plan found in TAP output
../t/uni/tr_sjis.t..........................................FAILED
     No plan found in TAP output
../t/uni/latin2.t...........................................FAILED
     No plan found in TAP output
../t/uni/tr_utf8.t..........................................FAILED
     No plan found in TAP output
../t/uni/greek.t............................................FAILED
     No plan found in TAP output
../t/mro/package_aliases_utf8.t.............................FAILED
     11-34
../t/porting/regen.t........................................FAILED
     Non-zero exit status: 255
     Bad plan. You planned 43 tests but ran 9.
../t/porting/podcheck.t.....................................FAILED
     No plan found in TAP output
../ext/XS-APItest/t/fetch_pad_names.t.......................FAILED
     No plan found in TAP output
../ext/XS-APItest/t/utf16_to_utf8.t.........................FAILED
     No plan found in TAP output
../cpan/ExtUtils-MakeMaker/t/arch_check.t...................FAILED
     No plan found in TAP output
../cpan/ExtUtils-MakeMaker/t/backwards.t....................FAILED
     Bad plan. You planned 2 tests but ran 0.
../cpan/ExtUtils-MakeMaker/t/basic.t........................FAILED
     No plan found in TAP output
../cpan/ExtUtils-MakeMaker/t/build_man.t....................FAILED
     Bad plan. You planned 9 tests but ran 0.
../cpan/ExtUtils-MakeMaker/t/cd.t...........................FAILED
     Bad plan. You planned 4 tests but ran 0.
../cpan/ExtUtils-MakeMaker/t/dir_target.t...................FAILED
     Bad plan. You planned 1 tests but ran 0.
../cpan/ExtUtils-MakeMaker/t/echo.t.........................FAILED
     No plan found in TAP output
../cpan/ExtUtils-MakeMaker/t/FIRST_MAKEFILE.t...............FAILED
     Bad plan. You planned 7 tests but ran 0.
../cpan/ExtUtils-MakeMaker/t/fix_libs.t.....................FAILED
     No plan found in TAP output
../cpan/ExtUtils-MakeMaker/t/fixin.t........................FAILED
     Bad plan. You planned 22 tests but ran 0.
../cpan/ExtUtils-MakeMaker/t/hints.t........................FAILED
     Bad plan. You planned 3 tests but ran 0.
../cpan/ExtUtils-MakeMaker/t/INST.t.........................FAILED
     Bad plan. You planned 26 tests but ran 0.
../cpan/ExtUtils-MakeMaker/t/INST_PREFIX.t..................FAILED
     Bad plan. You planned 52 tests but ran 0.
../cpan/ExtUtils-MakeMaker/t/INSTALL_BASE.t.................FAILED
     No plan found in TAP output
../cpan/ExtUtils-MakeMaker/t/installed_file.t...............FAILED
     No plan found in TAP output
../cpan/ExtUtils-MakeMaker/t/is_of_type.t...................FAILED
     No plan found in TAP output
../cpan/ExtUtils-MakeMaker/t/make.t.........................FAILED
     Bad plan. You planned 3 tests but ran 0.
../cpan/ExtUtils-MakeMaker/t/MakeMaker_Parameters.t.........FAILED
     No plan found in TAP output
../cpan/ExtUtils-MakeMaker/t/maketext_filter.t..............FAILED
     Bad plan. You planned 6 tests but ran 0.
../cpan/ExtUtils-MakeMaker/t/meta_convert.t.................FAILED
     No plan found in TAP output
../cpan/ExtUtils-MakeMaker/t/metafile_data.t................FAILED
     Bad plan. You planned 31 tests but ran 0.
../cpan/ExtUtils-MakeMaker/t/metafile_file.t................FAILED
     Bad plan. You planned 16 tests but ran 0.
../cpan/ExtUtils-MakeMaker/t/min_perl_version.t.............FAILED
     No plan found in TAP output
../cpan/ExtUtils-MakeMaker/t/miniperl.t.....................FAILED
     3-4
     Non-zero exit status: 2
../cpan/ExtUtils-MakeMaker/t/MM_Any.t.......................FAILED
     Bad plan. You planned 7 tests but ran 0.
../cpan/IO-Compress/t/110encode-bzip2.t.....................FAILED
     No plan found in TAP output
../cpan/IO-Compress/t/110encode-deflate.t...................FAILED
     No plan found in TAP output
../cpan/ExtUtils-MakeMaker/t/MM_Unix.t......................FAILED
     Bad plan. You planned 110 tests but ran 0.
../cpan/IO-Compress/t/110encode-gzip.t......................FAILED
     No plan found in TAP output
../cpan/IO-Compress/t/110encode-rawdeflate.t................FAILED
     No plan found in TAP output
../cpan/ExtUtils-MakeMaker/t/oneliner.t.....................FAILED
     No plan found in TAP output
../cpan/ExtUtils-MakeMaker/t/parse_abstract.t...............FAILED
     No plan found in TAP output
../cpan/IO-Compress/t/110encode-zip.t.......................FAILED
     No plan found in TAP output
../cpan/ExtUtils-MakeMaker/t/parse_version.t................FAILED
     No plan found in TAP output
../cpan/ExtUtils-MakeMaker/t/PL_FILES.t.....................FAILED
     No plan found in TAP output
../cpan/ExtUtils-MakeMaker/t/pm.t...........................FAILED
     Bad plan. You planned 6 tests but ran 0.
../cpan/ExtUtils-MakeMaker/t/pm_to_blib.t...................FAILED
     No plan found in TAP output
../cpan/ExtUtils-MakeMaker/t/pod2man.t......................FAILED
     Bad plan. You planned 3 tests but ran 0.
../cpan/ExtUtils-MakeMaker/t/postamble.t....................FAILED
     Bad plan. You planned 8 tests but ran 0.
../cpan/IO-Compress/t/cz-08encoding.t.......................FAILED
     No plan found in TAP output
../cpan/ExtUtils-MakeMaker/t/prefixify.t....................FAILED
     No plan found in TAP output
../cpan/ExtUtils-MakeMaker/t/prereq.t.......................FAILED
     Bad plan. You planned 16 tests but ran 0.
../cpan/ExtUtils-MakeMaker/t/prereq_print.t.................FAILED
     No plan found in TAP output
../cpan/ExtUtils-MakeMaker/t/problems.t.....................FAILED
     Bad plan. You planned 6 tests but ran 0.
../cpan/ExtUtils-MakeMaker/t/prompt.t.......................FAILED
     Bad plan. You planned 11 tests but ran 0.
../cpan/ExtUtils-MakeMaker/t/recurs.t.......................FAILED
     No plan found in TAP output
../cpan/ExtUtils-MakeMaker/t/revision.t.....................FAILED
     Bad plan. You planned 4 tests but ran 0.
../cpan/ExtUtils-MakeMaker/t/several_authors.t..............FAILED
     No plan found in TAP output
../cpan/ExtUtils-MakeMaker/t/split_command.t................FAILED
     No plan found in TAP output
../cpan/ExtUtils-MakeMaker/t/test_boilerplate.t.............FAILED
     No plan found in TAP output
../cpan/ExtUtils-MakeMaker/t/unicode.t......................FAILED
     Bad plan. You planned 9 tests but ran 0.
../cpan/ExtUtils-MakeMaker/t/VERSION_FROM.t.................FAILED
     Bad plan. You planned 1 tests but ran 0.
../cpan/ExtUtils-MakeMaker/t/vstrings.t.....................FAILED
     No plan found in TAP output
../cpan/ExtUtils-MakeMaker/t/WriteEmptyMakefile.t...........FAILED
     Bad plan. You planned 5 tests but ran 0.
../cpan/ExtUtils-MakeMaker/t/writemakefile_args.t...........FAILED
     Bad plan. You planned 43 tests but ran 0.
../cpan/ExtUtils-MakeMaker/t/xs.t...........................FAILED
     No plan found in TAP output
../cpan/Encode/t/Aliases.t..................................FAILED
     No plan found in TAP output
../cpan/Encode/t/at-cn.t....................................FAILED
     Bad plan. You planned 29 tests but ran 0.
../cpan/Encode/t/at-tw.t....................................FAILED
     Bad plan. You planned 17 tests but ran 0.
../cpan/Encode/t/CJKT.t.....................................FAILED
     Bad plan. You planned 60 tests but ran 0.
../cpan/Encode/t/cow.t......................................FAILED
     No plan found in TAP output
../cpan/Encode/t/decode.t...................................FAILED
     No plan found in TAP output
../cpan/Encode/t/enc_data.t.................................FAILED
     No plan found in TAP output
../cpan/Encode/t/enc_eucjp.t................................FAILED
     No plan found in TAP output
../cpan/Encode/t/enc_utf8.t.................................FAILED
     No plan found in TAP output
../cpan/Encode/t/Encode.t...................................FAILED
     No plan found in TAP output
../cpan/Encode/t/Encoder.t..................................FAILED
     Bad plan. You planned 516 tests but ran 0.
../cpan/Encode/t/encoding.t.................................FAILED
     No plan found in TAP output
../cpan/Encode/t/fallback.t.................................FAILED
     Bad plan. You planned 50 tests but ran 0.
../cpan/Encode/t/from_to.t..................................FAILED
     Bad plan. You planned 3 tests but ran 0.
../cpan/Encode/t/grow.t.....................................FAILED
     No plan found in TAP output
../cpan/Encode/t/gsm0338.t..................................FAILED
     Bad plan. You planned 780 tests but ran 0.
../cpan/Encode/t/guess.t....................................FAILED
     No plan found in TAP output
../cpan/Encode/t/jis7-fallback.t............................FAILED
     No plan found in TAP output
../cpan/Encode/t/jperl.t....................................FAILED
     Bad plan. You planned 15 tests but ran 0.
../cpan/Encode/t/mime-header.t..............................FAILED
     Bad plan. You planned 14 tests but ran 0.
../cpan/Encode/t/mime-name.t................................FAILED
     No plan found in TAP output
../cpan/Encode/t/mime_header_iso2022jp.t....................FAILED
     Bad plan. You planned 14 tests but ran 0.
../cpan/Encode/t/perlio.t...................................FAILED
     Bad plan. You planned 38 tests but ran 0.
../cpan/Encode/t/taint.t....................................FAILED
     No plan found in TAP output
../cpan/Encode/t/Unicode.t..................................FAILED
     Bad plan. You planned 56 tests but ran 0.
../cpan/Encode/t/utf8ref.t..................................FAILED
     No plan found in TAP output
../cpan/Encode/t/utf8strict.t...............................FAILED
     No plan found in TAP output
../cpan/Encode/t/utf8warnings.t.............................FAILED
     No plan found in TAP output
../cpan/Pod-Simple/t/00about.t..............................FAILED
     Bad plan. You planned 27 tests but ran 24.
../cpan/Pod-Simple/t/corpus.t...............................FAILED
     Bad plan. You planned 61 tests but ran 1.
../cpan/Pod-Simple/t/enc-chars.t............................FAILED
     Bad plan. You planned 5 tests but ran 3.
../cpan/Pod-Simple/t/encod01.t..............................FAILED
     Bad plan. You planned 6 tests but ran 0.
../cpan/Pod-Simple/t/encod02.t..............................FAILED
     Bad plan. You planned 4 tests but ran 1.
../cpan/Pod-Simple/t/encod03.t..............................FAILED
     Bad plan. You planned 4 tests but ran 1.
../cpan/Pod-Simple/t/encod04.t..............................FAILED
     Bad plan. You planned 5 tests but ran 1.
../cpan/Pod-Simple/t/htmlbat.t..............................FAILED
     Bad plan. You planned 17 tests but ran 2.
../cpan/Pod-Simple/t/pulltitl.t.............................FAILED
     Bad plan. You planned 117 tests but ran 69.
../cpan/Pod-Simple/t/xhtml01.t..............................FAILED
     Bad plan. You planned 62 tests but ran 40.
../cpan/podlators/t/basic.t.................................FAILED
     Bad plan. You planned 15 tests but ran 0.
../cpan/podlators/t/color.t.................................FAILED
     Bad plan. You planned 4 tests but ran 0.
../cpan/podlators/t/devise-date.t...........................FAILED
     Bad plan. You planned 1 tests but ran 0.
../cpan/podlators/t/filehandle.t............................FAILED
     Bad plan. You planned 6 tests but ran 0.
../cpan/podlators/t/man-empty.t.............................FAILED
     Bad plan. You planned 8 tests but ran 0.
../cpan/podlators/t/man-heading.t...........................FAILED
     Bad plan. You planned 7 tests but ran 0.
../cpan/podlators/t/man-options.t...........................FAILED
     Bad plan. You planned 28 tests but ran 0.
../cpan/podlators/t/man-perlio.t............................FAILED
     Bad plan. You planned 7 tests but ran 0.
../cpan/podlators/t/man-utf8.t..............................FAILED
     Bad plan. You planned 7 tests but ran 0.
../cpan/podlators/t/man.t...................................FAILED
     Bad plan. You planned 34 tests but ran 0.
../cpan/podlators/t/overstrike.t............................FAILED
     Bad plan. You planned 4 tests but ran 0.
../cpan/podlators/t/pod-parser.t............................FAILED
     Bad plan. You planned 7 tests but ran 0.
../cpan/podlators/t/termcap.t...............................FAILED
     Bad plan. You planned 4 tests but ran 0.
../cpan/podlators/t/text-empty.t............................FAILED
     Bad plan. You planned 8 tests but ran 0.
../cpan/podlators/t/text-encoding.t.........................FAILED
     Bad plan. You planned 5 tests but ran 0.
../cpan/podlators/t/text-options.t..........................FAILED
     Bad plan. You planned 34 tests but ran 0.
../cpan/podlators/t/text-perlio.t...........................FAILED
     Bad plan. You planned 4 tests but ran 0.
../cpan/podlators/t/text-utf8.t.............................FAILED
     Bad plan. You planned 4 tests but ran 0.
../cpan/podlators/t/text.t..................................FAILED
     Bad plan. You planned 9 tests but ran 0.
../cpan/Test-Simple/t/Legacy/utf8.t.........................FAILED
     No plan found in TAP output
../cpan/CPAN-Meta/t/converter-bad.t.........................FAILED
     No plan found in TAP output
../cpan/CPAN-Meta/t/converter-fail.t........................FAILED
     No plan found in TAP output
../cpan/CPAN-Meta/t/converter.t.............................FAILED
     No plan found in TAP output
../cpan/CPAN-Meta/t/load-bad.t..............................FAILED
     No plan found in TAP output
../cpan/CPAN-Meta/t/save-load.t.............................FAILED
     No plan found in TAP output
../cpan/CPAN-Meta/t/validator.t.............................FAILED
     No plan found in TAP output
../cpan/CPAN/t/01loadme.t...................................FAILED
     No plan found in TAP output
../cpan/CPAN/t/02nox.t......................................FAILED
     Bad plan. You planned 8 tests but ran 0.
../cpan/CPAN/t/03pkgs.t.....................................FAILED
     Bad plan. You planned 11 tests but ran 0.
../cpan/CPAN/t/11mirroredby.t...............................FAILED
     Bad plan. You planned 6 tests but ran 0.
../cpan/CPAN-Meta-YAML/t/10_read.t..........................FAILED
     No plan found in TAP output
../cpan/CPAN-Meta-YAML/t/12_write.t.........................FAILED
     No plan found in TAP output
../cpan/CPAN-Meta-YAML/t/21_yamlpm_compat.t.................FAILED
     No plan found in TAP output
../cpan/CPAN-Meta-YAML/t/30_yaml_spec_tml.t.................FAILED
     No plan found in TAP output
../cpan/CPAN-Meta-YAML/t/31_local_tml.t.....................FAILED
     No plan found in TAP output
../cpan/CPAN-Meta-YAML/t/32_world_tml.t.....................FAILED
     No plan found in TAP output
../cpan/ExtUtils-Install/t/Install.t........................FAILED
     Bad plan. You planned 60 tests but ran 0.
../cpan/ExtUtils-Install/t/Installapi2.t....................FAILED
     Bad plan. You planned 70 tests but ran 0.
../cpan/ExtUtils-Install/t/Installed.t......................FAILED
     Bad plan. You planned 73 tests but ran 0.
../cpan/ExtUtils-Install/t/InstallWithMM.t..................FAILED
     No plan found in TAP output
../cpan/Archive-Tar/t/08_ptargrep.t.........................FAILED
     1
     Non-zero exit status: 1
../cpan/Test-Simple/t/Test-Stream-API.t.....................FAILED
     No plan found in TAP output
../cpan/Test-Simple/t/Test-Stream-IOSets.t..................FAILED
     No plan found in TAP output
../cpan/encoding-warnings/t/1-warning.t.....................FAILED
     No plan found in TAP output
../cpan/encoding-warnings/t/2-fatal.t.......................FAILED
     No plan found in TAP output
../cpan/encoding-warnings/t/3-normal.t......................FAILED
     Bad plan. You planned 2 tests but ran 0.
../cpan/encoding-warnings/t/4-lexical.t.....................FAILED
     Bad plan. You planned 3 tests but ran 0.
../cpan/autodie/t/utf8_open.t...............................FAILED
     No plan found in TAP output
../ext/PerlIO-encoding/t/encoding.t.........................FAILED
     No plan found in TAP output
../ext/PerlIO-encoding/t/fallback.t.........................FAILED
     No plan found in TAP output
../ext/PerlIO-encoding/t/nolooping.t........................FAILED
     Bad plan. You planned 1 tests but ran 0.
../lib/DBM_Filter/t/encode.t................................FAILED
     No plan found in TAP output
../lib/DBM_Filter/t/utf8.t..................................FAILED
     No plan found in TAP output
../dist/Data-Dumper/t/bugs.t................................FAILED
     Bad plan. You planned 15 tests but ran 6.
../cpan/Module-Metadata/t/encoding.t........................FAILED
     Bad plan. You planned 12 tests but ran 0.
../cpan/IPC-Cmd/t/01_IPC-Cmd.t..............................FAILED
     No plan found in TAP output
../cpan/IPC-Cmd/t/03_run-forked.t...........................FAILED
     No plan found in TAP output
../cpan/Test-Simple/t/Behavior/encoding_test.t..............FAILED
     No plan found in TAP output
../lib/ExtUtils/t/Embed.t...................................FAILED
     Bad plan. You planned 10 tests but ran 0.
../cpan/Parse-CPAN-Meta/t/02_api.t..........................FAILED
     No plan found in TAP output
../cpan/Pod-Perldoc/t/load.t................................FAILED
     Bad plan. You planned 12 tests but ran 0.
../lib/Pod/t/Usage.t........................................FAILED
     Bad plan. You planned 8 tests but ran 0.
../cpan/Pod-Usage/t/pod/pod2usage2.t........................FAILED
     Bad plan. You planned 34 tests but ran 0.
../cpan/Pod-Perldoc/t/man/_get_columns.t....................FAILED
     No plan found in TAP output
../cpan/Digest-MD5/t/utf8.t.................................FAILED
     No plan found in TAP output
../lib/open.t...............................................FAILED
     No plan found in TAP output
../cpan/ExtUtils-Constant/t/Constant.t......................FAILED
     No plan found in TAP output

[stdio] -DDEBUGGING -Duseithreads -Duse64bitall
../t/io/layers.t............................................FAILED
     No plan found in TAP output
../t/re/fold_grind.t........................................FAILED
     No plan found in TAP output
../t/re/pat_re_eval.t.......................................FAILED
     Bad plan. You planned 527 tests but ran 290.
../t/re/pat_re_eval_thr.t...................................FAILED
     Bad plan. You planned 527 tests but ran 290.
../t/re/pat_rt_report.t.....................................FAILED
     2523
../t/re/pat_rt_report_thr.t.................................FAILED
     2523
../t/op/concat2.t...........................................FAILED
     1
../t/op/tr.t................................................FAILED
     Bad plan. You planned 138 tests but ran 130.
../t/uni/chomp.t............................................FAILED
     No plan found in TAP output
../t/uni/chr.t..............................................FAILED
     No plan found in TAP output
../t/uni/greek.t............................................FAILED
     No plan found in TAP output
../t/uni/gv.t...............................................FAILED
     Bad plan. You planned 206 tests but ran 77.
../t/uni/labels.t...........................................FAILED
     Bad plan. You planned 10 tests but ran 1.
../t/uni/latin2.t...........................................FAILED
     No plan found in TAP output
../t/uni/method.t...........................................FAILED
     Bad plan. You planned 62 tests but ran 24.
../t/uni/tr_7jis.t..........................................FAILED
     No plan found in TAP output
../t/uni/tr_eucjp.t.........................................FAILED
     No plan found in TAP output
../t/uni/tr_sjis.t..........................................FAILED
     No plan found in TAP output
../t/uni/tr_utf8.t..........................................FAILED
     No plan found in TAP output
../t/mro/package_aliases_utf8.t.............................FAILED
     11-34
../t/porting/regen.t........................................FAILED
     Non-zero exit status: 255
     Bad plan. You planned 43 tests but ran 9.
../t/porting/podcheck.t.....................................FAILED
     Bad plan. You planned 1450 tests but ran 0.
../cpan/Archive-Tar/t/08_ptargrep.t.........................FAILED
     1
     Non-zero exit status: 1
../cpan/CPAN-Meta-YAML/t/10_read.t..........................FAILED
     No plan found in TAP output
../cpan/CPAN-Meta-YAML/t/12_write.t.........................FAILED
     No plan found in TAP output
../cpan/CPAN-Meta-YAML/t/21_yamlpm_compat.t.................FAILED
     No plan found in TAP output
../cpan/CPAN-Meta-YAML/t/30_yaml_spec_tml.t.................FAILED
     No plan found in TAP output
../cpan/CPAN-Meta-YAML/t/31_local_tml.t.....................FAILED
     No plan found in TAP output
../cpan/CPAN-Meta-YAML/t/32_world_tml.t.....................FAILED
     No plan found in TAP output
../cpan/CPAN-Meta/t/converter-bad.t.........................FAILED
     No plan found in TAP output
../cpan/CPAN-Meta/t/converter-fail.t........................FAILED
     No plan found in TAP output
../cpan/CPAN-Meta/t/converter.t.............................FAILED
     No plan found in TAP output
../cpan/CPAN/t/01loadme.t...................................FAILED
     Bad plan. You planned 1 tests but ran 0.
../cpan/CPAN-Meta/t/load-bad.t..............................FAILED
     No plan found in TAP output
../cpan/CPAN/t/02nox.t......................................FAILED
     Bad plan. You planned 8 tests but ran 0.
../cpan/CPAN/t/03pkgs.t.....................................FAILED
     Bad plan. You planned 11 tests but ran 0.
../cpan/CPAN/t/11mirroredby.t...............................FAILED
     Bad plan. You planned 6 tests but ran 0.
../cpan/CPAN-Meta/t/save-load.t.............................FAILED
     No plan found in TAP output
../cpan/CPAN-Meta/t/validator.t.............................FAILED
     No plan found in TAP output
../cpan/Digest-MD5/t/utf8.t.................................FAILED
     Bad plan. You planned 5 tests but ran 3.
../cpan/Encode/t/Aliases.t..................................FAILED
     No plan found in TAP output
../cpan/Encode/t/at-cn.t....................................FAILED
     Bad plan. You planned 29 tests but ran 0.
../cpan/Encode/t/at-tw.t....................................FAILED
     Bad plan. You planned 17 tests but ran 0.
../cpan/Encode/t/CJKT.t.....................................FAILED
     Bad plan. You planned 60 tests but ran 0.
../cpan/Encode/t/cow.t......................................FAILED
     No plan found in TAP output
../cpan/Encode/t/decode.t...................................FAILED
     No plan found in TAP output
../cpan/Encode/t/enc_data.t.................................FAILED
     No plan found in TAP output
../cpan/Encode/t/enc_eucjp.t................................FAILED
     No plan found in TAP output
../cpan/Encode/t/enc_module.t...............................FAILED
     No plan found in TAP output
../cpan/Encode/t/enc_utf8.t.................................FAILED
     No plan found in TAP output
../cpan/Encode/t/Encode.t...................................FAILED
     No plan found in TAP output
../cpan/Encode/t/Encoder.t..................................FAILED
     Bad plan. You planned 516 tests but ran 0.
../cpan/Encode/t/encoding.t.................................FAILED
     No plan found in TAP output
../cpan/Encode/t/fallback.t.................................FAILED
     Bad plan. You planned 50 tests but ran 0.
../cpan/Encode/t/from_to.t..................................FAILED
     Bad plan. You planned 3 tests but ran 0.
../cpan/Encode/t/grow.t.....................................FAILED
     No plan found in TAP output
../cpan/Encode/t/gsm0338.t..................................FAILED
     Bad plan. You planned 780 tests but ran 0.
../cpan/Encode/t/guess.t....................................FAILED
     No plan found in TAP output
../cpan/Encode/t/jis7-fallback.t............................FAILED
     No plan found in TAP output
../cpan/Encode/t/jperl.t....................................FAILED
     Bad plan. You planned 15 tests but ran 0.
../cpan/Encode/t/mime-header.t..............................FAILED
     Bad plan. You planned 14 tests but ran 0.
../cpan/Encode/t/mime-name.t................................FAILED
     No plan found in TAP output
../cpan/Encode/t/mime_header_iso2022jp.t....................FAILED
     Bad plan. You planned 14 tests but ran 0.
../cpan/Encode/t/perlio.t...................................FAILED
     Bad plan. You planned 38 tests but ran 0.
../cpan/Encode/t/taint.t....................................FAILED
     No plan found in TAP output
../cpan/Encode/t/Unicode.t..................................FAILED
     Bad plan. You planned 56 tests but ran 0.
../cpan/Encode/t/utf8ref.t..................................FAILED
     No plan found in TAP output
../cpan/Encode/t/utf8strict.t...............................FAILED
     No plan found in TAP output
../cpan/Encode/t/utf8warnings.t.............................FAILED
     No plan found in TAP output
../cpan/ExtUtils-Constant/t/Constant.t......................FAILED
     No plan found in TAP output
../cpan/ExtUtils-Install/t/Install.t........................FAILED
     Bad plan. You planned 60 tests but ran 0.
../cpan/ExtUtils-Install/t/Installapi2.t....................FAILED
     Bad plan. You planned 70 tests but ran 0.
../cpan/ExtUtils-Install/t/Installed.t......................FAILED
     Bad plan. You planned 73 tests but ran 0.
../cpan/ExtUtils-MakeMaker/t/arch_check.t...................FAILED
     No plan found in TAP output
../cpan/ExtUtils-Install/t/InstallWithMM.t..................FAILED
     No plan found in TAP output
../cpan/ExtUtils-MakeMaker/t/backwards.t....................FAILED
     Bad plan. You planned 2 tests but ran 0.
../cpan/ExtUtils-MakeMaker/t/basic.t........................FAILED
     No plan found in TAP output
../cpan/ExtUtils-MakeMaker/t/build_man.t....................FAILED
     Bad plan. You planned 9 tests but ran 0.
../cpan/ExtUtils-MakeMaker/t/cd.t...........................FAILED
     Bad plan. You planned 4 tests but ran 0.
../cpan/ExtUtils-MakeMaker/t/dir_target.t...................FAILED
     Bad plan. You planned 1 tests but ran 0.
../cpan/ExtUtils-MakeMaker/t/echo.t.........................FAILED
     No plan found in TAP output
../cpan/ExtUtils-MakeMaker/t/FIRST_MAKEFILE.t...............FAILED
     Bad plan. You planned 7 tests but ran 0.
../cpan/ExtUtils-MakeMaker/t/fix_libs.t.....................FAILED
     No plan found in TAP output
../cpan/ExtUtils-MakeMaker/t/fixin.t........................FAILED
     Bad plan. You planned 22 tests but ran 0.
../cpan/ExtUtils-MakeMaker/t/hints.t........................FAILED
     Bad plan. You planned 3 tests but ran 0.
../cpan/ExtUtils-MakeMaker/t/INST.t.........................FAILED
     Bad plan. You planned 26 tests but ran 0.
../cpan/ExtUtils-MakeMaker/t/INST_PREFIX.t..................FAILED
     Bad plan. You planned 52 tests but ran 0.
../cpan/ExtUtils-MakeMaker/t/INSTALL_BASE.t.................FAILED
     No plan found in TAP output
../cpan/ExtUtils-MakeMaker/t/installed_file.t...............FAILED
     No plan found in TAP output
../cpan/ExtUtils-MakeMaker/t/is_of_type.t...................FAILED
     No plan found in TAP output
../cpan/ExtUtils-MakeMaker/t/make.t.........................FAILED
     Bad plan. You planned 3 tests but ran 0.
../cpan/ExtUtils-MakeMaker/t/MakeMaker_Parameters.t.........FAILED
     No plan found in TAP output
../cpan/ExtUtils-MakeMaker/t/maketext_filter.t..............FAILED
     Bad plan. You planned 6 tests but ran 0.
../cpan/ExtUtils-MakeMaker/t/meta_convert.t.................FAILED
     No plan found in TAP output
../cpan/ExtUtils-MakeMaker/t/metafile_data.t................FAILED
     Bad plan. You planned 31 tests but ran 0.
../cpan/ExtUtils-MakeMaker/t/metafile_file.t................FAILED
     Bad plan. You planned 16 tests but ran 0.
../cpan/ExtUtils-MakeMaker/t/min_perl_version.t.............FAILED
     No plan found in TAP output
../cpan/ExtUtils-MakeMaker/t/miniperl.t.....................FAILED
     3-4
     Non-zero exit status: 2
../cpan/ExtUtils-MakeMaker/t/MM_Any.t.......................FAILED
     Bad plan. You planned 7 tests but ran 0.
../cpan/ExtUtils-MakeMaker/t/MM_Unix.t......................FAILED
     Bad plan. You planned 110 tests but ran 0.
../cpan/ExtUtils-MakeMaker/t/oneliner.t.....................FAILED
     No plan found in TAP output
../cpan/ExtUtils-MakeMaker/t/parse_abstract.t...............FAILED
     No plan found in TAP output
../cpan/ExtUtils-MakeMaker/t/parse_version.t................FAILED
     No plan found in TAP output
../cpan/ExtUtils-MakeMaker/t/PL_FILES.t.....................FAILED
     No plan found in TAP output
../cpan/ExtUtils-MakeMaker/t/pm.t...........................FAILED
     Bad plan. You planned 6 tests but ran 0.
../cpan/ExtUtils-MakeMaker/t/pm_to_blib.t...................FAILED
     No plan found in TAP output
../cpan/ExtUtils-MakeMaker/t/pod2man.t......................FAILED
     Bad plan. You planned 3 tests but ran 0.
../cpan/ExtUtils-MakeMaker/t/postamble.t....................FAILED
     Bad plan. You planned 8 tests but ran 0.
../cpan/ExtUtils-MakeMaker/t/prefixify.t....................FAILED
     No plan found in TAP output
../cpan/ExtUtils-MakeMaker/t/prereq.t.......................FAILED
     Bad plan. You planned 16 tests but ran 0.
../cpan/ExtUtils-MakeMaker/t/prereq_print.t.................FAILED
     No plan found in TAP output
../cpan/ExtUtils-MakeMaker/t/problems.t.....................FAILED
     Bad plan. You planned 6 tests but ran 0.
../cpan/ExtUtils-MakeMaker/t/prompt.t.......................FAILED
     Bad plan. You planned 11 tests but ran 0.
../cpan/ExtUtils-MakeMaker/t/recurs.t.......................FAILED
     No plan found in TAP output
../cpan/ExtUtils-MakeMaker/t/revision.t.....................FAILED
     Bad plan. You planned 4 tests but ran 0.
../cpan/ExtUtils-MakeMaker/t/several_authors.t..............FAILED
     No plan found in TAP output
../cpan/ExtUtils-MakeMaker/t/split_command.t................FAILED
     No plan found in TAP output
../cpan/ExtUtils-MakeMaker/t/test_boilerplate.t.............FAILED
     No plan found in TAP output
../cpan/ExtUtils-MakeMaker/t/unicode.t......................FAILED
     Bad plan. You planned 9 tests but ran 0.
../cpan/ExtUtils-MakeMaker/t/VERSION_FROM.t.................FAILED
     Bad plan. You planned 1 tests but ran 0.
../cpan/ExtUtils-MakeMaker/t/vstrings.t.....................FAILED
     No plan found in TAP output
../cpan/ExtUtils-MakeMaker/t/WriteEmptyMakefile.t...........FAILED
     Bad plan. You planned 5 tests but ran 0.
../cpan/ExtUtils-MakeMaker/t/writemakefile_args.t...........FAILED
     Bad plan. You planned 43 tests but ran 0.
../cpan/ExtUtils-MakeMaker/t/xs.t...........................FAILED
     No plan found in TAP output
../cpan/IPC-Cmd/t/01_IPC-Cmd.t..............................FAILED
     No plan found in TAP output
../cpan/IPC-Cmd/t/03_run-forked.t...........................FAILED
     No plan found in TAP output
../cpan/IO-Compress/t/110encode-bzip2.t.....................FAILED
     No plan found in TAP output
../cpan/IO-Compress/t/110encode-deflate.t...................FAILED
     No plan found in TAP output
../cpan/IO-Compress/t/110encode-gzip.t......................FAILED
     No plan found in TAP output
../cpan/IO-Compress/t/110encode-rawdeflate.t................FAILED
     No plan found in TAP output
../cpan/IO-Compress/t/110encode-zip.t.......................FAILED
     No plan found in TAP output
../cpan/IO-Compress/t/cz-08encoding.t.......................FAILED
     No plan found in TAP output
../cpan/Module-Metadata/t/encoding.t........................FAILED
     Bad plan. You planned 12 tests but ran 0.
../cpan/Parse-CPAN-Meta/t/02_api.t..........................FAILED
     No plan found in TAP output
../cpan/Pod-Perldoc/t/load.t................................FAILED
     Bad plan. You planned 12 tests but ran 0.
../cpan/Pod-Perldoc/t/man/_get_columns.t....................FAILED
     No plan found in TAP output
../cpan/Pod-Simple/t/00about.t..............................FAILED
     Bad plan. You planned 27 tests but ran 24.
../cpan/Pod-Simple/t/corpus.t...............................FAILED
     Bad plan. You planned 61 tests but ran 1.
../cpan/Pod-Simple/t/enc-chars.t............................FAILED
     Bad plan. You planned 5 tests but ran 3.
../cpan/Pod-Simple/t/encod01.t..............................FAILED
     Bad plan. You planned 6 tests but ran 0.
../cpan/Pod-Simple/t/encod02.t..............................FAILED
     Bad plan. You planned 4 tests but ran 1.
../cpan/Pod-Simple/t/encod03.t..............................FAILED
     Bad plan. You planned 4 tests but ran 1.
../cpan/Pod-Simple/t/encod04.t..............................FAILED
     Bad plan. You planned 5 tests but ran 1.
../cpan/Pod-Simple/t/htmlbat.t..............................FAILED
     Bad plan. You planned 17 tests but ran 2.
../cpan/Pod-Usage/t/pod/pod2usage2.t........................FAILED
     Bad plan. You planned 34 tests but ran 0.
../cpan/Pod-Simple/t/pulltitl.t.............................FAILED
     Bad plan. You planned 117 tests but ran 69.
../cpan/Pod-Simple/t/xhtml01.t..............................FAILED
     Bad plan. You planned 62 tests but ran 40.
../cpan/Test-Simple/t/Test-Stream-API.t.....................FAILED
     No plan found in TAP output
../cpan/Test-Simple/t/Test-Stream-IOSets.t..................FAILED
     No plan found in TAP output
../cpan/Test-Simple/t/Behavior/encoding_test.t..............FAILED
     No plan found in TAP output
../cpan/Test-Harness/t/unicode.t............................FAILED
     No plan found in TAP output
../cpan/Test-Simple/t/Legacy/utf8.t.........................FAILED
     No plan found in TAP output
../cpan/encoding-warnings/t/1-warning.t.....................FAILED
     No plan found in TAP output
../cpan/encoding-warnings/t/2-fatal.t.......................FAILED
     No plan found in TAP output
../cpan/encoding-warnings/t/3-normal.t......................FAILED
     Bad plan. You planned 2 tests but ran 0.
../cpan/encoding-warnings/t/4-lexical.t.....................FAILED
     Bad plan. You planned 3 tests but ran 0.
../cpan/podlators/t/basic.t.................................FAILED
     Bad plan. You planned 15 tests but ran 0.
../cpan/podlators/t/color.t.................................FAILED
     Bad plan. You planned 4 tests but ran 0.
../cpan/podlators/t/devise-date.t...........................FAILED
     Bad plan. You planned 1 tests but ran 0.
../cpan/podlators/t/filehandle.t............................FAILED
     Bad plan. You planned 6 tests but ran 0.
../cpan/autodie/t/utf8_open.t...............................FAILED
     No plan found in TAP output
../cpan/podlators/t/man-empty.t.............................FAILED
     Bad plan. You planned 8 tests but ran 0.
../cpan/podlators/t/man-heading.t...........................FAILED
     Bad plan. You planned 7 tests but ran 0.
../cpan/podlators/t/man-options.t...........................FAILED
     Bad plan. You planned 28 tests but ran 0.
../cpan/podlators/t/man-perlio.t............................FAILED
     Bad plan. You planned 7 tests but ran 0.
../cpan/podlators/t/man-utf8.t..............................FAILED
     Bad plan. You planned 7 tests but ran 0.
../cpan/podlators/t/man.t...................................FAILED
     Bad plan. You planned 34 tests but ran 0.
../cpan/podlators/t/overstrike.t............................FAILED
     Bad plan. You planned 4 tests but ran 0.
../cpan/podlators/t/pod-parser.t............................FAILED
     Bad plan. You planned 7 tests but ran 0.
../cpan/podlators/t/termcap.t...............................FAILED
     Bad plan. You planned 4 tests but ran 0.
../cpan/podlators/t/text-empty.t............................FAILED
     Bad plan. You planned 8 tests but ran 0.
../cpan/podlators/t/text-encoding.t.........................FAILED
     Bad plan. You planned 5 tests but ran 0.
../cpan/podlators/t/text-options.t..........................FAILED
     Bad plan. You planned 34 tests but ran 0.
../cpan/podlators/t/text-perlio.t...........................FAILED
     Bad plan. You planned 4 tests but ran 0.
../cpan/podlators/t/text-utf8.t.............................FAILED
     Bad plan. You planned 4 tests but ran 0.
../cpan/podlators/t/text.t..................................FAILED
     Bad plan. You planned 9 tests but ran 0.
../dist/Data-Dumper/t/bugs.t................................FAILED
     Bad plan. You planned 15 tests but ran 6.
../ext/PerlIO-encoding/t/encoding.t.........................FAILED
     No plan found in TAP output
../ext/PerlIO-encoding/t/fallback.t.........................FAILED
     No plan found in TAP output
../ext/PerlIO-encoding/t/nolooping.t........................FAILED
     Bad plan. You planned 1 tests but ran 0.
../ext/XS-APItest/t/fetch_pad_names.t.......................FAILED
     No plan found in TAP output
../ext/XS-APItest/t/utf16_to_utf8.t.........................FAILED
     No plan found in TAP output
../lib/DBM_Filter/t/encode.t................................FAILED
     No plan found in TAP output
../lib/DBM_Filter/t/utf8.t..................................FAILED
     No plan found in TAP output
../lib/ExtUtils/t/Embed.t...................................FAILED
     Bad plan. You planned 10 tests but ran 0.
../lib/Pod/t/Usage.t........................................FAILED
     Bad plan. You planned 8 tests but ran 0.
../lib/open.t...............................................FAILED
     Bad plan. You planned 23 tests but ran 21.

[perlio] -DDEBUGGING -Duseithreads -Duse64bitall
../t/io/layers.t............................................FAILED
     No plan found in TAP output
../t/re/pat_rt_report.t.....................................FAILED
     2523
../t/re/pat_rt_report_thr.t.................................FAILED
     2523
../t/re/pat_re_eval_thr.t...................................FAILED
     Bad plan. You planned 527 tests but ran 290.
../t/re/pat_re_eval.t.......................................FAILED
     Bad plan. You planned 527 tests but ran 290.
../t/re/fold_grind.t........................................FAILED
     No plan found in TAP output
../t/op/tr.t................................................FAILED
     Bad plan. You planned 138 tests but ran 107.
../t/op/concat2.t...........................................FAILED
     1
../t/uni/labels.t...........................................FAILED
     No plan found in TAP output
../t/uni/gv.t...............................................FAILED
     Bad plan. You planned 206 tests but ran 77.
../t/uni/chomp.t............................................FAILED
     No plan found in TAP output
../t/uni/method.t...........................................FAILED
     Bad plan. You planned 62 tests but ran 24.
../t/uni/greek.t............................................FAILED
     No plan found in TAP output
../t/uni/tr_sjis.t..........................................FAILED
     No plan found in TAP output
../t/uni/tr_eucjp.t.........................................FAILED
     No plan found in TAP output
../t/uni/tr_7jis.t..........................................FAILED
     No plan found in TAP output
../t/uni/latin2.t...........................................FAILED
     No plan found in TAP output
../t/uni/tr_utf8.t..........................................FAILED
     No plan found in TAP output
../t/uni/chr.t..............................................FAILED
     No plan found in TAP output
../t/mro/package_aliases_utf8.t.............................FAILED
     11-34
../t/porting/regen.t........................................FAILED
     Non-zero exit status: 255
     Bad plan. You planned 43 tests but ran 9.
../t/porting/podcheck.t.....................................FAILED
     No plan found in TAP output
../ext/XS-APItest/t/fetch_pad_names.t.......................FAILED
     No plan found in TAP output
../cpan/IO-Compress/t/110encode-bzip2.t.....................FAILED
     No plan found in TAP output
../cpan/IO-Compress/t/110encode-deflate.t...................FAILED
     No plan found in TAP output
../cpan/IO-Compress/t/110encode-gzip.t......................FAILED
     No plan found in TAP output
../cpan/IO-Compress/t/110encode-rawdeflate.t................FAILED
     No plan found in TAP output
../cpan/IO-Compress/t/110encode-zip.t.......................FAILED
     No plan found in TAP output
../cpan/IO-Compress/t/cz-08encoding.t.......................FAILED
     No plan found in TAP output
../ext/XS-APItest/t/utf16_to_utf8.t.........................FAILED
     No plan found in TAP output
../cpan/ExtUtils-MakeMaker/t/arch_check.t...................FAILED
     No plan found in TAP output
../cpan/ExtUtils-MakeMaker/t/backwards.t....................FAILED
     Bad plan. You planned 2 tests but ran 0.
../cpan/ExtUtils-MakeMaker/t/basic.t........................FAILED
     No plan found in TAP output
../cpan/ExtUtils-MakeMaker/t/build_man.t....................FAILED
     Bad plan. You planned 9 tests but ran 0.
../cpan/ExtUtils-MakeMaker/t/cd.t...........................FAILED
     Bad plan. You planned 4 tests but ran 0.
../cpan/ExtUtils-MakeMaker/t/dir_target.t...................FAILED
     Bad plan. You planned 1 tests but ran 0.
../cpan/ExtUtils-MakeMaker/t/echo.t.........................FAILED
     No plan found in TAP output
../cpan/ExtUtils-MakeMaker/t/FIRST_MAKEFILE.t...............FAILED
     Bad plan. You planned 7 tests but ran 0.
../cpan/ExtUtils-MakeMaker/t/fix_libs.t.....................FAILED
     No plan found in TAP output
../cpan/ExtUtils-MakeMaker/t/fixin.t........................FAILED
     Bad plan. You planned 22 tests but ran 0.
../cpan/ExtUtils-MakeMaker/t/hints.t........................FAILED
     Bad plan. You planned 3 tests but ran 0.
../cpan/ExtUtils-MakeMaker/t/INST.t.........................FAILED
     Bad plan. You planned 26 tests but ran 0.
../cpan/ExtUtils-MakeMaker/t/INST_PREFIX.t..................FAILED
     Bad plan. You planned 52 tests but ran 0.
../cpan/ExtUtils-MakeMaker/t/INSTALL_BASE.t.................FAILED
     No plan found in TAP output
../cpan/ExtUtils-MakeMaker/t/installed_file.t...............FAILED
     No plan found in TAP output
../cpan/ExtUtils-MakeMaker/t/is_of_type.t...................FAILED
     No plan found in TAP output
../cpan/ExtUtils-MakeMaker/t/make.t.........................FAILED
     Bad plan. You planned 3 tests but ran 0.
../cpan/ExtUtils-MakeMaker/t/MakeMaker_Parameters.t.........FAILED
     No plan found in TAP output
../cpan/ExtUtils-MakeMaker/t/maketext_filter.t..............FAILED
     Bad plan. You planned 6 tests but ran 0.
../cpan/ExtUtils-MakeMaker/t/meta_convert.t.................FAILED
     No plan found in TAP output
../cpan/ExtUtils-MakeMaker/t/metafile_data.t................FAILED
     Bad plan. You planned 31 tests but ran 0.
../cpan/ExtUtils-MakeMaker/t/metafile_file.t................FAILED
     Bad plan. You planned 16 tests but ran 0.
../cpan/ExtUtils-MakeMaker/t/min_perl_version.t.............FAILED
     No plan found in TAP output
../cpan/ExtUtils-MakeMaker/t/miniperl.t.....................FAILED
     3-4
     Non-zero exit status: 2
../cpan/ExtUtils-MakeMaker/t/MM_Any.t.......................FAILED
     Bad plan. You planned 7 tests but ran 0.
../cpan/ExtUtils-MakeMaker/t/MM_Unix.t......................FAILED
     Bad plan. You planned 110 tests but ran 0.
../cpan/ExtUtils-MakeMaker/t/oneliner.t.....................FAILED
     No plan found in TAP output
../cpan/ExtUtils-MakeMaker/t/parse_abstract.t...............FAILED
     No plan found in TAP output
../cpan/ExtUtils-MakeMaker/t/parse_version.t................FAILED
     No plan found in TAP output
../cpan/ExtUtils-MakeMaker/t/PL_FILES.t.....................FAILED
     No plan found in TAP output
../cpan/ExtUtils-MakeMaker/t/pm.t...........................FAILED
     Bad plan. You planned 6 tests but ran 0.
../cpan/ExtUtils-MakeMaker/t/pm_to_blib.t...................FAILED
     No plan found in TAP output
../cpan/ExtUtils-MakeMaker/t/pod2man.t......................FAILED
     Bad plan. You planned 3 tests but ran 0.
../cpan/ExtUtils-MakeMaker/t/postamble.t....................FAILED
     Bad plan. You planned 8 tests but ran 0.
../cpan/ExtUtils-MakeMaker/t/prefixify.t....................FAILED
     No plan found in TAP output
../cpan/ExtUtils-MakeMaker/t/prereq.t.......................FAILED
     Bad plan. You planned 16 tests but ran 0.
../cpan/ExtUtils-MakeMaker/t/prereq_print.t.................FAILED
     No plan found in TAP output
../cpan/ExtUtils-MakeMaker/t/problems.t.....................FAILED
     Bad plan. You planned 6 tests but ran 0.
../cpan/ExtUtils-MakeMaker/t/prompt.t.......................FAILED
     Bad plan. You planned 11 tests but ran 0.
../cpan/ExtUtils-MakeMaker/t/recurs.t.......................FAILED
     No plan found in TAP output
../cpan/ExtUtils-MakeMaker/t/revision.t.....................FAILED
     Bad plan. You planned 4 tests but ran 0.
../cpan/ExtUtils-MakeMaker/t/several_authors.t..............FAILED
     No plan found in TAP output
../cpan/ExtUtils-MakeMaker/t/split_command.t................FAILED
     No plan found in TAP output
../cpan/ExtUtils-MakeMaker/t/test_boilerplate.t.............FAILED
     No plan found in TAP output
../cpan/ExtUtils-MakeMaker/t/unicode.t......................FAILED
     Bad plan. You planned 9 tests but ran 0.
../cpan/ExtUtils-MakeMaker/t/VERSION_FROM.t.................FAILED
     Bad plan. You planned 1 tests but ran 0.
../cpan/ExtUtils-MakeMaker/t/vstrings.t.....................FAILED
     No plan found in TAP output
../cpan/ExtUtils-MakeMaker/t/WriteEmptyMakefile.t...........FAILED
     Bad plan. You planned 5 tests but ran 0.
../cpan/ExtUtils-MakeMaker/t/writemakefile_args.t...........FAILED
     Bad plan. You planned 43 tests but ran 0.
../cpan/ExtUtils-MakeMaker/t/xs.t...........................FAILED
     No plan found in TAP output
../cpan/Pod-Simple/t/00about.t..............................FAILED
     Bad plan. You planned 27 tests but ran 24.
../cpan/Pod-Simple/t/corpus.t...............................FAILED
     Bad plan. You planned 61 tests but ran 1.
../cpan/Pod-Simple/t/enc-chars.t............................FAILED
     Bad plan. You planned 5 tests but ran 3.
../cpan/Pod-Simple/t/encod01.t..............................FAILED
     Bad plan. You planned 6 tests but ran 0.
../cpan/Pod-Simple/t/encod02.t..............................FAILED
     Bad plan. You planned 4 tests but ran 1.
../cpan/Pod-Simple/t/encod03.t..............................FAILED
     Bad plan. You planned 4 tests but ran 1.
../cpan/Pod-Simple/t/encod04.t..............................FAILED
     Bad plan. You planned 5 tests but ran 1.
../cpan/Pod-Simple/t/htmlbat.t..............................FAILED
     Bad plan. You planned 17 tests but ran 2.
../cpan/Pod-Simple/t/pulltitl.t.............................FAILED
     Bad plan. You planned 117 tests but ran 69.
../cpan/Pod-Simple/t/xhtml01.t..............................FAILED
     Bad plan. You planned 62 tests but ran 40.
../cpan/Test-Harness/t/unicode.t............................FAILED
     No plan found in TAP output
../cpan/Encode/t/Aliases.t..................................FAILED
     No plan found in TAP output
../cpan/Encode/t/at-cn.t....................................FAILED
     Bad plan. You planned 29 tests but ran 0.
../cpan/Encode/t/at-tw.t....................................FAILED
     Bad plan. You planned 17 tests but ran 0.
../cpan/Encode/t/CJKT.t.....................................FAILED
     Bad plan. You planned 60 tests but ran 0.
../cpan/Encode/t/cow.t......................................FAILED
     No plan found in TAP output
../cpan/Encode/t/decode.t...................................FAILED
     No plan found in TAP output
../cpan/Encode/t/enc_data.t.................................FAILED
     No plan found in TAP output
../cpan/Encode/t/enc_eucjp.t................................FAILED
     No plan found in TAP output
../cpan/Encode/t/enc_module.t...............................FAILED
     No plan found in TAP output
../cpan/Encode/t/enc_utf8.t.................................FAILED
     No plan found in TAP output
../cpan/Encode/t/Encode.t...................................FAILED
     No plan found in TAP output
../cpan/Encode/t/Encoder.t..................................FAILED
     Bad plan. You planned 516 tests but ran 0.
../cpan/Encode/t/encoding.t.................................FAILED
     No plan found in TAP output
../cpan/Encode/t/fallback.t.................................FAILED
     Bad plan. You planned 50 tests but ran 0.
../cpan/Encode/t/from_to.t..................................FAILED
     Bad plan. You planned 3 tests but ran 0.
../cpan/Encode/t/grow.t.....................................FAILED
     No plan found in TAP output
../cpan/Encode/t/gsm0338.t..................................FAILED
     Bad plan. You planned 780 tests but ran 0.
../cpan/Encode/t/guess.t....................................FAILED
     No plan found in TAP output
../cpan/Encode/t/jis7-fallback.t............................FAILED
     No plan found in TAP output
../cpan/Encode/t/jperl.t....................................FAILED
     Bad plan. You planned 15 tests but ran 0.
../cpan/Encode/t/mime-header.t..............................FAILED
     Bad plan. You planned 14 tests but ran 0.
../cpan/Encode/t/mime-name.t................................FAILED
     No plan found in TAP output
../cpan/Encode/t/mime_header_iso2022jp.t....................FAILED
     Bad plan. You planned 14 tests but ran 0.
../cpan/Encode/t/perlio.t...................................FAILED
     Bad plan. You planned 38 tests but ran 0.
../cpan/Encode/t/taint.t....................................FAILED
     No plan found in TAP output
../cpan/Encode/t/Unicode.t..................................FAILED
     Bad plan. You planned 56 tests but ran 0.
../cpan/Encode/t/utf8ref.t..................................FAILED
     No plan found in TAP output
../cpan/Encode/t/utf8strict.t...............................FAILED
     No plan found in TAP output
../cpan/Encode/t/utf8warnings.t.............................FAILED
     No plan found in TAP output
../cpan/podlators/t/basic.t.................................FAILED
     Bad plan. You planned 15 tests but ran 0.
../cpan/podlators/t/color.t.................................FAILED
     Bad plan. You planned 4 tests but ran 0.
../cpan/podlators/t/devise-date.t...........................FAILED
     Bad plan. You planned 1 tests but ran 0.
../cpan/podlators/t/filehandle.t............................FAILED
     Bad plan. You planned 6 tests but ran 0.
../cpan/podlators/t/man-empty.t.............................FAILED
     Bad plan. You planned 8 tests but ran 0.
../cpan/podlators/t/man-heading.t...........................FAILED
     Bad plan. You planned 7 tests but ran 0.
../cpan/podlators/t/man-options.t...........................FAILED
     Bad plan. You planned 28 tests but ran 0.
../cpan/podlators/t/man-perlio.t............................FAILED
     Bad plan. You planned 7 tests but ran 0.
../cpan/podlators/t/man-utf8.t..............................FAILED
     Bad plan. You planned 7 tests but ran 0.
../cpan/podlators/t/man.t...................................FAILED
     Bad plan. You planned 34 tests but ran 0.
../cpan/podlators/t/overstrike.t............................FAILED
     Bad plan. You planned 4 tests but ran 0.
../cpan/podlators/t/pod-parser.t............................FAILED
     Bad plan. You planned 7 tests but ran 0.
../cpan/podlators/t/termcap.t...............................FAILED
     Bad plan. You planned 4 tests but ran 0.
../cpan/podlators/t/text-empty.t............................FAILED
     Bad plan. You planned 8 tests but ran 0.
../cpan/podlators/t/text-encoding.t.........................FAILED
     Bad plan. You planned 5 tests but ran 0.
../cpan/podlators/t/text-options.t..........................FAILED
     Bad plan. You planned 34 tests but ran 0.
../cpan/podlators/t/text-perlio.t...........................FAILED
     Bad plan. You planned 4 tests but ran 0.
../cpan/podlators/t/text-utf8.t.............................FAILED
     Bad plan. You planned 4 tests but ran 0.
../cpan/podlators/t/text.t..................................FAILED
     Bad plan. You planned 9 tests but ran 0.
../cpan/Test-Simple/t/Legacy/utf8.t.........................FAILED
     No plan found in TAP output
../cpan/CPAN-Meta/t/converter-bad.t.........................FAILED
     No plan found in TAP output
../cpan/CPAN-Meta/t/converter-fail.t........................FAILED
     No plan found in TAP output
../cpan/CPAN-Meta/t/converter.t.............................FAILED
     No plan found in TAP output
../cpan/CPAN-Meta/t/load-bad.t..............................FAILED
     No plan found in TAP output
../cpan/CPAN-Meta/t/save-load.t.............................FAILED
     No plan found in TAP output
../cpan/CPAN-Meta-YAML/t/10_read.t..........................FAILED
     No plan found in TAP output
../cpan/CPAN-Meta/t/validator.t.............................FAILED
     No plan found in TAP output
../cpan/CPAN-Meta-YAML/t/12_write.t.........................FAILED
     No plan found in TAP output
../cpan/CPAN-Meta-YAML/t/21_yamlpm_compat.t.................FAILED
     No plan found in TAP output
../cpan/CPAN-Meta-YAML/t/30_yaml_spec_tml.t.................FAILED
     No plan found in TAP output
../cpan/CPAN-Meta-YAML/t/31_local_tml.t.....................FAILED
     No plan found in TAP output
../cpan/CPAN-Meta-YAML/t/32_world_tml.t.....................FAILED
     No plan found in TAP output
../cpan/ExtUtils-Install/t/Install.t........................FAILED
     Bad plan. You planned 60 tests but ran 0.
../cpan/ExtUtils-Install/t/Installapi2.t....................FAILED
     Bad plan. You planned 70 tests but ran 0.
../cpan/ExtUtils-Install/t/Installed.t......................FAILED
     Bad plan. You planned 73 tests but ran 0.
../cpan/ExtUtils-Install/t/InstallWithMM.t..................FAILED
     No plan found in TAP output
../cpan/CPAN/t/01loadme.t...................................FAILED
     No plan found in TAP output
../cpan/CPAN/t/02nox.t......................................FAILED
     Bad plan. You planned 8 tests but ran 0.
../cpan/CPAN/t/03pkgs.t.....................................FAILED
     Bad plan. You planned 11 tests but ran 0.
../cpan/CPAN/t/11mirroredby.t...............................FAILED
     Bad plan. You planned 6 tests but ran 0.
../cpan/autodie/t/utf8_open.t...............................FAILED
     No plan found in TAP output
../cpan/Test-Simple/t/Test-Stream-API.t.....................FAILED
     No plan found in TAP output
../cpan/Archive-Tar/t/08_ptargrep.t.........................FAILED
     1
     Non-zero exit status: 1
../cpan/Test-Simple/t/Test-Stream-IOSets.t..................FAILED
     No plan found in TAP output
../cpan/IPC-Cmd/t/01_IPC-Cmd.t..............................FAILED
     No plan found in TAP output
../cpan/IPC-Cmd/t/03_run-forked.t...........................FAILED
     No plan found in TAP output
../cpan/encoding-warnings/t/1-warning.t.....................FAILED
     No plan found in TAP output
../cpan/encoding-warnings/t/2-fatal.t.......................FAILED
     No plan found in TAP output
../cpan/encoding-warnings/t/3-normal.t......................FAILED
     Bad plan. You planned 2 tests but ran 0.
../cpan/encoding-warnings/t/4-lexical.t.....................FAILED
     Bad plan. You planned 3 tests but ran 0.
../dist/Data-Dumper/t/bugs.t................................FAILED
     Bad plan. You planned 15 tests but ran 6.
../ext/PerlIO-encoding/t/encoding.t.........................FAILED
     No plan found in TAP output
../ext/PerlIO-encoding/t/fallback.t.........................FAILED
     No plan found in TAP output
../ext/PerlIO-encoding/t/nolooping.t........................FAILED
     Bad plan. You planned 1 tests but ran 0.
../lib/DBM_Filter/t/encode.t................................FAILED
     No plan found in TAP output
../lib/DBM_Filter/t/utf8.t..................................FAILED
     No plan found in TAP output
../cpan/Test-Simple/t/Behavior/encoding_test.t..............FAILED
     No plan found in TAP output
../cpan/Module-Metadata/t/encoding.t........................FAILED
     Bad plan. You planned 12 tests but ran 0.
../lib/ExtUtils/t/Embed.t...................................FAILED
     Bad plan. You planned 10 tests but ran 0.
../lib/Pod/t/Usage.t........................................FAILED
     Bad plan. You planned 8 tests but ran 0.
../cpan/Parse-CPAN-Meta/t/02_api.t..........................FAILED
     No plan found in TAP output
../cpan/Pod-Usage/t/pod/pod2usage2.t........................FAILED
     Bad plan. You planned 34 tests but ran 0.
../cpan/Pod-Perldoc/t/load.t................................FAILED
     Bad plan. You planned 12 tests but ran 0.
../cpan/Pod-Perldoc/t/man/_get_columns.t....................FAILED
     No plan found in TAP output
../cpan/ExtUtils-Constant/t/Constant.t......................FAILED
     No plan found in TAP output
../lib/open.t...............................................FAILED
     No plan found in TAP output
../cpan/Digest-MD5/t/utf8.t.................................FAILED
     No plan found in TAP output

[univ.utf8] -DDEBUGGING -Duseithreads -Duse64bitall
../t/io/layers.t............................................FAILED
     No plan found in TAP output
../t/re/pat_rt_report_thr.t.................................FAILED
     2523
../t/re/pat_rt_report.t.....................................FAILED
     2523
../t/re/pat_re_eval_thr.t...................................FAILED
     Bad plan. You planned 527 tests but ran 290.
../t/re/pat_re_eval.t.......................................FAILED
     Bad plan. You planned 527 tests but ran 290.
../t/re/fold_grind.t........................................FAILED
     No plan found in TAP output
../t/op/tr.t................................................FAILED
     Bad plan. You planned 138 tests but ran 107.
../t/op/concat2.t...........................................FAILED
     1
../t/uni/gv.t...............................................FAILED
     Bad plan. You planned 206 tests but ran 77.
../t/uni/labels.t...........................................FAILED
     No plan found in TAP output
../t/uni/tr_7jis.t..........................................FAILED
     No plan found in TAP output
../t/uni/method.t...........................................FAILED
     Bad plan. You planned 62 tests but ran 24.
../t/uni/chr.t..............................................FAILED
     No plan found in TAP output
../t/uni/tr_utf8.t..........................................FAILED
     No plan found in TAP output
../t/uni/greek.t............................................FAILED
     No plan found in TAP output
../t/uni/tr_sjis.t..........................................FAILED
     No plan found in TAP output
../t/uni/chomp.t............................................FAILED
     No plan found in TAP output
../t/uni/tr_eucjp.t.........................................FAILED
     No plan found in TAP output
../t/uni/latin2.t...........................................FAILED
     No plan found in TAP output
../t/mro/package_aliases_utf8.t.............................FAILED
     11-34
../t/porting/podcheck.t.....................................FAILED
     Non-zero exit status: 25
     Bad plan. You planned 1472 tests but ran 0.
../t/porting/regen.t........................................FAILED
     Non-zero exit status: 255
     Bad plan. You planned 43 tests but ran 9.
../ext/XS-APItest/t/fetch_pad_names.t.......................FAILED
     No plan found in TAP output
../ext/XS-APItest/t/utf16_to_utf8.t.........................FAILED
     No plan found in TAP output
../cpan/IO-Compress/t/110encode-bzip2.t.....................FAILED
     No plan found in TAP output
../cpan/IO-Compress/t/110encode-deflate.t...................FAILED
     No plan found in TAP output
../cpan/IO-Compress/t/110encode-gzip.t......................FAILED
     No plan found in TAP output
../cpan/IO-Compress/t/110encode-rawdeflate.t................FAILED
     No plan found in TAP output
../cpan/IO-Compress/t/110encode-zip.t.......................FAILED
     No plan found in TAP output
../cpan/IO-Compress/t/cz-08encoding.t.......................FAILED
     No plan found in TAP output
../cpan/ExtUtils-MakeMaker/t/arch_check.t...................FAILED
     No plan found in TAP output
../cpan/ExtUtils-MakeMaker/t/backwards.t....................FAILED
     Bad plan. You planned 2 tests but ran 0.
../cpan/ExtUtils-MakeMaker/t/basic.t........................FAILED
     No plan found in TAP output
../cpan/ExtUtils-MakeMaker/t/build_man.t....................FAILED
     Bad plan. You planned 9 tests but ran 0.
../cpan/ExtUtils-MakeMaker/t/cd.t...........................FAILED
     Bad plan. You planned 4 tests but ran 0.
../cpan/ExtUtils-MakeMaker/t/dir_target.t...................FAILED
     Bad plan. You planned 1 tests but ran 0.
../cpan/ExtUtils-MakeMaker/t/echo.t.........................FAILED
     No plan found in TAP output
../cpan/ExtUtils-MakeMaker/t/FIRST_MAKEFILE.t...............FAILED
     Bad plan. You planned 7 tests but ran 0.
../cpan/ExtUtils-MakeMaker/t/fix_libs.t.....................FAILED
     No plan found in TAP output
../cpan/ExtUtils-MakeMaker/t/fixin.t........................FAILED
     Bad plan. You planned 22 tests but ran 0.
../cpan/ExtUtils-MakeMaker/t/hints.t........................FAILED
     Bad plan. You planned 3 tests but ran 0.
../cpan/ExtUtils-MakeMaker/t/INST.t.........................FAILED
     Bad plan. You planned 26 tests but ran 0.
../cpan/ExtUtils-MakeMaker/t/INST_PREFIX.t..................FAILED
     Bad plan. You planned 52 tests but ran 0.
../cpan/ExtUtils-MakeMaker/t/INSTALL_BASE.t.................FAILED
     No plan found in TAP output
../cpan/ExtUtils-MakeMaker/t/installed_file.t...............FAILED
     No plan found in TAP output
../cpan/ExtUtils-MakeMaker/t/is_of_type.t...................FAILED
     No plan found in TAP output
../cpan/ExtUtils-MakeMaker/t/make.t.........................FAILED
     Bad plan. You planned 3 tests but ran 0.
../cpan/ExtUtils-MakeMaker/t/MakeMaker_Parameters.t.........FAILED
     No plan found in TAP output
../cpan/ExtUtils-MakeMaker/t/maketext_filter.t..............FAILED
     Bad plan. You planned 6 tests but ran 0.
../cpan/ExtUtils-MakeMaker/t/meta_convert.t.................FAILED
     No plan found in TAP output
../cpan/ExtUtils-MakeMaker/t/metafile_data.t................FAILED
     Bad plan. You planned 31 tests but ran 0.
../cpan/ExtUtils-MakeMaker/t/metafile_file.t................FAILED
     Bad plan. You planned 16 tests but ran 0.
../cpan/ExtUtils-MakeMaker/t/min_perl_version.t.............FAILED
     No plan found in TAP output
../cpan/ExtUtils-MakeMaker/t/miniperl.t.....................FAILED
     3-4
     Non-zero exit status: 2
../cpan/ExtUtils-MakeMaker/t/MM_Any.t.......................FAILED
     Bad plan. You planned 7 tests but ran 0.
../cpan/ExtUtils-MakeMaker/t/MM_Unix.t......................FAILED
     Bad plan. You planned 110 tests but ran 0.
../cpan/ExtUtils-MakeMaker/t/oneliner.t.....................FAILED
     No plan found in TAP output
../cpan/ExtUtils-MakeMaker/t/parse_abstract.t...............FAILED
     No plan found in TAP output
../cpan/ExtUtils-MakeMaker/t/parse_version.t................FAILED
     No plan found in TAP output
../cpan/ExtUtils-MakeMaker/t/PL_FILES.t.....................FAILED
     No plan found in TAP output
../cpan/ExtUtils-MakeMaker/t/pm.t...........................FAILED
     Bad plan. You planned 6 tests but ran 0.
../cpan/ExtUtils-MakeMaker/t/pm_to_blib.t...................FAILED
     No plan found in TAP output
../cpan/ExtUtils-MakeMaker/t/pod2man.t......................FAILED
     Bad plan. You planned 3 tests but ran 0.
../cpan/ExtUtils-MakeMaker/t/postamble.t....................FAILED
     Bad plan. You planned 8 tests but ran 0.
../cpan/ExtUtils-MakeMaker/t/prefixify.t....................FAILED
     No plan found in TAP output
../cpan/ExtUtils-MakeMaker/t/prereq.t.......................FAILED
     Bad plan. You planned 16 tests but ran 0.
../cpan/ExtUtils-MakeMaker/t/prereq_print.t.................FAILED
     No plan found in TAP output
../cpan/ExtUtils-MakeMaker/t/problems.t.....................FAILED
     Bad plan. You planned 6 tests but ran 0.
../cpan/ExtUtils-MakeMaker/t/prompt.t.......................FAILED
     Bad plan. You planned 11 tests but ran 0.
../cpan/ExtUtils-MakeMaker/t/recurs.t.......................FAILED
     No plan found in TAP output
../cpan/ExtUtils-MakeMaker/t/revision.t.....................FAILED
     Bad plan. You planned 4 tests but ran 0.
../cpan/ExtUtils-MakeMaker/t/several_authors.t..............FAILED
     No plan found in TAP output
../cpan/ExtUtils-MakeMaker/t/split_command.t................FAILED
     No plan found in TAP output
../cpan/ExtUtils-MakeMaker/t/test_boilerplate.t.............FAILED
     No plan found in TAP output
../cpan/ExtUtils-MakeMaker/t/unicode.t......................FAILED
     Bad plan. You planned 9 tests but ran 0.
../cpan/ExtUtils-MakeMaker/t/VERSION_FROM.t.................FAILED
     Bad plan. You planned 1 tests but ran 0.
../cpan/ExtUtils-MakeMaker/t/vstrings.t.....................FAILED
     No plan found in TAP output
../cpan/ExtUtils-MakeMaker/t/WriteEmptyMakefile.t...........FAILED
     Bad plan. You planned 5 tests but ran 0.
../cpan/ExtUtils-MakeMaker/t/writemakefile_args.t...........FAILED
     Bad plan. You planned 43 tests but ran 0.
../cpan/ExtUtils-MakeMaker/t/xs.t...........................FAILED
     No plan found in TAP output
../cpan/Pod-Simple/t/00about.t..............................FAILED
     Bad plan. You planned 27 tests but ran 24.
../cpan/Pod-Simple/t/corpus.t...............................FAILED
     Bad plan. You planned 61 tests but ran 1.
../cpan/Pod-Simple/t/enc-chars.t............................FAILED
     Bad plan. You planned 5 tests but ran 3.
../cpan/Pod-Simple/t/encod01.t..............................FAILED
     Bad plan. You planned 6 tests but ran 0.
../cpan/Pod-Simple/t/encod02.t..............................FAILED
     Bad plan. You planned 4 tests but ran 1.
../cpan/Pod-Simple/t/encod03.t..............................FAILED
     Bad plan. You planned 4 tests but ran 1.
../cpan/Pod-Simple/t/encod04.t..............................FAILED
     Bad plan. You planned 5 tests but ran 1.
../cpan/Pod-Simple/t/htmlbat.t..............................FAILED
     Bad plan. You planned 17 tests but ran 2.
../cpan/Pod-Simple/t/pulltitl.t.............................FAILED
     Bad plan. You planned 117 tests but ran 69.
../cpan/Pod-Simple/t/xhtml01.t..............................FAILED
     Bad plan. You planned 62 tests but ran 40.
../cpan/Encode/t/Aliases.t..................................FAILED
     No plan found in TAP output
../cpan/Encode/t/at-cn.t....................................FAILED
     Bad plan. You planned 29 tests but ran 0.
../cpan/Encode/t/at-tw.t....................................FAILED
     Bad plan. You planned 17 tests but ran 0.
../cpan/Encode/t/CJKT.t.....................................FAILED
     Bad plan. You planned 60 tests but ran 0.
../cpan/Encode/t/cow.t......................................FAILED
     No plan found in TAP output
../cpan/Encode/t/decode.t...................................FAILED
     No plan found in TAP output
../cpan/Encode/t/enc_data.t.................................FAILED
     No plan found in TAP output
../cpan/Encode/t/enc_eucjp.t................................FAILED
     No plan found in TAP output
../cpan/Encode/t/enc_utf8.t.................................FAILED
     No plan found in TAP output
../cpan/Encode/t/Encode.t...................................FAILED
     No plan found in TAP output
../cpan/Encode/t/Encoder.t..................................FAILED
     Bad plan. You planned 516 tests but ran 0.
../cpan/Encode/t/encoding.t.................................FAILED
     No plan found in TAP output
../cpan/Encode/t/fallback.t.................................FAILED
     Bad plan. You planned 50 tests but ran 0.
../cpan/Encode/t/from_to.t..................................FAILED
     Bad plan. You planned 3 tests but ran 0.
../cpan/Encode/t/grow.t.....................................FAILED
     No plan found in TAP output
../cpan/Encode/t/gsm0338.t..................................FAILED
     Bad plan. You planned 780 tests but ran 0.
../cpan/Encode/t/guess.t....................................FAILED
     No plan found in TAP output
../cpan/Encode/t/jis7-fallback.t............................FAILED
     No plan found in TAP output
../cpan/Encode/t/jperl.t....................................FAILED
     Bad plan. You planned 15 tests but ran 0.
../cpan/Encode/t/mime-header.t..............................FAILED
     Bad plan. You planned 14 tests but ran 0.
../cpan/Encode/t/mime-name.t................................FAILED
     No plan found in TAP output
../cpan/Encode/t/mime_header_iso2022jp.t....................FAILED
     Bad plan. You planned 14 tests but ran 0.
../cpan/Encode/t/perlio.t...................................FAILED
     Bad plan. You planned 38 tests but ran 0.
../cpan/Encode/t/taint.t....................................FAILED
     No plan found in TAP output
../cpan/Encode/t/Unicode.t..................................FAILED
     Bad plan. You planned 56 tests but ran 0.
../cpan/Encode/t/utf8ref.t..................................FAILED
     No plan found in TAP output
../cpan/Encode/t/utf8strict.t...............................FAILED
     No plan found in TAP output
../cpan/Encode/t/utf8warnings.t.............................FAILED
     No plan found in TAP output
../cpan/podlators/t/basic.t.................................FAILED
     Bad plan. You planned 15 tests but ran 0.
../cpan/podlators/t/color.t.................................FAILED
     Bad plan. You planned 4 tests but ran 0.
../cpan/podlators/t/devise-date.t...........................FAILED
     Bad plan. You planned 1 tests but ran 0.
../cpan/podlators/t/filehandle.t............................FAILED
     Bad plan. You planned 6 tests but ran 0.
../cpan/podlators/t/man-empty.t.............................FAILED
     Bad plan. You planned 8 tests but ran 0.
../cpan/podlators/t/man-heading.t...........................FAILED
     Bad plan. You planned 7 tests but ran 0.
../cpan/podlators/t/man-options.t...........................FAILED
     Bad plan. You planned 28 tests but ran 0.
../cpan/podlators/t/man-perlio.t............................FAILED
     Bad plan. You planned 7 tests but ran 0.
../cpan/podlators/t/man-utf8.t..............................FAILED
     Bad plan. You planned 7 tests but ran 0.
../cpan/podlators/t/man.t...................................FAILED
     Bad plan. You planned 34 tests but ran 0.
../cpan/podlators/t/overstrike.t............................FAILED
     Bad plan. You planned 4 tests but ran 0.
../cpan/podlators/t/pod-parser.t............................FAILED
     Bad plan. You planned 7 tests but ran 0.
../cpan/podlators/t/termcap.t...............................FAILED
     Bad plan. You planned 4 tests but ran 0.
../cpan/podlators/t/text-empty.t............................FAILED
     Bad plan. You planned 8 tests but ran 0.
../cpan/podlators/t/text-encoding.t.........................FAILED
     Bad plan. You planned 5 tests but ran 0.
../cpan/podlators/t/text-options.t..........................FAILED
     Bad plan. You planned 34 tests but ran 0.
../cpan/podlators/t/text-perlio.t...........................FAILED
     Bad plan. You planned 4 tests but ran 0.
../cpan/podlators/t/text-utf8.t.............................FAILED
     Bad plan. You planned 4 tests but ran 0.
../cpan/podlators/t/text.t..................................FAILED
     Bad plan. You planned 9 tests but ran 0.
../cpan/Test-Simple/t/Legacy/utf8.t.........................FAILED
     No plan found in TAP output
../cpan/CPAN-Meta/t/converter-bad.t.........................FAILED
     No plan found in TAP output
../cpan/CPAN-Meta/t/converter-fail.t........................FAILED
     No plan found in TAP output
../cpan/CPAN-Meta/t/converter.t.............................FAILED
     No plan found in TAP output
../cpan/CPAN-Meta/t/load-bad.t..............................FAILED
     No plan found in TAP output
../cpan/CPAN/t/01loadme.t...................................FAILED
     No plan found in TAP output
../cpan/CPAN/t/02nox.t......................................FAILED
     Bad plan. You planned 8 tests but ran 0.
../cpan/CPAN/t/03pkgs.t.....................................FAILED
     Bad plan. You planned 11 tests but ran 0.
../cpan/CPAN/t/11mirroredby.t...............................FAILED
     Bad plan. You planned 6 tests but ran 0.
../cpan/CPAN-Meta/t/save-load.t.............................FAILED
     No plan found in TAP output
../cpan/CPAN-Meta/t/validator.t.............................FAILED
     No plan found in TAP output
../cpan/CPAN-Meta-YAML/t/10_read.t..........................FAILED
     No plan found in TAP output
../cpan/CPAN-Meta-YAML/t/12_write.t.........................FAILED
     No plan found in TAP output
../cpan/CPAN-Meta-YAML/t/21_yamlpm_compat.t.................FAILED
     No plan found in TAP output
../cpan/CPAN-Meta-YAML/t/30_yaml_spec_tml.t.................FAILED
     No plan found in TAP output
../cpan/CPAN-Meta-YAML/t/31_local_tml.t.....................FAILED
     No plan found in TAP output
../cpan/CPAN-Meta-YAML/t/32_world_tml.t.....................FAILED
     No plan found in TAP output
../cpan/ExtUtils-Install/t/Install.t........................FAILED
     Bad plan. You planned 60 tests but ran 0.
../cpan/ExtUtils-Install/t/Installapi2.t....................FAILED
     Bad plan. You planned 70 tests but ran 0.
../cpan/ExtUtils-Install/t/Installed.t......................FAILED
     Bad plan. You planned 73 tests but ran 0.
../cpan/ExtUtils-Install/t/InstallWithMM.t..................FAILED
     No plan found in TAP output
../cpan/Archive-Tar/t/08_ptargrep.t.........................FAILED
     1
     Non-zero exit status: 1
../cpan/Test-Simple/t/Test-Stream-API.t.....................FAILED
     No plan found in TAP output
../cpan/Test-Simple/t/Test-Stream-IOSets.t..................FAILED
     No plan found in TAP output
../cpan/IPC-Cmd/t/01_IPC-Cmd.t..............................FAILED
     No plan found in TAP output
../cpan/IPC-Cmd/t/03_run-forked.t...........................FAILED
     No plan found in TAP output
../cpan/encoding-warnings/t/1-warning.t.....................FAILED
     No plan found in TAP output
../cpan/encoding-warnings/t/2-fatal.t.......................FAILED
     No plan found in TAP output
../cpan/encoding-warnings/t/3-normal.t......................FAILED
     Bad plan. You planned 2 tests but ran 0.
../cpan/encoding-warnings/t/4-lexical.t.....................FAILED
     Bad plan. You planned 3 tests but ran 0.
../cpan/autodie/t/utf8_open.t...............................FAILED
     No plan found in TAP output
../ext/PerlIO-encoding/t/encoding.t.........................FAILED
     No plan found in TAP output
../ext/PerlIO-encoding/t/fallback.t.........................FAILED
     No plan found in TAP output
../ext/PerlIO-encoding/t/nolooping.t........................FAILED
     Bad plan. You planned 1 tests but ran 0.
../cpan/Module-Metadata/t/encoding.t........................FAILED
     Bad plan. You planned 12 tests but ran 0.
../lib/DBM_Filter/t/encode.t................................FAILED
     No plan found in TAP output
../lib/DBM_Filter/t/utf8.t..................................FAILED
     No plan found in TAP output
../dist/Data-Dumper/t/bugs.t................................FAILED
     Bad plan. You planned 15 tests but ran 6.
../cpan/Test-Simple/t/Behavior/encoding_test.t..............FAILED
     No plan found in TAP output
../lib/ExtUtils/t/Embed.t...................................FAILED
     Bad plan. You planned 10 tests but ran 0.
../cpan/Parse-CPAN-Meta/t/02_api.t..........................FAILED
     No plan found in TAP output
../lib/Pod/t/Usage.t........................................FAILED
     Bad plan. You planned 8 tests but ran 0.
../cpan/Pod-Usage/t/pod/pod2usage2.t........................FAILED
     Bad plan. You planned 34 tests but ran 0.
../cpan/Pod-Perldoc/t/man/_get_columns.t....................FAILED
     No plan found in TAP output
../cpan/Pod-Perldoc/t/load.t................................FAILED
     Bad plan. You planned 12 tests but ran 0.
../cpan/Digest-MD5/t/utf8.t.................................FAILED
     No plan found in TAP output
../lib/open.t...............................................FAILED
     No plan found in TAP output
../cpan/ExtUtils-Constant/t/Constant.t......................FAILED
     No plan found in TAP output

Passed Todo tests: (common-args) none
[stdio/perlio]
[stdio/perlio] -DDEBUGGING
[stdio/perlio] -Duse64bitall
[stdio/perlio] -DDEBUGGING -Duse64bitall
[stdio/perlio] -Duseithreads
[stdio/perlio] -DDEBUGGING -Duseithreads
[stdio/perlio] -Duseithreads -Duse64bitall
[stdio/perlio] -DDEBUGGING -Duseithreads -Duse64bitall
../dist/Net-Ping/t/450_service.t............................PASSED
     9, 18

[univ.utf8]
[univ.utf8] -DDEBUGGING
[univ.utf8] -Duse64bitall
[univ.utf8] -DDEBUGGING -Duse64bitall
[univ.utf8] -Duseithreads
[univ.utf8] -DDEBUGGING -Duseithreads
[univ.utf8] -Duseithreads -Duse64bitall
[univ.utf8] -DDEBUGGING -Duseithreads -Duse64bitall
../lib/B/Deparse.t..........................................PASSED
     2
../dist/Net-Ping/t/450_service.t............................PASSED
     9, 18

Compiler messages(hpux):


Status overview available here: http://doc.procura.nl/smoke/index.html

--
Report by Test::Smoke v1.59 running on perl 5.14.2
(Reporter v0.052 / Smoker v0.045)

Search Discussions

  • H.Merijn Brand at Mar 7, 2015 at 3:21 pm
    Automated smoke report for branch blead 5.21.10 patch 19eeb8f3f538405239ec8f4cff95421b9d9a3bfb v5.21.9-167-g19eeb8f
    x2: ia64 (ia64/2 cpu)
         on HP-UX - B.11.31/64
         using ccache gcc version 4.7.2
         smoketime 9 hours 24 minutes (average 1 hour 10 minutes)

    Summary: FAIL(F)

    O = OK F = Failure(s), extended report at the bottom
    X = Failure(s) under TEST but not under harness
    ? = still running or test results not (yet) available
    Build failures during: - = unknown or N/A
    c = Configure, m = make, M = make (after miniperl), t = make test-prep

    v5.21.9-167-g19eeb8f Configuration (common) -Dcc=gcc
    ----------- ---------------------------------------------------------
    O O O O O O
    F O O O O O -Duse64bitall
    O O F O O O -Duseithreads
    O O O O O O -Duseithreads -Duse64bitall
    +- LC_ALL = univ.utf8 -DDEBUGGING
    +--- PERLIO = perlio -DDEBUGGING
    +----- PERLIO = stdio -DDEBUGGING
    +------- LC_ALL = univ.utf8
    +--------- PERLIO = perlio
    +----------- PERLIO = stdio

    Locally applied patches:
         SMOKE19eeb8f3f538405239ec8f4cff95421b9d9a3bfb

    Testsuite was run only with 'harness'

    Failures: (common-args) -Dcc=gcc
    [stdio] -Duse64bitall
    ../cpan/ExtUtils-Command/t/eu_command.t.....................FAILED
         8
         Non-zero exit status: 1

    [univ.utf8] -Duseithreads
    ../t/op/alarm.t.............................................FAILED
         2

    Passed Todo tests: (common-args) -Dcc=gcc
    [stdio/perlio]
    [stdio/perlio] -DDEBUGGING
    [stdio/perlio] -Duse64bitall
    [stdio/perlio] -DDEBUGGING -Duse64bitall
    [stdio/perlio] -Duseithreads
    [stdio/perlio] -DDEBUGGING -Duseithreads
    [stdio/perlio] -Duseithreads -Duse64bitall
    [stdio/perlio] -DDEBUGGING -Duseithreads -Duse64bitall
    ../dist/Net-Ping/t/450_service.t............................PASSED
         9, 18

    [univ.utf8]
    [univ.utf8] -DDEBUGGING
    [univ.utf8] -Duse64bitall
    [univ.utf8] -DDEBUGGING -Duse64bitall
    [univ.utf8] -Duseithreads
    [univ.utf8] -DDEBUGGING -Duseithreads
    [univ.utf8] -Duseithreads -Duse64bitall
    [univ.utf8] -DDEBUGGING -Duseithreads -Duse64bitall
    ../lib/B/Deparse.t..........................................PASSED
         2
    ../dist/Net-Ping/t/450_service.t............................PASSED
         9, 18

    Compiler messages(gcc):
    try.c: In function 'main':
    make ...regexec.c: In function 'S_regmatch':
    regexec.c:5531:37: warning: comparison between signed and unsigned integer expressions [-Wsign-compare]
    regexec.c:5568:37: warning: comparison between signed and unsigned integer expressions [-Wsign-compare]
    regexec.c:5592:38: warning: comparison between signed and unsigned integer expressions [-Wsign-compare]
    regexec.c:5661:38: warning: comparison between signed and unsigned integer expressions [-Wsign-compare]
    Zlib.c: In function 'XS_Compress__Raw__Zlib_constant':
    ./constants.xs:38:34: warning: 'iv' may be used uninitialized in this function [-Wmaybe-uninitialized]
    DB_File.c: In function 'XS_DB_File_constant':
    RealPPPort.xs: In function 'XS_Devel__PPPort_check_HeUTF8':
    RealPPPort.xs:1663:18: warning: value computed is not used [-Wunused-value]
    MD5.xs:171:1: warning: 'static' is not at beginning of declaration [-Wold-style-declaration]
    Unicode.xs: In function 'XS_Encode__Unicode_decode_xs':
    Unicode.xs:174:270: warning: the address of 'PL_sv_undef' will always evaluate as 'true' [-Waddress]
    Unicode.xs:175:7: warning: value computed is not used [-Wunused-value]
    Unicode.xs:193:268: warning: the address of 'PL_sv_undef' will always evaluate as 'true' [-Waddress]
    Unicode.xs: In function 'XS_Encode__Unicode_encode_xs':
    Unicode.xs:339:270: warning: the address of 'PL_sv_undef' will always evaluate as 'true' [-Waddress]
    Unicode.xs:340:7: warning: value computed is not used [-Wunused-value]
    Unicode.xs:355:272: warning: the address of 'PL_sv_undef' will always evaluate as 'true' [-Waddress]
    ./const-xs.inc: In function 'XS_Fcntl_AUTOLOAD':
    ./const-xs.inc:559:6: warning: format '%d' expects argument of type 'int', but argument 4 has type 'line_t' [-Wformat]
    ./const-xs.inc:564:6: warning: format '%d' expects argument of type 'int', but argument 4 has type 'line_t' [-Wformat]
    ./const-xs.inc: In function 'XS_File__Glob_AUTOLOAD':
    ./const-xs.inc:135:6: warning: format '%d' expects argument of type 'int', but argument 4 has type 'line_t' [-Wformat]
    ./const-xs.inc:140:6: warning: format '%d' expects argument of type 'int', but argument 4 has type 'line_t' [-Wformat]
    ./const-xs.inc: In function 'XS_GDBM_File_AUTOLOAD':
    ./const-xs.inc:137:6: warning: format '%d' expects argument of type 'int', but argument 4 has type 'line_t' [-Wformat]
    ./const-xs.inc:142:6: warning: format '%d' expects argument of type 'int', but argument 4 has type 'line_t' [-Wformat]
    ./const-xs.inc: In function 'XS_I18N__Langinfo_AUTOLOAD':
    ./const-xs.inc:263:6: warning: format '%d' expects argument of type 'int', but argument 4 has type 'line_t' [-Wformat]
    ./const-xs.inc:268:6: warning: format '%d' expects argument of type 'int', but argument 4 has type 'line_t' [-Wformat]
    SysV.c: In function 'XS_IPC__SysV__constant':
    ./const-xs.inc:38:34: warning: 'iv' may be used uninitialized in this function [-Wmaybe-uninitialized]
    ListUtil.xs: In function 'XS_List__Util_reduce':
    ListUtil.xs:327:14: warning: variable 'newsp' set but not used [-Wunused-but-set-variable]
    ListUtil.xs: In function 'XS_List__Util_first':
    ListUtil.xs:381:14: warning: variable 'newsp' set but not used [-Wunused-but-set-variable]
    ListUtil.xs: In function 'XS_List__Util_any':
    ListUtil.xs:447:14: warning: variable 'newsp' set but not used [-Wunused-but-set-variable]
    ListUtil.xs: In function 'XS_List__Util_pairfirst':
    ListUtil.xs:509:14: warning: variable 'newsp' set but not used [-Wunused-but-set-variable]
    ListUtil.xs: In function 'XS_List__Util_pairgrep':
    ListUtil.xs:593:14: warning: variable 'newsp' set but not used [-Wunused-but-set-variable]
    ListUtil.xs: In function 'XS_List__Util_pairmap':
    ListUtil.xs:689:17: warning: unused variable 'b' [-Wunused-variable]
    ListUtil.xs:688:17: warning: unused variable 'a' [-Wunused-variable]
    ListUtil.xs:683:14: warning: variable 'newsp' set but not used [-Wunused-but-set-variable]
    ListUtil.xs:731:17: warning: unused variable 'b' [-Wunused-variable]
    ListUtil.xs:730:17: warning: unused variable 'a' [-Wunused-variable]
    ListUtil.c: In function 'XS_List__Util_min':
    ListUtil.xs:129:16: warning: 'retval' may be used uninitialized in this function [-Wmaybe-uninitialized]
    ./const-xs.inc: In function 'XS_POSIX_constant':
    ./const-xs.inc:1461:6: warning: format '%d' expects argument of type 'int', but argument 4 has type 'line_t' [-Wformat]
    ./const-xs.inc:1466:6: warning: format '%d' expects argument of type 'int', but argument 4 has type 'line_t' [-Wformat]
    encoding.xs: In function 'PerlIOEncode_flush':
    encoding.xs:447:15: warning: pointer targets in assignment differ in signedness [-Wpointer-sign]
    encoding.xs:448:15: warning: pointer targets in assignment differ in signedness [-Wpointer-sign]
    ./const-xs.inc: In function 'XS_Socket_AUTOLOAD':
    ./const-xs.inc:911:6: warning: format '%d' expects argument of type 'int', but argument 4 has type 'line_t' [-Wformat]
    ./const-xs.inc:916:6: warning: format '%d' expects argument of type 'int', but argument 4 has type 'line_t' [-Wformat]
    ./const-xs.inc: In function 'boot_Socket':
    ./const-xs.inc:873:20: warning: missing braces around initializer [-Wmissing-braces]
    ./const-xs.inc:873:20: warning: (near initialization for 'ip6_address._s6_un') [-Wmissing-braces]
    ./const-xs.inc:882:20: warning: missing braces around initializer [-Wmissing-braces]
    ./const-xs.inc:882:20: warning: (near initialization for 'ip6_address._s6_un') [-Wmissing-braces]
    HiRes.xs: In function 'XS_Time__HiRes_clock_gettime':
    HiRes.xs:1150:2: warning: enum conversion when passing argument 1 of 'clock_gettime' is invalid in C++ [-Wc++-compat]
    HiRes.xs: In function 'XS_Time__HiRes_clock_getres':
    HiRes.xs:1182:2: warning: enum conversion when passing argument 1 of 'clock_getres' is invalid in C++ [-Wc++-compat]
    HiRes.xs: In function 'XS_Time__HiRes_clock':
    HiRes.xs:1250:18: warning: comparison between signed and unsigned integer expressions [-Wsign-compare]
    HiRes.c: In function 'XS_Time__HiRes_constant':
    Piece.xs: In function '_strptime':
    Piece.xs:688:18: warning: comparison between signed and unsigned integer expressions [-Wsign-compare]
    Piece.xs:782:18: warning: comparison between signed and unsigned integer expressions [-Wsign-compare]
    Piece.xs: In function 'XS_Time__Piece__strftime':
    Piece.xs:1059:29: warning: comparison between signed and unsigned integer expressions [-Wsign-compare]
    Piece.xs:350:13: warning: 'copyright' defined but not used [-Wunused-variable]
    Piece.xs:352:13: warning: 'sccsid' defined but not used [-Wunused-variable]
    re_exec.c: In function 'S_regmatch':
    re_exec.c:5531:37: warning: comparison between signed and unsigned integer expressions [-Wsign-compare]
    re_exec.c:5568:37: warning: comparison between signed and unsigned integer expressions [-Wsign-compare]
    re_exec.c:5592:38: warning: comparison between signed and unsigned integer expressions [-Wsign-compare]
    re_exec.c:5661:38: warning: comparison between signed and unsigned integer expressions [-Wsign-compare]
    ExtTest.c: In function 'XS_ExtTest_constant':
    ExtTest.xs:465:35: warning: 'pv' may be used uninitialized in this function [-Wmaybe-uninitialized]
    ExtTest.xs:465:35: warning: 'iv' may be used uninitialized in this function [-Wmaybe-uninitialized]
    ExtTest.xs:237:35: warning: 'pv' may be used uninitialized in this function [-Wmaybe-uninitialized]
    ExtTest.xs:236:34: warning: 'iv' may be used uninitialized in this function [-Wmaybe-uninitialized]
    ExtTest.xs:217:34: warning: 'iv' may be used uninitialized in this function [-Wmaybe-uninitialized]
    ExtTest.xs:193:34: warning: 'iv' may be used uninitialized in this function [-Wmaybe-uninitialized]
    make ...op.c: In function 'Perl_custom_op_get_field':
    op.c:14122:2: warning: 'any.xop_name' may be used uninitialized in this function [-Wmaybe-uninitialized]
    regexec.c: In function 'S_regmatch':
    op.c: In function 'Perl_custom_op_get_field':
    B.c: In function 'XS_B__PADNAME_TYPE':
    B.xs:2402:26: warning: 'ret' may be used uninitialized in this function [-Wmaybe-uninitialized]
    Unicode.xs:174:1624: warning: the address of 'PL_sv_undef' will always evaluate as 'true' [-Waddress]
    Unicode.xs:193:1622: warning: the address of 'PL_sv_undef' will always evaluate as 'true' [-Waddress]
    Unicode.xs:339:1624: warning: the address of 'PL_sv_undef' will always evaluate as 'true' [-Waddress]
    Unicode.xs:355:1626: warning: the address of 'PL_sv_undef' will always evaluate as 'true' [-Waddress]
    scalar.xs: In function 'PerlIOScalar_read':
    scalar.xs:178:9: warning: comparison is always true due to limited range of data type [-Wtype-limits]
    TSTENV = perlio ExtTest.c: In function 'XS_ExtTest_constant':
    make ...Zlib.c: In function 'XS_Compress__Raw__Zlib_constant':
    make ...B.c: In function 'XS_B__PADNAME_TYPE':
    MD5.xs:159:1: warning: 'static' is not at beginning of declaration [-Wold-style-declaration]
    Opcode.xs: In function 'opmask_addlocal':
    Opcode.xs:230:15: warning: unused variable 'my_cxtp' [-Wunused-variable]
    B.xs:2402:35: warning: 'ret' may be used uninitialized in this function [-Wmaybe-uninitialized]

    Status overview available here: http://doc.procura.nl/smoke/index.html

    --
    Report by Test::Smoke v1.59 running on perl 5.14.2
    (Reporter v0.052 / Smoker v0.045)

Related Discussions

Discussion Navigation
viewthread | post
Discussion Overview
groupdaily-build-reports @
categoriesperl
postedMar 7, '15 at 5:56a
activeMar 7, '15 at 3:21p
posts2
users1
websiteperl.org

1 user in discussion

H.Merijn Brand: 2 posts

People

Translate

site design / logo © 2019 Grokbase