Automated smoke report for patch 23196 on - ()
(kosh.hut.fi) using version
Report by Test::Smoke v1.18 (perl 5.8.3) [4 hours 7 minutes]

O = OK F = Failure(s), extended report at the bottom
? = still running or test results not (yet) available
Build failures during: - = unknown or N/A
c = Configure, m = make, M = make (after miniperl), t = make test-prep

23196 Configuration (common) -Dlocincpth=/p/include -Dloclibpth=/p/lib
------------ ----------------------------------------------------------------
O O O O
F F F F -Duseithreads
O O O O -Dcc=gcc
+----- PERLIO = perlio -DDEBUGGING
+------- PERLIO = stdio -DDEBUGGING
+--------- PERLIO = perlio
+----------- PERLIO = stdio

Summary: FAIL(F)


Failures:

dec_osf [stdio/perlio]-Dlocincpth=/p/include -Dloclibpth=/p/lib
(cont) -Duseithreads
dec_osf [stdio/perlio]-DDEBUGGING -Dlocincpth=/p/include
(cont) -Dloclibpth=/p/lib -Duseithreads
t/op/threads..............................FAILED at test 1

Search Discussions

  • Alian at Aug 5, 2004 at 8:18 am
    Automated smoke report for patch 23196 on - ()
    (redflag) using ccache /usr/local/gcc-3.3.1/bin/gcc version 3.3.1
    Report by Test::Smoke v1.18.10 (perl 5.6.0) [4 hours 12 minutes]

    O = OK F = Failure(s), extended report at the bottom
    X = test(s) failed under TEST but not under harness
    ? = still running or test results not (yet) available
    Build failures during: - = unknown or N/A
    c = Configure, m = make, M = make (after miniperl), t = make test-prep

    23196 Configuration (common) -Dcc="ccache
    /usr/local/gcc-3.3.1/bin/gcc" -Dcf_email=alian@cpan.org
    ------------ ----------------------------------------------------------------
    O O O O O O
    O O O O O O -Duse64bitint
    F F F F F F -Duseithreads
    F F F F F F -Duseithreads -Duse64bitint
    +- LC_ALL = fr_FR.utf8 -DDEBUGGING
    +--- PERLIO = perlio -DDEBUGGING
    +----- PERLIO = stdio -DDEBUGGING
    +------- LC_ALL = fr_FR.utf8
    +--------- PERLIO = perlio
    +----------- PERLIO = stdio

    Summary: FAIL(F)


    Failures:

    linux [stdio/perlio]-Dcf_email=alian@cpan.org -Dcc="ccache
    (cont) /usr/local/gcc-3.3.1/bin/gcc" -Duseithreads
    ../t/op/threads.t.......................FAILED 1-3

    linux [locale:fr_FR]-Dcf_email=alian@cpan.org -Dcc="ccache
    (cont) /usr/local/gcc-3.3.1/bin/gcc" -Duseithreads
    ../t/op/threads.t.......................FAILED 1-3

    linux [stdio/perlio]-DDEBUGGING -Dcf_email=alian@cpan.org
    (cont) -Dcc="ccache /usr/local/gcc-3.3.1/bin/gcc"
    (cont) -Duseithreads
    ../t/op/threads.t.......................FAILED 1-3

    linux [locale:fr_FR]-DDEBUGGING -Dcf_email=alian@cpan.org
    (cont) -Dcc="ccache /usr/local/gcc-3.3.1/bin/gcc"
    (cont) -Duseithreads
    ../t/op/threads.t.......................FAILED 1-3

    linux [stdio/perlio]-Dcf_email=alian@cpan.org -Dcc="ccache
    (cont) /usr/local/gcc-3.3.1/bin/gcc" -Duseithreads
    (cont) -Duse64bitint
    ../t/op/threads.t.......................FAILED 1-3

    linux [locale:fr_FR]-Dcf_email=alian@cpan.org -Dcc="ccache
    (cont) /usr/local/gcc-3.3.1/bin/gcc" -Duseithreads
    (cont) -Duse64bitint
    ../t/op/threads.t.......................FAILED 1-3

    linux [stdio/perlio]-DDEBUGGING -Dcf_email=alian@cpan.org
    (cont) -Dcc="ccache /usr/local/gcc-3.3.1/bin/gcc"
    (cont) -Duseithreads -Duse64bitint
    ../t/op/threads.t.......................FAILED 1-3

    linux [locale:fr_FR]-DDEBUGGING -Dcf_email=alian@cpan.org
    (cont) -Dcc="ccache /usr/local/gcc-3.3.1/bin/gcc"
    (cont) -Duseithreads -Duse64bitint
    ../t/op/threads.t.......................FAILED 1-3
  • Nospam at Aug 5, 2004 at 9:06 am
    Automated smoke report for patch 23196 on - ()
    (saket.hursley.ibm.com) using version
    Report by Test::Smoke v1.18.10 (perl 5.8.0) [8 hours 55 minutes]

    O = OK F = Failure(s), extended report at the bottom
    X = test(s) failed under TEST but not under harness
    ? = still running or test results not (yet) available
    Build failures during: - = unknown or N/A
    c = Configure, m = make, M = make (after miniperl), t = make test-prep

    23196 Configuration (common) none
    ------------ ----------------------------------------------------------------
    F - F - -Uuseperlio
    O O O O
    O O O O -Duse64bitint
    O O O O -Duselongdouble
    O O O O -Dusemorebits
    F F F F -Duseithreads
    F F F F -Duseithreads -Duse64bitint
    F F F F -Duseithreads -Duselongdouble
    F F F F -Duseithreads -Dusemorebits
    +----- PERLIO = perlio -DDEBUGGING
    +------- PERLIO = stdio -DDEBUGGING
    +--------- PERLIO = perlio
    +----------- PERLIO = stdio

    Summary: FAIL(F)


    Failures:

    linux [stdio ]-Uuseperlio
    linux [stdio ]-DDEBUGGING -Uuseperlio
    ../ext/B/t/f_map.t......................FAILED 1-9
    ../ext/B/t/f_sort.t.....................FAILED 1-20
    ../ext/B/t/optree_check.t...............FAILED 24
    ../ext/B/t/optree_concise.t.............FAILED 24
    ../ext/B/t/showlex.t....................FAILED 4-8

    linux [stdio/perlio]-Duseithreads
    linux [stdio/perlio]-DDEBUGGING -Duseithreads
    linux [stdio/perlio]-Duseithreads -Duse64bitint
    linux [stdio/perlio]-DDEBUGGING -Duseithreads -Duse64bitint
    linux [stdio/perlio]-Duseithreads -Duselongdouble
    linux [stdio/perlio]-DDEBUGGING -Duseithreads -Duselongdouble
    linux [stdio/perlio]-Duseithreads -Dusemorebits
    linux [stdio/perlio]-DDEBUGGING -Duseithreads -Dusemorebits
    ../t/op/threads.t.......................FAILED 1-3
  • Alan Burlison at Aug 6, 2004 at 8:56 am
    Automated smoke report for patch 23196 on - ()
    (fubar) using version
    Report by Test::Smoke v1.18.06 (perl 5.6.1) [18 hours 54 minutes]

    O = OK F = Failure(s), extended report at the bottom
    X = test(s) failed under TEST but not under harness
    ? = still running or test results not (yet) available
    Build failures during: - = unknown or N/A
    c = Configure, m = make, M = make (after miniperl), t = make test-prep

    23196 Configuration (common) none
    ------------ ----------------------------------------------------------------
    O O O O -Duse64bitint
    O O O O -Duselongdouble
    O O O O -Dusemorebits
    F F F F -Duseithreads -Duse64bitint
    F F F F -Duseithreads -Duselongdouble
    F F F F -Duseithreads -Dusemorebits
    +----- PERLIO = perlio -DDEBUGGING
    +------- PERLIO = stdio -DDEBUGGING
    +--------- PERLIO = perlio
    +----------- PERLIO = stdio

    Summary: FAIL(F)


    Failures:

    solaris [stdio/perlio]-Duseithreads -Duse64bitint
    solaris [stdio/perlio]-DDEBUGGING -Duseithreads -Duse64bitint
    solaris [stdio/perlio]-Duseithreads -Duselongdouble
    solaris [stdio/perlio]-DDEBUGGING -Duseithreads -Duselongdouble
    solaris [stdio/perlio]-Duseithreads -Dusemorebits
    solaris [stdio/perlio]-DDEBUGGING -Duseithreads -Dusemorebits
    ../t/op/threads.t.......................FAILED 1-3
  • Alan Burlison at Aug 6, 2004 at 10:52 am
    Automated smoke report for patch 23196 on - ()
    (curly) using version
    Report by Test::Smoke v1.18.06 (perl 5.6.1) [1 day 8 hours 46 minutes]

    O = OK F = Failure(s), extended report at the bottom
    X = test(s) failed under TEST but not under harness
    ? = still running or test results not (yet) available
    Build failures during: - = unknown or N/A
    c = Configure, m = make, M = make (after miniperl), t = make test-prep

    23196 Configuration (common) none
    ------------ ----------------------------------------------------------------
    O O O O -Duse64bitint
    O O O O -Duselongdouble
    O O O O -Dusemorebits
    F F F F -Duseithreads -Duse64bitint
    F F F F -Duseithreads -Duselongdouble
    F F F F -Duseithreads -Dusemorebits
    +----- PERLIO = perlio -DDEBUGGING
    +------- PERLIO = stdio -DDEBUGGING
    +--------- PERLIO = perlio
    +----------- PERLIO = stdio

    Summary: FAIL(F)


    Failures:

    solaris [stdio/perlio]-Duseithreads -Duse64bitint
    solaris [stdio/perlio]-DDEBUGGING -Duseithreads -Duse64bitint
    solaris [stdio/perlio]-Duseithreads -Duselongdouble
    solaris [stdio/perlio]-DDEBUGGING -Duseithreads -Duselongdouble
    solaris [stdio/perlio]-Duseithreads -Dusemorebits
    solaris [stdio/perlio]-DDEBUGGING -Duseithreads -Dusemorebits
    ../t/op/threads.t.......................FAILED 1-3
  • Alan Burlison at Aug 7, 2004 at 1:33 am
    Automated smoke report for patch 23196 on - ()
    (moe) using version
    Report by Test::Smoke v1.18.06 (perl 5.6.1) [1 day 8 hours 27 minutes]

    O = OK F = Failure(s), extended report at the bottom
    X = test(s) failed under TEST but not under harness
    ? = still running or test results not (yet) available
    Build failures during: - = unknown or N/A
    c = Configure, m = make, M = make (after miniperl), t = make test-prep

    23196 Configuration (common) none
    ------------ ----------------------------------------------------------------
    O O O O -Duse64bitint
    O O O O -Duselongdouble
    O O O O -Dusemorebits
    F F F F -Duseithreads -Duse64bitint
    F F F F -Duseithreads -Duselongdouble
    F F F F -Duseithreads -Dusemorebits
    +----- PERLIO = perlio -DDEBUGGING
    +------- PERLIO = stdio -DDEBUGGING
    +--------- PERLIO = perlio
    +----------- PERLIO = stdio

    Summary: FAIL(F)


    Failures:

    solaris [stdio/perlio]-Duseithreads -Duse64bitint
    solaris [stdio/perlio]-DDEBUGGING -Duseithreads -Duse64bitint
    solaris [stdio/perlio]-Duseithreads -Duselongdouble
    solaris [stdio/perlio]-DDEBUGGING -Duseithreads -Duselongdouble
    solaris [stdio/perlio]-Duseithreads -Dusemorebits
    solaris [stdio/perlio]-DDEBUGGING -Duseithreads -Dusemorebits
    ../t/op/threads.t.......................FAILED 1-3
  • Alan Burlison at Aug 7, 2004 at 10:47 am
    Automated smoke report for patch 23196 on - ()
    (larry) using version
    Report by Test::Smoke v1.18.06 (perl 5.6.1) [1 day 8 hours 42 minutes]

    O = OK F = Failure(s), extended report at the bottom
    X = test(s) failed under TEST but not under harness
    ? = still running or test results not (yet) available
    Build failures during: - = unknown or N/A
    c = Configure, m = make, M = make (after miniperl), t = make test-prep

    23196 Configuration (common) none
    ------------ ----------------------------------------------------------------
    O O O O -Duse64bitint
    O O O O -Duselongdouble
    O O O O -Dusemorebits
    F F F F -Duseithreads -Duse64bitint
    F F F F -Duseithreads -Duselongdouble
    F F F F -Duseithreads -Dusemorebits
    +----- PERLIO = perlio -DDEBUGGING
    +------- PERLIO = stdio -DDEBUGGING
    +--------- PERLIO = perlio
    +----------- PERLIO = stdio

    Summary: FAIL(F)


    Failures:

    solaris [stdio/perlio]-Duseithreads -Duse64bitint
    solaris [stdio/perlio]-DDEBUGGING -Duseithreads -Duse64bitint
    solaris [stdio/perlio]-Duseithreads -Duselongdouble
    solaris [stdio/perlio]-DDEBUGGING -Duseithreads -Duselongdouble
    solaris [stdio/perlio]-Duseithreads -Dusemorebits
    solaris [stdio/perlio]-DDEBUGGING -Duseithreads -Dusemorebits
    ../t/op/threads.t.......................FAILED 1-3

Related Discussions

Discussion Navigation
viewthread | post
Discussion Overview
groupdaily-build-reports @
categoriesperl
postedAug 5, '04 at 4:08a
activeAug 7, '04 at 10:47a
posts7
users4
websiteperl.org

People

Translate

site design / logo © 2019 Grokbase