Automated smoke report for patch 23180 on - ()
(kosh.hut.fi) using version
Report by Test::Smoke v1.18 (perl 5.8.3) [4 hours 6 minutes]

O = OK F = Failure(s), extended report at the bottom
? = still running or test results not (yet) available
Build failures during: - = unknown or N/A
c = Configure, m = make, M = make (after miniperl), t = make test-prep

23180 Configuration (common) -Dlocincpth=/p/include -Dloclibpth=/p/lib
------------ ----------------------------------------------------------------
F F F F
F F F F -Duseithreads
F F F F -Dcc=gcc
+----- PERLIO = perlio -DDEBUGGING
+------- PERLIO = stdio -DDEBUGGING
+--------- PERLIO = perlio
+----------- PERLIO = stdio

Summary: FAIL(F)


Failures:

dec_osf [stdio/perlio]-Dlocincpth=/p/include -Dloclibpth=/p/lib
dec_osf [stdio/perlio]-DDEBUGGING -Dlocincpth=/p/include
(cont) -Dloclibpth=/p/lib
dec_osf [stdio/perlio]-Dlocincpth=/p/include -Dloclibpth=/p/lib
(cont) -Duseithreads
dec_osf [stdio/perlio]-DDEBUGGING -Dlocincpth=/p/include
(cont) -Dloclibpth=/p/lib -Duseithreads
t/run/fresh_perl..........................FAILED at test 94

dec_osf [stdio/perlio]-Dlocincpth=/p/include -Dloclibpth=/p/lib
(cont) -Dcc=gcc
dec_osf [stdio/perlio]-DDEBUGGING -Dlocincpth=/p/include
(cont) -Dloclibpth=/p/lib -Dcc=gcc
../t/run/fresh_perl.t.........FAILED 94

Search Discussions

  • Alian at Aug 2, 2004 at 7:56 am
    Automated smoke report for patch 23180 on - ()
    (redflag) using ccache /usr/local/gcc-3.3.1/bin/gcc version 3.3.1
    Report by Test::Smoke v1.18.10 (perl 5.6.0) [3 hours 50 minutes]

    O = OK F = Failure(s), extended report at the bottom
    X = test(s) failed under TEST but not under harness
    ? = still running or test results not (yet) available
    Build failures during: - = unknown or N/A
    c = Configure, m = make, M = make (after miniperl), t = make test-prep

    23180 Configuration (common) -Dcc="ccache
    /usr/local/gcc-3.3.1/bin/gcc" -Dcf_email=alian@cpan.org
    ------------ ----------------------------------------------------------------
    F F F F F F
    F F F F F F -Duse64bitint
    F F F F F F -Duseithreads
    F F F F F F -Duseithreads -Duse64bitint
    +- LC_ALL = fr_FR.utf8 -DDEBUGGING
    +--- PERLIO = perlio -DDEBUGGING
    +----- PERLIO = stdio -DDEBUGGING
    +------- LC_ALL = fr_FR.utf8
    +--------- PERLIO = perlio
    +----------- PERLIO = stdio

    Summary: FAIL(F)


    Failures:

    linux [stdio/perlio]-Dcf_email=alian@cpan.org -Dcc="ccache
    (cont) /usr/local/gcc-3.3.1/bin/gcc"
    ../t/run/fresh_perl.t...................FAILED 94

    linux [locale:fr_FR]-Dcf_email=alian@cpan.org -Dcc="ccache
    (cont) /usr/local/gcc-3.3.1/bin/gcc"
    ../t/run/fresh_perl.t...................FAILED 94

    linux [stdio/perlio]-DDEBUGGING -Dcf_email=alian@cpan.org
    (cont) -Dcc="ccache /usr/local/gcc-3.3.1/bin/gcc"
    ../t/run/fresh_perl.t...................FAILED 94

    linux [locale:fr_FR]-DDEBUGGING -Dcf_email=alian@cpan.org
    (cont) -Dcc="ccache /usr/local/gcc-3.3.1/bin/gcc"
    ../t/run/fresh_perl.t...................FAILED 94

    linux [stdio/perlio]-Dcf_email=alian@cpan.org -Dcc="ccache
    (cont) /usr/local/gcc-3.3.1/bin/gcc" -Duse64bitint
    ../t/run/fresh_perl.t...................FAILED 94

    linux [locale:fr_FR]-Dcf_email=alian@cpan.org -Dcc="ccache
    (cont) /usr/local/gcc-3.3.1/bin/gcc" -Duse64bitint
    ../t/run/fresh_perl.t...................FAILED 94

    linux [stdio/perlio]-DDEBUGGING -Dcf_email=alian@cpan.org
    (cont) -Dcc="ccache /usr/local/gcc-3.3.1/bin/gcc"
    (cont) -Duse64bitint
    ../t/run/fresh_perl.t...................FAILED 94

    linux [locale:fr_FR]-DDEBUGGING -Dcf_email=alian@cpan.org
    (cont) -Dcc="ccache /usr/local/gcc-3.3.1/bin/gcc"
    (cont) -Duse64bitint
    ../t/run/fresh_perl.t...................FAILED 94

    linux [stdio/perlio]-Dcf_email=alian@cpan.org -Dcc="ccache
    (cont) /usr/local/gcc-3.3.1/bin/gcc" -Duseithreads
    ../t/run/fresh_perl.t...................FAILED 94

    linux [locale:fr_FR]-Dcf_email=alian@cpan.org -Dcc="ccache
    (cont) /usr/local/gcc-3.3.1/bin/gcc" -Duseithreads
    ../t/run/fresh_perl.t...................FAILED 94

    linux [stdio/perlio]-DDEBUGGING -Dcf_email=alian@cpan.org
    (cont) -Dcc="ccache /usr/local/gcc-3.3.1/bin/gcc"
    (cont) -Duseithreads
    ../t/run/fresh_perl.t...................FAILED 94

    linux [locale:fr_FR]-DDEBUGGING -Dcf_email=alian@cpan.org
    (cont) -Dcc="ccache /usr/local/gcc-3.3.1/bin/gcc"
    (cont) -Duseithreads
    ../t/run/fresh_perl.t...................FAILED 94

    linux [stdio/perlio]-Dcf_email=alian@cpan.org -Dcc="ccache
    (cont) /usr/local/gcc-3.3.1/bin/gcc" -Duseithreads
    (cont) -Duse64bitint
    ../t/run/fresh_perl.t...................FAILED 94

    linux [locale:fr_FR]-Dcf_email=alian@cpan.org -Dcc="ccache
    (cont) /usr/local/gcc-3.3.1/bin/gcc" -Duseithreads
    (cont) -Duse64bitint
    ../t/run/fresh_perl.t...................FAILED 94

    linux [stdio/perlio]-DDEBUGGING -Dcf_email=alian@cpan.org
    (cont) -Dcc="ccache /usr/local/gcc-3.3.1/bin/gcc"
    (cont) -Duseithreads -Duse64bitint
    ../t/run/fresh_perl.t...................FAILED 94

    linux [locale:fr_FR]-DDEBUGGING -Dcf_email=alian@cpan.org
    (cont) -Dcc="ccache /usr/local/gcc-3.3.1/bin/gcc"
    (cont) -Duseithreads -Duse64bitint
    ../t/run/fresh_perl.t...................FAILED 94
  • Nospam at Aug 2, 2004 at 9:02 am
    Automated smoke report for patch 23180 on - ()
    (saket.hursley.ibm.com) using version
    Report by Test::Smoke v1.18.10 (perl 5.8.0) [8 hours 51 minutes]

    O = OK F = Failure(s), extended report at the bottom
    X = test(s) failed under TEST but not under harness
    ? = still running or test results not (yet) available
    Build failures during: - = unknown or N/A
    c = Configure, m = make, M = make (after miniperl), t = make test-prep

    23180 Configuration (common) none
    ------------ ----------------------------------------------------------------
    F - F - -Uuseperlio
    F F F F
    F F F F -Duse64bitint
    F F F F -Duselongdouble
    F F F F -Dusemorebits
    F F F F -Duseithreads
    F F F F -Duseithreads -Duse64bitint
    F F F F -Duseithreads -Duselongdouble
    F F F F -Duseithreads -Dusemorebits
    +----- PERLIO = perlio -DDEBUGGING
    +------- PERLIO = stdio -DDEBUGGING
    +--------- PERLIO = perlio
    +----------- PERLIO = stdio

    Summary: FAIL(F)


    Failures:

    linux [stdio ]-Uuseperlio
    linux [stdio ]-DDEBUGGING -Uuseperlio
    ../ext/B/t/f_map.t......................FAILED 1-9
    ../ext/B/t/f_sort.t.....................FAILED 1-20
    ../ext/B/t/optree_check.t...............FAILED 24
    ../ext/B/t/optree_concise.t.............FAILED 24
    ../ext/B/t/showlex.t....................FAILED 4-8
    ../t/run/fresh_perl.t...................FAILED 94

    linux [stdio/perlio]
    linux [stdio/perlio]-DDEBUGGING
    linux [stdio/perlio]-Duse64bitint
    linux [stdio/perlio]-DDEBUGGING -Duse64bitint
    linux [stdio/perlio]-Duselongdouble
    linux [stdio/perlio]-DDEBUGGING -Duselongdouble
    linux [stdio/perlio]-Dusemorebits
    linux [stdio/perlio]-DDEBUGGING -Dusemorebits
    linux [stdio/perlio]-Duseithreads
    linux [stdio/perlio]-DDEBUGGING -Duseithreads
    linux [stdio/perlio]-Duseithreads -Duse64bitint
    linux [stdio/perlio]-DDEBUGGING -Duseithreads -Duse64bitint
    linux [stdio/perlio]-Duseithreads -Duselongdouble
    linux [stdio/perlio]-DDEBUGGING -Duseithreads -Duselongdouble
    linux [stdio/perlio]-Duseithreads -Dusemorebits
    linux [stdio/perlio]-DDEBUGGING -Duseithreads -Dusemorebits
    ../t/run/fresh_perl.t...................FAILED 94
  • Alan Burlison at Aug 2, 2004 at 8:59 pm
    Automated smoke report for patch 23180 on - ()
    (fubar) using version
    Report by Test::Smoke v1.18.06 (perl 5.6.1) [18 hours 57 minutes]

    O = OK F = Failure(s), extended report at the bottom
    X = test(s) failed under TEST but not under harness
    ? = still running or test results not (yet) available
    Build failures during: - = unknown or N/A
    c = Configure, m = make, M = make (after miniperl), t = make test-prep

    23180 Configuration (common) none
    ------------ ----------------------------------------------------------------
    F F F F -Duse64bitint
    F F F F -Duselongdouble
    F F F F -Dusemorebits
    F F F F -Duseithreads -Duse64bitint
    F F F F -Duseithreads -Duselongdouble
    F F F F -Duseithreads -Dusemorebits
    +----- PERLIO = perlio -DDEBUGGING
    +------- PERLIO = stdio -DDEBUGGING
    +--------- PERLIO = perlio
    +----------- PERLIO = stdio

    Summary: FAIL(F)


    Failures:

    solaris [stdio/perlio]-Duse64bitint
    solaris [stdio/perlio]-DDEBUGGING -Duse64bitint
    solaris [stdio/perlio]-Duselongdouble
    solaris [stdio/perlio]-DDEBUGGING -Duselongdouble
    solaris [stdio/perlio]-Dusemorebits
    solaris [stdio/perlio]-DDEBUGGING -Dusemorebits
    solaris [stdio/perlio]-Duseithreads -Duse64bitint
    solaris [stdio/perlio]-DDEBUGGING -Duseithreads -Duse64bitint
    solaris [stdio/perlio]-Duseithreads -Duselongdouble
    solaris [stdio/perlio]-DDEBUGGING -Duseithreads -Duselongdouble
    solaris [stdio/perlio]-Duseithreads -Dusemorebits
    solaris [stdio/perlio]-DDEBUGGING -Duseithreads -Dusemorebits
    ../t/run/fresh_perl.t...................FAILED 94
  • Alan Burlison at Aug 3, 2004 at 7:53 am
    Automated smoke report for patch 23180 on - ()
    (larry) using version
    Report by Test::Smoke v1.18.06 (perl 5.6.1) [1 day 8 hours 47 minutes]

    O = OK F = Failure(s), extended report at the bottom
    X = test(s) failed under TEST but not under harness
    ? = still running or test results not (yet) available
    Build failures during: - = unknown or N/A
    c = Configure, m = make, M = make (after miniperl), t = make test-prep

    23180 Configuration (common) none
    ------------ ----------------------------------------------------------------
    F F F F -Duse64bitint
    F F F F -Duselongdouble
    F F F F -Dusemorebits
    F F F F -Duseithreads -Duse64bitint
    F F F F -Duseithreads -Duselongdouble
    F F F F -Duseithreads -Dusemorebits
    +----- PERLIO = perlio -DDEBUGGING
    +------- PERLIO = stdio -DDEBUGGING
    +--------- PERLIO = perlio
    +----------- PERLIO = stdio

    Summary: FAIL(F)


    Failures:

    solaris [stdio/perlio]-Duse64bitint
    solaris [stdio/perlio]-DDEBUGGING -Duse64bitint
    solaris [stdio/perlio]-Duselongdouble
    solaris [stdio/perlio]-DDEBUGGING -Duselongdouble
    solaris [stdio/perlio]-Dusemorebits
    solaris [stdio/perlio]-DDEBUGGING -Dusemorebits
    solaris [stdio/perlio]-Duseithreads -Duse64bitint
    solaris [stdio/perlio]-DDEBUGGING -Duseithreads -Duse64bitint
    solaris [stdio/perlio]-Duseithreads -Duselongdouble
    solaris [stdio/perlio]-DDEBUGGING -Duseithreads -Duselongdouble
    solaris [stdio/perlio]-Duseithreads -Dusemorebits
    solaris [stdio/perlio]-DDEBUGGING -Duseithreads -Dusemorebits
    ../t/run/fresh_perl.t...................FAILED 94
  • Alan Burlison at Aug 3, 2004 at 4:46 pm
    Automated smoke report for patch 23180 on - ()
    (curly) using version
    Report by Test::Smoke v1.18.06 (perl 5.6.1) [1 day 8 hours 40 minutes]

    O = OK F = Failure(s), extended report at the bottom
    X = test(s) failed under TEST but not under harness
    ? = still running or test results not (yet) available
    Build failures during: - = unknown or N/A
    c = Configure, m = make, M = make (after miniperl), t = make test-prep

    23180 Configuration (common) none
    ------------ ----------------------------------------------------------------
    F F F F -Duse64bitint
    F F F F -Duselongdouble
    F F F F -Dusemorebits
    F F F F -Duseithreads -Duse64bitint
    F F F F -Duseithreads -Duselongdouble
    F F F F -Duseithreads -Dusemorebits
    +----- PERLIO = perlio -DDEBUGGING
    +------- PERLIO = stdio -DDEBUGGING
    +--------- PERLIO = perlio
    +----------- PERLIO = stdio

    Summary: FAIL(F)


    Failures:

    solaris [stdio/perlio]-Duse64bitint
    solaris [stdio/perlio]-DDEBUGGING -Duse64bitint
    solaris [stdio/perlio]-Duselongdouble
    solaris [stdio/perlio]-DDEBUGGING -Duselongdouble
    solaris [stdio/perlio]-Dusemorebits
    solaris [stdio/perlio]-DDEBUGGING -Dusemorebits
    solaris [stdio/perlio]-Duseithreads -Duse64bitint
    solaris [stdio/perlio]-DDEBUGGING -Duseithreads -Duse64bitint
    solaris [stdio/perlio]-Duseithreads -Duselongdouble
    solaris [stdio/perlio]-DDEBUGGING -Duseithreads -Duselongdouble
    solaris [stdio/perlio]-Duseithreads -Dusemorebits
    solaris [stdio/perlio]-DDEBUGGING -Duseithreads -Dusemorebits
    ../t/run/fresh_perl.t...................FAILED 94

Related Discussions

Discussion Navigation
viewthread | post
Discussion Overview
groupdaily-build-reports @
categoriesperl
postedAug 2, '04 at 4:07a
activeAug 3, '04 at 4:46p
posts6
users4
websiteperl.org

People

Translate

site design / logo © 2019 Grokbase