FAQ
Hi all

I'm having all this problems, can someone help me?

Best Regards

cpan> install CDB_File
CPAN: Storable loaded ok
Going to read /home/oleber/.cpan/Metadata
Database was generated on Thu, 24 Jan 2008 10:31:02 GMT
Running install for module CDB_File
Running make for M/MS/MSERGEANT/CDB_File-0.95.tar.gz
CPAN: Digest::MD5 loaded ok
Checksum for /home/oleber/.cpan/sources/authors/id/M/MS/MSERGEANT/CDB_File-0.95.tar.gz
ok
Scanning cache /home/oleber/.cpan/build for sizes
CDB_File-0.95/
CDB_File-0.95/ACKNOWLEDGE
CDB_File-0.95/bun-x.pl
CDB_File-0.95/CDB_File.pm
CDB_File-0.95/CDB_File.xs
CDB_File-0.95/CHANGES
CDB_File-0.95/COPYRIGHT
CDB_File-0.95/INSTALL
CDB_File-0.95/Makefile.PL
CDB_File-0.95/MANIFEST
CDB_File-0.95/META.yml
CDB_File-0.95/ppport.h
CDB_File-0.95/README
CDB_File-0.95/t/
CDB_File-0.95/t/01main.t
CDB_File-0.95/t/02last.t
CDB_File-0.95/typemap
Removing previously used /home/oleber/.cpan/build/CDB_File-0.95

CPAN.pm: Going to build M/MS/MSERGEANT/CDB_File-0.95.tar.gz

Checking if your kit is complete...
Looks good
Writing Makefile for CDB_File
cp bun-x.pl blib/lib/bun-x.pl
cp CDB_File.pm blib/lib/CDB_File.pm
/usr/bin/perl /usr/share/perl/5.8/ExtUtils/xsubpp -typemap
/usr/share/perl/5.8/ExtUtils/typemap -typemap typemap CDB_File.xs >
CDB_File.xsc && mv CDB_File.xsc CDB_File.c
cc -c -D_REENTRANT -D_GNU_SOURCE -DTHREADS_HAVE_PIDS -DDEBIAN
-fno-strict-aliasing -pipe -I/usr/local/include -D_LARGEFILE_SOURCE
-D_FILE_OFFSET_BITS=64 -O2 -DVERSION=\"0.95\" -DXS_VERSION=\"0.95\"
-fPIC "-I/usr/lib/perl/5.8/CORE" -DHASMMAP CDB_File.c
In file included from CDB_File.xs:37:
/usr/lib/perl/5.8/CORE/perl.h:420:24: error: sys/types.h: No such file
or directory
/usr/lib/perl/5.8/CORE/perl.h:451:19: error: ctype.h: No such file or directory
/usr/lib/perl/5.8/CORE/perl.h:463:23: error: locale.h: No such file or directory
/usr/lib/perl/5.8/CORE/perl.h:480:20: error: setjmp.h: No such file or directory
/usr/lib/perl/5.8/CORE/perl.h:486:26: error: sys/param.h: No such file
or directory
/usr/lib/perl/5.8/CORE/perl.h:491:23: error: stdlib.h: No such file or directory
/usr/lib/perl/5.8/CORE/perl.h:496:23: error: unistd.h: No such file or directory
/usr/lib/perl/5.8/CORE/perl.h:776:23: error: string.h: No such file or directory
/usr/lib/perl/5.8/CORE/perl.h:925:27: error: netinet/in.h: No such
file or directory
/usr/lib/perl/5.8/CORE/perl.h:929:26: error: arpa/inet.h: No such file
or directory
/usr/lib/perl/5.8/CORE/perl.h:939:25: error: sys/stat.h: No such file
or directory
/usr/lib/perl/5.8/CORE/perl.h:961:21: error: time.h: No such file or directory
/usr/lib/perl/5.8/CORE/perl.h:968:25: error: sys/time.h: No such file
or directory
/usr/lib/perl/5.8/CORE/perl.h:975:27: error: sys/times.h: No such file
or directory
/usr/lib/perl/5.8/CORE/perl.h:982:19: error: errno.h: No such file or directory
/usr/lib/perl/5.8/CORE/perl.h:997:25: error: sys/socket.h: No such
file or directory
/usr/lib/perl/5.8/CORE/perl.h:1024:21: error: netdb.h: No such file or directory
/usr/lib/perl/5.8/CORE/perl.h:1127:24: error: sys/ioctl.h: No such
file or directory
/usr/lib/perl/5.8/CORE/perl.h:1156:23: error: dirent.h: No such file
or directory
In file included from /usr/lib/gcc/i486-linux-gnu/4.1.3/include/syslimits.h:7,
from /usr/lib/gcc/i486-linux-gnu/4.1.3/include/limits.h:11,
from /usr/lib/perl/5.8/CORE/perl.h:1510,
from CDB_File.xs:37:
/usr/lib/gcc/i486-linux-gnu/4.1.3/include/limits.h:122:61: error:
limits.h: No such file or directory
In file included from /usr/lib/perl/5.8/CORE/perl.h:2120,
from CDB_File.xs:37:
/usr/lib/perl/5.8/CORE/handy.h:136:25: error: inttypes.h: No such file
or directory
In file included from /usr/lib/perl/5.8/CORE/perl.h:2284,
from CDB_File.xs:37:
/usr/lib/perl/5.8/CORE/unixish.h:106:21: error: signal.h: No such file
or directory
In file included from CDB_File.xs:37:
/usr/lib/perl/5.8/CORE/perl.h:2421:33: error: pthread.h: No such file
or directory
In file included from CDB_File.xs:37:
/usr/lib/perl/5.8/CORE/perl.h:2423: error: expected '=', ',', ';',
'asm' or '__attribute__' before 'perl_os_thread'
/usr/lib/perl/5.8/CORE/perl.h:2424: error: expected '=', ',', ';',
'asm' or '__attribute__' before 'perl_mutex'
/usr/lib/perl/5.8/CORE/perl.h:2425: error: expected '=', ',', ';',
'asm' or '__attribute__' before 'perl_cond'
/usr/lib/perl/5.8/CORE/perl.h:2426: error: expected '=', ',', ';',
'asm' or '__attribute__' before 'perl_key'
In file included from /usr/lib/perl/5.8/CORE/iperlsys.h:51,
from /usr/lib/perl/5.8/CORE/perl.h:2733,
from CDB_File.xs:37:
/usr/lib/perl/5.8/CORE/perlio.h:65:19: error: stdio.h: No such file or directory
In file included from /usr/lib/perl/5.8/CORE/iperlsys.h:51,
from /usr/lib/perl/5.8/CORE/perl.h:2733,
from CDB_File.xs:37:
/usr/lib/perl/5.8/CORE/perlio.h:259: error: expected ')' before '*' token
/usr/lib/perl/5.8/CORE/perlio.h:262: error: expected '=', ',', ';',
'asm' or '__attribute__' before '*' token
/usr/lib/perl/5.8/CORE/perlio.h:265: error: expected '=', ',', ';',
'asm' or '__attribute__' before '*' token
/usr/lib/perl/5.8/CORE/perlio.h:268: error: expected declaration
specifiers or '...' before 'FILE'
In file included from /usr/lib/perl/5.8/CORE/perl.h:2747,
from CDB_File.xs:37:
/usr/lib/perl/5.8/CORE/sv.h:389: error: expected
specifier-qualifier-list before 'DIR'
In file included from /usr/lib/perl/5.8/CORE/op.h:497,
from /usr/lib/perl/5.8/CORE/perl.h:2754,
from CDB_File.xs:37:
/usr/lib/perl/5.8/CORE/reentr.h:72:20: error: pwd.h: No such file or directory
/usr/lib/perl/5.8/CORE/reentr.h:75:20: error: grp.h: No such file or directory
/usr/lib/perl/5.8/CORE/reentr.h:85:26: error: crypt.h: No such file or directory
/usr/lib/perl/5.8/CORE/reentr.h:90:27: error: shadow.h: No such file
or directory
In file included from /usr/lib/perl/5.8/CORE/op.h:497,
from /usr/lib/perl/5.8/CORE/perl.h:2754,
from CDB_File.xs:37:
/usr/lib/perl/5.8/CORE/reentr.h:612: error: field '_crypt_struct' has
incomplete type
/usr/lib/perl/5.8/CORE/reentr.h:620: error: field '_drand48_struct'
has incomplete type
/usr/lib/perl/5.8/CORE/reentr.h:624: error: field '_grent_struct' has
incomplete type
/usr/lib/perl/5.8/CORE/reentr.h:635: error: field '_hostent_struct'
has incomplete type
/usr/lib/perl/5.8/CORE/reentr.h:654: error: field '_netent_struct' has
incomplete type
/usr/lib/perl/5.8/CORE/reentr.h:669: error: field '_protoent_struct'
has incomplete type
/usr/lib/perl/5.8/CORE/reentr.h:684: error: field '_pwent_struct' has
incomplete type
/usr/lib/perl/5.8/CORE/reentr.h:695: error: field '_servent_struct'
has incomplete type
/usr/lib/perl/5.8/CORE/reentr.h:710: error: field '_spent_struct' has
incomplete type
/usr/lib/perl/5.8/CORE/reentr.h:721: error: field '_gmtime_struct' has
incomplete type
/usr/lib/perl/5.8/CORE/reentr.h:724: error: field '_localtime_struct'
has incomplete type
/usr/lib/perl/5.8/CORE/reentr.h:771: error: field '_random_struct' has
incomplete type
/usr/lib/perl/5.8/CORE/reentr.h:772: error: expected
specifier-qualifier-list before 'int32_t'
In file included from /usr/lib/perl/5.8/CORE/perl.h:2756,
from CDB_File.xs:37:
/usr/lib/perl/5.8/CORE/av.h:13: error: expected
specifier-qualifier-list before 'ssize_t'
In file included from /usr/lib/perl/5.8/CORE/perl.h:2759,
from CDB_File.xs:37:
/usr/lib/perl/5.8/CORE/scope.h:232: error: expected
specifier-qualifier-list before 'sigjmp_buf'
In file included from CDB_File.xs:37:
/usr/lib/perl/5.8/CORE/perl.h:2931: error: expected '=', ',', ';',
'asm' or '__attribute__' before 'getuid'
/usr/lib/perl/5.8/CORE/perl.h:2932: error: expected '=', ',', ';',
'asm' or '__attribute__' before 'geteuid'
/usr/lib/perl/5.8/CORE/perl.h:2933: error: expected '=', ',', ';',
'asm' or '__attribute__' before 'getgid'
/usr/lib/perl/5.8/CORE/perl.h:2934: error: expected '=', ',', ';',
'asm' or '__attribute__' before 'getegid'
In file included from CDB_File.xs:37:
/usr/lib/perl/5.8/CORE/perl.h:3238:22: error: math.h: No such file or directory
In file included from /usr/lib/perl/5.8/CORE/perl.h:3881,
from CDB_File.xs:37:
/usr/lib/perl/5.8/CORE/thrdvar.h:85: error: field 'Tstatbuf' has incomplete type
/usr/lib/perl/5.8/CORE/thrdvar.h:86: error: field 'Tstatcache' has
incomplete type
/usr/lib/perl/5.8/CORE/thrdvar.h:91: error: field 'Ttimesbuf' has
incomplete type
In file included from /usr/lib/perl/5.8/CORE/perl.h:3883,
from CDB_File.xs:37:
/usr/lib/perl/5.8/CORE/intrpvar.h:66: error: expected
specifier-qualifier-list before 'time_t'
In file included from /usr/lib/perl/5.8/CORE/perl.h:3950,
from CDB_File.xs:37:
/usr/lib/perl/5.8/CORE/proto.h:128: error: expected declaration
specifiers or '...' before 'mode_t'
/usr/lib/perl/5.8/CORE/proto.h:128: error: expected declaration
specifiers or '...' before 'uid_t'
/usr/lib/perl/5.8/CORE/proto.h:297: error: expected declaration
specifiers or '...' before 'off64_t'
/usr/lib/perl/5.8/CORE/proto.h:299: error: expected '=', ',', ';',
'asm' or '__attribute__' before 'Perl_do_sysseek'
/usr/lib/perl/5.8/CORE/proto.h:300: error: expected '=', ',', ';',
'asm' or '__attribute__' before 'Perl_do_tell'
/usr/lib/perl/5.8/CORE/proto.h:411: error: expected declaration
specifiers or '...' before 'gid_t'
/usr/lib/perl/5.8/CORE/proto.h:411: error: expected declaration
specifiers or '...' before 'uid_t'
/usr/lib/perl/5.8/CORE/proto.h:736: error: expected '=', ',', ';',
'asm' or '__attribute__' before 'Perl_my_fork'
/usr/lib/perl/5.8/CORE/proto.h:1020: error: expected declaration
specifiers or '...' before 'pid_t'
/usr/lib/perl/5.8/CORE/proto.h:1300: error: expected declaration
specifiers or '...' before 'pid_t'
/usr/lib/perl/5.8/CORE/proto.h:1456: error: expected '=', ',', ';',
'asm' or '__attribute__' before '*' token
/usr/lib/perl/5.8/CORE/proto.h:2001: error: expected '=', ',', ';',
'asm' or '__attribute__' before 'Perl_PerlIO_read'
/usr/lib/perl/5.8/CORE/proto.h:2002: error: expected '=', ',', ';',
'asm' or '__attribute__' before 'Perl_PerlIO_write'
/usr/lib/perl/5.8/CORE/proto.h:2003: error: expected '=', ',', ';',
'asm' or '__attribute__' before 'Perl_PerlIO_unread'
/usr/lib/perl/5.8/CORE/proto.h:2004: error: expected '=', ',', ';',
'asm' or '__attribute__' before 'Perl_PerlIO_tell'
/usr/lib/perl/5.8/CORE/proto.h:2005: error: expected declaration
specifiers or '...' before 'off64_t'
In file included from /usr/lib/perl/5.8/CORE/perl.h:3988,
from CDB_File.xs:37:
/usr/lib/perl/5.8/CORE/perlvars.h:31: error: expected '=', ',', ';',
'asm' or '__attribute__' before 'PL_thr_key'
/usr/lib/perl/5.8/CORE/perlvars.h:48: error: expected '=', ',', ';',
'asm' or '__attribute__' before 'PL_op_mutex'
/usr/lib/perl/5.8/CORE/perlvars.h:52: error: expected '=', ',', ';',
'asm' or '__attribute__' before 'PL_dollarzero_mutex'
/usr/lib/perl/5.8/CORE/perl.h:4485:24: error: sys/ipc.h: No such file
or directory
/usr/lib/perl/5.8/CORE/perl.h:4486:24: error: sys/sem.h: No such file
or directory
/usr/lib/perl/5.8/CORE/perl.h:4611:24: error: sys/file.h: No such file
or directory
In file included from /usr/lib/perl/5.8/CORE/perlapi.h:38,
from /usr/lib/perl/5.8/CORE/XSUB.h:349,
from CDB_File.xs:38:
/usr/lib/perl/5.8/CORE/intrpvar.h:66: error: expected '=', ',', ';',
'asm' or '__attribute__' before '*' token
/usr/lib/perl/5.8/CORE/intrpvar.h:237: error: expected '=', ',', ';',
'asm' or '__attribute__' before '*' token
/usr/lib/perl/5.8/CORE/intrpvar.h:238: error: expected '=', ',', ';',
'asm' or '__attribute__' before '*' token
/usr/lib/perl/5.8/CORE/intrpvar.h:239: error: expected '=', ',', ';',
'asm' or '__attribute__' before '*' token
/usr/lib/perl/5.8/CORE/intrpvar.h:240: error: expected '=', ',', ';',
'asm' or '__attribute__' before '*' token
In file included from /usr/lib/perl/5.8/CORE/perlapi.h:39,
from /usr/lib/perl/5.8/CORE/XSUB.h:349,
from CDB_File.xs:38:
/usr/lib/perl/5.8/CORE/perlvars.h:31: error: expected '=', ',', ';',
'asm' or '__attribute__' before '*' token
/usr/lib/perl/5.8/CORE/perlvars.h:48: error: expected '=', ',', ';',
'asm' or '__attribute__' before '*' token
/usr/lib/perl/5.8/CORE/perlvars.h:52: error: expected '=', ',', ';',
'asm' or '__attribute__' before '*' token
In file included from CDB_File.xs:39:
ppport.h:230:1: warning: "PERL_UNUSED_DECL" redefined
In file included from CDB_File.xs:37:
/usr/lib/perl/5.8/CORE/perl.h:163:1: warning: this is the location of
the previous definition
CDB_File.xs:44:19: error: fcntl.h: No such file or directory
CDB_File.xs:53:22: error: sys/mman.h: No such file or directory
CDB_File.xs: In function 'writeerror':
CDB_File.xs:125: error: invalid type argument of 'unary *'
CDB_File.xs:125: error: invalid type argument of 'unary *'
CDB_File.xs: In function 'readerror':
CDB_File.xs:127: error: invalid type argument of 'unary *'
CDB_File.xs:127: error: invalid type argument of 'unary *'
CDB_File.xs: In function 'seekerror':
CDB_File.xs:129: error: invalid type argument of 'unary *'
CDB_File.xs:129: error: invalid type argument of 'unary *'
CDB_File.xs: In function 'cdb_make_start':
CDB_File.xs:139: error: invalid type argument of 'unary *'
CDB_File.xs:139: error: too many arguments to function 'Perl_PerlIO_seek'
CDB_File.xs: In function 'posplus':
CDB_File.xs:144: error: 'ENOMEM' undeclared (first use in this function)
CDB_File.xs:144: error: (Each undeclared identifier is reported only once
CDB_File.xs:144: error: for each function it appears in.)
CDB_File.xs: In function 'cdb_read':
CDB_File.xs:219: error: 'EINVAL' undeclared (first use in this function)
CDB_File.xs:222: warning: incompatible implicit declaration of
built-in function 'memcpy'
CDB_File.xs:227: error: invalid type argument of 'unary *'
CDB_File.xs:227: error: too many arguments to function 'Perl_PerlIO_seek'
CDB_File.xs:231: error: invalid type argument of 'unary *'
CDB_File.xs:232: error: 'EINTR' undeclared (first use in this function)
CDB_File.xs: In function 'iter_start':
CDB_File.xs:318: error: invalid type argument of 'unary *'
CDB_File.xs: In function 'iter_key':
CDB_File.xs:330: error: invalid type argument of 'unary *'
CDB_File.xs: In function 'iter_end':
CDB_File.xs:350: error: invalid type argument of 'unary *'
CDB_File.c: In function 'XS_CDB_File_handle':
CDB_File.c:373: error: invalid type argument of 'unary *'
CDB_File.c:373: error: invalid type argument of 'unary *'
CDB_File.c:373: error: invalid type argument of 'unary *'
CDB_File.c:375: error: invalid type argument of 'unary *'
CDB_File.c:385: error: invalid type argument of 'unary *'
CDB_File.c:385: error: invalid type argument of 'unary *'
CDB_File.c:385: error: invalid type argument of 'unary *'
CDB_File.c:386: error: invalid type argument of 'unary *'
CDB_File.c:386: error: invalid type argument of 'unary *'
CDB_File.c:386: error: invalid type argument of 'unary *'
CDB_File.c:386: error: invalid type argument of 'unary *'
CDB_File.c:389: error: invalid type argument of 'unary *'
CDB_File.c:389: error: invalid type argument of 'unary *'
CDB_File.c:389: error: invalid type argument of 'unary *'
CDB_File.c:389: error: invalid type argument of 'unary *'
CDB_File.xs:383: error: invalid type argument of 'unary *'
CDB_File.c:396: error: invalid type argument of 'unary *'
CDB_File.c:396: error: invalid type argument of 'unary *'
CDB_File.c:398: error: invalid type argument of 'unary *'
CDB_File.c:399: error: invalid type argument of 'unary *'
CDB_File.c:400: error: invalid type argument of 'unary *'
CDB_File.c:400: error: invalid type argument of 'unary *'
CDB_File.c:400: error: invalid type argument of 'unary *'
CDB_File.c:400: error: invalid type argument of 'unary *'
CDB_File.c:400: error: invalid type argument of 'unary *'
CDB_File.c:402: error: invalid type argument of 'unary *'
CDB_File.c:402: error: invalid type argument of 'unary *'
CDB_File.c:405: error: invalid type argument of 'unary *'
CDB_File.c:405: error: invalid type argument of 'unary *'
CDB_File.c: In function 'XS_CDB_File_datalen':
CDB_File.c:412: error: invalid type argument of 'unary *'
CDB_File.c:412: error: invalid type argument of 'unary *'
CDB_File.c:412: error: invalid type argument of 'unary *'
CDB_File.c:414: error: invalid type argument of 'unary *'
CDB_File.c:418: error: invalid type argument of 'unary *'
CDB_File.c:418: error: invalid type argument of 'unary *'
CDB_File.c:418: error: invalid type argument of 'unary *'
CDB_File.c:418: error: invalid type argument of 'unary *'
CDB_File.c:420: error: invalid type argument of 'unary *'
CDB_File.c:420: error: invalid type argument of 'unary *'
CDB_File.c:420: error: invalid type argument of 'unary *'
CDB_File.c:421: error: invalid type argument of 'unary *'
CDB_File.c:421: error: invalid type argument of 'unary *'
CDB_File.c:421: error: invalid type argument of 'unary *'
CDB_File.c:421: error: invalid type argument of 'unary *'
CDB_File.c:424: error: invalid type argument of 'unary *'
CDB_File.c:424: error: invalid type argument of 'unary *'
CDB_File.c:424: error: invalid type argument of 'unary *'
CDB_File.c:424: error: invalid type argument of 'unary *'
CDB_File.c:430: error: invalid type argument of 'unary *'
CDB_File.c:430: error: invalid type argument of 'unary *'
CDB_File.c:430: error: invalid type argument of 'unary *'
CDB_File.c:432: error: invalid type argument of 'unary *'
CDB_File.c:432: error: invalid type argument of 'unary *'
CDB_File.c: In function 'XS_CDB_File_datapos':
CDB_File.c:439: error: invalid type argument of 'unary *'
CDB_File.c:439: error: invalid type argument of 'unary *'
CDB_File.c:439: error: invalid type argument of 'unary *'
CDB_File.c:441: error: invalid type argument of 'unary *'
CDB_File.c:445: error: invalid type argument of 'unary *'
CDB_File.c:445: error: invalid type argument of 'unary *'
CDB_File.c:445: error: invalid type argument of 'unary *'
CDB_File.c:445: error: invalid type argument of 'unary *'
CDB_File.c:447: error: invalid type argument of 'unary *'
CDB_File.c:447: error: invalid type argument of 'unary *'
CDB_File.c:447: error: invalid type argument of 'unary *'
CDB_File.c:448: error: invalid type argument of 'unary *'
CDB_File.c:448: error: invalid type argument of 'unary *'
CDB_File.c:448: error: invalid type argument of 'unary *'
CDB_File.c:448: error: invalid type argument of 'unary *'
CDB_File.c:451: error: invalid type argument of 'unary *'
CDB_File.c:451: error: invalid type argument of 'unary *'
CDB_File.c:451: error: invalid type argument of 'unary *'
CDB_File.c:451: error: invalid type argument of 'unary *'
CDB_File.c:457: error: invalid type argument of 'unary *'
CDB_File.c:457: error: invalid type argument of 'unary *'
CDB_File.c:457: error: invalid type argument of 'unary *'
CDB_File.c:459: error: invalid type argument of 'unary *'
CDB_File.c:459: error: invalid type argument of 'unary *'
CDB_File.c: In function 'XS_CDB_File_TIEHASH':
CDB_File.c:466: error: invalid type argument of 'unary *'
CDB_File.c:466: error: invalid type argument of 'unary *'
CDB_File.c:466: error: invalid type argument of 'unary *'
CDB_File.c:468: error: invalid type argument of 'unary *'
CDB_File.c:470: error: invalid type argument of 'unary *'
CDB_File.c:470: error: invalid type argument of 'unary *'
CDB_File.c:470: error: invalid type argument of 'unary *'
CDB_File.c:470: error: invalid type argument of 'unary *'
CDB_File.c:471: error: invalid type argument of 'unary *'
CDB_File.c:471: error: invalid type argument of 'unary *'
CDB_File.c:471: error: invalid type argument of 'unary *'
CDB_File.c:471: error: invalid type argument of 'unary *'
CDB_File.xs:420: error: invalid type argument of 'unary *'
CDB_File.xs:420: error: invalid type argument of 'unary *'
CDB_File.xs:420: error: invalid type argument of 'unary *'
CDB_File.xs:420: error: invalid type argument of 'unary *'
CDB_File.xs:424: error: storage size of 'st' isn't known
CDB_File.xs:425: error: invalid type argument of 'unary *'
CDB_File.xs:432: error: 'PROT_READ' undeclared (first use in this function)
CDB_File.xs:432: error: 'MAP_SHARED' undeclared (first use in this function)
CDB_File.xs:432: warning: assignment makes pointer from integer without a cast
CDB_File.c:504: error: invalid type argument of 'unary *'
CDB_File.c:504: error: invalid type argument of 'unary *'
CDB_File.c:505: error: invalid type argument of 'unary *'
CDB_File.c:505: error: invalid type argument of 'unary *'
CDB_File.c:506: error: invalid type argument of 'unary *'
CDB_File.c:509: error: invalid type argument of 'unary *'
CDB_File.c:509: error: invalid type argument of 'unary *'
CDB_File.c: In function 'XS_CDB_File_FETCH':
CDB_File.c:516: error: invalid type argument of 'unary *'
CDB_File.c:516: error: invalid type argument of 'unary *'
CDB_File.c:516: error: invalid type argument of 'unary *'
CDB_File.c:518: error: invalid type argument of 'unary *'
CDB_File.c:521: error: invalid type argument of 'unary *'
CDB_File.xs:453: error: 'off_t' undeclared (first use in this function)
CDB_File.xs:453: error: expected ';' before 'pos'
CDB_File.c:534: error: invalid type argument of 'unary *'
CDB_File.c:534: error: invalid type argument of 'unary *'
CDB_File.c:534: error: invalid type argument of 'unary *'
CDB_File.c:535: error: invalid type argument of 'unary *'
CDB_File.c:535: error: invalid type argument of 'unary *'
CDB_File.c:535: error: invalid type argument of 'unary *'
CDB_File.c:535: error: invalid type argument of 'unary *'
CDB_File.c:538: error: invalid type argument of 'unary *'
CDB_File.c:538: error: invalid type argument of 'unary *'
CDB_File.c:538: error: invalid type argument of 'unary *'
CDB_File.c:538: error: invalid type argument of 'unary *'
CDB_File.xs:460: error: invalid type argument of 'unary *'
CDB_File.xs:460: error: invalid type argument of 'unary *'
CDB_File.xs:460: error: invalid type argument of 'unary *'
CDB_File.xs:460: error: invalid type argument of 'unary *'
CDB_File.xs:462: error: invalid type argument of 'unary *'
CDB_File.xs:463: error: invalid type argument of 'unary *'
CDB_File.xs:477: error: invalid type argument of 'unary *'
CDB_File.xs:477: error: invalid type argument of 'unary *'
CDB_File.xs:478: error: invalid type argument of 'unary *'
CDB_File.xs:478: error: invalid type argument of 'unary *'
CDB_File.xs:481: error: invalid type argument of 'unary *'
CDB_File.xs:481: error: invalid type argument of 'unary *'
CDB_File.xs:482: error: invalid type argument of 'unary *'
CDB_File.xs:482: error: invalid type argument of 'unary *'
CDB_File.xs:482: error: invalid type argument of 'unary *'
CDB_File.xs:482: error: invalid type argument of 'unary *'
CDB_File.xs:482: error: invalid type argument of 'unary *'
CDB_File.xs:483: error: invalid type argument of 'unary *'
CDB_File.xs:484: error: invalid type argument of 'unary *'
CDB_File.xs:484: error: invalid type argument of 'unary *'
CDB_File.xs:484: error: invalid type argument of 'unary *'
CDB_File.xs:484: error: invalid type argument of 'unary *'
CDB_File.xs:484: error: invalid type argument of 'unary *'
CDB_File.xs:484: error: invalid type argument of 'unary *'
CDB_File.xs:484: error: invalid type argument of 'unary *'
CDB_File.c:570: error: invalid type argument of 'unary *'
CDB_File.c:570: error: invalid type argument of 'unary *'
CDB_File.c: In function 'XS_CDB_File_multi_get':
CDB_File.c:577: error: invalid type argument of 'unary *'
CDB_File.c:577: error: invalid type argument of 'unary *'
CDB_File.c:577: error: invalid type argument of 'unary *'
CDB_File.c:579: error: invalid type argument of 'unary *'
CDB_File.c:582: error: invalid type argument of 'unary *'
CDB_File.xs:496: error: 'off_t' undeclared (first use in this function)
CDB_File.xs:496: error: expected ';' before 'pos'
CDB_File.c:596: error: invalid type argument of 'unary *'
CDB_File.c:596: error: invalid type argument of 'unary *'
CDB_File.c:596: error: invalid type argument of 'unary *'
CDB_File.c:597: error: invalid type argument of 'unary *'
CDB_File.c:597: error: invalid type argument of 'unary *'
CDB_File.c:597: error: invalid type argument of 'unary *'
CDB_File.c:597: error: invalid type argument of 'unary *'
CDB_File.c:600: error: invalid type argument of 'unary *'
CDB_File.c:600: error: invalid type argument of 'unary *'
CDB_File.c:600: error: invalid type argument of 'unary *'
CDB_File.c:600: error: invalid type argument of 'unary *'
CDB_File.xs:504: error: invalid type argument of 'unary *'
CDB_File.xs:504: error: invalid type argument of 'unary *'
CDB_File.xs:504: error: invalid type argument of 'unary *'
CDB_File.xs:504: error: invalid type argument of 'unary *'
CDB_File.xs:507: error: invalid type argument of 'unary *'
CDB_File.xs:508: error: invalid type argument of 'unary *'
CDB_File.xs:509: error: invalid type argument of 'unary *'
CDB_File.xs:514: error: invalid type argument of 'unary *'
CDB_File.xs:516: error: invalid type argument of 'unary *'
CDB_File.xs:518: error: invalid type argument of 'unary *'
CDB_File.xs:518: error: invalid type argument of 'unary *'
CDB_File.xs:518: error: invalid type argument of 'unary *'
CDB_File.xs:519: error: invalid type argument of 'unary *'
CDB_File.c:623: error: invalid type argument of 'unary *'
CDB_File.c:623: error: invalid type argument of 'unary *'
CDB_File.c:624: error: invalid type argument of 'unary *'
CDB_File.c:624: error: invalid type argument of 'unary *'
CDB_File.c:626: error: invalid type argument of 'unary *'
CDB_File.c:626: error: invalid type argument of 'unary *'
CDB_File.c: In function 'XS_CDB_File_EXISTS':
CDB_File.c:633: error: invalid type argument of 'unary *'
CDB_File.c:633: error: invalid type argument of 'unary *'
CDB_File.c:633: error: invalid type argument of 'unary *'
CDB_File.c:635: error: invalid type argument of 'unary *'
CDB_File.c:638: error: invalid type argument of 'unary *'
CDB_File.c:645: error: invalid type argument of 'unary *'
CDB_File.c:645: error: invalid type argument of 'unary *'
CDB_File.c:645: error: invalid type argument of 'unary *'
CDB_File.c:645: error: invalid type argument of 'unary *'
CDB_File.c:647: error: invalid type argument of 'unary *'
CDB_File.c:647: error: invalid type argument of 'unary *'
CDB_File.c:647: error: invalid type argument of 'unary *'
CDB_File.c:648: error: invalid type argument of 'unary *'
CDB_File.c:648: error: invalid type argument of 'unary *'
CDB_File.c:648: error: invalid type argument of 'unary *'
CDB_File.c:648: error: invalid type argument of 'unary *'
CDB_File.c:651: error: invalid type argument of 'unary *'
CDB_File.c:651: error: invalid type argument of 'unary *'
CDB_File.c:651: error: invalid type argument of 'unary *'
CDB_File.c:651: error: invalid type argument of 'unary *'
CDB_File.xs:536: error: invalid type argument of 'unary *'
CDB_File.xs:536: error: invalid type argument of 'unary *'
CDB_File.xs:536: error: invalid type argument of 'unary *'
CDB_File.xs:536: error: invalid type argument of 'unary *'
CDB_File.xs:538: error: invalid type argument of 'unary *'
CDB_File.c:662: error: invalid type argument of 'unary *'
CDB_File.c:662: error: invalid type argument of 'unary *'
CDB_File.c:662: error: invalid type argument of 'unary *'
CDB_File.c:664: error: invalid type argument of 'unary *'
CDB_File.c:664: error: invalid type argument of 'unary *'
CDB_File.c: In function 'XS_CDB_File_DESTROY':
CDB_File.c:671: error: invalid type argument of 'unary *'
CDB_File.c:671: error: invalid type argument of 'unary *'
CDB_File.c:671: error: invalid type argument of 'unary *'
CDB_File.c:673: error: invalid type argument of 'unary *'
CDB_File.c:675: error: invalid type argument of 'unary *'
CDB_File.xs:554: error: invalid type argument of 'unary *'
CDB_File.xs:555: error: invalid type argument of 'unary *'
CDB_File.xs:564: error: invalid type argument of 'unary *'
CDB_File.c:697: error: invalid type argument of 'unary *'
CDB_File.c:697: error: invalid type argument of 'unary *'
CDB_File.c: In function 'XS_CDB_File_FIRSTKEY':
CDB_File.c:704: error: invalid type argument of 'unary *'
CDB_File.c:704: error: invalid type argument of 'unary *'
CDB_File.c:704: error: invalid type argument of 'unary *'
CDB_File.c:706: error: invalid type argument of 'unary *'
CDB_File.c:716: error: invalid type argument of 'unary *'
CDB_File.c:716: error: invalid type argument of 'unary *'
CDB_File.c:716: error: invalid type argument of 'unary *'
CDB_File.c:717: error: invalid type argument of 'unary *'
CDB_File.c:717: error: invalid type argument of 'unary *'
CDB_File.c:717: error: invalid type argument of 'unary *'
CDB_File.c:717: error: invalid type argument of 'unary *'
CDB_File.c:720: error: invalid type argument of 'unary *'
CDB_File.c:720: error: invalid type argument of 'unary *'
CDB_File.c:720: error: invalid type argument of 'unary *'
CDB_File.c:720: error: invalid type argument of 'unary *'
CDB_File.xs:579: error: invalid type argument of 'unary *'
CDB_File.xs:579: error: invalid type argument of 'unary *'
CDB_File.xs:581: error: invalid type argument of 'unary *'
CDB_File.xs:581: error: invalid type argument of 'unary *'
CDB_File.xs:581: error: invalid type argument of 'unary *'
CDB_File.xs:581: error: invalid type argument of 'unary *'
CDB_File.c:730: error: invalid type argument of 'unary *'
CDB_File.c:730: error: invalid type argument of 'unary *'
CDB_File.c: In function 'XS_CDB_File_NEXTKEY':
CDB_File.c:737: error: invalid type argument of 'unary *'
CDB_File.c:737: error: invalid type argument of 'unary *'
CDB_File.c:737: error: invalid type argument of 'unary *'
CDB_File.c:739: error: invalid type argument of 'unary *'
CDB_File.c:742: error: invalid type argument of 'unary *'
CDB_File.xs:591: error: 'off_t' undeclared (first use in this function)
CDB_File.xs:591: error: expected ';' before 'pos'
CDB_File.c:753: error: invalid type argument of 'unary *'
CDB_File.c:753: error: invalid type argument of 'unary *'
CDB_File.c:753: error: invalid type argument of 'unary *'
CDB_File.c:754: error: invalid type argument of 'unary *'
CDB_File.c:754: error: invalid type argument of 'unary *'
CDB_File.c:754: error: invalid type argument of 'unary *'
CDB_File.c:754: error: invalid type argument of 'unary *'
CDB_File.c:757: error: invalid type argument of 'unary *'
CDB_File.c:757: error: invalid type argument of 'unary *'
CDB_File.c:757: error: invalid type argument of 'unary *'
CDB_File.c:757: error: invalid type argument of 'unary *'
CDB_File.xs:597: error: invalid type argument of 'unary *'
CDB_File.xs:597: error: invalid type argument of 'unary *'
CDB_File.xs:597: error: invalid type argument of 'unary *'
CDB_File.xs:597: error: invalid type argument of 'unary *'
CDB_File.xs:601: error: invalid type argument of 'unary *'
CDB_File.xs:605: error: invalid type argument of 'unary *'
CDB_File.xs:605: error: invalid type argument of 'unary *'
CDB_File.xs:610: error: invalid type argument of 'unary *'
CDB_File.xs:610: error: invalid type argument of 'unary *'
CDB_File.xs:610: error: invalid type argument of 'unary *'
CDB_File.xs:610: error: invalid type argument of 'unary *'
CDB_File.c:778: error: invalid type argument of 'unary *'
CDB_File.c:778: error: invalid type argument of 'unary *'
CDB_File.c: In function 'XS_CDB_File_new':
CDB_File.c:785: error: invalid type argument of 'unary *'
CDB_File.c:785: error: invalid type argument of 'unary *'
CDB_File.c:785: error: invalid type argument of 'unary *'
CDB_File.c:787: error: invalid type argument of 'unary *'
CDB_File.c:789: error: invalid type argument of 'unary *'
CDB_File.c:789: error: invalid type argument of 'unary *'
CDB_File.c:789: error: invalid type argument of 'unary *'
CDB_File.c:789: error: invalid type argument of 'unary *'
CDB_File.c:790: error: invalid type argument of 'unary *'
CDB_File.c:790: error: invalid type argument of 'unary *'
CDB_File.c:790: error: invalid type argument of 'unary *'
CDB_File.c:790: error: invalid type argument of 'unary *'
CDB_File.c:791: error: invalid type argument of 'unary *'
CDB_File.c:791: error: invalid type argument of 'unary *'
CDB_File.c:791: error: invalid type argument of 'unary *'
CDB_File.c:791: error: invalid type argument of 'unary *'
CDB_File.xs:626: error: invalid type argument of 'unary *'
CDB_File.xs:626: error: invalid type argument of 'unary *'
CDB_File.xs:626: error: invalid type argument of 'unary *'
CDB_File.xs:626: error: invalid type argument of 'unary *'
CDB_File.xs:628: error: invalid type argument of 'unary *'
CDB_File.xs:628: error: invalid type argument of 'unary *'
CDB_File.xs:628: error: invalid type argument of 'unary *'
CDB_File.xs:628: error: invalid type argument of 'unary *'
CDB_File.xs:631: warning: incompatible implicit declaration of
built-in function 'strlen'
CDB_File.xs:633: warning: incompatible implicit declaration of
built-in function 'strncpy'
CDB_File.c:816: error: invalid type argument of 'unary *'
CDB_File.c:816: error: invalid type argument of 'unary *'
CDB_File.c:817: error: invalid type argument of 'unary *'
CDB_File.c:817: error: invalid type argument of 'unary *'
CDB_File.c:818: error: invalid type argument of 'unary *'
CDB_File.c:821: error: invalid type argument of 'unary *'
CDB_File.c:821: error: invalid type argument of 'unary *'
CDB_File.c: In function 'XS_CDB_File__Maker_DESTROY':
CDB_File.c:828: error: invalid type argument of 'unary *'
CDB_File.c:828: error: invalid type argument of 'unary *'
CDB_File.c:828: error: invalid type argument of 'unary *'
CDB_File.c:830: error: invalid type argument of 'unary *'
CDB_File.c:832: error: invalid type argument of 'unary *'
CDB_File.xs:653: error: invalid type argument of 'unary *'
CDB_File.xs:654: error: invalid type argument of 'unary *'
CDB_File.c:845: error: invalid type argument of 'unary *'
CDB_File.c:845: error: invalid type argument of 'unary *'
CDB_File.c: In function 'XS_CDB_File__Maker_insert':
CDB_File.c:852: error: invalid type argument of 'unary *'
CDB_File.c:852: error: invalid type argument of 'unary *'
CDB_File.c:852: error: invalid type argument of 'unary *'
CDB_File.c:854: error: invalid type argument of 'unary *'
CDB_File.c:868: error: invalid type argument of 'unary *'
CDB_File.c:868: error: invalid type argument of 'unary *'
CDB_File.c:868: error: invalid type argument of 'unary *'
CDB_File.c:869: error: invalid type argument of 'unary *'
CDB_File.c:869: error: invalid type argument of 'unary *'
CDB_File.c:869: error: invalid type argument of 'unary *'
CDB_File.c:869: error: invalid type argument of 'unary *'
CDB_File.c:872: error: invalid type argument of 'unary *'
CDB_File.c:872: error: invalid type argument of 'unary *'
CDB_File.c:872: error: invalid type argument of 'unary *'
CDB_File.c:872: error: invalid type argument of 'unary *'
CDB_File.xs:673: error: invalid type argument of 'unary *'
CDB_File.xs:674: error: invalid type argument of 'unary *'
CDB_File.xs:675: error: invalid type argument of 'unary *'
CDB_File.xs:675: error: invalid type argument of 'unary *'
CDB_File.xs:679: error: invalid type argument of 'unary *'
CDB_File.xs:682: error: invalid type argument of 'unary *'
CDB_File.xs:683: error: invalid type argument of 'unary *'
CDB_File.c:891: error: invalid type argument of 'unary *'
CDB_File.c: In function 'XS_CDB_File__Maker_finish':
CDB_File.c:900: error: invalid type argument of 'unary *'
CDB_File.c:900: error: invalid type argument of 'unary *'
CDB_File.c:900: error: invalid type argument of 'unary *'
CDB_File.c:902: error: invalid type argument of 'unary *'
CDB_File.c:915: error: invalid type argument of 'unary *'
CDB_File.c:915: error: invalid type argument of 'unary *'
CDB_File.c:915: error: invalid type argument of 'unary *'
CDB_File.c:915: error: invalid type argument of 'unary *'
CDB_File.c:917: error: invalid type argument of 'unary *'
CDB_File.c:917: error: invalid type argument of 'unary *'
CDB_File.c:917: error: invalid type argument of 'unary *'
CDB_File.c:918: error: invalid type argument of 'unary *'
CDB_File.c:918: error: invalid type argument of 'unary *'
CDB_File.c:918: error: invalid type argument of 'unary *'
CDB_File.c:918: error: invalid type argument of 'unary *'
CDB_File.c:921: error: invalid type argument of 'unary *'
CDB_File.c:921: error: invalid type argument of 'unary *'
CDB_File.c:921: error: invalid type argument of 'unary *'
CDB_File.c:921: error: invalid type argument of 'unary *'
CDB_File.xs:720: error: 'ENOMEM' undeclared (first use in this function)
CDB_File.xs:720: error: invalid type argument of 'unary *'
CDB_File.xs:720: error: invalid type argument of 'unary *'
CDB_File.xs:720: error: invalid type argument of 'unary *'
CDB_File.xs:720: error: invalid type argument of 'unary *'
CDB_File.xs:764: error: invalid type argument of 'unary *'
CDB_File.xs:764: error: invalid type argument of 'unary *'
CDB_File.xs:764: error: invalid type argument of 'unary *'
CDB_File.xs:764: error: invalid type argument of 'unary *'
CDB_File.xs:764: error: invalid type argument of 'unary *'
CDB_File.xs:765: error: invalid type argument of 'unary *'
CDB_File.xs:765: error: invalid type argument of 'unary *'
CDB_File.xs:765: error: invalid type argument of 'unary *'
CDB_File.xs:765: error: invalid type argument of 'unary *'
CDB_File.xs:771: error: invalid type argument of 'unary *'
CDB_File.xs:774: error: invalid type argument of 'unary *'
CDB_File.xs:775: error: invalid type argument of 'unary *'
CDB_File.xs:777: error: invalid type argument of 'unary *'
CDB_File.xs:777: error: invalid type argument of 'unary *'
CDB_File.xs:777: error: invalid type argument of 'unary *'
CDB_File.xs:777: error: invalid type argument of 'unary *'
CDB_File.xs:777: error: invalid type argument of 'unary *'
CDB_File.xs:778: error: invalid type argument of 'unary *'
CDB_File.xs:778: error: invalid type argument of 'unary *'
CDB_File.xs:778: error: invalid type argument of 'unary *'
CDB_File.xs:778: error: invalid type argument of 'unary *'
CDB_File.xs:778: error: invalid type argument of 'unary *'
CDB_File.xs:780: error: invalid type argument of 'unary *'
CDB_File.xs:780: error: invalid type argument of 'unary *'
CDB_File.xs:780: error: invalid type argument of 'unary *'
CDB_File.xs:780: error: invalid type argument of 'unary *'
CDB_File.c:1011: error: invalid type argument of 'unary *'
CDB_File.c:1011: error: invalid type argument of 'unary *'
CDB_File.c:1011: error: invalid type argument of 'unary *'
CDB_File.c:1013: error: invalid type argument of 'unary *'
CDB_File.c:1013: error: invalid type argument of 'unary *'
CDB_File.c: In function 'boot_CDB_File':
CDB_File.c:1022: error: invalid type argument of 'unary *'
CDB_File.c:1022: error: invalid type argument of 'unary *'
CDB_File.c:1022: error: invalid type argument of 'unary *'
CDB_File.c:1025: error: invalid type argument of 'unary *'
CDB_File.c:1025: error: invalid type argument of 'unary *'
CDB_File.c:1025: error: invalid type argument of 'unary *'
CDB_File.c:1025: error: invalid type argument of 'unary *'
CDB_File.c:1025: error: invalid type argument of 'unary *'
CDB_File.c:1025: error: invalid type argument of 'unary *'
CDB_File.c:1025: error: invalid type argument of 'unary *'
CDB_File.c:1025: error: invalid type argument of 'unary *'
CDB_File.c:1025: error: invalid type argument of 'unary *'
CDB_File.c:1025: error: invalid type argument of 'unary *'
CDB_File.c:1025: error: invalid type argument of 'unary *'
CDB_File.c:1027: error: invalid type argument of 'unary *'
CDB_File.c:1028: error: invalid type argument of 'unary *'
CDB_File.c:1029: error: invalid type argument of 'unary *'
CDB_File.c:1030: error: invalid type argument of 'unary *'
CDB_File.c:1031: error: invalid type argument of 'unary *'
CDB_File.c:1032: error: invalid type argument of 'unary *'
CDB_File.c:1033: error: invalid type argument of 'unary *'
CDB_File.c:1034: error: invalid type argument of 'unary *'
CDB_File.c:1035: error: invalid type argument of 'unary *'
CDB_File.c:1036: error: invalid type argument of 'unary *'
CDB_File.c:1037: error: invalid type argument of 'unary *'
CDB_File.c:1038: error: invalid type argument of 'unary *'
CDB_File.c:1039: error: invalid type argument of 'unary *'
CDB_File.c:1040: error: invalid type argument of 'unary *'
CDB_File.c:1041: error: invalid type argument of 'unary *'
CDB_File.c:1041: error: invalid type argument of 'unary *'
CDB_File.c:1041: error: invalid type argument of 'unary *'
CDB_File.c:1041: error: invalid type argument of 'unary *'
make: *** [CDB_File.o] Error 1
/usr/bin/make -- NOT OK
Running make test
Can't test without successful make
Running make install
make had returned bad status, install seems impossible

Search Discussions

  • Chas. Owens at Jan 25, 2008 at 1:39 pm

    On Jan 25, 2008 1:39 AM, marcos rebelo wrote:
    Hi all

    I'm having all this problems, can someone help me?

    Best Regards snip
    /usr/lib/perl/5.8/CORE/perl.h:420:24: error: sys/types.h: No such file
    or directory
    /usr/lib/perl/5.8/CORE/perl.h:451:19: error: ctype.h: No such file or directory
    /usr/lib/perl/5.8/CORE/perl.h:463:23: error: locale.h: No such file or directory
    /usr/lib/perl/5.8/CORE/perl.h:480:20: error: setjmp.h: No such file or directory
    /usr/lib/perl/5.8/CORE/perl.h:486:26: error: sys/param.h: No such file
    or directory
    snip

    It looks like you are missing the header files for your system. If
    you tells us what operating system you are using we may be able to
    tell you how to go about installing them (or if you have a sysadmin,
    just ask him/her to do it).
  • Marcos rebelo at Jan 25, 2008 at 5:46 pm
    Hy all

    I'm using the last Ubuntu.

    What shell I ask to the apt?

    Thanks for the help
    Marcos
    On Jan 25, 2008 1:38 PM, Chas. Owens wrote:
    On Jan 25, 2008 1:39 AM, marcos rebelo wrote:
    Hi all

    I'm having all this problems, can someone help me?

    Best Regards snip
    /usr/lib/perl/5.8/CORE/perl.h:420:24: error: sys/types.h: No such file
    or directory
    /usr/lib/perl/5.8/CORE/perl.h:451:19: error: ctype.h: No such file or directory
    /usr/lib/perl/5.8/CORE/perl.h:463:23: error: locale.h: No such file or directory
    /usr/lib/perl/5.8/CORE/perl.h:480:20: error: setjmp.h: No such file or directory
    /usr/lib/perl/5.8/CORE/perl.h:486:26: error: sys/param.h: No such file
    or directory
    snip

    It looks like you are missing the header files for your system. If
    you tells us what operating system you are using we may be able to
    tell you how to go about installing them (or if you have a sysadmin,
    just ask him/her to do it).


    --
    Marcos Rebelo
    http://oleber.freehostia.com
  • Chas. Owens at Jan 25, 2008 at 8:22 pm

    On Jan 25, 2008 12:46 PM, marcos rebelo wrote:
    Hy all

    I'm using the last Ubuntu.

    What shell I ask to the apt?

    Thanks for the help
    Marcos
    snip

    apt-get install build-essential

    should get you the full GCC toolchain including the glibc headers.
  • Oleber at Jan 26, 2008 at 9:19 am

    On Jan 25, 8:22 pm, chas.ow...@gmail.com (Chas. Owens) wrote:
    On Jan 25, 2008 12:46 PM, marcos rebelo wrote:> Hy all
    I'm using the last Ubuntu.
    What shell I ask to the apt?
    Thanks for the help
    Marcos
    snip

    apt-get install build-essential

    should get you the full GCC toolchain including the glibc headers.
    Thanks for the help

Related Discussions

Discussion Navigation
viewthread | post
Discussion Overview
groupbeginners @
categoriesperl
postedJan 25, '08 at 6:39a
activeJan 26, '08 at 9:19a
posts5
users2
websiteperl.org

2 users in discussion

Oleber: 3 posts Chas. Owens: 2 posts

People

Translate

site design / logo © 2022 Grokbase