FAQ
See http://hudson.zones.apache.org/hudson/job/Solr-trunk/501/changes

Changes:

[ehatcher] SOLR-632: Upgrade Jetty to 6.1.11

[ryan] SOLR-572 -- expose the configured spellcheckers. This will give other custom components access to the same spelling dictionaries

------------------------------------------
[...truncated 1281 lines...]
[javac] Note: Recompile with -Xlint:deprecation for details.
[javac] Note: Some input files use unchecked or unsafe operations.
[javac] Note: Recompile with -Xlint:unchecked for details.

compile-solrj-core:
[mkdir] Created dir: http://hudson.zones.apache.org/hudson/job/Solr-trunk/ws/trunk/build/client/solrj
[javac] Compiling 25 source files to http://hudson.zones.apache.org/hudson/job/Solr-trunk/ws/trunk/build/client/solrj
[javac] Note: http://hudson.zones.apache.org/hudson/job/Solr-trunk/ws/trunk/client/java/solrj/src/org/apache/solr/client/solrj/impl/CommonsHttpSolrServer.java uses or overrides a deprecated API.
[javac] Note: Recompile with -Xlint:deprecation for details.
[javac] Note: Some input files use unchecked or unsafe operations.
[javac] Note: Recompile with -Xlint:unchecked for details.

compile-solrj:
[javac] Compiling 2 source files to http://hudson.zones.apache.org/hudson/job/Solr-trunk/ws/trunk/build/client/solrj

compileTests:
[mkdir] Created dir: http://hudson.zones.apache.org/hudson/job/Solr-trunk/ws/trunk/build/tests
[javac] Compiling 107 source files to http://hudson.zones.apache.org/hudson/job/Solr-trunk/ws/trunk/build/tests
[javac] Note: Some input files use or override a deprecated API.
[javac] Note: Recompile with -Xlint:deprecation for details.
[javac] Note: Some input files use unchecked or unsafe operations.
[javac] Note: Recompile with -Xlint:unchecked for details.

junit:
[mkdir] Created dir: http://hudson.zones.apache.org/hudson/job/Solr-trunk/ws/trunk/build/test-results
[junit] Running org.apache.solr.BasicFunctionalityTest
[junit] Tests run: 25, Failures: 0, Errors: 0, Time elapsed: 26.646 sec
[junit] Running org.apache.solr.ConvertedLegacyTest
[junit] Tests run: 1, Failures: 0, Errors: 0, Time elapsed: 8.385 sec
[junit] Running org.apache.solr.DisMaxRequestHandlerTest
[junit] Tests run: 3, Failures: 0, Errors: 0, Time elapsed: 7.382 sec
[junit] Running org.apache.solr.EchoParamsTest
[junit] Tests run: 4, Failures: 0, Errors: 0, Time elapsed: 3.136 sec
[junit] Running org.apache.solr.OutputWriterTest
[junit] Tests run: 3, Failures: 0, Errors: 0, Time elapsed: 3.174 sec
[junit] Running org.apache.solr.SampleTest
[junit] Tests run: 2, Failures: 0, Errors: 0, Time elapsed: 2.349 sec
[junit] Running org.apache.solr.SolrInfoMBeanTest
[junit] Tests run: 1, Failures: 0, Errors: 0, Time elapsed: 0.88 sec
[junit] Running org.apache.solr.TestDistributedSearch
[junit] Tests run: 1, Failures: 0, Errors: 0, Time elapsed: 18.97 sec
[junit] 2008-07-17 08:10:57.616::INFO: Shutdown hook executing
[junit] 2008-07-17 08:10:57.616::INFO: Shutdown hook complete
[junit] 2008-07-17 08:10:58.619::INFO: Shutdown hook complete
[junit] 2008-07-17 08:10:59.532::INFO: Shutdown hook complete
[junit] 2008-07-17 08:11:00.542::INFO: Shutdown hook complete
[junit] 2008-07-17 08:11:02.552::INFO: Shutdown hook complete
[junit] 2008-07-17 08:11:03.562::INFO: Shutdown hook complete
[junit] 2008-07-17 08:11:04.475::INFO: Shutdown hook complete
[junit] 2008-07-17 08:11:05.485::INFO: Shutdown hook complete
[junit] 2008-07-17 08:11:06.495::INFO: Shutdown hook complete
[junit] Running org.apache.solr.analysis.EnglishPorterFilterFactoryTest
[junit] Tests run: 2, Failures: 0, Errors: 0, Time elapsed: 1.285 sec
[junit] Running org.apache.solr.analysis.HTMLStripReaderTest
[junit] Tests run: 9, Failures: 0, Errors: 0, Time elapsed: 1.066 sec
[junit] Running org.apache.solr.analysis.LengthFilterTest
[junit] Tests run: 1, Failures: 0, Errors: 0, Time elapsed: 1.04 sec
[junit] Running org.apache.solr.analysis.TestBufferedTokenStream
[junit] Tests run: 2, Failures: 0, Errors: 0, Time elapsed: 1.612 sec
[junit] Running org.apache.solr.analysis.TestCapitalizationFilter
[junit] Tests run: 2, Failures: 0, Errors: 0, Time elapsed: 1.827 sec
[junit] Running org.apache.solr.analysis.TestHyphenatedWordsFilter
[junit] Tests run: 1, Failures: 0, Errors: 0, Time elapsed: 1.339 sec
[junit] Running org.apache.solr.analysis.TestKeepWordFilter
[junit] Tests run: 1, Failures: 0, Errors: 0, Time elapsed: 0.934 sec
[junit] Running org.apache.solr.analysis.TestPatternReplaceFilter
[junit] Tests run: 5, Failures: 0, Errors: 0, Time elapsed: 1.537 sec
[junit] Running org.apache.solr.analysis.TestPatternTokenizerFactory
[junit] Tests run: 1, Failures: 0, Errors: 0, Time elapsed: 0.902 sec
[junit] Running org.apache.solr.analysis.TestPhoneticFilter
[junit] Tests run: 2, Failures: 0, Errors: 0, Time elapsed: 1.086 sec
[junit] Running org.apache.solr.analysis.TestRemoveDuplicatesTokenFilter
[junit] Tests run: 3, Failures: 0, Errors: 0, Time elapsed: 1.498 sec
[junit] Running org.apache.solr.analysis.TestSynonymFilter
[junit] Tests run: 7, Failures: 0, Errors: 0, Time elapsed: 2.086 sec
[junit] Running org.apache.solr.analysis.TestSynonymMap
[junit] Tests run: 5, Failures: 0, Errors: 0, Time elapsed: 1.942 sec
[junit] Running org.apache.solr.analysis.TestTrimFilter
[junit] Tests run: 1, Failures: 0, Errors: 0, Time elapsed: 1.244 sec
[junit] Running org.apache.solr.analysis.TestWordDelimiterFilter
[junit] Tests run: 5, Failures: 0, Errors: 0, Time elapsed: 7.679 sec
[junit] Running org.apache.solr.common.SolrDocumentTest
[junit] Tests run: 4, Failures: 0, Errors: 0, Time elapsed: 0.424 sec
[junit] Running org.apache.solr.common.params.SolrParamTest
[junit] Tests run: 1, Failures: 0, Errors: 0, Time elapsed: 0.456 sec
[junit] Running org.apache.solr.common.util.ContentStreamTest
[junit] Tests run: 3, Failures: 0, Errors: 0, Time elapsed: 0.806 sec
[junit] Running org.apache.solr.common.util.IteratorChainTest
[junit] Tests run: 7, Failures: 0, Errors: 0, Time elapsed: 0.456 sec
[junit] Running org.apache.solr.common.util.TestNamedListCodec
[junit] Tests run: 2, Failures: 0, Errors: 0, Time elapsed: 2.069 sec
[junit] Running org.apache.solr.common.util.TestXMLEscaping
[junit] Tests run: 7, Failures: 0, Errors: 0, Time elapsed: 0.424 sec
[junit] Running org.apache.solr.core.RequestHandlersTest
[junit] Tests run: 2, Failures: 0, Errors: 0, Time elapsed: 4.041 sec
[junit] Running org.apache.solr.core.ResourceLoaderTest
[junit] Tests run: 2, Failures: 0, Errors: 0, Time elapsed: 0.468 sec
[junit] Running org.apache.solr.core.SolrCoreTest
[junit] Tests run: 2, Failures: 0, Errors: 0, Time elapsed: 4.128 sec
[junit] Running org.apache.solr.core.TestBadConfig
[junit] Tests run: 1, Failures: 0, Errors: 0, Time elapsed: 0.786 sec
[junit] Running org.apache.solr.core.TestConfig
[junit] Tests run: 2, Failures: 0, Errors: 0, Time elapsed: 5.082 sec
[junit] Running org.apache.solr.core.TestQuerySenderListener
[junit] Tests run: 1, Failures: 0, Errors: 0, Time elapsed: 3.816 sec
[junit] Running org.apache.solr.handler.AnalysisRequestHandlerTest
[junit] Tests run: 1, Failures: 0, Errors: 0, Time elapsed: 3.427 sec
[junit] Running org.apache.solr.handler.MoreLikeThisHandlerTest
[junit] Tests run: 1, Failures: 0, Errors: 0, Time elapsed: 2.772 sec
[junit] Running org.apache.solr.handler.SpellCheckerRequestHandlerTest
[junit] Tests run: 5, Failures: 0, Errors: 0, Time elapsed: 4.024 sec
[junit] Running org.apache.solr.handler.StandardRequestHandlerTest
[junit] Tests run: 1, Failures: 0, Errors: 0, Time elapsed: 2.649 sec
[junit] Running org.apache.solr.handler.TestCSVLoader
[junit] Tests run: 4, Failures: 0, Errors: 0, Time elapsed: 10.632 sec
[junit] Running org.apache.solr.handler.XmlUpdateRequestHandlerTest
[junit] Tests run: 1, Failures: 0, Errors: 0, Time elapsed: 4.251 sec
[junit] Running org.apache.solr.handler.admin.SystemInfoHandlerTest
[junit] Tests run: 1, Failures: 0, Errors: 0, Time elapsed: 0.531 sec
[junit] Running org.apache.solr.handler.component.QueryElevationComponentTest
[junit] Tests run: 3, Failures: 0, Errors: 0, Time elapsed: 7.67 sec
[junit] Running org.apache.solr.handler.component.SearchHandlerTest
[junit] Tests run: 1, Failures: 0, Errors: 0, Time elapsed: 5.081 sec
[junit] Running org.apache.solr.handler.component.SpellCheckComponentTest
[junit] Tests run: 6, Failures: 0, Errors: 0, Time elapsed: 11.93 sec
[junit] Running org.apache.solr.highlight.HighlighterConfigTest
[junit] Tests run: 1, Failures: 0, Errors: 0, Time elapsed: 4.415 sec
[junit] Running org.apache.solr.highlight.HighlighterTest
[junit] Tests run: 17, Failures: 0, Errors: 0, Time elapsed: 24.482 sec
[junit] Running org.apache.solr.request.JSONWriterTest
[junit] Tests run: 1, Failures: 0, Errors: 0, Time elapsed: 3.058 sec
[junit] Running org.apache.solr.request.TestWriterPerf
[junit] Tests run: 1, Failures: 0, Errors: 0, Time elapsed: 4.593 sec
[junit] Running org.apache.solr.schema.BadIndexSchemaTest
[junit] Tests run: 1, Failures: 0, Errors: 0, Time elapsed: 2.927 sec
[junit] Running org.apache.solr.schema.DateFieldTest
[junit] Tests run: 6, Failures: 0, Errors: 0, Time elapsed: 0.597 sec
[junit] Running org.apache.solr.schema.IndexSchemaTest
[junit] Tests run: 2, Failures: 0, Errors: 0, Time elapsed: 7.891 sec
[junit] Running org.apache.solr.schema.LegacyDateFieldTest
[junit] Tests run: 4, Failures: 0, Errors: 0, Time elapsed: 0.456 sec
[junit] Running org.apache.solr.schema.NotRequiredUniqueKeyTest
[junit] Tests run: 1, Failures: 0, Errors: 0, Time elapsed: 2.078 sec
[junit] Running org.apache.solr.schema.RequiredFieldsTest
[junit] Tests run: 3, Failures: 0, Errors: 0, Time elapsed: 6.88 sec
[junit] Running org.apache.solr.schema.UUIDFieldTest
[junit] Tests run: 1, Failures: 0, Errors: 0, Time elapsed: 0.849 sec
[junit] Running org.apache.solr.search.TestDocSet
[junit] Tests run: 1, Failures: 0, Errors: 0, Time elapsed: 1.329 sec
[junit] Running org.apache.solr.search.TestQueryTypes
[junit] Tests run: 1, Failures: 0, Errors: 0, Time elapsed: 3.412 sec
[junit] Running org.apache.solr.search.TestQueryUtils
[junit] Tests run: 1, Failures: 0, Errors: 0, Time elapsed: 4.91 sec
[junit] Running org.apache.solr.search.function.TestFunctionQuery
[junit] Tests run: 2, Failures: 0, Errors: 0, Time elapsed: 7.69 sec
[junit] Running org.apache.solr.servlet.CacheHeaderTest
[junit] Tests run: 5, Failures: 1, Errors: 0, Time elapsed: 20.73 sec
[junit] 2008-07-17 08:15:06.564::INFO: Shutdown hook executing
[junit] 2008-07-17 08:15:06.564::INFO: Shutdown hook complete
[junit] 2008-07-17 08:15:07.572::INFO: Shutdown hook complete
[junit] 2008-07-17 08:15:08.582::INFO: Shutdown hook complete
[junit] 2008-07-17 08:15:09.488::INFO: Shutdown hook complete
[junit] 2008-07-17 08:15:10.495::INFO: Shutdown hook complete
[junit] Test org.apache.solr.servlet.CacheHeaderTest FAILED
[junit] Running org.apache.solr.servlet.DirectSolrConnectionTest
[junit] Tests run: 2, Failures: 0, Errors: 0, Time elapsed: 4.392 sec
[junit] Running org.apache.solr.servlet.NoCacheHeaderTest
[junit] Tests run: 3, Failures: 0, Errors: 0, Time elapsed: 11.662 sec
[junit] 2008-07-17 08:15:29.808::INFO: Shutdown hook executing
[junit] 2008-07-17 08:15:29.809::INFO: Shutdown hook complete
[junit] 2008-07-17 08:15:30.742::INFO: Shutdown hook complete
[junit] 2008-07-17 08:15:31.749::INFO: Shutdown hook complete
[junit] Running org.apache.solr.servlet.SolrRequestParserTest
[junit] Tests run: 4, Failures: 0, Errors: 0, Time elapsed: 9.886 sec
[junit] Running org.apache.solr.spelling.FileBasedSpellCheckerTest
[junit] Tests run: 3, Failures: 0, Errors: 0, Time elapsed: 5.937 sec
[junit] Running org.apache.solr.spelling.IndexBasedSpellCheckerTest
[junit] Tests run: 4, Failures: 0, Errors: 0, Time elapsed: 6.143 sec
[junit] Running org.apache.solr.spelling.SpellingQueryConverterTest
[junit] Tests run: 1, Failures: 0, Errors: 0, Time elapsed: 2.879 sec
[junit] Running org.apache.solr.update.AutoCommitTest
[junit] Tests run: 1, Failures: 0, Errors: 0, Time elapsed: 4.429 sec
[junit] Running org.apache.solr.update.DirectUpdateHandlerOptimizeTest
[junit] Tests run: 1, Failures: 0, Errors: 0, Time elapsed: 8.507 sec
[junit] Running org.apache.solr.update.DirectUpdateHandlerTest
[junit] Tests run: 1, Failures: 0, Errors: 0, Time elapsed: 2.609 sec
[junit] Running org.apache.solr.update.DocumentBuilderTest
[junit] Tests run: 2, Failures: 0, Errors: 0, Time elapsed: 3.196 sec
[junit] Running org.apache.solr.update.processor.UpdateRequestProcessorFactoryTest
[junit] Tests run: 1, Failures: 0, Errors: 0, Time elapsed: 2.29 sec
[junit] Running org.apache.solr.util.ArraysUtilsTest
[junit] Tests run: 1, Failures: 0, Errors: 0, Time elapsed: 0.416 sec
[junit] Running org.apache.solr.util.DateMathParserTest
[junit] Tests run: 7, Failures: 0, Errors: 0, Time elapsed: 0.474 sec
[junit] Running org.apache.solr.util.SolrPluginUtilsTest
[junit] Tests run: 5, Failures: 0, Errors: 0, Time elapsed: 6.728 sec
[junit] Running org.apache.solr.util.TestCharArrayMap
[junit] Tests run: 2, Failures: 0, Errors: 0, Time elapsed: 0.558 sec
[junit] Running org.apache.solr.util.TestNumberUtils
[junit] Tests run: 1, Failures: 0, Errors: 0, Time elapsed: 1.328 sec
[junit] Running org.apache.solr.util.TestOpenBitSet
[junit] Tests run: 3, Failures: 0, Errors: 0, Time elapsed: 1.25 sec
[junit] Running org.apache.solr.util.TestUtils
[junit] Tests run: 4, Failures: 0, Errors: 0, Time elapsed: 0.401 sec
[junit] Running org.apache.solr.client.solrj.SolrExceptionTest
[junit] Tests run: 1, Failures: 0, Errors: 0, Time elapsed: 0.584 sec
[junit] Running org.apache.solr.client.solrj.SolrQueryTest
[junit] Tests run: 1, Failures: 0, Errors: 0, Time elapsed: 0.462 sec
[junit] Running org.apache.solr.client.solrj.beans.TestDocumentObjectBinder
[junit] Tests run: 2, Failures: 0, Errors: 0, Time elapsed: 0.581 sec
[junit] Running org.apache.solr.client.solrj.embedded.JettyWebappTest
[junit] Tests run: 1, Failures: 0, Errors: 0, Time elapsed: 5.92 sec
[junit] 2008-07-17 08:16:50.681::INFO: Shutdown hook executing
[junit] 2008-07-17 08:16:50.799::INFO: Shutdown hook complete
[junit] Running org.apache.solr.client.solrj.embedded.LargeVolumeEmbeddedTest
[junit] Tests run: 1, Failures: 0, Errors: 0, Time elapsed: 3.973 sec
[junit] Running org.apache.solr.client.solrj.embedded.LargeVolumeJettyTest
[junit] Tests run: 1, Failures: 0, Errors: 0, Time elapsed: 4.998 sec
[junit] 2008-07-17 08:17:01.996::INFO: Shutdown hook executing
[junit] 2008-07-17 08:17:01.996::INFO: Shutdown hook complete
[junit] Running org.apache.solr.client.solrj.embedded.MultiCoreEmbeddedTest
[junit] Tests run: 1, Failures: 0, Errors: 0, Time elapsed: 2.818 sec
[junit] Running org.apache.solr.client.solrj.embedded.MultiCoreExampleJettyTest
[junit] Tests run: 1, Failures: 0, Errors: 0, Time elapsed: 3.047 sec
[junit] 2008-07-17 08:17:10.950::INFO: Shutdown hook executing
[junit] 2008-07-17 08:17:10.950::INFO: Shutdown hook complete
[junit] Running org.apache.solr.client.solrj.embedded.SolrExampleEmbeddedTest
[junit] Tests run: 6, Failures: 0, Errors: 0, Time elapsed: 5.376 sec
[junit] Running org.apache.solr.client.solrj.embedded.SolrExampleJettyTest
[junit] Tests run: 7, Failures: 0, Errors: 0, Time elapsed: 9.539 sec
[junit] 2008-07-17 08:17:27.510::INFO: Shutdown hook executing
[junit] 2008-07-17 08:17:27.511::INFO: Shutdown hook complete
[junit] 2008-07-17 08:17:28.418::INFO: Shutdown hook complete
[junit] 2008-07-17 08:17:30.427::INFO: Shutdown hook complete
[junit] 2008-07-17 08:17:31.437::INFO: Shutdown hook complete
[junit] 2008-07-17 08:17:32.447::INFO: Shutdown hook complete
[junit] 2008-07-17 08:17:33.360::INFO: Shutdown hook complete
[junit] 2008-07-17 08:17:34.370::INFO: Shutdown hook complete
[junit] Running org.apache.solr.client.solrj.response.QueryResponseTest
[junit] Tests run: 1, Failures: 0, Errors: 0, Time elapsed: 0.467 sec
[junit] Running org.apache.solr.client.solrj.util.ClientUtilsTest
[junit] Tests run: 1, Failures: 0, Errors: 0, Time elapsed: 0.4 sec

BUILD FAILED
http://hudson.zones.apache.org/hudson/job/Solr-trunk/ws/trunk/build.xml :434: Tests failed!

Total time: 8 minutes 16 seconds
Publishing Javadoc
Recording test results

Search Discussions

  • Chris Hostetter at Jul 17, 2008 at 6:40 pm
    something related to the Jetty upgrade (SOLR-632) seems to have caused
    this ... i can reproduce locally.

    junit.framework.AssertionFailedError: We got no Cache-Control header
    at org.apache.solr.servlet.CacheHeaderTest.checkVetoHeaders(CacheHeaderTest.java:64)
    at org.apache.solr.servlet.CacheHeaderTest.testCacheVetoException(CacheHeaderTest.java:59)

    : See http://hudson.zones.apache.org/hudson/job/Solr-trunk/501/changes


    -Hoss
  • Norberto Meijome at Jul 18, 2008 at 3:34 am

    On Thu, 17 Jul 2008 11:39:29 -0700 (PDT) Chris Hostetter wrote:

    something related to the Jetty upgrade (SOLR-632) seems to have caused
    this ... i can reproduce locally.

    junit.framework.AssertionFailedError: We got no Cache-Control header
    at org.apache.solr.servlet.CacheHeaderTest.checkVetoHeaders(CacheHeaderTest.java:64)
    at org.apache.solr.servlet.CacheHeaderTest.testCacheVetoException(CacheHeaderTest.java:59)

    : See http://hudson.zones.apache.org/hudson/job/Solr-trunk/501/changes
    bugger. my bad, i should have run ant test when I tested.

    my apologies for wasting your time.

    b

    _________________________
    {Beto|Norberto|Numard} Meijome

    "I abhor a system designed for the 'user', if that word is a coded pejorative meaning 'stupid and unsophisticated'.
    Ken Thompson

    I speak for myself, not my employer. Contents may be hot. Slippery when wet. Reading disclaimers makes you go blind. Writing them is worse. You have been Warned.
  • Apache Hudson Server at Jul 21, 2008 at 3:51 am
    See http://hudson.zones.apache.org/hudson/job/Solr-trunk/502/changes

    ------------------------------------------
    Failed to access build log

    java.io.InterruptedIOException
    at java.io.FileInputStream.readBytes(Native Method)
    at java.io.FileInputStream.read(FileInputStream.java:199)
    at sun.nio.cs.StreamDecoder.readBytes(StreamDecoder.java:264)
    at sun.nio.cs.StreamDecoder.implRead(StreamDecoder.java:306)
    at sun.nio.cs.StreamDecoder.read(StreamDecoder.java:158)
    at java.io.InputStreamReader.read(InputStreamReader.java:167)
    at java.io.BufferedReader.fill(BufferedReader.java:136)
    at java.io.BufferedReader.readLine(BufferedReader.java:299)
    at java.io.BufferedReader.readLine(BufferedReader.java:362)
    at hudson.model.Run.getLog(Run.java:892)
    at hudson.tasks.MailSender.createFailureMail(MailSender.java:185)
    at hudson.tasks.MailSender.getMail(MailSender.java:90)
    at hudson.tasks.MailSender.execute(MailSender.java:58)
    at hudson.tasks.Mailer._perform(Mailer.java:74)
    at hudson.tasks.Mailer.perform(Mailer.java:68)
    at hudson.tasks.BuildStepCompatibilityLayer.perform(BuildStepCompatibilityLayer.java:33)
    at hudson.model.AbstractBuild$AbstractRunner.performAllBuildStep(AbstractBuild.java:302)
    at hudson.model.AbstractBuild$AbstractRunner.performAllBuildStep(AbstractBuild.java:290)
    at hudson.model.Build$RunnerImpl.post2(Build.java:136)
    at hudson.model.AbstractBuild$AbstractRunner.post(AbstractBuild.java:275)
    at hudson.model.Run.run(Run.java:769)
    at hudson.model.Build.run(Build.java:103)
    at hudson.model.ResourceController.execute(ResourceController.java:70)
    at hudson.model.Executor.run(Executor.java:77)
  • Apache Hudson Server at Jul 21, 2008 at 8:25 am
    See http://hudson.zones.apache.org/hudson/job/Solr-trunk/503/changes

    ------------------------------------------
    [...truncated 1286 lines...]
    compile-solrj-core:
    [mkdir] Created dir: http://hudson.zones.apache.org/hudson/job/Solr-trunk/ws/trunk/build/client/solrj
    [javac] Compiling 25 source files to http://hudson.zones.apache.org/hudson/job/Solr-trunk/ws/trunk/build/client/solrj
    [javac] Note: http://hudson.zones.apache.org/hudson/job/Solr-trunk/ws/trunk/client/java/solrj/src/org/apache/solr/client/solrj/impl/CommonsHttpSolrServer.java uses or overrides a deprecated API.
    [javac] Note: Recompile with -Xlint:deprecation for details.
    [javac] Note: Some input files use unchecked or unsafe operations.
    [javac] Note: Recompile with -Xlint:unchecked for details.

    compile-solrj:
    [javac] Compiling 2 source files to http://hudson.zones.apache.org/hudson/job/Solr-trunk/ws/trunk/build/client/solrj

    compileTests:
    [mkdir] Created dir: http://hudson.zones.apache.org/hudson/job/Solr-trunk/ws/trunk/build/tests
    [javac] Compiling 107 source files to http://hudson.zones.apache.org/hudson/job/Solr-trunk/ws/trunk/build/tests
    [javac] Note: Some input files use or override a deprecated API.
    [javac] Note: Recompile with -Xlint:deprecation for details.
    [javac] Note: Some input files use unchecked or unsafe operations.
    [javac] Note: Recompile with -Xlint:unchecked for details.

    junit:
    [mkdir] Created dir: http://hudson.zones.apache.org/hudson/job/Solr-trunk/ws/trunk/build/test-results
    [junit] Running org.apache.solr.BasicFunctionalityTest
    [junit] Tests run: 25, Failures: 0, Errors: 0, Time elapsed: 36.038 sec
    [junit] Running org.apache.solr.ConvertedLegacyTest
    [junit] Tests run: 1, Failures: 0, Errors: 0, Time elapsed: 9.031 sec
    [junit] Running org.apache.solr.DisMaxRequestHandlerTest
    [junit] Tests run: 3, Failures: 0, Errors: 0, Time elapsed: 8.045 sec
    [junit] Running org.apache.solr.EchoParamsTest
    [junit] Tests run: 4, Failures: 0, Errors: 0, Time elapsed: 3.279 sec
    [junit] Running org.apache.solr.OutputWriterTest
    [junit] Tests run: 3, Failures: 0, Errors: 0, Time elapsed: 4.153 sec
    [junit] Running org.apache.solr.SampleTest
    [junit] Tests run: 2, Failures: 0, Errors: 0, Time elapsed: 2.4 sec
    [junit] Running org.apache.solr.SolrInfoMBeanTest
    [junit] Tests run: 1, Failures: 0, Errors: 0, Time elapsed: 0.855 sec
    [junit] Running org.apache.solr.TestDistributedSearch
    [junit] Tests run: 1, Failures: 0, Errors: 0, Time elapsed: 19.81 sec
    [junit] 2008-07-21 08:10:34.411::INFO: Shutdown hook executing
    [junit] 2008-07-21 08:10:34.411::INFO: Shutdown hook complete
    [junit] 2008-07-21 08:10:35.417::INFO: Shutdown hook complete
    [junit] 2008-07-21 08:10:36.427::INFO: Shutdown hook complete
    [junit] 2008-07-21 08:10:37.437::INFO: Shutdown hook complete
    [junit] 2008-07-21 08:10:38.446::INFO: Shutdown hook complete
    [junit] 2008-07-21 08:10:39.456::INFO: Shutdown hook complete
    [junit] 2008-07-21 08:10:40.465::INFO: Shutdown hook complete
    [junit] 2008-07-21 08:10:41.475::INFO: Shutdown hook complete
    [junit] 2008-07-21 08:10:42.520::INFO: Shutdown hook complete
    [junit] Running org.apache.solr.analysis.EnglishPorterFilterFactoryTest
    [junit] Tests run: 2, Failures: 0, Errors: 0, Time elapsed: 1.348 sec
    [junit] Running org.apache.solr.analysis.HTMLStripReaderTest
    [junit] Tests run: 9, Failures: 0, Errors: 0, Time elapsed: 0.976 sec
    [junit] Running org.apache.solr.analysis.LengthFilterTest
    [junit] Tests run: 1, Failures: 0, Errors: 0, Time elapsed: 1.376 sec
    [junit] Running org.apache.solr.analysis.TestBufferedTokenStream
    [junit] Tests run: 2, Failures: 0, Errors: 0, Time elapsed: 1.058 sec
    [junit] Running org.apache.solr.analysis.TestCapitalizationFilter
    [junit] Tests run: 2, Failures: 0, Errors: 0, Time elapsed: 1.078 sec
    [junit] Running org.apache.solr.analysis.TestHyphenatedWordsFilter
    [junit] Tests run: 1, Failures: 0, Errors: 0, Time elapsed: 0.992 sec
    [junit] Running org.apache.solr.analysis.TestKeepWordFilter
    [junit] Tests run: 1, Failures: 0, Errors: 0, Time elapsed: 0.967 sec
    [junit] Running org.apache.solr.analysis.TestPatternReplaceFilter
    [junit] Tests run: 5, Failures: 0, Errors: 0, Time elapsed: 1.936 sec
    [junit] Running org.apache.solr.analysis.TestPatternTokenizerFactory
    [junit] Tests run: 1, Failures: 0, Errors: 0, Time elapsed: 1.191 sec
    [junit] Running org.apache.solr.analysis.TestPhoneticFilter
    [junit] Tests run: 2, Failures: 0, Errors: 0, Time elapsed: 1.306 sec
    [junit] Running org.apache.solr.analysis.TestRemoveDuplicatesTokenFilter
    [junit] Tests run: 3, Failures: 0, Errors: 0, Time elapsed: 1.543 sec
    [junit] Running org.apache.solr.analysis.TestSynonymFilter
    [junit] Tests run: 7, Failures: 0, Errors: 0, Time elapsed: 2.348 sec
    [junit] Running org.apache.solr.analysis.TestSynonymMap
    [junit] Tests run: 5, Failures: 0, Errors: 0, Time elapsed: 1.711 sec
    [junit] Running org.apache.solr.analysis.TestTrimFilter
    [junit] Tests run: 1, Failures: 0, Errors: 0, Time elapsed: 0.945 sec
    [junit] Running org.apache.solr.analysis.TestWordDelimiterFilter
    [junit] Tests run: 5, Failures: 0, Errors: 0, Time elapsed: 9.393 sec
    [junit] Running org.apache.solr.common.SolrDocumentTest
    [junit] Tests run: 4, Failures: 0, Errors: 0, Time elapsed: 0.409 sec
    [junit] Running org.apache.solr.common.params.SolrParamTest
    [junit] Tests run: 1, Failures: 0, Errors: 0, Time elapsed: 0.412 sec
    [junit] Running org.apache.solr.common.util.ContentStreamTest
    [junit] Tests run: 3, Failures: 0, Errors: 0, Time elapsed: 0.664 sec
    [junit] Running org.apache.solr.common.util.IteratorChainTest
    [junit] Tests run: 7, Failures: 0, Errors: 0, Time elapsed: 0.456 sec
    [junit] Running org.apache.solr.common.util.TestNamedListCodec
    [junit] Tests run: 2, Failures: 0, Errors: 0, Time elapsed: 1.71 sec
    [junit] Running org.apache.solr.common.util.TestXMLEscaping
    [junit] Tests run: 7, Failures: 0, Errors: 0, Time elapsed: 0.432 sec
    [junit] Running org.apache.solr.core.RequestHandlersTest
    [junit] Tests run: 2, Failures: 0, Errors: 0, Time elapsed: 4.751 sec
    [junit] Running org.apache.solr.core.ResourceLoaderTest
    [junit] Tests run: 2, Failures: 0, Errors: 0, Time elapsed: 0.469 sec
    [junit] Running org.apache.solr.core.SolrCoreTest
    [junit] Tests run: 2, Failures: 0, Errors: 0, Time elapsed: 3.862 sec
    [junit] Running org.apache.solr.core.TestBadConfig
    [junit] Tests run: 1, Failures: 0, Errors: 0, Time elapsed: 0.512 sec
    [junit] Running org.apache.solr.core.TestConfig
    [junit] Tests run: 2, Failures: 0, Errors: 0, Time elapsed: 3.742 sec
    [junit] Running org.apache.solr.core.TestQuerySenderListener
    [junit] Tests run: 1, Failures: 0, Errors: 0, Time elapsed: 2.478 sec
    [junit] Running org.apache.solr.handler.AnalysisRequestHandlerTest
    [junit] Tests run: 1, Failures: 0, Errors: 0, Time elapsed: 2.977 sec
    [junit] Running org.apache.solr.handler.MoreLikeThisHandlerTest
    [junit] Tests run: 1, Failures: 0, Errors: 0, Time elapsed: 3.02 sec
    [junit] Running org.apache.solr.handler.SpellCheckerRequestHandlerTest
    [junit] Tests run: 5, Failures: 0, Errors: 0, Time elapsed: 3.799 sec
    [junit] Running org.apache.solr.handler.StandardRequestHandlerTest
    [junit] Tests run: 1, Failures: 0, Errors: 0, Time elapsed: 2.847 sec
    [junit] Running org.apache.solr.handler.TestCSVLoader
    [junit] Tests run: 4, Failures: 0, Errors: 0, Time elapsed: 7.347 sec
    [junit] Running org.apache.solr.handler.XmlUpdateRequestHandlerTest
    [junit] Tests run: 1, Failures: 0, Errors: 0, Time elapsed: 2.815 sec
    [junit] Running org.apache.solr.handler.admin.SystemInfoHandlerTest
    [junit] Tests run: 1, Failures: 0, Errors: 0, Time elapsed: 0.504 sec
    [junit] Running org.apache.solr.handler.component.QueryElevationComponentTest
    [junit] Tests run: 3, Failures: 0, Errors: 0, Time elapsed: 5.18 sec
    [junit] Running org.apache.solr.handler.component.SearchHandlerTest
    [junit] Tests run: 1, Failures: 0, Errors: 0, Time elapsed: 3.524 sec
    [junit] Running org.apache.solr.handler.component.SpellCheckComponentTest
    [junit] Tests run: 6, Failures: 0, Errors: 0, Time elapsed: 11.778 sec
    [junit] Running org.apache.solr.highlight.HighlighterConfigTest
    [junit] Tests run: 1, Failures: 0, Errors: 0, Time elapsed: 3.505 sec
    [junit] Running org.apache.solr.highlight.HighlighterTest
    [junit] Tests run: 17, Failures: 0, Errors: 0, Time elapsed: 31.51 sec
    [junit] Running org.apache.solr.request.JSONWriterTest
    [junit] Tests run: 1, Failures: 0, Errors: 0, Time elapsed: 2.573 sec
    [junit] Running org.apache.solr.request.TestWriterPerf
    [junit] Tests run: 1, Failures: 0, Errors: 0, Time elapsed: 2.421 sec
    [junit] Running org.apache.solr.schema.BadIndexSchemaTest
    [junit] Tests run: 1, Failures: 0, Errors: 0, Time elapsed: 1.881 sec
    [junit] Running org.apache.solr.schema.DateFieldTest
    [junit] Tests run: 6, Failures: 0, Errors: 0, Time elapsed: 0.456 sec
    [junit] Running org.apache.solr.schema.IndexSchemaTest
    [junit] Tests run: 3, Failures: 0, Errors: 0, Time elapsed: 5.767 sec
    [junit] Running org.apache.solr.schema.LegacyDateFieldTest
    [junit] Tests run: 4, Failures: 0, Errors: 0, Time elapsed: 0.79 sec
    [junit] Running org.apache.solr.schema.NotRequiredUniqueKeyTest
    [junit] Tests run: 1, Failures: 0, Errors: 0, Time elapsed: 4.876 sec
    [junit] Running org.apache.solr.schema.RequiredFieldsTest
    [junit] Tests run: 3, Failures: 0, Errors: 0, Time elapsed: 5.827 sec
    [junit] Running org.apache.solr.schema.UUIDFieldTest
    [junit] Tests run: 1, Failures: 0, Errors: 0, Time elapsed: 0.732 sec
    [junit] Running org.apache.solr.search.TestDocSet
    [junit] Tests run: 1, Failures: 0, Errors: 0, Time elapsed: 1.2 sec
    [junit] Running org.apache.solr.search.TestQueryTypes
    [junit] Tests run: 1, Failures: 0, Errors: 0, Time elapsed: 2.755 sec
    [junit] Running org.apache.solr.search.TestQueryUtils
    [junit] Tests run: 1, Failures: 0, Errors: 0, Time elapsed: 4.069 sec
    [junit] Running org.apache.solr.search.function.TestFunctionQuery
    [junit] Tests run: 2, Failures: 0, Errors: 0, Time elapsed: 5.267 sec
    [junit] Running org.apache.solr.servlet.CacheHeaderTest
    [junit] Tests run: 5, Failures: 0, Errors: 0, Time elapsed: 16.935 sec
    [junit] 2008-07-21 08:14:21.925::INFO: Shutdown hook executing
    [junit] 2008-07-21 08:14:21.927::INFO: Shutdown hook complete
    [junit] 2008-07-21 08:14:22.931::INFO: Shutdown hook complete
    [junit] 2008-07-21 08:14:23.941::INFO: Shutdown hook complete
    [junit] 2008-07-21 08:14:24.950::INFO: Shutdown hook complete
    [junit] 2008-07-21 08:14:26.169::INFO: Shutdown hook complete
    [junit] Running org.apache.solr.servlet.DirectSolrConnectionTest
    [junit] Tests run: 2, Failures: 0, Errors: 0, Time elapsed: 4.281 sec
    [junit] Running org.apache.solr.servlet.NoCacheHeaderTest
    [junit] Tests run: 3, Failures: 0, Errors: 0, Time elapsed: 15.676 sec
    [junit] 2008-07-21 08:14:48.750::INFO: Shutdown hook executing
    [junit] 2008-07-21 08:14:48.751::INFO: Shutdown hook complete
    [junit] 2008-07-21 08:14:49.761::INFO: Shutdown hook complete
    [junit] 2008-07-21 08:14:50.807::INFO: Shutdown hook complete
    [junit] Running org.apache.solr.servlet.SolrRequestParserTest
    [junit] Tests run: 4, Failures: 0, Errors: 0, Time elapsed: 8.83 sec
    [junit] Running org.apache.solr.spelling.FileBasedSpellCheckerTest
    [junit] Tests run: 3, Failures: 0, Errors: 0, Time elapsed: 10.108 sec
    [junit] Running org.apache.solr.spelling.IndexBasedSpellCheckerTest
    [junit] Tests run: 4, Failures: 0, Errors: 0, Time elapsed: 9.363 sec
    [junit] Running org.apache.solr.spelling.SpellingQueryConverterTest
    [junit] Tests run: 1, Failures: 0, Errors: 0, Time elapsed: 3.623 sec
    [junit] Running org.apache.solr.update.AutoCommitTest
    [junit] <response>
    [junit] <lst name="responseHeader"><int name="status">0</int><int name="QTime">0</int></lst><result name="response" numFound="0" start="0"/>
    [junit] </response>
    [junit] )
    [junit] Tests run: 1, Failures: 1, Errors: 0, Time elapsed: 6.293 sec
    [junit] Test org.apache.solr.update.AutoCommitTest FAILED
    [junit] Running org.apache.solr.update.DirectUpdateHandlerOptimizeTest
    [junit] Tests run: 1, Failures: 0, Errors: 0, Time elapsed: 15.088 sec
    [junit] Running org.apache.solr.update.DirectUpdateHandlerTest
    [junit] Tests run: 1, Failures: 0, Errors: 0, Time elapsed: 4.557 sec
    [junit] Running org.apache.solr.update.DocumentBuilderTest
    [junit] Tests run: 2, Failures: 0, Errors: 0, Time elapsed: 4.963 sec
    [junit] Running org.apache.solr.update.processor.UpdateRequestProcessorFactoryTest
    [junit] Tests run: 1, Failures: 0, Errors: 0, Time elapsed: 3.09 sec
    [junit] Running org.apache.solr.util.ArraysUtilsTest
    [junit] Tests run: 1, Failures: 0, Errors: 0, Time elapsed: 0.864 sec
    [junit] Running org.apache.solr.util.DateMathParserTest
    [junit] Tests run: 7, Failures: 0, Errors: 0, Time elapsed: 0.685 sec
    [junit] Running org.apache.solr.util.SolrPluginUtilsTest
    [junit] Tests run: 5, Failures: 0, Errors: 0, Time elapsed: 7.047 sec
    [junit] Running org.apache.solr.util.TestCharArrayMap
    [junit] Tests run: 2, Failures: 0, Errors: 0, Time elapsed: 0.609 sec
    [junit] Running org.apache.solr.util.TestNumberUtils
    [junit] Tests run: 1, Failures: 0, Errors: 0, Time elapsed: 1.597 sec
    [junit] Running org.apache.solr.util.TestOpenBitSet
    [junit] Tests run: 3, Failures: 0, Errors: 0, Time elapsed: 1.95 sec
    [junit] Running org.apache.solr.util.TestUtils
    [junit] Tests run: 4, Failures: 0, Errors: 0, Time elapsed: 0.584 sec
    [junit] Running org.apache.solr.client.solrj.SolrExceptionTest
    [junit] Tests run: 1, Failures: 0, Errors: 0, Time elapsed: 0.774 sec
    [junit] Running org.apache.solr.client.solrj.SolrQueryTest
    [junit] Tests run: 1, Failures: 0, Errors: 0, Time elapsed: 0.483 sec
    [junit] Running org.apache.solr.client.solrj.beans.TestDocumentObjectBinder
    [junit] Tests run: 3, Failures: 0, Errors: 0, Time elapsed: 0.938 sec
    [junit] Running org.apache.solr.client.solrj.embedded.JettyWebappTest
    [junit] Tests run: 1, Failures: 0, Errors: 0, Time elapsed: 10.886 sec
    [junit] 2008-07-21 08:16:41.168::INFO: Shutdown hook executing
    [junit] 2008-07-21 08:16:41.290::INFO: Shutdown hook complete
    [junit] Running org.apache.solr.client.solrj.embedded.LargeVolumeEmbeddedTest
    [junit] Tests run: 1, Failures: 0, Errors: 0, Time elapsed: 5.278 sec
    [junit] Running org.apache.solr.client.solrj.embedded.LargeVolumeJettyTest
    [junit] Tests run: 1, Failures: 0, Errors: 0, Time elapsed: 6.903 sec
    [junit] 2008-07-21 08:16:56.215::INFO: Shutdown hook executing
    [junit] 2008-07-21 08:16:56.215::INFO: Shutdown hook complete
    [junit] Running org.apache.solr.client.solrj.embedded.MultiCoreEmbeddedTest
    [junit] Tests run: 1, Failures: 0, Errors: 0, Time elapsed: 3.644 sec
    [junit] Running org.apache.solr.client.solrj.embedded.MultiCoreExampleJettyTest
    [junit] Tests run: 1, Failures: 0, Errors: 0, Time elapsed: 4.438 sec
    [junit] 2008-07-21 08:17:06.846::INFO: Shutdown hook executing
    [junit] 2008-07-21 08:17:06.848::INFO: Shutdown hook complete
    [junit] Running org.apache.solr.client.solrj.embedded.SolrExampleEmbeddedTest
    [junit] Tests run: 6, Failures: 0, Errors: 0, Time elapsed: 10.838 sec
    [junit] Running org.apache.solr.client.solrj.embedded.SolrExampleJettyTest
    [junit] Tests run: 7, Failures: 0, Errors: 0, Time elapsed: 13.107 sec
    [junit] 2008-07-21 08:17:33.281::INFO: Shutdown hook executing
    [junit] 2008-07-21 08:17:33.282::INFO: Shutdown hook complete
    [junit] 2008-07-21 08:17:34.291::INFO: Shutdown hook complete
    [junit] 2008-07-21 08:17:35.300::INFO: Shutdown hook complete
    [junit] 2008-07-21 08:17:36.310::INFO: Shutdown hook complete
    [junit] 2008-07-21 08:17:37.320::INFO: Shutdown hook complete
    [junit] 2008-07-21 08:17:38.329::INFO: Shutdown hook complete
    [junit] 2008-07-21 08:17:39.338::INFO: Shutdown hook complete
    [junit] Running org.apache.solr.client.solrj.response.QueryResponseTest
    [junit] Tests run: 1, Failures: 0, Errors: 0, Time elapsed: 0.471 sec
    [junit] Running org.apache.solr.client.solrj.util.ClientUtilsTest
    [junit] Tests run: 1, Failures: 0, Errors: 0, Time elapsed: 0.416 sec

    BUILD FAILED
    http://hudson.zones.apache.org/hudson/job/Solr-trunk/ws/trunk/build.xml :434: Tests failed!

    Total time: 9 minutes 1 second
    Publishing Javadoc
    Recording test results

Related Discussions

Discussion Navigation
viewthread | post
Discussion Overview
groupsolr-dev @
categorieslucene
postedJul 17, '08 at 8:19a
activeJul 21, '08 at 8:25a
posts5
users3
websitelucene.apache.org...

People

Translate

site design / logo © 2019 Grokbase