Grokbase Groups Lucene dev June 2016
FAQ
Build: http://jenkins.thetaphi.de/job/Lucene-Solr-master-Windows/5908/
Java: 32bit/jdk1.8.0_92 -server -XX:+UseG1GC

1 tests failed.
FAILED: junit.framework.TestSuite.org.apache.solr.cloud.CdcrVersionReplicationTest

Error Message:
ObjectTracker found 1 object(s) that were not released!!! [InternalHttpClient]

Stack Trace:
java.lang.AssertionError: ObjectTracker found 1 object(s) that were not released!!! [InternalHttpClient]
  at __randomizedtesting.SeedInfo.seed([F29067D0C63F3C3]:0)
  at org.junit.Assert.fail(Assert.java:93)
  at org.junit.Assert.assertTrue(Assert.java:43)
  at org.junit.Assert.assertNull(Assert.java:551)
  at org.apache.solr.SolrTestCaseJ4.teardownTestCases(SolrTestCaseJ4.java:256)
  at sun.reflect.GeneratedMethodAccessor17.invoke(Unknown Source)
  at sun.reflect.DelegatingMethodAccessorImpl.invoke(DelegatingMethodAccessorImpl.java:43)
  at java.lang.reflect.Method.invoke(Method.java:498)
  at com.carrotsearch.randomizedtesting.RandomizedRunner.invoke(RandomizedRunner.java:1764)
  at com.carrotsearch.randomizedtesting.RandomizedRunner$7.evaluate(RandomizedRunner.java:834)
  at com.carrotsearch.randomizedtesting.rules.StatementAdapter.evaluate(StatementAdapter.java:36)
  at com.carrotsearch.randomizedtesting.rules.SystemPropertiesRestoreRule$1.evaluate(SystemPropertiesRestoreRule.java:57)
  at org.apache.lucene.util.AbstractBeforeAfterRule$1.evaluate(AbstractBeforeAfterRule.java:45)
  at com.carrotsearch.randomizedtesting.rules.StatementAdapter.evaluate(StatementAdapter.java:36)
  at org.apache.lucene.util.TestRuleStoreClassName$1.evaluate(TestRuleStoreClassName.java:41)
  at com.carrotsearch.randomizedtesting.rules.NoShadowingOrOverridesOnMethodsRule$1.evaluate(NoShadowingOrOverridesOnMethodsRule.java:40)
  at com.carrotsearch.randomizedtesting.rules.NoShadowingOrOverridesOnMethodsRule$1.evaluate(NoShadowingOrOverridesOnMethodsRule.java:40)
  at com.carrotsearch.randomizedtesting.rules.StatementAdapter.evaluate(StatementAdapter.java:36)
  at com.carrotsearch.randomizedtesting.rules.StatementAdapter.evaluate(StatementAdapter.java:36)
  at com.carrotsearch.randomizedtesting.rules.StatementAdapter.evaluate(StatementAdapter.java:36)
  at org.apache.lucene.util.TestRuleAssertionsRequired$1.evaluate(TestRuleAssertionsRequired.java:53)
  at org.apache.lucene.util.TestRuleMarkFailure$1.evaluate(TestRuleMarkFailure.java:47)
  at org.apache.lucene.util.TestRuleIgnoreAfterMaxFailures$1.evaluate(TestRuleIgnoreAfterMaxFailures.java:64)
  at org.apache.lucene.util.TestRuleIgnoreTestSuites$1.evaluate(TestRuleIgnoreTestSuites.java:54)
  at com.carrotsearch.randomizedtesting.rules.StatementAdapter.evaluate(StatementAdapter.java:36)
  at com.carrotsearch.randomizedtesting.ThreadLeakControl$StatementRunner.run(ThreadLeakControl.java:367)
  at java.lang.Thread.run(Thread.java:745)




Build Log:
[...truncated 11367 lines...]
    [junit4] Suite: org.apache.solr.cloud.CdcrVersionReplicationTest
    [junit4] 2> Creating dataDir: C:\Users\jenkins\workspace\Lucene-Solr-master-Windows\solr\build\solr-core\test\J1\temp\solr.cloud.CdcrVersionReplicationTest_F29067D0C63F3C3-001\init-core-data-001
    [junit4] 2> 1216016 INFO (SUITE-CdcrVersionReplicationTest-seed#[F29067D0C63F3C3]-worker) [ ] o.a.s.SolrTestCaseJ4 Randomized ssl (false) and clientAuth (false) via: @org.apache.solr.util.RandomizeSSL(reason=, value=NaN, ssl=NaN, clientAuth=NaN)
    [junit4] 2> 1216016 INFO (SUITE-CdcrVersionReplicationTest-seed#[F29067D0C63F3C3]-worker) [ ] o.a.s.BaseDistributedSearchTestCase Setting hostContext system property: /
    [junit4] 2> 1216021 INFO (TEST-CdcrVersionReplicationTest.testCdcrDocVersions-seed#[F29067D0C63F3C3]) [ ] o.a.s.c.ZkTestServer STARTING ZK TEST SERVER
    [junit4] 2> 1216026 INFO (Thread-3223) [ ] o.a.s.c.ZkTestServer client port:0.0.0.0/0.0.0.0:0
    [junit4] 2> 1216026 INFO (Thread-3223) [ ] o.a.s.c.ZkTestServer Starting server
    [junit4] 2> 1216123 INFO (TEST-CdcrVersionReplicationTest.testCdcrDocVersions-seed#[F29067D0C63F3C3]) [ ] o.a.s.c.ZkTestServer start zk server on port:54239
    [junit4] 2> 1216127 INFO (TEST-CdcrVersionReplicationTest.testCdcrDocVersions-seed#[F29067D0C63F3C3]) [ ] o.a.s.c.c.SolrZkClient Using default ZkCredentialsProvider
    [junit4] 2> 1216129 INFO (TEST-CdcrVersionReplicationTest.testCdcrDocVersions-seed#[F29067D0C63F3C3]) [ ] o.a.s.c.c.ConnectionManager Waiting for client to connect to ZooKeeper
    [junit4] 2> 1216141 INFO (zkCallback-1760-thread-1) [ ] o.a.s.c.c.ConnectionManager Watcher org.apache.solr.common.cloud.ConnectionManager@2d9bff name:ZooKeeperConnection Watcher:127.0.0.1:54239 got event WatchedEvent state:SyncConnected type:None path:null path:null type:None
    [junit4] 2> 1216141 INFO (TEST-CdcrVersionReplicationTest.testCdcrDocVersions-seed#[F29067D0C63F3C3]) [ ] o.a.s.c.c.ConnectionManager Client is connected to ZooKeeper
    [junit4] 2> 1216141 INFO (TEST-CdcrVersionReplicationTest.testCdcrDocVersions-seed#[F29067D0C63F3C3]) [ ] o.a.s.c.c.SolrZkClient Using default ZkACLProvider
    [junit4] 2> 1216142 INFO (TEST-CdcrVersionReplicationTest.testCdcrDocVersions-seed#[F29067D0C63F3C3]) [ ] o.a.s.c.c.SolrZkClient makePath: /solr
    [junit4] 2> 1216161 INFO (TEST-CdcrVersionReplicationTest.testCdcrDocVersions-seed#[F29067D0C63F3C3]) [ ] o.a.s.c.c.SolrZkClient Using default ZkCredentialsProvider
    [junit4] 2> 1216166 INFO (TEST-CdcrVersionReplicationTest.testCdcrDocVersions-seed#[F29067D0C63F3C3]) [ ] o.a.s.c.c.ConnectionManager Waiting for client to connect to ZooKeeper
    [junit4] 2> 1216171 INFO (zkCallback-1761-thread-1) [ ] o.a.s.c.c.ConnectionManager Watcher org.apache.solr.common.cloud.ConnectionManager@1a32b8 name:ZooKeeperConnection Watcher:127.0.0.1:54239/solr got event WatchedEvent state:SyncConnected type:None path:null path:null type:None
    [junit4] 2> 1216171 INFO (TEST-CdcrVersionReplicationTest.testCdcrDocVersions-seed#[F29067D0C63F3C3]) [ ] o.a.s.c.c.ConnectionManager Client is connected to ZooKeeper
    [junit4] 2> 1216171 INFO (TEST-CdcrVersionReplicationTest.testCdcrDocVersions-seed#[F29067D0C63F3C3]) [ ] o.a.s.c.c.SolrZkClient Using default ZkACLProvider
    [junit4] 2> 1216171 INFO (TEST-CdcrVersionReplicationTest.testCdcrDocVersions-seed#[F29067D0C63F3C3]) [ ] o.a.s.c.c.SolrZkClient makePath: /collections/collection1
    [junit4] 2> 1216176 INFO (TEST-CdcrVersionReplicationTest.testCdcrDocVersions-seed#[F29067D0C63F3C3]) [ ] o.a.s.c.c.SolrZkClient makePath: /collections/collection1/shards
    [junit4] 2> 1216180 INFO (TEST-CdcrVersionReplicationTest.testCdcrDocVersions-seed#[F29067D0C63F3C3]) [ ] o.a.s.c.c.SolrZkClient makePath: /collections/control_collection
    [junit4] 2> 1216182 INFO (TEST-CdcrVersionReplicationTest.testCdcrDocVersions-seed#[F29067D0C63F3C3]) [ ] o.a.s.c.c.SolrZkClient makePath: /collections/control_collection/shards
    [junit4] 2> 1216186 INFO (TEST-CdcrVersionReplicationTest.testCdcrDocVersions-seed#[F29067D0C63F3C3]) [ ] o.a.s.c.AbstractZkTestCase put C:\Users\jenkins\workspace\Lucene-Solr-master-Windows\solr\core\src\test-files\solr\collection1\conf\solrconfig-cdcr.xml to /configs/conf1/solrconfig.xml
    [junit4] 2> 1216186 INFO (TEST-CdcrVersionReplicationTest.testCdcrDocVersions-seed#[F29067D0C63F3C3]) [ ] o.a.s.c.c.SolrZkClient makePath: /configs/conf1/solrconfig.xml
    [junit4] 2> 1216192 INFO (TEST-CdcrVersionReplicationTest.testCdcrDocVersions-seed#[F29067D0C63F3C3]) [ ] o.a.s.c.AbstractZkTestCase put C:\Users\jenkins\workspace\Lucene-Solr-master-Windows\solr\core\src\test-files\solr\collection1\conf\schema15.xml to /configs/conf1/schema.xml
    [junit4] 2> 1216192 INFO (TEST-CdcrVersionReplicationTest.testCdcrDocVersions-seed#[F29067D0C63F3C3]) [ ] o.a.s.c.c.SolrZkClient makePath: /configs/conf1/schema.xml
    [junit4] 2> 1216197 INFO (TEST-CdcrVersionReplicationTest.testCdcrDocVersions-seed#[F29067D0C63F3C3]) [ ] o.a.s.c.AbstractZkTestCase put C:\Users\jenkins\workspace\Lucene-Solr-master-Windows\solr\core\src\test-files\solr\collection1\conf\solrconfig.snippet.randomindexconfig.xml to /configs/conf1/solrconfig.snippet.randomindexconfig.xml
    [junit4] 2> 1216197 INFO (TEST-CdcrVersionReplicationTest.testCdcrDocVersions-seed#[F29067D0C63F3C3]) [ ] o.a.s.c.c.SolrZkClient makePath: /configs/conf1/solrconfig.snippet.randomindexconfig.xml
    [junit4] 2> 1216206 INFO (TEST-CdcrVersionReplicationTest.testCdcrDocVersions-seed#[F29067D0C63F3C3]) [ ] o.a.s.c.AbstractZkTestCase put C:\Users\jenkins\workspace\Lucene-Solr-master-Windows\solr\core\src\test-files\solr\collection1\conf\stopwords.txt to /configs/conf1/stopwords.txt
    [junit4] 2> 1216206 INFO (TEST-CdcrVersionReplicationTest.testCdcrDocVersions-seed#[F29067D0C63F3C3]) [ ] o.a.s.c.c.SolrZkClient makePath: /configs/conf1/stopwords.txt
    [junit4] 2> 1216211 INFO (TEST-CdcrVersionReplicationTest.testCdcrDocVersions-seed#[F29067D0C63F3C3]) [ ] o.a.s.c.AbstractZkTestCase put C:\Users\jenkins\workspace\Lucene-Solr-master-Windows\solr\core\src\test-files\solr\collection1\conf\protwords.txt to /configs/conf1/protwords.txt
    [junit4] 2> 1216211 INFO (TEST-CdcrVersionReplicationTest.testCdcrDocVersions-seed#[F29067D0C63F3C3]) [ ] o.a.s.c.c.SolrZkClient makePath: /configs/conf1/protwords.txt
    [junit4] 2> 1216214 INFO (TEST-CdcrVersionReplicationTest.testCdcrDocVersions-seed#[F29067D0C63F3C3]) [ ] o.a.s.c.AbstractZkTestCase put C:\Users\jenkins\workspace\Lucene-Solr-master-Windows\solr\core\src\test-files\solr\collection1\conf\currency.xml to /configs/conf1/currency.xml
    [junit4] 2> 1216215 INFO (TEST-CdcrVersionReplicationTest.testCdcrDocVersions-seed#[F29067D0C63F3C3]) [ ] o.a.s.c.c.SolrZkClient makePath: /configs/conf1/currency.xml
    [junit4] 2> 1216218 INFO (TEST-CdcrVersionReplicationTest.testCdcrDocVersions-seed#[F29067D0C63F3C3]) [ ] o.a.s.c.AbstractZkTestCase put C:\Users\jenkins\workspace\Lucene-Solr-master-Windows\solr\core\src\test-files\solr\collection1\conf\enumsConfig.xml to /configs/conf1/enumsConfig.xml
    [junit4] 2> 1216218 INFO (TEST-CdcrVersionReplicationTest.testCdcrDocVersions-seed#[F29067D0C63F3C3]) [ ] o.a.s.c.c.SolrZkClient makePath: /configs/conf1/enumsConfig.xml
    [junit4] 2> 1216221 INFO (TEST-CdcrVersionReplicationTest.testCdcrDocVersions-seed#[F29067D0C63F3C3]) [ ] o.a.s.c.AbstractZkTestCase put C:\Users\jenkins\workspace\Lucene-Solr-master-Windows\solr\core\src\test-files\solr\collection1\conf\open-exchange-rates.json to /configs/conf1/open-exchange-rates.json
    [junit4] 2> 1216221 INFO (TEST-CdcrVersionReplicationTest.testCdcrDocVersions-seed#[F29067D0C63F3C3]) [ ] o.a.s.c.c.SolrZkClient makePath: /configs/conf1/open-exchange-rates.json
    [junit4] 2> 1216225 INFO (TEST-CdcrVersionReplicationTest.testCdcrDocVersions-seed#[F29067D0C63F3C3]) [ ] o.a.s.c.AbstractZkTestCase put C:\Users\jenkins\workspace\Lucene-Solr-master-Windows\solr\core\src\test-files\solr\collection1\conf\mapping-ISOLatin1Accent.txt to /configs/conf1/mapping-ISOLatin1Accent.txt
    [junit4] 2> 1216226 INFO (TEST-CdcrVersionReplicationTest.testCdcrDocVersions-seed#[F29067D0C63F3C3]) [ ] o.a.s.c.c.SolrZkClient makePath: /configs/conf1/mapping-ISOLatin1Accent.txt
    [junit4] 2> 1216228 INFO (TEST-CdcrVersionReplicationTest.testCdcrDocVersions-seed#[F29067D0C63F3C3]) [ ] o.a.s.c.AbstractZkTestCase put C:\Users\jenkins\workspace\Lucene-Solr-master-Windows\solr\core\src\test-files\solr\collection1\conf\old_synonyms.txt to /configs/conf1/old_synonyms.txt
    [junit4] 2> 1216229 INFO (TEST-CdcrVersionReplicationTest.testCdcrDocVersions-seed#[F29067D0C63F3C3]) [ ] o.a.s.c.c.SolrZkClient makePath: /configs/conf1/old_synonyms.txt
    [junit4] 2> 1216232 INFO (TEST-CdcrVersionReplicationTest.testCdcrDocVersions-seed#[F29067D0C63F3C3]) [ ] o.a.s.c.AbstractZkTestCase put C:\Users\jenkins\workspace\Lucene-Solr-master-Windows\solr\core\src\test-files\solr\collection1\conf\synonyms.txt to /configs/conf1/synonyms.txt
    [junit4] 2> 1216232 INFO (TEST-CdcrVersionReplicationTest.testCdcrDocVersions-seed#[F29067D0C63F3C3]) [ ] o.a.s.c.c.SolrZkClient makePath: /configs/conf1/synonyms.txt
    [junit4] 2> 1216239 INFO (TEST-CdcrVersionReplicationTest.testCdcrDocVersions-seed#[F29067D0C63F3C3]) [ ] o.a.s.SolrTestCaseJ4 ###Starting testCdcrDocVersions
    [junit4] 2> 1216830 INFO (TEST-CdcrVersionReplicationTest.testCdcrDocVersions-seed#[F29067D0C63F3C3]) [ ] o.a.s.SolrTestCaseJ4 Writing core.properties file to C:\Users\jenkins\workspace\Lucene-Solr-master-Windows\solr\build\solr-core\test\J1\temp\solr.cloud.CdcrVersionReplicationTest_F29067D0C63F3C3-001\jetty-001\cores\collection1
    [junit4] 2> 1216833 INFO (TEST-CdcrVersionReplicationTest.testCdcrDocVersions-seed#[F29067D0C63F3C3]) [ ] o.e.j.s.Server jetty-9.3.8.v20160314
    [junit4] 2> 1216834 INFO (TEST-CdcrVersionReplicationTest.testCdcrDocVersions-seed#[F29067D0C63F3C3]) [ ] o.e.j.s.h.ContextHandler Started o.e.j.s.ServletContextHandler@4c51e6{/,null,AVAILABLE}
    [junit4] 2> 1216835 INFO (TEST-CdcrVersionReplicationTest.testCdcrDocVersions-seed#[F29067D0C63F3C3]) [ ] o.e.j.s.ServerConnector Started ServerConnector@a1728a{HTTP/1.1,[http/1.1]}{127.0.0.1:54246}
    [junit4] 2> 1216836 INFO (TEST-CdcrVersionReplicationTest.testCdcrDocVersions-seed#[F29067D0C63F3C3]) [ ] o.e.j.s.Server Started @1222998ms
    [junit4] 2> 1216836 INFO (TEST-CdcrVersionReplicationTest.testCdcrDocVersions-seed#[F29067D0C63F3C3]) [ ] o.a.s.c.s.e.JettySolrRunner Jetty properties: {shards=shard1, hostContext=/, hostPort=54246, coreRootDirectory=C:\Users\jenkins\workspace\Lucene-Solr-master-Windows\solr\build\solr-core\test\J1\temp\solr.cloud.CdcrVersionReplicationTest_F29067D0C63F3C3-001\jetty-001\cores}
    [junit4] 2> 1216836 INFO (TEST-CdcrVersionReplicationTest.testCdcrDocVersions-seed#[F29067D0C63F3C3]) [ ] o.a.s.s.SolrDispatchFilter SolrDispatchFilter.init(): sun.misc.Launcher$AppClassLoader@1d16e93
    [junit4] 2> 1216836 INFO (TEST-CdcrVersionReplicationTest.testCdcrDocVersions-seed#[F29067D0C63F3C3]) [ ] o.a.s.c.SolrResourceLoader new SolrResourceLoader for directory: 'C:\Users\jenkins\workspace\Lucene-Solr-master-Windows\solr\build\solr-core\test\J1\temp\solr.cloud.CdcrVersionReplicationTest_F29067D0C63F3C3-001\jetty-001'
    [junit4] 2> 1216837 INFO (TEST-CdcrVersionReplicationTest.testCdcrDocVersions-seed#[F29067D0C63F3C3]) [ ] o.a.s.c.SolrResourceLoader JNDI not configured for solr (NoInitialContextEx)
    [junit4] 2> 1216837 INFO (TEST-CdcrVersionReplicationTest.testCdcrDocVersions-seed#[F29067D0C63F3C3]) [ ] o.a.s.c.SolrResourceLoader solr home defaulted to 'solr/' (could not find system property or JNDI)
    [junit4] 2> 1216838 INFO (TEST-CdcrVersionReplicationTest.testCdcrDocVersions-seed#[F29067D0C63F3C3]) [ ] o.a.s.c.c.SolrZkClient Using default ZkCredentialsProvider
    [junit4] 2> 1216839 INFO (TEST-CdcrVersionReplicationTest.testCdcrDocVersions-seed#[F29067D0C63F3C3]) [ ] o.a.s.c.c.ConnectionManager Waiting for client to connect to ZooKeeper
    [junit4] 2> 1216840 INFO (zkCallback-1762-thread-1) [ ] o.a.s.c.c.ConnectionManager Watcher org.apache.solr.common.cloud.ConnectionManager@48adb4 name:ZooKeeperConnection Watcher:127.0.0.1:54239/solr got event WatchedEvent state:SyncConnected type:None path:null path:null type:None
    [junit4] 2> 1216840 INFO (TEST-CdcrVersionReplicationTest.testCdcrDocVersions-seed#[F29067D0C63F3C3]) [ ] o.a.s.c.c.ConnectionManager Client is connected to ZooKeeper
    [junit4] 2> 1216841 INFO (TEST-CdcrVersionReplicationTest.testCdcrDocVersions-seed#[F29067D0C63F3C3]) [ ] o.a.s.c.c.SolrZkClient Using default ZkACLProvider
    [junit4] 2> 1216843 INFO (TEST-CdcrVersionReplicationTest.testCdcrDocVersions-seed#[F29067D0C63F3C3]) [ ] o.a.s.s.SolrDispatchFilter Loading solr.xml from SolrHome (not found in ZooKeeper)
    [junit4] 2> 1216843 INFO (TEST-CdcrVersionReplicationTest.testCdcrDocVersions-seed#[F29067D0C63F3C3]) [ ] o.a.s.c.SolrXmlConfig Loading container configuration from C:\Users\jenkins\workspace\Lucene-Solr-master-Windows\solr\build\solr-core\test\J1\temp\solr.cloud.CdcrVersionReplicationTest_F29067D0C63F3C3-001\jetty-001\solr.xml
    [junit4] 2> 1216855 INFO (TEST-CdcrVersionReplicationTest.testCdcrDocVersions-seed#[F29067D0C63F3C3]) [ ] o.a.s.c.CorePropertiesLocator Config-defined core root directory: C:\Users\jenkins\workspace\Lucene-Solr-master-Windows\solr\build\solr-core\test\J1\temp\solr.cloud.CdcrVersionReplicationTest_F29067D0C63F3C3-001\jetty-001\cores
    [junit4] 2> 1216855 INFO (TEST-CdcrVersionReplicationTest.testCdcrDocVersions-seed#[F29067D0C63F3C3]) [ ] o.a.s.c.CoreContainer New CoreContainer 22518317
    [junit4] 2> 1216855 INFO (TEST-CdcrVersionReplicationTest.testCdcrDocVersions-seed#[F29067D0C63F3C3]) [ ] o.a.s.c.CoreContainer Loading cores into CoreContainer [instanceDir=C:\Users\jenkins\workspace\Lucene-Solr-master-Windows\solr\build\solr-core\test\J1\temp\solr.cloud.CdcrVersionReplicationTest_F29067D0C63F3C3-001\jetty-001]
    [junit4] 2> 1216855 WARN (TEST-CdcrVersionReplicationTest.testCdcrDocVersions-seed#[F29067D0C63F3C3]) [ ] o.a.s.c.CoreContainer Couldn't add files from C:\Users\jenkins\workspace\Lucene-Solr-master-Windows\solr\build\solr-core\test\J1\temp\solr.cloud.CdcrVersionReplicationTest_F29067D0C63F3C3-001\jetty-001\lib to classpath: C:\Users\jenkins\workspace\Lucene-Solr-master-Windows\solr\build\solr-core\test\J1\temp\solr.cloud.CdcrVersionReplicationTest_F29067D0C63F3C3-001\jetty-001\lib
    [junit4] 2> 1216857 INFO (TEST-CdcrVersionReplicationTest.testCdcrDocVersions-seed#[F29067D0C63F3C3]) [ ] o.a.s.h.c.HttpShardHandlerFactory created with socketTimeout : 90000,urlScheme : ,connTimeout : 15000,maxConnectionsPerHost : 20,maxConnections : 10000,corePoolSize : 0,maximumPoolSize : 2147483647,maxThreadIdleTime : 5,sizeOfQueue : -1,fairnessPolicy : false,
    [junit4] 2> 1216862 INFO (TEST-CdcrVersionReplicationTest.testCdcrDocVersions-seed#[F29067D0C63F3C3]) [ ] o.a.s.u.UpdateShardHandler Creating UpdateShardHandler HTTP client with params:
    [junit4] 2> 1216864 INFO (TEST-CdcrVersionReplicationTest.testCdcrDocVersions-seed#[F29067D0C63F3C3]) [ ] o.a.s.l.LogWatcher SLF4J impl is org.slf4j.impl.Log4jLoggerFactory
    [junit4] 2> 1216864 INFO (TEST-CdcrVersionReplicationTest.testCdcrDocVersions-seed#[F29067D0C63F3C3]) [ ] o.a.s.l.LogWatcher Registering Log Listener [Log4j (org.slf4j.impl.Log4jLoggerFactory)]
    [junit4] 2> 1216864 INFO (TEST-CdcrVersionReplicationTest.testCdcrDocVersions-seed#[F29067D0C63F3C3]) [ ] o.a.s.c.ZkContainer Zookeeper client=127.0.0.1:54239/solr
    [junit4] 2> 1216864 INFO (TEST-CdcrVersionReplicationTest.testCdcrDocVersions-seed#[F29067D0C63F3C3]) [ ] o.a.s.c.ZkController zkHost includes chroot
    [junit4] 2> 1216864 INFO (TEST-CdcrVersionReplicationTest.testCdcrDocVersions-seed#[F29067D0C63F3C3]) [ ] o.a.s.c.c.SolrZkClient Using default ZkCredentialsProvider
    [junit4] 2> 1216865 INFO (TEST-CdcrVersionReplicationTest.testCdcrDocVersions-seed#[F29067D0C63F3C3]) [ ] o.a.s.c.c.ConnectionManager Waiting for client to connect to ZooKeeper
    [junit4] 2> 1216867 INFO (zkCallback-1765-thread-1) [ ] o.a.s.c.c.ConnectionManager Watcher org.apache.solr.common.cloud.ConnectionManager@aaf2b7 name:ZooKeeperConnection Watcher:127.0.0.1:54239 got event WatchedEvent state:SyncConnected type:None path:null path:null type:None
    [junit4] 2> 1216867 INFO (TEST-CdcrVersionReplicationTest.testCdcrDocVersions-seed#[F29067D0C63F3C3]) [ ] o.a.s.c.c.ConnectionManager Client is connected to ZooKeeper
    [junit4] 2> 1216867 INFO (TEST-CdcrVersionReplicationTest.testCdcrDocVersions-seed#[F29067D0C63F3C3]) [ ] o.a.s.c.c.SolrZkClient Using default ZkACLProvider
    [junit4] 2> 1216870 INFO (TEST-CdcrVersionReplicationTest.testCdcrDocVersions-seed#[F29067D0C63F3C3]) [n:127.0.0.1:54246_ ] o.a.s.c.ZkController Added new OnReconnect listener org.apache.solr.cloud.ZkController$$Lambda$55/32534973@609246
    [junit4] 2> 1216871 INFO (TEST-CdcrVersionReplicationTest.testCdcrDocVersions-seed#[F29067D0C63F3C3]) [n:127.0.0.1:54246_ ] o.a.s.c.c.ConnectionManager Waiting for client to connect to ZooKeeper
    [junit4] 2> 1216874 INFO (zkCallback-1766-thread-1-processing-n:127.0.0.1:54246_) [n:127.0.0.1:54246_ ] o.a.s.c.c.ConnectionManager Watcher org.apache.solr.common.cloud.ConnectionManager@1c6b86a name:ZooKeeperConnection Watcher:127.0.0.1:54239/solr got event WatchedEvent state:SyncConnected type:None path:null path:null type:None
    [junit4] 2> 1216874 INFO (TEST-CdcrVersionReplicationTest.testCdcrDocVersions-seed#[F29067D0C63F3C3]) [n:127.0.0.1:54246_ ] o.a.s.c.c.ConnectionManager Client is connected to ZooKeeper
    [junit4] 2> 1216875 INFO (TEST-CdcrVersionReplicationTest.testCdcrDocVersions-seed#[F29067D0C63F3C3]) [n:127.0.0.1:54246_ ] o.a.s.c.c.SolrZkClient makePath: /overseer/queue
    [junit4] 2> 1216880 INFO (TEST-CdcrVersionReplicationTest.testCdcrDocVersions-seed#[F29067D0C63F3C3]) [n:127.0.0.1:54246_ ] o.a.s.c.c.SolrZkClient makePath: /overseer/collection-queue-work
    [junit4] 2> 1216884 INFO (TEST-CdcrVersionReplicationTest.testCdcrDocVersions-seed#[F29067D0C63F3C3]) [n:127.0.0.1:54246_ ] o.a.s.c.c.SolrZkClient makePath: /overseer/collection-map-running
    [junit4] 2> 1216887 INFO (TEST-CdcrVersionReplicationTest.testCdcrDocVersions-seed#[F29067D0C63F3C3]) [n:127.0.0.1:54246_ ] o.a.s.c.c.SolrZkClient makePath: /overseer/collection-map-completed
    [junit4] 2> 1216889 INFO (TEST-CdcrVersionReplicationTest.testCdcrDocVersions-seed#[F29067D0C63F3C3]) [n:127.0.0.1:54246_ ] o.a.s.c.c.SolrZkClient makePath: /overseer/collection-map-failure
    [junit4] 2> 1216890 INFO (TEST-CdcrVersionReplicationTest.testCdcrDocVersions-seed#[F29067D0C63F3C3]) [n:127.0.0.1:54246_ ] o.a.s.c.c.SolrZkClient makePath: /live_nodes
    [junit4] 2> 1216893 INFO (TEST-CdcrVersionReplicationTest.testCdcrDocVersions-seed#[F29067D0C63F3C3]) [n:127.0.0.1:54246_ ] o.a.s.c.c.SolrZkClient makePath: /aliases.json
    [junit4] 2> 1216896 INFO (TEST-CdcrVersionReplicationTest.testCdcrDocVersions-seed#[F29067D0C63F3C3]) [n:127.0.0.1:54246_ ] o.a.s.c.c.SolrZkClient makePath: /clusterstate.json
    [junit4] 2> 1216897 INFO (TEST-CdcrVersionReplicationTest.testCdcrDocVersions-seed#[F29067D0C63F3C3]) [n:127.0.0.1:54246_ ] o.a.s.c.c.SolrZkClient makePath: /security.json
    [junit4] 2> 1216898 INFO (TEST-CdcrVersionReplicationTest.testCdcrDocVersions-seed#[F29067D0C63F3C3]) [n:127.0.0.1:54246_ ] o.a.s.c.c.ZkStateReader Updating cluster state from ZooKeeper...
    [junit4] 2> 1216899 INFO (TEST-CdcrVersionReplicationTest.testCdcrDocVersions-seed#[F29067D0C63F3C3]) [n:127.0.0.1:54246_ ] o.a.s.c.c.ZkStateReader Loaded empty cluster properties
    [junit4] 2> 1216900 INFO (TEST-CdcrVersionReplicationTest.testCdcrDocVersions-seed#[F29067D0C63F3C3]) [n:127.0.0.1:54246_ ] o.a.s.c.c.ZkStateReader Updated live nodes from ZooKeeper... (0) -> (0)
    [junit4] 2> 1216905 INFO (TEST-CdcrVersionReplicationTest.testCdcrDocVersions-seed#[F29067D0C63F3C3]) [n:127.0.0.1:54246_ ] o.a.s.c.c.SolrZkClient makePath: /overseer_elect
    [junit4] 2> 1216908 INFO (TEST-CdcrVersionReplicationTest.testCdcrDocVersions-seed#[F29067D0C63F3C3]) [n:127.0.0.1:54246_ ] o.a.s.c.c.SolrZkClient makePath: /overseer_elect/election
    [junit4] 2> 1216910 INFO (TEST-CdcrVersionReplicationTest.testCdcrDocVersions-seed#[F29067D0C63F3C3]) [n:127.0.0.1:54246_ ] o.a.s.c.Overseer Overseer (id=null) closing
    [junit4] 2> 1216911 INFO (TEST-CdcrVersionReplicationTest.testCdcrDocVersions-seed#[F29067D0C63F3C3]) [n:127.0.0.1:54246_ ] o.a.s.c.LeaderElector Joined leadership election with path: /overseer_elect/election/96063468244107268-127.0.0.1:54246_-n_0000000000
    [junit4] 2> 1216912 INFO (TEST-CdcrVersionReplicationTest.testCdcrDocVersions-seed#[F29067D0C63F3C3]) [n:127.0.0.1:54246_ ] o.a.s.c.OverseerElectionContext I am going to be the leader 127.0.0.1:54246_
    [junit4] 2> 1216912 INFO (TEST-CdcrVersionReplicationTest.testCdcrDocVersions-seed#[F29067D0C63F3C3]) [n:127.0.0.1:54246_ ] o.a.s.c.c.SolrZkClient makePath: /overseer_elect/leader
    [junit4] 2> 1216914 INFO (TEST-CdcrVersionReplicationTest.testCdcrDocVersions-seed#[F29067D0C63F3C3]) [n:127.0.0.1:54246_ ] o.a.s.c.Overseer Overseer (id=96063468244107268-127.0.0.1:54246_-n_0000000000) starting
    [junit4] 2> 1216917 INFO (TEST-CdcrVersionReplicationTest.testCdcrDocVersions-seed#[F29067D0C63F3C3]) [n:127.0.0.1:54246_ ] o.a.s.c.c.SolrZkClient makePath: /overseer/queue-work
    [junit4] 2> 1216924 INFO (TEST-CdcrVersionReplicationTest.testCdcrDocVersions-seed#[F29067D0C63F3C3]) [n:127.0.0.1:54246_ ] o.a.s.c.OverseerAutoReplicaFailoverThread Starting OverseerAutoReplicaFailoverThread autoReplicaFailoverWorkLoopDelay=10000 autoReplicaFailoverWaitAfterExpiration=30000 autoReplicaFailoverBadNodeExpiration=60000
    [junit4] 2> 1216925 INFO (TEST-CdcrVersionReplicationTest.testCdcrDocVersions-seed#[F29067D0C63F3C3]) [n:127.0.0.1:54246_ ] o.a.s.c.ZkController Register node as live in ZooKeeper:/live_nodes/127.0.0.1:54246_
    [junit4] 2> 1216926 INFO (TEST-CdcrVersionReplicationTest.testCdcrDocVersions-seed#[F29067D0C63F3C3]) [n:127.0.0.1:54246_ ] o.a.s.c.c.SolrZkClient makePath: /live_nodes/127.0.0.1:54246_
    [junit4] 2> 1216927 INFO (OverseerStateUpdate-96063468244107268-127.0.0.1:54246_-n_0000000000) [n:127.0.0.1:54246_ ] o.a.s.c.Overseer Starting to work on the main queue
    [junit4] 2> 1216928 INFO (zkCallback-1766-thread-1-processing-n:127.0.0.1:54246_) [n:127.0.0.1:54246_ ] o.a.s.c.c.ZkStateReader A live node change: [WatchedEvent state:SyncConnected type:NodeChildrenChanged path:/live_nodes], has occurred - updating... (live nodes size: [0])
    [junit4] 2> 1216931 INFO (OverseerCollectionConfigSetProcessor-96063468244107268-127.0.0.1:54246_-n_0000000000) [n:127.0.0.1:54246_ ] o.a.s.c.OverseerTaskProcessor Process current queue of overseer operations
    [junit4] 2> 1216933 INFO (OverseerStateUpdate-96063468244107268-127.0.0.1:54246_-n_0000000000) [n:127.0.0.1:54246_ ] o.a.s.c.c.ZkStateReader Updated live nodes from ZooKeeper... (0) -> (1)
    [junit4] 2> 1216951 INFO (TEST-CdcrVersionReplicationTest.testCdcrDocVersions-seed#[F29067D0C63F3C3]) [n:127.0.0.1:54246_ ] o.a.s.c.CoreContainer Security conf doesn't exist. Skipping setup for authorization module.
    [junit4] 2> 1216951 INFO (TEST-CdcrVersionReplicationTest.testCdcrDocVersions-seed#[F29067D0C63F3C3]) [n:127.0.0.1:54246_ ] o.a.s.c.CoreContainer No authentication plugin used.
    [junit4] 2> 1216952 INFO (TEST-CdcrVersionReplicationTest.testCdcrDocVersions-seed#[F29067D0C63F3C3]) [n:127.0.0.1:54246_ ] o.a.s.c.CorePropertiesLocator Looking for core definitions underneath C:\Users\jenkins\workspace\Lucene-Solr-master-Windows\solr\build\solr-core\test\J1\temp\solr.cloud.CdcrVersionReplicationTest_F29067D0C63F3C3-001\jetty-001\cores
    [junit4] 2> 1216954 INFO (TEST-CdcrVersionReplicationTest.testCdcrDocVersions-seed#[F29067D0C63F3C3]) [n:127.0.0.1:54246_ ] o.a.s.c.CoreDescriptor Created CoreDescriptor: {name=collection1, config=solrconfig.xml, transient=false, schema=schema.xml, loadOnStartup=true, configSetProperties=configsetprops.json, collection=tmp_collection, coreNodeName=, dataDir=data\, shard=}
    [junit4] 2> 1216954 INFO (TEST-CdcrVersionReplicationTest.testCdcrDocVersions-seed#[F29067D0C63F3C3]) [n:127.0.0.1:54246_ ] o.a.s.c.CorePropertiesLocator Found core collection1 in C:\Users\jenkins\workspace\Lucene-Solr-master-Windows\solr\build\solr-core\test\J1\temp\solr.cloud.CdcrVersionReplicationTest_F29067D0C63F3C3-001\jetty-001\cores\collection1
    [junit4] 2> 1216954 INFO (TEST-CdcrVersionReplicationTest.testCdcrDocVersions-seed#[F29067D0C63F3C3]) [n:127.0.0.1:54246_ ] o.a.s.c.CorePropertiesLocator Found 1 core definitions
    [junit4] 2> 1216954 INFO (coreLoadExecutor-4434-thread-1-processing-n:127.0.0.1:54246_) [n:127.0.0.1:54246_ c:tmp_collection x:collection1] o.a.s.c.ZkController publishing state=down
    [junit4] 2> 1216954 INFO (coreLoadExecutor-4434-thread-1-processing-n:127.0.0.1:54246_) [n:127.0.0.1:54246_ c:tmp_collection x:collection1] o.a.s.c.ZkController numShards not found on descriptor - reading it from system property
    [junit4] 2> 1216955 INFO (TEST-CdcrVersionReplicationTest.testCdcrDocVersions-seed#[F29067D0C63F3C3]) [n:127.0.0.1:54246_ ] o.a.s.s.SolrDispatchFilter user.dir=C:\Users\jenkins\workspace\Lucene-Solr-master-Windows\solr\build\solr-core\test\J1
    [junit4] 2> 1216955 INFO (TEST-CdcrVersionReplicationTest.testCdcrDocVersions-seed#[F29067D0C63F3C3]) [n:127.0.0.1:54246_ ] o.a.s.s.SolrDispatchFilter SolrDispatchFilter.init() done
    [junit4] 2> 1216956 INFO (coreLoadExecutor-4434-thread-1-processing-n:127.0.0.1:54246_) [n:127.0.0.1:54246_ c:tmp_collection x:collection1] o.a.s.c.ZkController Collection tmp_collection not visible yet, but flagging it so a watch is registered when it becomes visible
    [junit4] 2> 1216957 INFO (OverseerStateUpdate-96063468244107268-127.0.0.1:54246_-n_0000000000) [n:127.0.0.1:54246_ ] o.a.s.c.Overseer processMessage: queueSize: 1, message = {
    [junit4] 2> "core":"collection1",
    [junit4] 2> "roles":null,
    [junit4] 2> "base_url":"http://127.0.0.1:54246",
    [junit4] 2> "node_name":"127.0.0.1:54246_",
    [junit4] 2> "numShards":"2",
    [junit4] 2> "state":"down",
    [junit4] 2> "shard":null,
    [junit4] 2> "collection":"tmp_collection",
    [junit4] 2> "operation":"state"} current state version: 0
    [junit4] 2> 1216957 INFO (coreLoadExecutor-4434-thread-1-processing-n:127.0.0.1:54246_) [n:127.0.0.1:54246_ c:tmp_collection x:collection1] o.a.s.c.c.ZkStateReader Deleting data for [tmp_collection]
    [junit4] 2> 1216957 INFO (OverseerStateUpdate-96063468244107268-127.0.0.1:54246_-n_0000000000) [n:127.0.0.1:54246_ ] o.a.s.c.o.ReplicaMutator Update state numShards=2 message={
    [junit4] 2> "core":"collection1",
    [junit4] 2> "roles":null,
    [junit4] 2> "base_url":"http://127.0.0.1:54246",
    [junit4] 2> "node_name":"127.0.0.1:54246_",
    [junit4] 2> "numShards":"2",
    [junit4] 2> "state":"down",
    [junit4] 2> "shard":null,
    [junit4] 2> "collection":"tmp_collection",
    [junit4] 2> "operation":"state"}
    [junit4] 2> 1216957 INFO (OverseerStateUpdate-96063468244107268-127.0.0.1:54246_-n_0000000000) [n:127.0.0.1:54246_ ] o.a.s.c.o.ClusterStateMutator building a new cName: tmp_collection
    [junit4] 2> 1216957 INFO (OverseerStateUpdate-96063468244107268-127.0.0.1:54246_-n_0000000000) [n:127.0.0.1:54246_ ] o.a.s.c.o.ReplicaMutator Assigning new node to shard shard=shard2
    [junit4] 2> 1216958 INFO (coreLoadExecutor-4434-thread-1-processing-n:127.0.0.1:54246_) [n:127.0.0.1:54246_ c:tmp_collection x:collection1] o.a.s.c.ZkController look for our core node name
    [junit4] 2> 1216958 INFO (zkCallback-1766-thread-1-processing-n:127.0.0.1:54246_) [n:127.0.0.1:54246_ ] o.a.s.c.c.ZkStateReader A cluster state change: [WatchedEvent state:SyncConnected type:NodeDataChanged path:/clusterstate.json], has occurred - updating... (live nodes size: [1])
    [junit4] 2> 1217959 INFO (coreLoadExecutor-4434-thread-1-processing-n:127.0.0.1:54246_) [n:127.0.0.1:54246_ c:tmp_collection x:collection1] o.a.s.c.ZkController waiting to find shard id in clusterstate for collection1
    [junit4] 2> 1217959 INFO (coreLoadExecutor-4434-thread-1-processing-n:127.0.0.1:54246_) [n:127.0.0.1:54246_ c:tmp_collection x:collection1] o.a.s.c.ZkController Check for collection zkNode:tmp_collection
    [junit4] 2> 1217960 INFO (coreLoadExecutor-4434-thread-1-processing-n:127.0.0.1:54246_) [n:127.0.0.1:54246_ c:tmp_collection x:collection1] o.a.s.c.ZkController Creating collection in ZooKeeper:tmp_collection
    [junit4] 2> 1217960 INFO (coreLoadExecutor-4434-thread-1-processing-n:127.0.0.1:54246_) [n:127.0.0.1:54246_ c:tmp_collection x:collection1] o.a.s.c.ZkController Looking for collection configName
    [junit4] 2> 1217965 INFO (coreLoadExecutor-4434-thread-1-processing-n:127.0.0.1:54246_) [n:127.0.0.1:54246_ c:tmp_collection x:collection1] o.a.s.c.ZkController Only one config set found in zk - using it:conf1
    [junit4] 2> 1217965 INFO (coreLoadExecutor-4434-thread-1-processing-n:127.0.0.1:54246_) [n:127.0.0.1:54246_ c:tmp_collection x:collection1] o.a.s.c.c.SolrZkClient makePath: /collections/tmp_collection
    [junit4] 2> 1217967 INFO (zkCallback-1766-thread-1-processing-n:127.0.0.1:54246_) [n:127.0.0.1:54246_ ] o.a.s.c.c.ZkStateReader A collections change: [WatchedEvent state:SyncConnected type:NodeChildrenChanged path:/collections], has occurred - updating...
    [junit4] 2> 1217969 INFO (coreLoadExecutor-4434-thread-1-processing-n:127.0.0.1:54246_) [n:127.0.0.1:54246_ c:tmp_collection x:collection1] o.a.s.c.c.ZkStateReader Load collection config from: [/collections/tmp_collection]
    [junit4] 2> 1217969 INFO (coreLoadExecutor-4434-thread-1-processing-n:127.0.0.1:54246_) [n:127.0.0.1:54246_ c:tmp_collection x:collection1] o.a.s.c.c.ZkStateReader path=[/collections/tmp_collection] [configName]=[conf1] specified config exists in ZooKeeper
    [junit4] 2> 1217969 INFO (coreLoadExecutor-4434-thread-1-processing-n:127.0.0.1:54246_) [n:127.0.0.1:54246_ c:tmp_collection x:collection1] o.a.s.c.SolrResourceLoader new SolrResourceLoader for directory: 'C:\Users\jenkins\workspace\Lucene-Solr-master-Windows\solr\build\solr-core\test\J1\temp\solr.cloud.CdcrVersionReplicationTest_F29067D0C63F3C3-001\jetty-001\cores\collection1'
    [junit4] 2> 1217970 INFO (coreLoadExecutor-4434-thread-1-processing-n:127.0.0.1:54246_) [n:127.0.0.1:54246_ c:tmp_collection x:collection1] o.a.s.c.SolrResourceLoader JNDI not configured for solr (NoInitialContextEx)
    [junit4] 2> 1217970 INFO (coreLoadExecutor-4434-thread-1-processing-n:127.0.0.1:54246_) [n:127.0.0.1:54246_ c:tmp_collection x:collection1] o.a.s.c.SolrResourceLoader solr home defaulted to 'solr/' (could not find system property or JNDI)
    [junit4] 2> 1217972 INFO (coreLoadExecutor-4434-thread-1-processing-n:127.0.0.1:54246_) [n:127.0.0.1:54246_ c:tmp_collection x:collection1] o.a.s.c.Config loaded config solrconfig.xml with version 0
    [junit4] 2> 1217982 INFO (coreLoadExecutor-4434-thread-1-processing-n:127.0.0.1:54246_) [n:127.0.0.1:54246_ c:tmp_collection x:collection1] o.a.s.c.SolrConfig current version of requestparams : -1
    [junit4] 2> 1217984 WARN (coreLoadExecutor-4434-thread-1-processing-n:127.0.0.1:54246_) [n:127.0.0.1:54246_ c:tmp_collection x:collection1] o.a.s.c.Config Beginning with Solr 5.5, <mergePolicy> is deprecated, use <mergePolicyFactory> instead.
    [junit4] 2> 1217984 INFO (coreLoadExecutor-4434-thread-1-processing-n:127.0.0.1:54246_) [n:127.0.0.1:54246_ c:tmp_collection x:collection1] o.a.s.c.SolrConfig Using Lucene MatchVersion: 7.0.0
    [junit4] 2> 1217989 INFO (coreLoadExecutor-4434-thread-1-processing-n:127.0.0.1:54246_) [n:127.0.0.1:54246_ c:tmp_collection x:collection1] o.a.s.c.SolrConfig Loaded SolrConfig: solrconfig.xml
    [junit4] 2> 1217995 INFO (coreLoadExecutor-4434-thread-1-processing-n:127.0.0.1:54246_) [n:127.0.0.1:54246_ c:tmp_collection x:collection1] o.a.s.s.IndexSchema [collection1] Schema name=test
    [junit4] 2> 1218059 INFO (coreLoadExecutor-4434-thread-1-processing-n:127.0.0.1:54246_) [n:127.0.0.1:54246_ c:tmp_collection x:collection1] o.a.s.s.IndexSchema default search field in schema is text
    [junit4] 2> 1218060 INFO (coreLoadExecutor-4434-thread-1-processing-n:127.0.0.1:54246_) [n:127.0.0.1:54246_ c:tmp_collection x:collection1] o.a.s.s.IndexSchema unique key field: id
    [junit4] 2> 1218060 INFO (coreLoadExecutor-4434-thread-1-processing-n:127.0.0.1:54246_) [n:127.0.0.1:54246_ c:tmp_collection x:collection1] o.a.s.s.FileExchangeRateProvider Reloading exchange rates from file currency.xml
    [junit4] 2> 1218064 INFO (coreLoadExecutor-4434-thread-1-processing-n:127.0.0.1:54246_) [n:127.0.0.1:54246_ c:tmp_collection x:collection1] o.a.s.s.FileExchangeRateProvider Reloading exchange rates from file currency.xml
    [junit4] 2> 1218093 INFO (coreLoadExecutor-4434-thread-1-processing-n:127.0.0.1:54246_) [n:127.0.0.1:54246_ c:tmp_collection x:collection1] o.a.s.c.ConfigSetProperties Did not find ConfigSet properties, assuming default properties: Can't find resource 'configsetprops.json' in classpath or '/configs/conf1', cwd=C:\Users\jenkins\workspace\Lucene-Solr-master-Windows\solr\build\solr-core\test\J1
    [junit4] 2> 1218093 INFO (coreLoadExecutor-4434-thread-1-processing-n:127.0.0.1:54246_) [n:127.0.0.1:54246_ c:tmp_collection x:collection1] o.a.s.c.CoreContainer Creating SolrCore 'collection1' using configuration from collection tmp_collection
    [junit4] 2> 1218093 INFO (coreLoadExecutor-4434-thread-1-processing-n:127.0.0.1:54246_) [n:127.0.0.1:54246_ c:tmp_collection s:shard2 r:core_node1 x:collection1] o.a.s.c.SolrCore org.apache.solr.core.MockDirectoryFactory
    [junit4] 2> 1218093 INFO (coreLoadExecutor-4434-thread-1-processing-n:127.0.0.1:54246_) [n:127.0.0.1:54246_ c:tmp_collection s:shard2 r:core_node1 x:collection1] o.a.s.c.SolrCore [[collection1] ] Opening new SolrCore at [C:\Users\jenkins\workspace\Lucene-Solr-master-Windows\solr\build\solr-core\test\J1\temp\solr.cloud.CdcrVersionReplicationTest_F29067D0C63F3C3-001\jetty-001\cores\collection1], dataDir=[C:\Users\jenkins\workspace\Lucene-Solr-master-Windows\solr\build\solr-core\test\J1\temp\solr.cloud.CdcrVersionReplicationTest_F29067D0C63F3C3-001\jetty-001\cores\collection1\data\]
    [junit4] 2> 1218093 INFO (coreLoadExecutor-4434-thread-1-processing-n:127.0.0.1:54246_) [n:127.0.0.1:54246_ c:tmp_collection s:shard2 r:core_node1 x:collection1] o.a.s.c.JmxMonitoredMap JMX monitoring is enabled. Adding Solr mbeans to JMX Server: com.sun.jmx.mbeanserver.JmxMBeanServer@7e6ece
    [junit4] 2> 1218095 INFO (coreLoadExecutor-4434-thread-1-processing-n:127.0.0.1:54246_) [n:127.0.0.1:54246_ c:tmp_collection s:shard2 r:core_node1 x:collection1] o.a.s.c.CachingDirectoryFactory return new directory for C:\Users\jenkins\workspace\Lucene-Solr-master-Windows\solr\build\solr-core\test\J1\temp\solr.cloud.CdcrVersionReplicationTest_F29067D0C63F3C3-001\jetty-001\cores\collection1\data\
    [junit4] 2> 1218095 INFO (coreLoadExecutor-4434-thread-1-processing-n:127.0.0.1:54246_) [n:127.0.0.1:54246_ c:tmp_collection s:shard2 r:core_node1 x:collection1] o.a.s.c.SolrCore New index directory detected: old=null new=C:\Users\jenkins\workspace\Lucene-Solr-master-Windows\solr\build\solr-core\test\J1\temp\solr.cloud.CdcrVersionReplicationTest_F29067D0C63F3C3-001\jetty-001\cores\collection1\data\index/
    [junit4] 2> 1218095 WARN (coreLoadExecutor-4434-thread-1-processing-n:127.0.0.1:54246_) [n:127.0.0.1:54246_ c:tmp_collection s:shard2 r:core_node1 x:collection1] o.a.s.c.SolrCore [collection1] Solr index directory 'C:\Users\jenkins\workspace\Lucene-Solr-master-Windows\solr\build\solr-core\test\J1\temp\solr.cloud.CdcrVersionReplicationTest_F29067D0C63F3C3-001\jetty-001\cores\collection1\data\index' doesn't exist. Creating new index...
    [junit4] 2> 1218095 INFO (coreLoadExecutor-4434-thread-1-processing-n:127.0.0.1:54246_) [n:127.0.0.1:54246_ c:tmp_collection s:shard2 r:core_node1 x:collection1] o.a.s.c.CachingDirectoryFactory return new directory for C:\Users\jenkins\workspace\Lucene-Solr-master-Windows\solr\build\solr-core\test\J1\temp\solr.cloud.CdcrVersionReplicationTest_F29067D0C63F3C3-001\jetty-001\cores\collection1\data\index
    [junit4] 2> 1218096 INFO (coreLoadExecutor-4434-thread-1-processing-n:127.0.0.1:54246_) [n:127.0.0.1:54246_ c:tmp_collection s:shard2 r:core_node1 x:collection1] o.a.s.u.RandomMergePolicy RandomMergePolicy wrapping class org.apache.lucene.index.LogByteSizeMergePolicy: [LogByteSizeMergePolicy: minMergeSize=1677721, mergeFactor=13, maxMergeSize=2147483648, maxMergeSizeForForcedMerge=9223372036854775807, calibrateSizeByDeletes=true, maxMergeDocs=2147483647, maxCFSSegmentSizeMB=8.796093022207999E12, noCFSRatio=0.37967563377534297]
    [junit4] 2> 1218096 INFO (coreLoadExecutor-4434-thread-1-processing-n:127.0.0.1:54246_) [n:127.0.0.1:54246_ c:tmp_collection s:shard2 r:core_node1 x:collection1] o.a.s.c.SolrDeletionPolicy SolrDeletionPolicy.onCommit: commits: num=1
    [junit4] 2> commit{dir=MockDirectoryWrapper(RAMDirectory@6e39ad lockFactory=org.apache.lucene.store.SingleInstanceLockFactory@17d168e),segFN=segments_1,generation=1}
    [junit4] 2> 1218096 INFO (coreLoadExecutor-4434-thread-1-processing-n:127.0.0.1:54246_) [n:127.0.0.1:54246_ c:tmp_collection s:shard2 r:core_node1 x:collection1] o.a.s.c.SolrDeletionPolicy newest commit generation = 1
    [junit4] 2> 1218098 INFO (coreLoadExecutor-4434-thread-1-processing-n:127.0.0.1:54246_) [n:127.0.0.1:54246_ c:tmp_collection s:shard2 r:core_node1 x:collection1] o.a.s.u.p.UpdateRequestProcessorChain creating updateRequestProcessorChain "cdcr-processor-chain"
    [junit4] 2> 1218099 INFO (OldIndexDirectoryCleanupThreadForCore-collection1) [n:127.0.0.1:54246_ c:tmp_collection s:shard2 r:core_node1 x:collection1] o.a.s.c.SolrCore Looking for old index directories to cleanup for core collection1 in C:\Users\jenkins\workspace\Lucene-Solr-master-Windows\solr\build\solr-core\test\J1\temp\solr.cloud.CdcrVersionReplicationTest_F29067D0C63F3C3-001\jetty-001\cores\collection1\data\
    [junit4] 2> 1218099 WARN (OldIndexDirectoryCleanupThreadForCore-collection1) [n:127.0.0.1:54246_ c:tmp_collection s:shard2 r:core_node1 x:collection1] o.a.s.c.DirectoryFactory C:\Users\jenkins\workspace\Lucene-Solr-master-Windows\solr\build\solr-core\test\J1\temp\solr.cloud.CdcrVersionReplicationTest_F29067D0C63F3C3-001\jetty-001\cores\collection1\data\ does not point to a valid data directory; skipping clean-up of old index directories.
    [junit4] 2> 1218156 INFO (coreLoadExecutor-4434-thread-1-processing-n:127.0.0.1:54246_) [n:127.0.0.1:54246_ c:tmp_collection s:shard2 r:core_node1 x:collection1] o.a.s.c.SolrCore no updateRequestProcessorChain defined as default, creating implicit default
    [junit4] 2> 1218164 INFO (coreLoadExecutor-4434-thread-1-processing-n:127.0.0.1:54246_) [n:127.0.0.1:54246_ c:tmp_collection s:shard2 r:core_node1 x:collection1] o.a.s.h.l.XMLLoader xsltCacheLifetimeSeconds=60
    [junit4] 2> 1218166 INFO (coreLoadExecutor-4434-thread-1-processing-n:127.0.0.1:54246_) [n:127.0.0.1:54246_ c:tmp_collection s:shard2 r:core_node1 x:collection1] o.a.s.h.l.XMLLoader xsltCacheLifetimeSeconds=60
    [junit4] 2> 1218166 INFO (coreLoadExecutor-4434-thread-1-processing-n:127.0.0.1:54246_) [n:127.0.0.1:54246_ c:tmp_collection s:shard2 r:core_node1 x:collection1] o.a.s.h.l.XMLLoader xsltCacheLifetimeSeconds=60
    [junit4] 2> 1218168 INFO (coreLoadExecutor-4434-thread-1-processing-n:127.0.0.1:54246_) [n:127.0.0.1:54246_ c:tmp_collection s:shard2 r:core_node1 x:collection1] o.a.s.h.l.XMLLoader xsltCacheLifetimeSeconds=60
    [junit4] 2> 1218199 INFO (coreLoadExecutor-4434-thread-1-processing-n:127.0.0.1:54246_) [n:127.0.0.1:54246_ c:tmp_collection s:shard2 r:core_node1 x:collection1] o.a.s.c.RequestHandlers Registered paths: /admin/mbeans,standard,/update/json/docs,/admin/luke,/export,/get,/admin/properties,/update/json,/admin/threads,/update/csv,/sql,/graph,/admin/segments,/admin/system,/replication,/config,/stream,/schema,/admin/plugins,/admin/logging,/admin/ping,/cdcr,/update,/admin/file
    [junit4] 2> 1218199 INFO (coreLoadExecutor-4434-thread-1-processing-n:127.0.0.1:54246_) [n:127.0.0.1:54246_ c:tmp_collection s:shard2 r:core_node1 x:collection1] o.a.s.c.SolrCore Using default statsCache cache: org.apache.solr.search.stats.LocalStatsCache
    [junit4] 2> 1218234 INFO (coreLoadExecutor-4434-thread-1-processing-n:127.0.0.1:54246_) [n:127.0.0.1:54246_ c:tmp_collection s:shard2 r:core_node1 x:collection1] o.a.s.u.UpdateHandler Using UpdateLog implementation: org.apache.solr.update.CdcrUpdateLog
    [junit4] 2> 1218234 INFO (coreLoadExecutor-4434-thread-1-processing-n:127.0.0.1:54246_) [n:127.0.0.1:54246_ c:tmp_collection s:shard2 r:core_node1 x:collection1] o.a.s.u.UpdateLog Initializing UpdateLog: dataDir= defaultSyncLevel=FLUSH numRecordsToKeep=100 maxNumLogsToKeep=10 numVersionBuckets=65536
    [junit4] 2> 1218237 INFO (coreLoadExecutor-4434-thread-1-processing-n:127.0.0.1:54246_) [n:127.0.0.1:54246_ c:tmp_collection s:shard2 r:core_node1 x:collection1] o.a.s.u.CommitTracker Hard AutoCommit: disabled
    [junit4] 2> 1218237 INFO (coreLoadExecutor-4434-thread-1-processing-n:127.0.0.1:54246_) [n:127.0.0.1:54246_ c:tmp_collection s:shard2 r:core_node1 x:collection1] o.a.s.u.CommitTracker Soft AutoCommit: disabled
    [junit4] 2> 1218238 INFO (coreLoadExecutor-4434-thread-1-processing-n:127.0.0.1:54246_) [n:127.0.0.1:54246_ c:tmp_collection s:shard2 r:core_node1 x:collection1] o.a.s.u.RandomMergePolicy RandomMergePolicy wrapping class org.apache.lucene.index.TieredMergePolicy: [TieredMergePolicy: maxMergeAtOnce=10, maxMergeAtOnceExplicit=22, maxMergedSegmentMB=87.69140625, floorSegmentMB=0.4619140625, forceMergeDeletesPctAllowed=8.069848236184619, segmentsPerTier=31.0, maxCFSSegmentSizeMB=8.796093022207999E12, noCFSRatio=1.0
    [junit4] 2> 1218238 INFO (coreLoadExecutor-4434-thread-1-processing-n:127.0.0.1:54246_) [n:127.0.0.1:54246_ c:tmp_collection s:shard2 r:core_node1 x:collection1] o.a.s.c.SolrDeletionPolicy SolrDeletionPolicy.onInit: commits: num=1
    [junit4] 2> commit{dir=MockDirectoryWrapper(RAMDirectory@6e39ad lockFactory=org.apache.lucene.store.SingleInstanceLockFactory@17d168e),segFN=segments_1,generation=1}
    [junit4] 2> 1218238 INFO (coreLoadExecutor-4434-thread-1-processing-n:127.0.0.1:54246_) [n:127.0.0.1:54246_ c:tmp_collection s:shard2 r:core_node1 x:collection1] o.a.s.c.SolrDeletionPolicy newest commit generation = 1
    [junit4] 2> 1218238 INFO (coreLoadExecutor-4434-thread-1-processing-n:127.0.0.1:54246_) [n:127.0.0.1:54246_ c:tmp_collection s:shard2 r:core_node1 x:collection1] o.a.s.s.SolrIndexSearcher Opening [Searcher@1f13005[collection1] main]
    [junit4] 2> 1218238 INFO (coreLoadExecutor-4434-thread-1-processing-n:127.0.0.1:54246_) [n:127.0.0.1:54246_ c:tmp_collection s:shard2 r:core_node1 x:collection1] o.a.s.c.c.ZkStateReader Load collection config from: [/collections/tmp_collection]
    [junit4] 2> 1218240 INFO (coreLoadExecutor-4434-thread-1-processing-n:127.0.0.1:54246_) [n:127.0.0.1:54246_ c:tmp_collection s:shard2 r:core_node1 x:collection1] o.a.s.c.c.ZkStateReader path=[/collections/tmp_collection] [configName]=[conf1] specified config exists in ZooKeeper
    [junit4] 2> 1218240 INFO (coreLoadExecutor-4434-thread-1-processing-n:127.0.0.1:54246_) [n:127.0.0.1:54246_ c:tmp_collection s:shard2 r:core_node1 x:collection1] o.a.s.r.ManagedResourceStorage Setting up ZooKeeper-based storage for the RestManager with znodeBase: /configs/conf1
    [junit4] 2> 1218240 INFO (coreLoadExecutor-4434-thread-1-processing-n:127.0.0.1:54246_) [n:127.0.0.1:54246_ c:tmp_collection s:shard2 r:core_node1 x:collection1] o.a.s.r.ManagedResourceStorage Configured ZooKeeperStorageIO with znodeBase: /configs/conf1
    [junit4] 2> 1218240 INFO (coreLoadExecutor-4434-thread-1-processing-n:127.0.0.1:54246_) [n:127.0.0.1:54246_ c:tmp_collection s:shard2 r:core_node1 x:collection1] o.a.s.r.RestManager Initializing RestManager with initArgs: {}
    [junit4] 2> 1218240 INFO (coreLoadExecutor-4434-thread-1-processing-n:127.0.0.1:54246_) [n:127.0.0.1:54246_ c:tmp_collection s:shard2 r:core_node1 x:collection1] o.a.s.r.ManagedResourceStorage Reading _rest_managed.json using ZooKeeperStorageIO:path=/configs/conf1
    [junit4] 2> 1218241 INFO (coreLoadExecutor-4434-thread-1-processing-n:127.0.0.1:54246_) [n:127.0.0.1:54246_ c:tmp_collection s:shard2 r:core_node1 x:collection1] o.a.s.r.ManagedResourceStorage No data found for znode /configs/conf1/_rest_managed.json
    [junit4] 2> 1218241 INFO (coreLoadExecutor-4434-thread-1-processing-n:127.0.0.1:54246_) [n:127.0.0.1:54246_ c:tmp_collection s:shard2 r:core_node1 x:collection1] o.a.s.r.ManagedResourceStorage Loaded null at path _rest_managed.json using ZooKeeperStorageIO:path=/configs/conf1
    [junit4] 2> 1218241 INFO (coreLoadExecutor-4434-thread-1-processing-n:127.0.0.1:54246_) [n:127.0.0.1:54246_ c:tmp_collection s:shard2 r:core_node1 x:collection1] o.a.s.r.RestManager Initializing 0 registered ManagedResources
    [junit4] 2> 1218241 INFO (coreLoadExecutor-4434-thread-1-processing-n:127.0.0.1:54246_) [n:127.0.0.1:54246_ c:tmp_collection s:shard2 r:core_node1 x:collection1] o.a.s.h.ReplicationHandler Commits will be reserved for 10000
    [junit4] 2> 1218251 INFO (coreLoadExecutor-4434-thread-1-processing-n:127.0.0.1:54246_) [n:127.0.0.1:54246_ c:tmp_collection s:shard2 r:core_node1 x:collection1] o.a.s.c.c.SolrZkClient makePath: /collections/tmp_collection/cdcr/state
    [junit4] 2> 1218255 INFO (coreLoadExecutor-4434-thread-1-processing-n:127.0.0.1:54246_) [n:127.0.0.1:54246_ c:tmp_collection s:shard2 r:core_node1 x:collection1] o.a.s.h.CdcrBufferStateManager Created znode /collections/tmp_collection/cdcr/state/buffer
    [junit4] 2> 1218265 INFO (coreLoadExecutor-4434-thread-1-processing-n:127.0.0.1:54246_) [n:127.0.0.1:54246_ c:tmp_collection s:shard2 r:core_node1 x:collection1] o.a.s.h.CdcrProcessStateManager Created znode /collections/tmp_collection/cdcr/state/process
    [junit4] 2> 1218310 INFO (searcherExecutor-4435-thread-1-processing-n:127.0.0.1:54246_ x:collection1 s:shard2 c:tmp_collection r:core_node1) [n:127.0.0.1:54246_ c:tmp_collection s:shard2 r:core_node1 x:collection1] o.a.s.c.SolrCore [collection1] Registered new searcher Searcher@1f13005[collection1] main{ExitableDirectoryReader(UninvertingDirectoryReader())}
    [junit4] 2> 1218310 INFO (coreLoadExecutor-4434-thread-1-processing-n:127.0.0.1:54246_) [n:127.0.0.1:54246_ c:tmp_collection s:shard2 r:core_node1 x:collection1] o.a.s.u.UpdateLog Looking up max value of version field to seed version buckets
    [junit4] 2> 1218310 INFO (coreLoadExecutor-4434-thread-1-processing-n:127.0.0.1:54246_) [n:127.0.0.1:54246_ c:tmp_collection s:shard2 r:core_node1 x:collection1] o.a.s.u.VersionInfo Refreshing highest value of _version_ for 65536 version buckets from index
    [junit4] 2> 1218310 INFO (coreLoadExecutor-4434-thread-1-processing-n:127.0.0.1:54246_) [n:127.0.0.1:54246_ c:tmp_collection s:shard2 r:core_node1 x:collection1] o.a.s.u.VersionInfo No terms found for _version_, cannot seed version bucket highest value from index
    [junit4] 2> 1218310 INFO (coreLoadExecutor-4434-thread-1-processing-n:127.0.0.1:54246_) [n:127.0.0.1:54246_ c:tmp_collection s:shard2 r:core_node1 x:collection1] o.a.s.u.UpdateLog Could not find max version in index or recent updates, using new clock 1537015494291226624
    [junit4] 2> 1218312 INFO (coreLoadExecutor-4434-thread-1-processing-n:127.0.0.1:54246_) [n:127.0.0.1:54246_ c:tmp_collection s:shard2 r:core_node1 x:collection1] o.a.s.u.UpdateLog Took 2.0ms to seed version buckets with highest version 1537015494291226624
    [junit4] 2> 1218312 INFO (coreLoadExecutor-4434-thread-1-processing-n:127.0.0.1:54246_) [n:127.0.0.1:54246_ c:tmp_collection s:shard2 r:core_node1 x:collection1] o.a.s.c.ZkController watch zkdir /configs/conf1
    [junit4] 2> 1218313 INFO (coreLoadExecutor-4434-thread-1-processing-n:127.0.0.1:54246_) [n:127.0.0.1:54246_ c:tmp_collection s:shard2 r:core_node1 x:collection1] o.a.s.c.CoreContainer registering core: collection1
    [junit4] 2> 1218314 INFO (coreZkRegister-4428-thread-1-processing-n:127.0.0.1:54246_ x:collection1 s:shard2 c:tmp_collection r:core_node1) [n:127.0.0.1:54246_ c:tmp_collection s:shard2 r:core_node1 x:collection1] o.a.s.c.ZkController Register replica - core:collection1 address:http://127.0.0.1:54246 collection:tmp_collection shard:shard2
    [junit4] 2> 1218316 INFO (coreZkRegister-4428-thread-1-processing-n:127.0.0.1:54246_ x:collection1 s:shard2 c:tmp_collection r:core_node1) [n:127.0.0.1:54246_ c:tmp_collection s:shard2 r:core_node1 x:collection1] o.a.s.c.c.SolrZkClient makePath: /collections/tmp_collection/leader_elect/shard2/election
    [junit4] 2> 1218323 INFO (coreZkRegister-4428-thread-1-processing-n:127.0.0.1:54246_ x:collection1 s:shard2 c:tmp_collection r:core_node1) [n:127.0.0.1:54246_ c:tmp_collection s:shard2 r:core_node1 x:collection1] o.a.s.c.LeaderElector Joined leadership election with path: /collections/tmp_collection/leader_elect/shard2/election/96063468244107268-core_node1-n_0000000000
    [junit4] 2> 1218324 INFO (coreZkRegister-4428-thread-1-processing-n:127.0.0.1:54246_ x:collection1 s:shard2 c:tmp_collection r:core_node1) [n:127.0.0.1:54246_ c:tmp_collection s:shard2 r:core_node1 x:collection1] o.a.s.c.ShardLeaderElectionContext Running the leader process for shard=shard2 and weAreReplacement=false and leaderVoteWait=10000
    [junit4] 2> 1218327 INFO (coreZkRegister-4428-thread-1-processing-n:127.0.0.1:54246_ x:collection1 s:shard2 c:tmp_collection r:core_node1) [n:127.0.0.1:54246_ c:tmp_collection s:shard2 r:core_node1 x:collection1] o.a.s.c.ShardLeaderElectionContext Enough replicas found to continue.
    [junit4] 2> 1218327 INFO (coreZkRegister-4428-thread-1-processing-n:127.0.0.1:54246_ x:collection1 s:shard2 c:tmp_collection r:core_node1) [n:127.0.0.1:54246_ c:tmp_collection s:shard2 r:core_node1 x:collection1] o.a.s.c.ShardLeaderElectionContext I may be the new leader - try and sync
    [junit4] 2> 1218327 INFO (coreZkRegister-4428-thread-1-processing-n:127.0.0.1:54246_ x:collection1 s:shard2 c:tmp_collection r:core_node1) [n:127.0.0.1:54246_ c:tmp_collection s:shard2 r:core_node1 x:collection1] o.a.s.c.SyncStrategy Sync replicas to http://127.0.0.1:54246/collection1/
    [junit4] 2> 1218327 INFO (coreZkRegister-4428-thread-1-processing-n:127.0.0.1:54246_ x:collection1 s:shard2 c:tmp_collection r:core_node1) [n:127.0.0.1:54246_ c:tmp_collection s:shard2 r:core_node1 x:collection1] o.a.s.c.SyncStrategy Sync Success - now sync replicas to me
    [junit4] 2> 1218327 INFO (coreZkRegister-4428-thread-1-processing-n:127.0.0.1:54246_ x:collection1 s:shard2 c:tmp_collection r:core_node1) [n:127.0.0.1:54246_ c:tmp_collection s:shard2 r:core_node1 x:collection1] o.a.s.c.SyncStrategy http://127.0.0.1:54246/collection1/ has no replicas
    [junit4] 2> 1218327 INFO (OverseerStateUpdate-96063468244107268-127.0.0.1:54246_-n_0000000000) [n:127.0.0.1:54246_ ] o.a.s.c.Overseer processMessage: queueSize: 1, message = {
    [junit4] 2> "operation":"leader",
    [junit4] 2> "shard":"shard2",
    [junit4] 2> "collection":"tmp_collection"} current state version: 1
    [junit4] 2> 1218328 INFO (coreZkRegister-4428-thread-1-processing-n:127.0.0.1:54246_ x:collection1 s:shard2 c:tmp_collection r:core_node1) [n:127.0.0.1:54246_ c:tmp_collection s:shard2 r:core_node1 x:collection1] o.a.s.c.c.SolrZkClient makePath: /collections/tmp_collection/leaders/shard2
    [junit4] 2> 1218330 INFO (coreZkRegister-4428-thread-1-processing-n:127.0.0.1:54246_ x:collection1 s:shard2 c:tmp_collection r:core_node1) [n:127.0.0.1:54246_ c:tmp_collection s:shard2 r:core_node1 x:collection1] o.a.s.c.ShardLeaderElectionContextBase Creating leader registration node /collections/tmp_collection/leaders/shard2/leader after winning as /collections/tmp_collection/leader_elect/shard2/election/96063468244107268-core_node1-n_0000000000
    [junit4] 2> 1218332 INFO (zkCallback-1766-thread-2-processing-n:127.0.0.1:54246_) [n:127.0.0.1:54246_ ] o.a.s.h.CdcrLeaderStateManager Received new leader state @ tmp_collection:shard2
    [junit4] 2> 1218333 INFO (coreZkRegister-4428-thread-1-processing-n:127.0.0.1:54246_ x:collection1 s:shard2 c:tmp_collection r:core_node1) [n:127.0.0.1:54246_ c:tmp_collection s:shard2 r:core_node1 x:collection1] o.a.s.c.ShardLeaderElectionContext I am the new leader: http://127.0.0.1:54246/collection1/ shard2
    [junit4] 2> 1218334 INFO (OverseerStateUpdate-96063468244107268-127.0.0.1:54246_-n_0000000000) [n:127.0.0.1:54246_ ] o.a.s.c.Overseer processMessage: queueSize: 1, message = {
    [junit4] 2> "operation":"leader",
    [junit4] 2> "shard":"shard2",
    [junit4] 2> "collection":"tmp_collection",
    [junit4] 2> "base_url":"http://127.0.0.1:54246",
    [junit4] 2> "core":"collection1",
    [junit4] 2> "state":"active"} current state version: 1
    [junit4] 2> 1218439 INFO (zkCallback-1766-thread-3-processing-n:127.0.0.1:54246_) [n:127.0.0.1:54246_ ] o.a.s.c.c.ZkStateReader A cluster state change: [WatchedEvent state:SyncConnected type:NodeDataChanged path:/clusterstate.json], has occurred - updating... (live nodes size: [1])
    [junit4] 2> 1218486 INFO (coreZkRegister-4428-thread-1-processing-n:127.0.0.1:54246_ x:collection1 s:shard2 c:tmp_collection r:core_node1) [n:127.0.0.1:54246_ c:tmp_collection s:shard2 r:core_node1 x:collection1] o.a.s.c.ZkController We are http://127.0.0.1:54246/collection1/ and leader is http://127.0.0.1:54246/collection1/
    [junit4] 2> 1218486 INFO (coreZkRegister-4428-thread-1-processing-n:127.0.0.1:54246_ x:collection1 s:shard2 c:tmp_collection r:core_node1) [n:127.0.0.1:54246_ c:tmp_collection s:shard2 r:core_node1 x:collection1] o.a.s.c.ZkController No LogReplay needed for core=collection1 baseURL=http://127.0.0.1:54246
    [junit4] 2> 1218486 INFO (coreZkRegister-4428-thread-1-processing-n:127.0.0.1:54246_ x:collection1 s:shard2 c:tmp_collection r:core_node1) [n:127.0.0.1:54246_ c:tmp_collection s:shard2 r:core_node1 x:collection1] o.a.s.c.ZkController I am the leader, no recovery necessary
    [junit4] 2> 1218486 INFO (coreZkRegister-4428-thread-1-processing-n:127.0.0.1:54246_ x:collection1 s:shard2 c:tmp_collection r:core_node1) [n:127.0.0.1:54246_ c:tmp_collection s:shard2 r:core_node1 x:collection1] o.a.s.c.ZkController publishing state=active
    [junit4] 2> 1218486 INFO (coreZkRegister-4428-thread-1-processing-n:127.0.0.1:54246_ x:collection1 s:shard2 c:tmp_collection r:core_node1) [n:127.0.0.1:54246_ c:tmp_collection s:shard2 r:core_node1 x:collection1] o.a.s.c.ZkController numShards not found on descriptor - reading it from system property
    [junit4] 2> 1218490 INFO (OverseerStateUpdate-96063468244107268-127.0.0.1:54246_-n_0000000000) [n:127.0.0.1:54246_ ] o.a.s.c.Overseer processMessage: queueSize: 1, message = {
    [junit4] 2> "core":"collection1",
    [junit4] 2> "core_node_name":"core_node1",
    [junit4] 2> "roles":null,
    [junit4] 2> "base_url":"http://127.0.0.1:54246",
    [junit4] 2> "node_name":"127.0.0.1:54246_",
    [junit4] 2> "numShards":"2",
    [junit4] 2> "state":"active",
    [junit4] 2> "shard":"shard2",
    [junit4] 2> "collection":"tmp_collection",
    [junit4] 2> "operation":"state"} current state version: 2
    [junit4] 2> 1218491 INFO (OverseerStateUpdate-96063468244107268-127.0.0.1:54246_-n_0000000000) [n:127.0.0.1:54246_ ] o.a.s.c.o.ReplicaMutator Update state numShards=2 message={
    [junit4] 2> "core":"collection1",
    [junit4] 2> "core_node_name":"core_node1",
    [junit4] 2> "roles":null,
    [junit4] 2> "base_url":"http://127.0.0.1:54246",
    [junit4] 2> "node_name":"127.0.0.1:54246_",
    [junit4] 2> "numShards":"2",
    [junit4] 2> "state":"active",
    [junit4] 2> "shard":"shard2",
    [junit4] 2> "collection":"tmp_collection",
    [junit4] 2> "operation":"state"}
    [junit4] 2> 1218597 INFO (zkCallback-1766-thread-2-processing-n:127.0.0.1:54246_) [n:127.0.0.1:54246_ ] o.a.s.c.c.ZkStateReader A cluster state change: [WatchedEvent state:SyncConnected type:NodeDataChanged path:/clusterstate.json], has occurred - updating... (live nodes size: [1])
    [junit4] 2> 1218952 INFO (TEST-CdcrVersionReplicationTest.testCdcrDocVersions-seed#[F29067D0C63F3C3]) [ ] o.a.s.SolrTestCaseJ4 Writing core.properties file to C:\Users\jenkins\workspace\Lucene-Solr-master-Windows\solr\build\solr-core\test\J1\temp\solr.cloud.CdcrVersionReplicationTest_F29067D0C63F3C3-001\jetty-002\cores\collection1
    [junit4] 2> 1218956 INFO (TEST-CdcrVersionReplicationTest.testCdcrDocVersions-seed#[F29067D0C63F3C3]) [ ] o.e.j.s.Server jetty-9.3.8.v20160314
    [junit4] 2> 1218957 INFO (TEST-CdcrVersionReplicationTest.testCdcrDocVersions-seed#[F29067D0C63F3C3]) [ ] o.e.j.s.h.ContextHandler Started o.e.j.s.ServletContextHandler@1748e5c{/,null,AVAILABLE}
    [junit4] 2> 1218957 INFO (TEST-CdcrVersionReplicationTest.testCdcrDocVersions-seed#[F29067D0C63F3C3]) [ ] o.e.j.s.ServerConnector Started ServerConnector@de1896{HTTP/1.1,[http/1.1]}{127.0.0.1:54258}
    [junit4] 2> 1218958 INFO (TEST-CdcrVersionReplicationTest.testCdcrDocVersions-seed#[F29067D0C63F3C3]) [ ] o.e.j.s.Server Started @1225121ms
    [junit4] 2> 1218958 INFO (TEST-CdcrVersionReplicationTest.testCdcrDocVersions-seed#[F29067D0C63F3C3]) [ ] o.a.s.c.s.e.JettySolrRunner Jetty properties: {shards=shard2, hostContext=/, hostPort=54258, coreRootDirectory=C:\Users\jenkins\workspace\Lucene-Solr-master-Windows\solr\build\solr-core\test\J1\temp\solr.cloud.CdcrVersionReplicationTest_F29067D0C63F3C3-001\jetty-002\cores}
    [junit4] 2> 1218958 INFO (TEST-CdcrVersionReplicationTest.testCdcrDocVersions-seed#[F29067D0C63F3C3]) [ ] o.a.s.s.SolrDispatchFilter SolrDispatchFilter.init(): sun.misc.Launcher$AppClassLoader@1d16e93
    [junit4] 2> 1218958 INFO (TEST-CdcrVersionReplicationTest.testCdcrDocVersions-seed#[F29067D0C63F3C3]) [ ] o.a.s.c.SolrResourceLoader new SolrResourceLoader for directory: 'C:\Users\jenkins\workspace\Lucene-Solr-master-Windows\solr\build\solr-core\test\J1\temp\solr.cloud.CdcrVersionReplicationTest_F29067D0C63F3C3-001\jetty-002'
    [junit4] 2> 1218958 INFO (TEST-CdcrVersionReplicationTest.testCdcrDocVersions-seed#[F29067D0C63F3C3]) [ ] o.a.s.c.SolrResourceLoader JNDI not configured for solr (NoInitialContextEx)
    [junit4] 2> 1218958 INFO (TEST-CdcrVersionReplicationTest.testCdcrDocVersions-seed#[F29067D0C63F3C3]) [ ] o.a.s.c.SolrResourceLoader solr home defaulted to 'solr/' (could not find system property or JNDI)
    [junit4] 2> 1218960 INFO (TEST-CdcrVersionReplicationTest.testCdcrDocVersions-seed#[F29067D0C63F3C3]) [ ] o.a.s.c.c.SolrZkClient Using default ZkCredentialsProvider
    [junit4] 2> 1218960 INFO (TEST-CdcrVersionReplicationTest.testCdcrDocVersions-seed#[F29067D0C63F3C3]) [ ] o.a.s.c.c.ConnectionManager Waiting for client to connect to ZooKeeper
    [junit4] 2> 1218963 INFO (zkCallback-1768-thread-1) [ ] o.a.s.c.c.ConnectionManager Watcher org.apache.solr.common.cloud.ConnectionManager@1d5119c name:ZooKeeperConnection Watcher:127.0.0.1:54239/solr got event WatchedEvent state:SyncConnected type:None path:null path:null type:None
    [junit4] 2> 1218963 INFO (TEST-CdcrVersionReplicationTest.testCdcrDocVersions-seed#[F29067D0C63F3C3]) [ ] o.a.s.c.c.ConnectionManager Client is connected to ZooKeeper
    [junit4] 2> 1218963 INFO (TEST-CdcrVersionReplicationTest.testCdcrDocVersions-seed#[F29067D0C63F3C3]) [ ] o.a.s.c.c.SolrZkClient Using default ZkACLProvider
    [junit4] 2> 1218965 INFO (TEST-CdcrVersionReplicationTest.testCdcrDocVersions-seed#[F29067D0C63F3C3]) [ ] o.a.s.s.SolrDispatchFilter Loading solr.xml from SolrHome (not found in ZooKeeper)
    [junit4] 2> 1218965 INFO (TEST-CdcrVersionReplicationTest.testCdcrDocVersions-seed#[F29067D0C63F3C3]) [ ] o.a.s.c.SolrXmlConfig Loading container configuration from C:\Users\jenkins\workspace\Lucene-Solr-master-Windows\solr\build\solr-core\test\J1\temp\solr.cloud.CdcrVersionReplicationTest_F29067D0C63F3C3-001\jetty-002\solr.xml
    [junit4] 2> 1218975 INFO (TEST-CdcrVersionReplicationTest.testCdcrDocVersions-seed#[F29067D0C63F3C3]) [ ] o.a.s.c.CorePropertiesLocator Config-defined core root directory: C:\Users\jenkins\workspace\Lucene-Solr-master-Windows\solr\build\solr-core\test\J1\temp\solr.cloud.CdcrVersionReplicationTest_F29067D0C63F3C3-001\jetty-002\cores
    [junit4] 2> 1218975 INFO (TEST-CdcrVersionReplicationTest.testCdcrDocVersions-seed#[F29067D0C63F3C3]) [ ] o.a.s.c.CoreContainer New CoreContainer 12996714
    [junit4] 2> 1218975 INFO (TEST-CdcrVersionReplicationTest.testCdcrDocVersions-seed#[F29067D0C63F3C3]) [ ] o.a.s.c.CoreContainer Loading cores into CoreContainer [instanceDir=C:\Users\jenkins\workspace\Lucene-Solr-master-Windows\solr\build\solr-core\test\J1\temp\solr.cloud.CdcrVersionReplicationTest_F29067D0C63F3C3-001\jetty-002]
    [junit4] 2> 1218975 WARN (TEST-CdcrVersionReplicationTest.testCdcrDocVersions-seed#[F29067D0C63F3C3]) [ ] o.a.s.c.CoreContainer Couldn't add files from C:\Users\jenkins\workspace\Lucene-Solr-master-Windows\solr\build\solr-core\test\J1\temp\solr.cloud.CdcrVersionReplicationTest_F29067D0C63F3C3-001\jetty-002\lib to classpath: C:\Users\jenkins\workspace\Lucene-Solr-master-Windows\solr\build\solr-core\test\J1\temp\solr.cloud.CdcrVersionReplicationTest_F29067D0C63F3C3-001\jetty-002\lib
    [junit4] 2> 1218976 INFO (TEST-CdcrVersionReplicationTest.testCdcrDocVersions-seed#[F29067D0C63F3C3]) [ ] o.a.s.h.c.HttpShardHandlerFactory created with socketTimeout : 90000,urlScheme : ,connTimeout : 15000,maxConnectionsPerHost : 20,maxConnections : 10000,corePoolSize : 0,maximumPoolSize : 2147483647,maxThreadIdleTime : 5,sizeOfQueue : -1,fairnessPolicy : false,
    [junit4] 2> 1218980 INFO (TEST-CdcrVersionReplicationTest.testCdcrDocVersions-seed#[F29067D0C63F3C3]) [ ] o.a.s.u.UpdateShardHandler Creating UpdateShardHandler HTTP client with params:
    [junit4] 2> 1218981 INFO (TEST-CdcrVersionReplicationTest.testCdcrDocVersions-seed#[F29067D0C63F3C3]) [ ] o.a.s.l.LogWatcher SLF4J impl is org.slf4j.impl.Log4jLoggerFactory
    [junit4] 2> 1218981 INFO (TEST-CdcrVersionReplicationTest.testCdcrDocVersions-seed#[F29067D0C63F3C3]) [ ] o.a.s.l.LogWatcher Registering Log Listener [Log4j (org.slf4j.impl.Log4jLoggerFactory)]
    [junit4] 2> 1218983 INFO (TEST-CdcrVersionReplicationTest.testCdcrDocVersions-seed#[F29067D0C63F3C3]) [ ] o.a.s.c.ZkContainer Zookeeper client=127.0.0.1:54239/solr
    [junit4] 2> 1218983 INFO (TEST-CdcrVersionReplicationTest.testCdcrDocVersions-seed#[F29067D0C63F3C3]) [ ] o.a.s.c.ZkController zkHost includes chroot
    [junit4] 2> 1218983 INFO (TEST-CdcrVersionReplicationTest.testCdcrDocVersions-seed#[F29067D0C63F3C3]) [ ] o.a.s.c.c.SolrZkClient Using default ZkCredentialsProvider
    [junit4] 2> 1218984 INFO (TEST-CdcrVersionReplicationTest.testCdcrDocVersions-seed#[F29067D0C63F3C3]) [ ] o.a.s.c.c.ConnectionManager Waiting for client to connect to ZooKeeper
    [junit4] 2> 1218984 INFO (zkCallback-1771-thread-1) [ ] o.a.s.c.c.ConnectionManager Watcher org.apache.solr.common.cloud.ConnectionManager@8f2357 name:ZooKeeperConnection Watcher:127.0.0.1:54239 got event WatchedEvent state:SyncConnected type:None path:null path:null type:None
    [junit4] 2> 1218984 INFO (TEST-CdcrVersionReplicationTest.testCdcrDocVersions-seed#[F29067D0C63F3C3]) [ ] o.a.s.c.c.ConnectionManager Client is connected to ZooKeeper
    [junit4] 2> 1218985 INFO (TEST-CdcrVersionReplicationTest.testCdcrDocVersions-seed#[F29067D0C63F3C3]) [ ] o.a.s.c.c.SolrZkClient Using default ZkACLProvider
    [junit4] 2> 1218986 WARN (NIOServerCxn.Factory:0.0.0.0/0.0.0.0:0) [ ] o.a.z.s.NIOServerCnxn caught end of stream exception
    [junit4] 2> EndOfStreamException: Unable to read additional data from client sessionid 0x155493724950006, likely client has closed socket
    [junit4] 2> at org.apache.zookeeper.server.NIOServerCnxn.doIO(NIOServerCnxn.java:228)
    [junit4] 2> at org.apache.zookeeper.server.NIOServerCnxnFactory.run(NIOServerCnxnFactory.java:208)
    [junit4] 2> at java.lang.Thread.run(Thread.java:745)
    [junit4] 2> 1218986 INFO (TEST-CdcrVersionReplicationTest.testCdcrDocVersions-seed#[F29067D0C63F3C3]) [n:127.0.0.1:54258_ ] o.a.s.c.ZkController Added new OnReconnect listener org.apache.solr.cloud.ZkController$$Lambda$55/32534973@128f17c
    [junit4] 2> 1218988 INFO (TEST-CdcrVersionReplicationTest.testCdcrDocVersions-seed#[F29067D0C63F3C3]) [n:127.0.0.1:54258_ ] o.a.s.c.c.ConnectionManager Waiting for client to connect to ZooKeeper
    [junit4] 2> 1218989 INFO (zkCallback-1772-thread-1-processing-n:127.0.0.1:54258_) [n:127.0.0.1:54258_ ] o.a.s.c.c.ConnectionManager Watcher org.apache.solr.common.cloud.ConnectionManager@90e5f7 name:ZooKeeperConnection Watcher:127.0.0.1:54239/solr got event WatchedEvent state:SyncConnected type:None path:null path:null type:None
    [junit4] 2> 1218989 INFO (TEST-CdcrVersionReplicationTest.testCdcrDocVersions-seed#[F29067D0C63F3C3]) [n:127.0.0.1:54258_ ] o.a.s.c.c.ConnectionManager Client is connected to ZooKeeper
    [junit4] 2> 1218998 INFO (TEST-CdcrVersionReplicationTest.testCdcrDocVersions-seed#[F29067D0C63F3C3]) [n:127.0.0.1:54258_ ] o.a.s.c.c.ZkStateReader Updating cluster state from ZooKeeper...
    [junit4] 2> 1218999 INFO (TEST-CdcrVersionReplicationTest.testCdcrDocVersions-seed#[F29067D0C63F3C3]) [n:127.0.0.1:54258_ ] o.a.s.c.c.ZkStateReader Loaded empty cluster properties
    [junit4] 2> 1219000 INFO (TEST-CdcrVersionReplicationTest.testCdcrDocVersions-seed#[F29067D0C63F3C3]) [n:127.0.0.1:54258_ ] o.a.s.c.c.ZkStateReader Updated live nodes from ZooKeeper... (0) -> (1)
    [junit4] 2> 1219003 INFO (TEST-CdcrVersionReplicationTest.testCdcrDocVersions-seed#[F29067D0C63F3C3]) [n:127.0.0.1:54258_ ] o.a.s.c.Overseer Overseer (id=null) closing
    [junit4] 2> 1219004 INFO (TEST-CdcrVersionReplicationTest.testCdcrDocVersions-seed#[F29067D0C63F3C3]) [n:127.0.0.1:54258_ ] o.a.s.c.LeaderElector Joined leadership election with path: /overseer_elect/election/96063468244107271-127.0.0.1:54258_-n_0000000001
    [junit4] 2> 1219005 INFO (TEST-CdcrVersionReplicationTest.testCdcrDocVersions-seed#[F29067D0C63F3C3]) [n:127.0.0.1:54258_ ] o.a.s.c.LeaderElector Watching path /overseer_elect/election/96063468244107268-127.0.0.1:54246_-n_0000000000 to know if I could be the leader
    [junit4] 2> 1219005 INFO (TEST-CdcrVersionReplicationTest.testCdcrDocVersions-seed#[F29067D0C63F3C3]) [n:127.0.0.1:54258_ ] o.a.s.c.ZkController Publish node=127.0.0.1:54258_ as DOWN
    [junit4] 2> 1219008 INFO (OverseerStateUpdate-96063468244107268-127.0.0.1:54246_-n_0000000000) [n:127.0.0.1:54246_ ] o.a.s.c.Overseer processMessage: queueSize: 1, message = {
    [junit4] 2> "operation":"downnode",
    [junit4] 2> "node_name":"127.0.0.1:54258_"} current state version: 3
    [junit4] 2> 1219008 INFO (OverseerStateUpdate-96063468244107268-127.0.0.1:54246_-n_0000000000) [n:127.0.0.1:54246_ ] o.a.s.c.o.NodeMutator DownNode state invoked for node: 127.0.0.1:54258_
    [junit4] 2> 1219113 INFO (zkCallback-1772-thread-1-processing-n:127.0.0.1:54258_) [n:127.0.0.1:54258_ ] o.a.s.c.c.ZkStateReader A cluster state change: [WatchedEvent state:SyncConnected type:NodeDataChanged path:/clusterstate.json], has occurred - updating... (live nodes size: [1])
    [junit4] 2> 1219113 INFO (zkCallback-1766-thread-3-processing-n:127.0.0.1:54246_) [n:127.0.0.1:54246_ ] o.a.s.c.c.ZkStateReader A cluster state change: [WatchedEvent state:SyncConnected type:NodeDataChanged path:/clusterstate.json], has occurred - updating... (live nodes size: [1])
    [junit4] 2> 1220008 INFO (TEST-CdcrVersionReplicationTest.testCdcrDocVersions-seed#[F29067D0C63F3C3]) [n:127.0.0.1:54258_ ] o.a.s.c.ZkController Register node as live in ZooKeeper:/live_nodes/127.0.0.1:54258_
    [junit4] 2> 1220009 INFO (TEST-CdcrVersionReplicationTest.testCdcrDocVersions-seed#[F29067D0C63F3C3]) [n:127.0.0.1:54258_ ] o.a.s.c.c.SolrZkClient makePath: /live_nodes/127.0.0.1:54258_
    [junit4] 2> 1220010 INFO (zkCallback-1772-thread-1-processing-n:127.0.0.1:54258_) [n:127.0.0.1:54258_ ] o.a.s.c.c.ZkStateReader A live node change: [WatchedEvent state:SyncConnected type:NodeChildrenChanged path:/live_nodes], has occurred - updating... (live nodes size: [1])
    [junit4] 2> 1220010 INFO (zkCallback-1766-thread-3-processing-n:127.0.0.1:54246_) [n:127.0.0.1:54246_ ] o.a.s.c.c.ZkStateReader A live node change: [WatchedEvent state:SyncConnected type:NodeChildrenChanged path:/live_nodes], has occurred - updating... (live nodes size: [1])
    [junit4] 2> 1220011 INFO (zkCallback-1766-thread-3-processing-n:127.0.0.1:54246_) [n:127.0.0.1:54246_ ] o.a.s.c.c.ZkStateReader Updated live nodes from ZooKeeper... (1) -> (2)
    [junit4] 2> 1220011 INFO (zkCallback-1772-thread-1-processing-n:127.0.0.1:54258_) [n:127.0.0.1:54258_ ] o.a.s.c.c.ZkStateReader Updated live nodes from ZooKeeper... (1) -> (2)
    [junit4] 2> 1220025 INFO (TEST-CdcrVersionReplicationTest.testCdcrDocVersions-seed#[F29067D0C63F3C3]) [n:127.0.0.1:54258_ ] o.a.s.c.CoreContainer Security conf doesn't exist. Skipping setup for authorization module.
    [junit4] 2> 1220025 INFO (TEST-CdcrVersionReplicationTest.testCdcrDocVersions-seed#[F29067D0C63F3C3]) [n:127.0.0.1:54258_ ] o.a.s.c.CoreContainer No authentication plugin used.
    [junit4] 2> 1220026 INFO (TEST-CdcrVersionReplicationTest.testCdcrDocVersions-seed#[F29067D0C63F3C3]) [n:127.0.0.1:54258_ ] o.a.s.c.CorePropertiesLocator Looking for core definitions underneath C:\Users\jenkins\workspace\Lucene-Solr-master-Windows\solr\build\solr-core\test\J1\temp\solr.cloud.CdcrVersionReplicationTest_F29067D0C63F3C3-001\jetty-002\cores
    [junit4] 2> 1220028 INFO (TEST-CdcrVersionReplicationTest.testCdcrDocVersions-seed#[F29067D0C63F3C3]) [n:127.0.0.1:54258_ ] o.a.s.c.CoreDescriptor Created CoreDescriptor: {name=collection1, config=solrconfig.xml, transient=false, schema=schema.xml, loadOnStartup=true, configSetProperties=configsetprops.json, collection=tmp_collection, coreNodeName=, dataDir=data\, shard=}
    [junit4] 2> 1220028 INFO (TEST-CdcrVersionReplicationTest.testCdcrDocVersions-seed#[F29067D0C63F3C3]) [n:127.0.0.1:54258_ ] o.a.s.c.CorePropertiesLocator Found core collection1 in C:\Users\jenkins\workspace\Lucene-Solr-master-Windows\solr\build\solr-core\test\J1\temp\solr.cloud.CdcrVersionReplicationTest_F29067D0C63F3C3-001\jetty-002\cores\collection1
    [junit4] 2> 1220028 INFO (TEST-CdcrVersionReplicationTest.testCdcrDocVersions-seed#[F29067D0C63F3C3]) [n:127.0.0.1:54258_ ] o.a.s.c.CorePropertiesLocator Found 1 core definitions
    [junit4] 2> 1220028 INFO (coreLoadExecutor-4446-thread-1-processing-n:127.0.0.1:54258_) [n:127.0.0.1:54258_ c:tmp_collection x:collection1] o.a.s.c.ZkController publishing state=down
    [junit4] 2> 1220028 INFO (coreLoadExecutor-4446-thread-1-processing-n:127.0.0.1:54258_) [n:127.0.0.1:54258_ c:tmp_collection x:collection1] o.a.s.c.ZkController numShards not found on descriptor - reading it from system property
    [junit4] 2> 1220029 INFO (TEST-CdcrVersionReplicationTest.testCdcrDocVersions-seed#[F29067D0C63F3C3]) [n:127.0.0.1:54258_ ] o.a.s.s.SolrDispatchFilter user.dir=C:\Users\jenkins\workspace\Lucene-Solr-master-Windows\solr\build\solr-core\test\J1
    [junit4] 2> 1220029 INFO (TEST-CdcrVersionReplicationTest.testCdcrDocVersions-seed#[F29067D0C63F3C3]) [n:127.0.0.1:54258_ ] o.a.s.s.SolrDispatchFilter SolrDispatchFilter.init() done
    [junit4] 2> 1220029 INFO (coreLoadExecutor-4446-thread-1-processing-n:127.0.0.1:54258_) [n:127.0.0.1:54258_ c:tmp_collection x:collection1] o.a.s.c.ZkController Registering watch for collection tmp_collection
    [junit4] 2> 1220031 INFO (coreLoadExecutor-4446-thread-1-processing-n:127.0.0.1:54258_) [n:127.0.0.1:54258_ c:tmp_collection x:collection1] o.a.s.c.c.ZkStateReader Deleting data for [tmp_collection]
    [junit4] 2> 1220031 INFO (OverseerStateUpdate-96063468244107268-127.0.0.1:54246_-n_0000000000) [n:127.0.0.1:54246_ ] o.a.s.c.Overseer processMessage: queueSize: 1, message = {
    [junit4] 2> "core":"collection1",
    [junit4] 2> "roles":null,
    [junit4] 2> "base_url":"http://127.0.0.1:54258",
    [junit4] 2> "node_name":"127.0.0.1:54258_",
    [junit4] 2> "numShards":"2",
    [junit4] 2> "state":"down",
    [junit4] 2> "shard":null,
    [junit4] 2> "collection":"tmp_collection",
    [junit4] 2> "operation":"state"} current state version: 4
    [junit4] 2> 1220031 INFO (OverseerStateUpdate-96063468244107268-127.0.0.1:54246_-n_0000000000) [n:127.0.0.1:54246_ ] o.a.s.c.o.ReplicaMutator Update state numShards=2 message={
    [junit4] 2> "core":"collection1",
    [junit4] 2> "roles":null,
    [junit4] 2> "base_url":"http://127.0.0.1:54258",
    [junit4] 2> "node_name":"127.0.0.1:54258_",
    [junit4] 2> "numShards":"2",
    [junit4] 2> "state":"down",
    [junit4] 2> "shard":null,
    [junit4] 2> "collection":"tmp_collection",
    [junit4] 2> "operation":"state"}
    [junit4] 2> 1220031 INFO (OverseerStateUpdate-96063468244107268-127.0.0.1:54246_-n_0000000000) [n:127.0.0.1:54246_ ] o.a.s.c.o.ReplicaMutator Collection already exists with numShards=2
    [junit4] 2> 1220031 INFO (OverseerStateUpdate-96063468244107268-127.0.0.1:54246_-n_0000000000) [n:127.0.0.1:54246_ ] o.a.s.c.o.ReplicaMutator Assigning new node to shard shard=shard1
    [junit4] 2> 1220032 INFO (coreLoadExecutor-4446-thread-1-processing-n:127.0.0.1:54258_) [n:127.0.0.1:54258_ c:tmp_collection x:collection1] o.a.s.c.ZkController look for our core node name
    [junit4] 2> 1220135 INFO (zkCallback-1772-thread-1-processing-n:127.0.0.1:54258_) [n:127.0.0.1:54258_ ] o.a.s.c.c.ZkStateReader A cluster state change: [WatchedEvent state:SyncConnected type:NodeDataChanged path:/clusterstate.json], has occurred - updating... (live nodes size: [2])
    [junit4] 2> 1220135 INFO (zkCallback-1766-thread-2-processing-n:127.0.0.1:54246_) [n:127.0.0.1:54246_ ] o.a.s.c.c.ZkStateReader A cluster state change: [WatchedEvent state:SyncConnected type:NodeDataChanged path:/clusterstate.json], has occurred - updating... (live nodes size: [2])
    [junit4] 2> 1221033 INFO (coreLoadExecutor-4446-thread-1-processing-n:127.0.0.1:54258_) [n:127.0.0.1:54258_ c:tmp_collection x:collection1] o.a.s.c.ZkController waiting to find shard id in clusterstate for collection1
    [junit4] 2> 1221033 INFO (coreLoadExecutor-4446-thread-1-processing-n:127.0.0.1:54258_) [n:127.0.0.1:54258_ c:tmp_collection x:collection1] o.a.s.c.ZkController Check for collection zkNode:tmp_collection
    [junit4] 2> 1221033 INFO (coreLoadExecutor-4446-thread-1-processing-n:127.0.0.1:54258_) [n:127.0.0.1:54258_ c:tmp_collection x:collection1] o.a.s.c.ZkController Collection zkNode exists
    [junit4] 2> 1221033 INFO (coreLoadExecutor-4446-thread-1-processing-n:127.0.0.1:54258_) [n:127.0.0.1:54258_ c:tmp_collection x:collection1] o.a.s.c.c.ZkStateReader Load collection config from: [/collections/tmp_collection]
    [junit4] 2> 1221034 INFO (coreLoadExecutor-4446-thread-1-processing-n:127.0.0.1:54258_) [n:127.0.0.1:54258_ c:tmp_collection x:collection1] o.a.s.c.c.ZkStateReader path=[/collections/tmp_collection] [configName]=[conf1] specified config exists in ZooKeeper
    [junit4] 2> 1221034 INFO (coreLoadExecutor-4446-thread-1-processing-n:127.0.0.1:54258_) [n:127.0.0.1:54258_ c:tmp_collection x:collection1] o.a.s.c.SolrResourceLoader new SolrResourceLoader for directory: 'C:\Users\jenkins\workspace\Lucene-Solr-master-Windows\solr\build\solr-core\test\J1\temp\solr.cloud.CdcrVersionReplicationTest_F29067D0C63F3C3-001\jetty-002\cores\collection1'
    [junit4] 2> 1221034 INFO (coreLoadExecutor-4446-thread-1-processing-n:127.0.0.1:54258_) [n:127.0.0.1:54258_ c:tmp_collection x:collection1] o.a.s.c.SolrResourceLoader JNDI not configured for solr (NoInitialContextEx)
    [junit4] 2> 1221034 INFO (coreLoadExecutor-4446-thread-1-processing-n:127.0.0.1:54258_) [n:127.0.0.1:54258_ c:tmp_collection x:collection1] o.a.s.c.SolrResourceLoader solr home defaulted to 'solr/' (could not find system property or JNDI)
    [junit4] 2> 1221037 INFO (coreLoadExecutor-4446-thread-1-processing-n:127.0.0.1:54258_) [n:127.0.0.1:54258_ c:tmp_collection x:collection1] o.a.s.c.Config loaded config solrconfig.xml with version 0
    [junit4] 2> 1221046 INFO (coreLoadExecutor-4446-thread-1-processing-n:127.0.0.1:54258_) [n:127.0.0.1:54258_ c:tmp_collection x:collection1] o.a.s.c.SolrConfig current version of requestparams : -1
    [junit4] 2> 1221048 WARN (coreLoadExecutor-4446-thread-1-processing-n:127.0.0.1:54258_) [n:127.0.0.1:54258_ c:tmp_collection x:collection1] o.a.s.c.Config Beginning with Solr 5.5, <mergePolicy> is deprecated, use <mergePolicyFactory> instead.
    [junit4] 2> 1221049 INFO (coreLoadExecutor-4446-thread-1-processing-n:127.0.0.1:54258_) [n:127.0.0.1:54258_ c:tmp_collection x:collection1] o.a.s.c.SolrConfig Using Lucene MatchVersion: 7.0.0
    [junit4] 2> 1221054 INFO (coreLoadExecutor-4446-thread-1-processing-n:127.0.0.1:54258_) [n:127.0.0.1:54258_ c:tmp_collection x:collection1] o.a.s.c.SolrConfig Loaded SolrConfig: solrconfig.xml
    [junit4] 2> 1221061 INFO (coreLoadExecutor-4446-thread-1-processing-n:127.0.0.1:54258_) [n:127.0.0.1:54258_ c:tmp_collection x:collection1] o.a.s.s.IndexSchema [collection1] Schema name=test
    [junit4] 2> 1221115 INFO (coreLoadExecutor-4446-thread-1-processing-n:127.0.0.1:54258_) [n:127.0.0.1:54258_ c:tmp_collection x:collection1] o.a.s.s.IndexSchema default search field in schema is text
    [junit4] 2> 1221116 INFO (coreLoadExecutor-4446-thread-1-processing-n:127.0.0.1:54258_) [n:127.0.0.1:54258_ c:tmp_collection x:collection1] o.a.s.s.IndexSchema unique key field: id
    [junit4] 2> 1221116 INFO (coreLoadExecutor-4446-thread-1-processing-n:127.0.0.1:54258_) [n:127.0.0.1:54258_ c:tmp_collection x:collection1] o.a.s.s.FileExchangeRateProvider Reloading exchange rates from file currency.xml
    [junit4] 2> 1221119 INFO (coreLoadExecutor-4446-thread-1-processing-n:127.0.0.1:54258_) [n:127.0.0.1:54258_ c:tmp_collection x:collection1] o.a.s.s.FileExchangeRateProvider Reloading exchange rates from file currency.xml
    [junit4] 2> 1221144 INFO (coreLoadExecutor-4446-thread-1-processing-n:127.0.0.1:54258_) [n:127.0.0.1:54258_ c:tmp_collection x:collection1] o.a.s.c.ConfigSetProperties Did not find ConfigSet properties, assuming default properties: Can't find resource 'configsetprops.json' in classpath or '/configs/conf1', cwd=C:\Users\jenkins\workspace\Lucene-Solr-master-Windows\solr\build\solr-core\test\J1
    [junit4] 2> 1221144 INFO (coreLoadExecutor-4446-thread-1-processing-n:127.0.0.1:54258_) [n:127.0.0.1:54258_ c:tmp_collection x:collection1] o.a.s.c.CoreContainer Creating SolrCore 'collection1' using configuration from collection tmp_collection
    [junit4] 2> 1221144 INFO (coreLoadExecutor-4446-thread-1-processing-n:127.0.0.1:54258_) [n:127.0.0.1:54258_ c:tmp_collection s:shard1 r:core_node2 x:collection1] o.a.s.c.SolrCore org.apache.solr.core.MockDirectoryFactory
    [junit4] 2> 1221144 INFO (coreLoadExecutor-4446-thread-1-processing-n:127.0.0.1:54258_) [n:127.0.0.1:54258_ c:tmp_collection s:shard1 r:core_node2 x:collection1] o.a.s.c.SolrCore [[collection1] ] Opening new SolrCore at [C:\Users\jenkins\workspace\Lucene-Solr-master-Windows\solr\build\solr-core\test\J1\temp\solr.cloud.CdcrVersionReplicationTest_F29067D0C63F3C3-001\jetty-002\cores\collection1], dataDir=[C:\Users\jenkins\workspace\Lucene-Solr-master-Windows\solr\build\solr-core\test\J1\temp\solr.cloud.CdcrVersionReplicationTest_F29067D0C63F3C3-001\jetty-002\cores\collection1\data\]
    [junit4] 2> 1221144 INFO (coreLoadExecutor-4446-thread-1-processing-n:127.0.0.1:54258_) [n:127.0.0.1:54258_ c:tmp_collection s:shard1 r:core_node2 x:collection1] o.a.s.c.JmxMonitoredMap JMX monitoring is enabled. Adding Solr mbeans to JMX Server: com.sun.jmx.mbeanserver.JmxMBeanServer@7e6ece
    [junit4] 2> 1221145 INFO (coreLoadExecutor-4446-thread-1-processing-n:127.0.0.1:54258_) [n:127.0.0.1:54258_ c:tmp_collection s:shard1 r:core_node2 x:collection1] o.a.s.c.CachingDirectoryFactory return new directory for C:\Users\jenkins\workspace\Lucene-Solr-master-Windows\solr\build\solr-core\test\J1\temp\solr.cloud.CdcrVersionReplicationTest_F29067D0C63F3C3-001\jetty-002\cores\collection1\data\
    [junit4] 2> 1221147 INFO (coreLoadExecutor-4446-thread-1-processing-n:127.0.0.1:54258_) [n:127.0.0.1:54258_ c:tmp_collection s:shard1 r:core_node2 x:collection1] o.a.s.c.SolrCore New index directory detected: old=null new=C:\Users\jenkins\workspace\Lucene-Solr-master-Windows\solr\build\solr-core\test\J1\temp\solr.cloud.CdcrVersionReplicationTest_F29067D0C63F3C3-001\jetty-002\cores\collection1\data\index/
    [junit4] 2> 1221147 WARN (coreLoadExecutor-4446-thread-1-processing-n:127.0.0.1:54258_) [n:127.0.0.1:54258_ c:tmp_collection s:shard1 r:core_node2 x:collection1] o.a.s.c.SolrCore [collection1] Solr index directory 'C:\Users\jenkins\workspace\Lucene-Solr-master-Windows\solr\build\solr-core\test\J1\temp\solr.cloud.CdcrVersionReplicationTest_F29067D0C63F3C3-001\jetty-002\cores\collection1\data\index' doesn't exist. Creating new index...
    [junit4] 2> 1221147 INFO (coreLoadExecutor-4446-thread-1-processing-n:127.0.0.1:54258_) [n:127.0.0.1:54258_ c:tmp_collection s:shard1 r:core_node2 x:collection1] o.a.s.c.CachingDirectoryFactory return new directory for C:\Users\jenkins\workspace\Lucene-Solr-master-Windows\solr\build\solr-core\test\J1\temp\solr.cloud.CdcrVersionReplicationTest_F29067D0C63F3C3-001\jetty-002\cores\collection1\data\index
    [junit4] 2> 1221147 INFO (coreLoadExecutor-4446-thread-1-processing-n:127.0.0.1:54258_) [n:127.0.0.1:54258_ c:tmp_collection s:shard1 r:core_node2 x:collection1] o.a.s.u.RandomMergePolicy RandomMergePolicy wrapping class org.apache.lucene.index.LogByteSizeMergePolicy: [LogByteSizeMergePolicy: minMergeSize=1677721, mergeFactor=13, maxMergeSize=2147483648, maxMergeSizeForForcedMerge=9223372036854775807, calibrateSizeByDeletes=true, maxMergeDocs=2147483647, maxCFSSegmentSizeMB=8.796093022207999E12, noCFSRatio=0.37967563377534297]
    [junit4] 2> 1221149 INFO (coreLoadExecutor-4446-thread-1-processing-n:127.0.0.1:54258_) [n:127.0.0.1:54258_ c:tmp_collection s:shard1 r:core_node2 x:collection1] o.a.s.c.SolrDeletionPolicy SolrDeletionPolicy.onCommit: commits: num=1
    [junit4] 2> commit{dir=MockDirectoryWrapper(RAMDirectory@6fda47 lockFactory=org.apache.lucene.store.SingleInstanceLockFactory@b475a5),segFN=segments_1,generation=1}
    [junit4] 2> 1221149 INFO (coreLoadExecutor-4446-thread-1-processing-n:127.0.0.1:54258_) [n:127.0.0.1:54258_ c:tmp_collection s:shard1 r:core_node2 x:collection1] o.a.s.c.SolrDeletionPolicy newest commit generation = 1
    [junit4] 2> 1221152 INFO (coreLoadExecutor-4446-thread-1-processing-n:127.0.0.1:54258_) [n:127.0.0.1:54258_ c:tmp_collection s:shard1 r:core_node2 x:collection1] o.a.s.u.p.UpdateRequestProcessorChain creating updateRequestProcessorChain "cdcr-processor-chain"
    [junit4] 2> 1221152 INFO (coreLoadExecutor-4446-thread-1-processing-n:127.0.0.1:54258_) [n:127.0.0.1:54258_ c:tmp_collection s:shard1 r:core_node2 x:collection1] o.a.s.c.SolrCore no updateRequestProcessorChain defined as default, creating implicit default
    [junit4] 2> 1221155 INFO (OldIndexDirectoryCleanupThreadForCore-collection1) [n:127.0.0.1:54258_ c:tmp_collection s:shard1 r:core_node2 x:collection1] o.a.s.c.SolrCore Looking for old index directories to cleanup for core collection1 in C:\Users\jenkins\workspace\Lucene-Solr-master-Windows\solr\build\solr-core\test\J1\temp\solr.cloud.CdcrVersionReplicationTest_F29067D0C63F3C3-001\jetty-002\cores\collection1\data\
    [junit4] 2> 1221155 WARN (OldIndexDirectoryCleanupThreadForCore-collection1) [n:127.0.0.1:54258_ c:tmp_collection s:shard1 r:core_node2 x:collection1] o.a.s.c.DirectoryFactory C:\Users\jenkins\workspace\Lucene-Solr-master-Windows\solr\build\solr-core\test\J1\temp\solr.cloud.CdcrVersionReplicationTest_F29067D0C63F3C3-001\jetty-002\cores\collection1\data\ does not point to a valid data directory; skipping clean-up of old index directories.
    [junit4] 2> 1221160 INFO (coreLoadExecutor-4446-thread-1-processing-n:127.0.0.1:54258_) [n:127.0.0.1:54258_ c:tmp_collection s:shard1 r:core_node2 x:collection1] o.a.s.h.l.XMLLoader xsltCacheLifetimeSeconds=60
    [junit4] 2> 1221162 INFO (coreLoadExecutor-4446-thread-1-processing-n:127.0.0.1:54258_) [n:127.0.0.1:54258_ c:tmp_collection s:shard1 r:core_node2 x:collection1] o.a.s.h.l.XMLLoader xsltCacheLifetimeSeconds=60
    [junit4] 2> 1221163 INFO (coreLoadExecutor-4446-thread-1-processing-n:127.0.0.1:54258_) [n:127.0.0.1:54258_ c:tmp_collection s:shard1 r:core_node2 x:collection1] o.a.s.h.l.XMLLoader xsltCacheLifetimeSeconds=60
    [junit4] 2> 1221164 INFO (coreLoadExecutor-4446-thread-1-processing-n:127.0.0.1:54258_) [n:127.0.0.1:54258_ c:tmp_c

[...truncated too long message...]

[ ] o.a.s.SolrTestCaseJ4 ###Ending testCdcrDocVersions
    [junit4] 2> 1248415 INFO (TEST-CdcrVersionReplicationTest.testCdcrDocVersions-seed#[F29067D0C63F3C3]) [ ] o.a.s.c.ZkTestServer connecting to 127.0.0.1:54239 54239
    [junit4] 2> 1248418 INFO (Thread-3223) [ ] o.a.s.c.ZkTestServer connecting to 127.0.0.1:54239 54239
    [junit4] 2> 1248420 WARN (Thread-3223) [ ] o.a.s.c.ZkTestServer Watch limit violations:
    [junit4] 2> Maximum concurrent create/delete watches above limit:
    [junit4] 2>
    [junit4] 2> 16 /solr/aliases.json
    [junit4] 2> 16 /solr/clusterprops.json
    [junit4] 2> 8 /solr/configs/conf1
    [junit4] 2> 4 /solr/collections/tmp_collection/state.json
    [junit4] 2> 4 /solr/security.json
    [junit4] 2> 2 /solr/collections/tmp_collection/leaders/shard2/leader
    [junit4] 2> 2 /solr/collections/tmp_collection/leaders/shard1/leader
    [junit4] 2> 2 /solr/collections/source_collection/leaders/shard1/leader
    [junit4] 2> 2 /solr/collections/source_collection/leaders/shard2/leader
    [junit4] 2>
    [junit4] 2> Maximum concurrent data watches above limit:
    [junit4] 2>
    [junit4] 2> 16 /solr/clusterstate.json
    [junit4] 2> 4 /solr/collections/source_collection/cdcr/state/buffer
    [junit4] 2> 4 /solr/collections/source_collection/cdcr/state/process
    [junit4] 2> 4 /solr/collections/tmp_collection/cdcr/state/buffer
    [junit4] 2> 4 /solr/collections/source_collection/state.json
    [junit4] 2> 4 /solr/collections/tmp_collection/cdcr/state/process
    [junit4] 2>
    [junit4] 2> Maximum concurrent children watches above limit:
    [junit4] 2>
    [junit4] 2> 50 /solr/overseer/queue
    [junit4] 2> 25 /solr/overseer/collection-queue-work
    [junit4] 2> 16 /solr/live_nodes
    [junit4] 2> 16 /solr/collections
    [junit4] 2> 4 /solr/overseer/queue-work
    [junit4] 2>
    [junit4] 2> 1248424 INFO (SUITE-CdcrVersionReplicationTest-seed#[F29067D0C63F3C3]-worker) [ ] o.a.s.SolrTestCaseJ4 ###deleteCore
    [junit4] 2> ObjectTracker found 1 object(s) that were not released!!! [InternalHttpClient]
    [junit4] 2> org.apache.solr.common.util.ObjectReleaseTracker$ObjectTrackerException
    [junit4] 2> at org.apache.solr.common.util.ObjectReleaseTracker.track(ObjectReleaseTracker.java:42)
    [junit4] 2> at org.apache.solr.client.solrj.impl.HttpClientUtil.createClient(HttpClientUtil.java:268)
    [junit4] 2> at org.apache.solr.client.solrj.impl.HttpClientUtil.createClient(HttpClientUtil.java:211)
    [junit4] 2> at org.apache.solr.client.solrj.impl.HttpClientUtil.createClient(HttpClientUtil.java:203)
    [junit4] 2> at org.apache.solr.client.solrj.impl.HttpSolrClient.<init>(HttpSolrClient.java:207)
    [junit4] 2> at org.apache.solr.client.solrj.impl.HttpSolrClient$Builder.build(HttpSolrClient.java:799)
    [junit4] 2> at org.apache.solr.handler.CdcrUpdateLogSynchronizer$UpdateLogSynchronisation.run(CdcrUpdateLogSynchronizer.java:134)
    [junit4] 2> at java.util.concurrent.Executors$RunnableAdapter.call(Executors.java:511)
    [junit4] 2> at java.util.concurrent.FutureTask.runAndReset(FutureTask.java:308)
    [junit4] 2> at java.util.concurrent.ScheduledThreadPoolExecutor$ScheduledFutureTask.access$301(ScheduledThreadPoolExecutor.java:180)
    [junit4] 2> at java.util.concurrent.ScheduledThreadPoolExecutor$ScheduledFutureTask.run(ScheduledThreadPoolExecutor.java:294)
    [junit4] 2> at java.util.concurrent.ThreadPoolExecutor.runWorker(ThreadPoolExecutor.java:1142)
    [junit4] 2> at java.util.concurrent.ThreadPoolExecutor$Worker.run(ThreadPoolExecutor.java:617)
    [junit4] 2> at java.lang.Thread.run(Thread.java:745)
    [junit4] 2>
    [junit4] 2> Jun 13, 2016 10:03:51 AM com.carrotsearch.randomizedtesting.ThreadLeakControl checkThreadLeaks
    [junit4] 2> WARNING: Will linger awaiting termination of 2 leaked thread(s).
    [junit4] 2> 1249309 WARN (cdcr-update-log-synchronizer-4498-thread-1) [n:127.0.0.1:54270_ c:source_collection s:shard2 r:core_node1 x:source_collection_shard2_replica2] o.a.s.h.CdcrUpdateLogSynchronizer Couldn't get last processed version from leader http://127.0.0.1:54246/source_collection_shard2_replica1/: Server refused connection at: http://127.0.0.1:54246/source_collection_shard2_replica1
    [junit4] 2> NOTE: test params are: codec=Asserting(Lucene62): {_version_=PostingsFormat(name=LuceneVarGapDocFreqInterval), id=PostingsFormat(name=MockRandom)}, docValues:{}, maxPointsInLeafNode=1712, maxMBSortInHeap=6.959028758103832, sim=ClassicSimilarity, locale=es-PE, timezone=America/Lower_Princes
    [junit4] 2> NOTE: Windows 10 10.0 x86/Oracle Corporation 1.8.0_92 (32-bit)/cpus=3,threads=1,free=148279952,total=536870912
    [junit4] 2> NOTE: All tests run in this JVM: [TestQuerySenderListener, SolrCoreCheckLockOnStartupTest, TestDistributedGrouping, TestCrossCoreJoin, TestInitParams, TestSchemaNameResource, TestRealTimeGet, TestSubQueryTransformerDistrib, BlockJoinFacetRandomTest, TestRandomCollapseQParserPlugin, TestRebalanceLeaders, TestRuleBasedAuthorizationPlugin, DistributedQueueTest, TestFieldCacheReopen, LeaderInitiatedRecoveryOnShardRestartTest, TestClusterStateMutator, NoCacheHeaderTest, TestHighFrequencyDictionaryFactory, TestRandomFaceting, ConfigSetsAPITest, TestBadConfig, TestSolrDeletionPolicy2, DistributedQueryComponentOptimizationTest, ConnectionReuseTest, CacheHeaderTest, TestWriterPerf, SpellCheckComponentTest, AddBlockUpdateTest, LeaderFailoverAfterPartitionTest, TestCloudSchemaless, TestJoin, SharedFSAutoReplicaFailoverUtilsTest, TestFiltering, ZkSolrClientTest, TestLegacyFieldCache, TestSolrConfigHandlerCloud, ForceLeaderTest, OverseerTaskQueueTest, ClassificationUpdateProcessorFactoryTest, NotRequiredUniqueKeyTest, TestTrie, SolrIndexSplitterTest, HdfsTlogReplayBufferedWhileIndexingTest, TestConfigSets, TestOverriddenPrefixQueryForCustomFieldType, SmileWriterTest, MultiThreadedOCPTest, TestSolrIndexConfig, TestInitQParser, CoreAdminHandlerTest, CloudMLTQParserTest, MergeStrategyTest, DocExpirationUpdateProcessorFactoryTest, TestSolr4Spatial2, DirectUpdateHandlerOptimizeTest, CollectionTooManyReplicasTest, TestAuthorizationFramework, AliasIntegrationTest, BlobRepositoryCloudTest, DistributedTermsComponentTest, ConvertedLegacyTest, MultiTermTest, TestIndexSearcher, DebugComponentTest, TestDocBasedVersionConstraints, BigEndianAscendingWordDeserializerTest, FieldMutatingUpdateProcessorTest, TestSortingResponseWriter, TestStandardQParsers, TestFastOutputStream, HdfsWriteToMultipleCollectionsTest, TestFieldCollectionResource, BadIndexSchemaTest, RequestHandlersTest, TestLeaderInitiatedRecoveryThread, ResponseHeaderTest, TestRTGBase, TestGraphTermsQParserPlugin, TestExactStatsCache, CachingDirectoryFactoryTest, TestNonDefinedSimilarityFactory, DistributedFacetPivotSmallAdvancedTest, TestBinaryResponseWriter, TestFieldCacheVsDocValues, ResourceLoaderTest, TestBulkSchemaAPI, TestStressCloudBlindAtomicUpdates, TestSolrConfigHandler, TestBlobHandler, SuggesterTSTTest, TestRangeQuery, ZkNodePropsTest, TestRequestForwarding, TestReload, TestSizeLimitedDistributedMap, SuggesterWFSTTest, TestSimpleTrackingShardHandler, SolrPluginUtilsTest, TestBM25SimilarityFactory, TestSolrJ, TestSolrQueryParser, TestIndexingPerformance, CdcrReplicationHandlerTest, TestGraphMLResponseWriter, TestNamedUpdateProcessors, DistributedDebugComponentTest, TestCloudPivotFacet, HdfsRecoveryZkTest, TestFuzzyAnalyzedSuggestions, BlockDirectoryTest, FileUtilsTest, SearchHandlerTest, SynonymTokenizerTest, TestSerializedLuceneMatchVersion, TestManagedResourceStorage, AnalyticsQueryTest, TestPHPSerializedResponseWriter, PluginInfoTest, TestSolr4Spatial, TestJsonFacets, QueryParsingTest, SolrCmdDistributorTest, TestFoldingMultitermQuery, CdcrVersionReplicationTest]
    [junit4] 2> NOTE: reproduce with: ant test -Dtestcase=CdcrVersionReplicationTest -Dtests.seed=F29067D0C63F3C3 -Dtests.slow=true -Dtests.locale=es-PE -Dtests.timezone=America/Lower_Princes -Dtests.asserts=true -Dtests.file.encoding=UTF-8
    [junit4] ERROR 0.00s J1 | CdcrVersionReplicationTest (suite) <<<
    [junit4] > Throwable #1: java.lang.AssertionError: ObjectTracker found 1 object(s) that were not released!!! [InternalHttpClient]
    [junit4] > at __randomizedtesting.SeedInfo.seed([F29067D0C63F3C3]:0)
    [junit4] > at org.apache.solr.SolrTestCaseJ4.teardownTestCases(SolrTestCaseJ4.java:256)
    [junit4] > at java.lang.Thread.run(Thread.java:745)
    [junit4] Completed [275/614 (1!)] on J1 in 33.48s, 1 test, 1 failure <<< FAILURES!

[...truncated 1136 lines...]
BUILD FAILED
C:\Users\jenkins\workspace\Lucene-Solr-master-Windows\build.xml:740: The following error occurred while executing this line:
C:\Users\jenkins\workspace\Lucene-Solr-master-Windows\build.xml:684: The following error occurred while executing this line:
C:\Users\jenkins\workspace\Lucene-Solr-master-Windows\build.xml:59: The following error occurred while executing this line:
C:\Users\jenkins\workspace\Lucene-Solr-master-Windows\solr\build.xml:233: The following error occurred while executing this line:
C:\Users\jenkins\workspace\Lucene-Solr-master-Windows\solr\common-build.xml:531: The following error occurred while executing this line:
C:\Users\jenkins\workspace\Lucene-Solr-master-Windows\lucene\common-build.xml:1427: The following error occurred while executing this line:
C:\Users\jenkins\workspace\Lucene-Solr-master-Windows\lucene\common-build.xml:984: There were test failures: 614 suites (10 ignored), 2583 tests, 1 suite-level error, 126 ignored (82 assumptions) [seed: F29067D0C63F3C3]

Total time: 83 minutes 38 seconds
Build step 'Invoke Ant' marked build as failure
Archiving artifacts
[WARNINGS] Skipping publisher since build result is FAILURE
Recording test results
Email was triggered for: Failure - Any
Sending email for trigger: Failure - Any

Search Discussions

  • Policeman Jenkins Server at Jun 14, 2016 at 12:50 am
    Build: http://jenkins.thetaphi.de/job/Lucene-Solr-master-Windows/5909/
    Java: 64bit/jdk1.8.0_92 -XX:-UseCompressedOops -XX:+UseG1GC

    All tests passed

    Build Log:
    [...truncated 63144 lines...]
    -ecj-javadoc-lint-src:
         [mkdir] Created dir: C:\Users\jenkins\AppData\Local\Temp\ecj26987694
      [ecj-lint] Compiling 932 source files to C:\Users\jenkins\AppData\Local\Temp\ecj26987694
      [ecj-lint] invalid Class-Path header in manifest of jar file: C:\Users\jenkins\workspace\Lucene-Solr-master-Windows\solr\core\lib\org.restlet-2.3.0.jar
      [ecj-lint] invalid Class-Path header in manifest of jar file: C:\Users\jenkins\workspace\Lucene-Solr-master-Windows\solr\core\lib\org.restlet.ext.servlet-2.3.0.jar
      [ecj-lint] ----------
      [ecj-lint] 1. WARNING in C:\Users\jenkins\workspace\Lucene-Solr-master-Windows\solr\core\src\java\org\apache\solr\cloud\Assign.java (at line 101)
      [ecj-lint] Collections.sort(shardIdNames, (o1, o2) -> {
      [ecj-lint] ^^^^^^^^^^^
      [ecj-lint] (Recovered) Internal inconsistency detected during lambda shape analysis
      [ecj-lint] ----------
      [ecj-lint] 2. WARNING in C:\Users\jenkins\workspace\Lucene-Solr-master-Windows\solr\core\src\java\org\apache\solr\cloud\Assign.java (at line 101)
      [ecj-lint] Collections.sort(shardIdNames, (o1, o2) -> {
      [ecj-lint] ^^^^^^^^^^^
      [ecj-lint] (Recovered) Internal inconsistency detected during lambda shape analysis
      [ecj-lint] ----------
      [ecj-lint] 3. WARNING in C:\Users\jenkins\workspace\Lucene-Solr-master-Windows\solr\core\src\java\org\apache\solr\cloud\Assign.java (at line 101)
      [ecj-lint] Collections.sort(shardIdNames, (o1, o2) -> {
      [ecj-lint] ^^^^^^^^^^^
      [ecj-lint] (Recovered) Internal inconsistency detected during lambda shape analysis
      [ecj-lint] ----------
      [ecj-lint] ----------
      [ecj-lint] 4. WARNING in C:\Users\jenkins\workspace\Lucene-Solr-master-Windows\solr\core\src\java\org\apache\solr\cloud\rule\ReplicaAssigner.java (at line 213)
      [ecj-lint] Collections.sort(sortedLiveNodes, (n1, n2) -> {
      [ecj-lint] ^^^^^^^^^^^
      [ecj-lint] (Recovered) Internal inconsistency detected during lambda shape analysis
      [ecj-lint] ----------
      [ecj-lint] 5. WARNING in C:\Users\jenkins\workspace\Lucene-Solr-master-Windows\solr\core\src\java\org\apache\solr\cloud\rule\ReplicaAssigner.java (at line 213)
      [ecj-lint] Collections.sort(sortedLiveNodes, (n1, n2) -> {
      [ecj-lint] ^^^^^^^^^^^
      [ecj-lint] (Recovered) Internal inconsistency detected during lambda shape analysis
      [ecj-lint] ----------
      [ecj-lint] 6. WARNING in C:\Users\jenkins\workspace\Lucene-Solr-master-Windows\solr\core\src\java\org\apache\solr\cloud\rule\ReplicaAssigner.java (at line 213)
      [ecj-lint] Collections.sort(sortedLiveNodes, (n1, n2) -> {
      [ecj-lint] ^^^^^^^^^^^
      [ecj-lint] (Recovered) Internal inconsistency detected during lambda shape analysis
      [ecj-lint] ----------
      [ecj-lint] ----------
      [ecj-lint] 7. ERROR in C:\Users\jenkins\workspace\Lucene-Solr-master-Windows\solr\core\src\java\org\apache\solr\core\HdfsDirectoryFactory.java (at line 34)
      [ecj-lint] import org.apache.hadoop.fs.FsStatus;
      [ecj-lint] ^^^^^^^^^^^^^^^^^^^^^^^^^^^^^
      [ecj-lint] The import org.apache.hadoop.fs.FsStatus is never used
      [ecj-lint] ----------
      [ecj-lint] 8. WARNING in C:\Users\jenkins\workspace\Lucene-Solr-master-Windows\solr\core\src\java\org\apache\solr\core\HdfsDirectoryFactory.java (at line 227)
      [ecj-lint] dir = new BlockDirectory(path, hdfsDir, cache, null, blockCacheReadEnabled, false, cacheMerges, cacheReadOnce);
      [ecj-lint] ^^^^^^^^^^^^^^^^^^^^^^^^^^^^^^^^^^^^^^^^^^^^^^^^^^^^^^^^^^^^^^^^^^^^^^^^^^^^^^^^^^^^^^^^^^^^^^^^^^^^^^^^^^^^^^
      [ecj-lint] Resource leak: 'dir' is never closed
      [ecj-lint] ----------
      [ecj-lint] ----------
      [ecj-lint] 9. WARNING in C:\Users\jenkins\workspace\Lucene-Solr-master-Windows\solr\core\src\java\org\apache\solr\handler\AnalysisRequestHandlerBase.java (at line 120)
      [ecj-lint] reader = cfiltfac.create(reader);
      [ecj-lint] ^^^^^^^^^^^^^^^^^^^^^^^^^^^^^^^^
      [ecj-lint] Resource leak: 'reader' is not closed at this location
      [ecj-lint] ----------
      [ecj-lint] 10. WARNING in C:\Users\jenkins\workspace\Lucene-Solr-master-Windows\solr\core\src\java\org\apache\solr\handler\AnalysisRequestHandlerBase.java (at line 144)
      [ecj-lint] return namedList;
      [ecj-lint] ^^^^^^^^^^^^^^^^^
      [ecj-lint] Resource leak: 'listBasedTokenStream' is not closed at this location
      [ecj-lint] ----------
      [ecj-lint] ----------
      [ecj-lint] 11. ERROR in C:\Users\jenkins\workspace\Lucene-Solr-master-Windows\solr\core\src\java\org\apache\solr\handler\ReplicationHandler.java (at line 79)
      [ecj-lint] import org.apache.solr.core.DirectoryFactory;
      [ecj-lint] ^^^^^^^^^^^^^^^^^^^^^^^^^^^^^^^^^^^^^
      [ecj-lint] The import org.apache.solr.core.DirectoryFactory is never used
      [ecj-lint] ----------
      [ecj-lint] 12. WARNING in C:\Users\jenkins\workspace\Lucene-Solr-master-Windows\solr\core\src\java\org\apache\solr\handler\ReplicationHandler.java (at line 1194)
      [ecj-lint] DirectoryReader reader = s==null ? null : s.get().getIndexReader();
      [ecj-lint] ^^^^^^
      [ecj-lint] Resource leak: 'reader' is never closed
      [ecj-lint] ----------
      [ecj-lint] ----------
      [ecj-lint] 13. WARNING in C:\Users\jenkins\workspace\Lucene-Solr-master-Windows\solr\core\src\java\org\apache\solr\handler\SQLHandler.java (at line 254)
      [ecj-lint] ParallelStream parallelStream = new ParallelStream(workerZkHost, workerCollection, tupleStream, numWorkers, comp);
      [ecj-lint] ^^^^^^^^^^^^^^
      [ecj-lint] Resource leak: 'parallelStream' is never closed
      [ecj-lint] ----------
      [ecj-lint] 14. WARNING in C:\Users\jenkins\workspace\Lucene-Solr-master-Windows\solr\core\src\java\org\apache\solr\handler\SQLHandler.java (at line 393)
      [ecj-lint] ParallelStream parallelStream = new ParallelStream(workerZkHost, workerCollection, tupleStream, numWorkers, comp);
      [ecj-lint] ^^^^^^^^^^^^^^
      [ecj-lint] Resource leak: 'parallelStream' is never closed
      [ecj-lint] ----------
      [ecj-lint] ----------
      [ecj-lint] 15. WARNING in C:\Users\jenkins\workspace\Lucene-Solr-master-Windows\solr\core\src\java\org\apache\solr\handler\component\ExpandComponent.java (at line 223)
      [ecj-lint] UninvertingReader uninvertingReader = new UninvertingReader(new ReaderWrapper(searcher.getLeafReader(), field), mapping);
      [ecj-lint] ^^^^^^^^^^^^^^^^^
      [ecj-lint] Resource leak: 'uninvertingReader' is never closed
      [ecj-lint] ----------
      [ecj-lint] ----------
      [ecj-lint] 16. WARNING in C:\Users\jenkins\workspace\Lucene-Solr-master-Windows\solr\core\src\java\org\apache\solr\highlight\DefaultSolrHighlighter.java (at line 544)
      [ecj-lint] tvWindowStream = new OffsetWindowTokenFilter(tvStream);
      [ecj-lint] ^^^^^^^^^^^^^^^^^^^^^^^^^^^^^^^^^^^^^^^^^^^^^^^^^^^^^^
      [ecj-lint] Resource leak: 'tvWindowStream' is never closed
      [ecj-lint] ----------
      [ecj-lint] ----------
      [ecj-lint] 17. WARNING in C:\Users\jenkins\workspace\Lucene-Solr-master-Windows\solr\core\src\java\org\apache\solr\request\SimpleFacets.java (at line 829)
      [ecj-lint] fastForRandomSet = new HashDocSet(sset.getDocs(), 0, sset.size());
      [ecj-lint] ^^^^^^^^^^^^^^^^^^^^^^^^^^^^^^^^^^^^^^^^^^^^^^^^^^^^^^^^^^^^^^^^^
      [ecj-lint] Resource leak: 'fastForRandomSet' is never closed
      [ecj-lint] ----------
      [ecj-lint] ----------
      [ecj-lint] 18. WARNING in C:\Users\jenkins\workspace\Lucene-Solr-master-Windows\solr\core\src\java\org\apache\solr\schema\OpenExchangeRatesOrgProvider.java (at line 146)
      [ecj-lint] ratesJsonStream = resourceLoader.openResource(ratesFileLocation);
      [ecj-lint] ^^^^^^^^^^^^^^^^^^^^^^^^^^^^^^^^^^^^^^^^^^^^^^^^^^^^^^^^^^^^^^^^
      [ecj-lint] Resource leak: 'ratesJsonStream' is not closed at this location
      [ecj-lint] ----------
      [ecj-lint] ----------
      [ecj-lint] 19. WARNING in C:\Users\jenkins\workspace\Lucene-Solr-master-Windows\solr\core\src\java\org\apache\solr\search\CollapsingQParserPlugin.java (at line 1187)
      [ecj-lint] UninvertingReader uninvertingReader = new UninvertingReader(new ReaderWrapper(searcher.getLeafReader(), collapseField), mapping);
      [ecj-lint] ^^^^^^^^^^^^^^^^^
      [ecj-lint] Resource leak: 'uninvertingReader' is never closed
      [ecj-lint] ----------
      [ecj-lint] ----------
      [ecj-lint] 20. WARNING in C:\Users\jenkins\workspace\Lucene-Solr-master-Windows\solr\core\src\java\org\apache\solr\search\DocSlice.java (at line 145)
      [ecj-lint] HashDocSet h = new HashDocSet(docs,offset,len);
      [ecj-lint] ^
      [ecj-lint] Resource leak: 'h' is never closed
      [ecj-lint] ----------
      [ecj-lint] 21. WARNING in C:\Users\jenkins\workspace\Lucene-Solr-master-Windows\solr\core\src\java\org\apache\solr\search\DocSlice.java (at line 154)
      [ecj-lint] HashDocSet h = new HashDocSet(docs,offset,len);
      [ecj-lint] ^
      [ecj-lint] Resource leak: 'h' is never closed
      [ecj-lint] ----------
      [ecj-lint] 22. WARNING in C:\Users\jenkins\workspace\Lucene-Solr-master-Windows\solr\core\src\java\org\apache\solr\search\DocSlice.java (at line 163)
      [ecj-lint] HashDocSet h = new HashDocSet(docs,offset,len);
      [ecj-lint] ^
      [ecj-lint] Resource leak: 'h' is never closed
      [ecj-lint] ----------
      [ecj-lint] ----------
      [ecj-lint] 23. WARNING in C:\Users\jenkins\workspace\Lucene-Solr-master-Windows\solr\core\src\java\org\apache\solr\search\function\OrdFieldSource.java (at line 78)
      [ecj-lint] SolrIndexSearcher is = (SolrIndexSearcher) o;
      [ecj-lint] ^^
      [ecj-lint] Resource leak: 'is' is never closed
      [ecj-lint] ----------
      [ecj-lint] ----------
      [ecj-lint] 24. WARNING in C:\Users\jenkins\workspace\Lucene-Solr-master-Windows\solr\core\src\java\org\apache\solr\search\function\ReverseOrdFieldSource.java (at line 78)
      [ecj-lint] SolrIndexSearcher is = (SolrIndexSearcher) o;
      [ecj-lint] ^^
      [ecj-lint] Resource leak: 'is' is never closed
      [ecj-lint] ----------
      [ecj-lint] ----------
      [ecj-lint] 25. WARNING in C:\Users\jenkins\workspace\Lucene-Solr-master-Windows\solr\core\src\java\org\apache\solr\servlet\SolrDispatchFilter.java (at line 184)
      [ecj-lint] throw new SolrException(ErrorCode.SERVER_ERROR, "Error occurred while loading solr.xml from zookeeper", e);
      [ecj-lint] ^^^^^^^^^^^^^^^^^^^^^^^^^^^^^^^^^^^^^^^^^^^^^^^^^^^^^^^^^^^^^^^^^^^^^^^^^^^^^^^^^^^^^^^^^^^^^^^^^^^^^^^^^^^
      [ecj-lint] Resource leak: 'loader' is not closed at this location
      [ecj-lint] ----------
      [ecj-lint] ----------
      [ecj-lint] 26. WARNING in C:\Users\jenkins\workspace\Lucene-Solr-master-Windows\solr\core\src\java\org\apache\solr\update\CdcrTransactionLog.java (at line 98)
      [ecj-lint] ChannelFastInputStream is = new ChannelFastInputStream(channel, pos);
      [ecj-lint] ^^
      [ecj-lint] Resource leak: 'is' is never closed
      [ecj-lint] ----------
      [ecj-lint] ----------
      [ecj-lint] 27. WARNING in C:\Users\jenkins\workspace\Lucene-Solr-master-Windows\solr\core\src\java\org\apache\solr\update\TransactionLog.java (at line 226)
      [ecj-lint] ChannelFastInputStream is = new ChannelFastInputStream(channel, pos);
      [ecj-lint] ^^
      [ecj-lint] Resource leak: 'is' is never closed
      [ecj-lint] ----------
      [ecj-lint] 28. WARNING in C:\Users\jenkins\workspace\Lucene-Solr-master-Windows\solr\core\src\java\org\apache\solr\update\TransactionLog.java (at line 226)
      [ecj-lint] ChannelFastInputStream is = new ChannelFastInputStream(channel, pos);
      [ecj-lint] ^^
      [ecj-lint] Resource leak: 'is' is never closed
      [ecj-lint] ----------
      [ecj-lint] ----------
      [ecj-lint] 29. WARNING in C:\Users\jenkins\workspace\Lucene-Solr-master-Windows\solr\core\src\java\org\apache\solr\util\SimplePostTool.java (at line 640)
      [ecj-lint] BAOS bos = new BAOS();
      [ecj-lint] ^^^
      [ecj-lint] Resource leak: 'bos' is never closed
      [ecj-lint] ----------
      [ecj-lint] 30. WARNING in C:\Users\jenkins\workspace\Lucene-Solr-master-Windows\solr\core\src\java\org\apache\solr\util\SimplePostTool.java (at line 640)
      [ecj-lint] BAOS bos = new BAOS();
      [ecj-lint] ^^^
      [ecj-lint] Resource leak: 'bos' is never closed
      [ecj-lint] ----------
      [ecj-lint] ----------
      [ecj-lint] 31. WARNING in C:\Users\jenkins\workspace\Lucene-Solr-master-Windows\solr\core\src\java\org\apache\solr\util\SolrLogLayout.java (at line 149)
      [ecj-lint] SolrQueryRequest req = requestInfo == null ? null : requestInfo.getReq();
      [ecj-lint] ^^^
      [ecj-lint] Resource leak: 'req' is never closed
      [ecj-lint] ----------
      [ecj-lint] 31 problems (2 errors, 29 warnings)

    BUILD FAILED
    C:\Users\jenkins\workspace\Lucene-Solr-master-Windows\build.xml:740: The following error occurred while executing this line:
    C:\Users\jenkins\workspace\Lucene-Solr-master-Windows\build.xml:101: The following error occurred while executing this line:
    C:\Users\jenkins\workspace\Lucene-Solr-master-Windows\solr\build.xml:652: The following error occurred while executing this line:
    C:\Users\jenkins\workspace\Lucene-Solr-master-Windows\lucene\common-build.xml:1976: The following error occurred while executing this line:
    C:\Users\jenkins\workspace\Lucene-Solr-master-Windows\lucene\common-build.xml:2015: Compile failed; see the compiler error output for details.

    Total time: 97 minutes 54 seconds
    Build step 'Invoke Ant' marked build as failure
    Archiving artifacts
    [WARNINGS] Skipping publisher since build result is FAILURE
    Recording test results
    Email was triggered for: Failure - Any
    Sending email for trigger: Failure - Any

Related Discussions

Discussion Navigation
viewthread | post
Discussion Overview
groupdev @
categorieslucene
postedJun 13, '16 at 10:44a
activeJun 14, '16 at 12:50a
posts2
users1
websitelucene.apache.org

1 user in discussion

Policeman Jenkins Server: 2 posts

People

Translate

site design / logo © 2021 Grokbase