Grokbase Groups Lucene dev June 2016
FAQ
Build: http://jenkins.thetaphi.de/job/Lucene-Solr-master-Linux/16972/
Java: 64bit/jdk1.8.0_92 -XX:-UseCompressedOops -XX:+UseParallelGC

3 tests failed.
FAILED: org.apache.solr.cloud.TestTolerantUpdateProcessorCloud.testAddsMixedWithDeletesViaNoCollectionClient

Error Message:
Error from server at https://127.0.0.1:36157/solr/test_col: Expected mime type application/octet-stream but got text/html. <html> <head> <meta http-equiv="Content-Type" content="text/html;charset=ISO-8859-1"/> <title>Error 500 </title> </head> <body> <h2>HTTP ERROR: 500</h2> <p>Problem accessing /solr/test_col/update. Reason: <pre> {msg=GC overhead limit exceeded,trace=java.lang.OutOfMemoryError: GC overhead limit exceeded at java.util.concurrent.ConcurrentHashMap.entrySet(ConcurrentHashMap.java:1276) at org.apache.http.params.BasicHttpParams.copyParams(BasicHttpParams.java:176) at org.apache.http.params.BasicHttpParams.clone(BasicHttpParams.java:164) at org.apache.http.params.BasicHttpParams.copy(BasicHttpParams.java:151) at org.apache.http.client.methods.HttpRequestWrapper.getParams(HttpRequestWrapper.java:203) at org.apache.http.impl.execchain.ProtocolExec.execute(ProtocolExec.java:133) at org.apache.http.impl.execchain.RetryExec.execute(RetryExec.java:88) at org.apache.http.impl.execchain.RedirectExec.execute(RedirectExec.java:110) at org.apache.http.impl.client.InternalHttpClient.doExecute(InternalHttpClient.java:184) at org.apache.http.impl.client.CloseableHttpClient.execute(CloseableHttpClient.java:82) at org.apache.http.impl.client.CloseableHttpClient.execute(CloseableHttpClient.java:55) at org.apache.solr.servlet.HttpSolrCall.remoteQuery(HttpSolrCall.java:566) at org.apache.solr.servlet.HttpSolrCall.call(HttpSolrCall.java:449) at org.apache.solr.servlet.SolrDispatchFilter.doFilter(SolrDispatchFilter.java:257) at org.apache.solr.servlet.SolrDispatchFilter.doFilter(SolrDispatchFilter.java:208) at org.eclipse.jetty.servlet.ServletHandler$CachedChain.doFilter(ServletHandler.java:1676) at org.apache.solr.client.solrj.embedded.JettySolrRunner$DebugFilter.doFilter(JettySolrRunner.java:111) at org.eclipse.jetty.servlet.ServletHandler$CachedChain.doFilter(ServletHandler.java:1676) at org.eclipse.jetty.servlet.ServletHandler.doHandle(ServletHandler.java:581) at org.eclipse.jetty.server.session.SessionHandler.doHandle(SessionHandler.java:224) at org.eclipse.jetty.server.handler.ContextHandler.doHandle(ContextHandler.java:1160) at org.eclipse.jetty.servlet.ServletHandler.doScope(ServletHandler.java:511) at org.eclipse.jetty.server.session.SessionHandler.doScope(SessionHandler.java:185) at org.eclipse.jetty.server.handler.ContextHandler.doScope(ContextHandler.java:1092) at org.eclipse.jetty.server.handler.ScopedHandler.handle(ScopedHandler.java:141) at org.eclipse.jetty.server.handler.gzip.GzipHandler.handle(GzipHandler.java:399) at org.eclipse.jetty.server.handler.HandlerWrapper.handle(HandlerWrapper.java:134) at org.eclipse.jetty.server.Server.handle(Server.java:518) at org.eclipse.jetty.server.HttpChannel.handle(HttpChannel.java:308) at org.eclipse.jetty.server.HttpConnection.onFillable(HttpConnection.java:244) at org.eclipse.jetty.io.AbstractConnection$ReadCallback.succeeded(AbstractConnection.java:273) at org.eclipse.jetty.io.FillInterest.fillable(FillInterest.java:95) ,code=500}</pre></p> <hr /><a href="http://eclipse.org/jetty">Powered by Jetty:// 9.3.8.v20160314</a><hr/> </body> </html>

Stack Trace:
org.apache.solr.client.solrj.impl.HttpSolrClient$RemoteSolrException: Error from server at https://127.0.0.1:36157/solr/test_col: Expected mime type application/octet-stream but got text/html. <html>
<head>
<meta http-equiv="Content-Type" content="text/html;charset=ISO-8859-1"/>
<title>Error 500 </title>
</head>
<body>
<h2>HTTP ERROR: 500</h2>
<p>Problem accessing /solr/test_col/update. Reason:
<pre> {msg=GC overhead limit exceeded,trace=java.lang.OutOfMemoryError: GC overhead limit exceeded
  at java.util.concurrent.ConcurrentHashMap.entrySet(ConcurrentHashMap.java:1276)
  at org.apache.http.params.BasicHttpParams.copyParams(BasicHttpParams.java:176)
  at org.apache.http.params.BasicHttpParams.clone(BasicHttpParams.java:164)
  at org.apache.http.params.BasicHttpParams.copy(BasicHttpParams.java:151)
  at org.apache.http.client.methods.HttpRequestWrapper.getParams(HttpRequestWrapper.java:203)
  at org.apache.http.impl.execchain.ProtocolExec.execute(ProtocolExec.java:133)
  at org.apache.http.impl.execchain.RetryExec.execute(RetryExec.java:88)
  at org.apache.http.impl.execchain.RedirectExec.execute(RedirectExec.java:110)
  at org.apache.http.impl.client.InternalHttpClient.doExecute(InternalHttpClient.java:184)
  at org.apache.http.impl.client.CloseableHttpClient.execute(CloseableHttpClient.java:82)
  at org.apache.http.impl.client.CloseableHttpClient.execute(CloseableHttpClient.java:55)
  at org.apache.solr.servlet.HttpSolrCall.remoteQuery(HttpSolrCall.java:566)
  at org.apache.solr.servlet.HttpSolrCall.call(HttpSolrCall.java:449)
  at org.apache.solr.servlet.SolrDispatchFilter.doFilter(SolrDispatchFilter.java:257)
  at org.apache.solr.servlet.SolrDispatchFilter.doFilter(SolrDispatchFilter.java:208)
  at org.eclipse.jetty.servlet.ServletHandler$CachedChain.doFilter(ServletHandler.java:1676)
  at org.apache.solr.client.solrj.embedded.JettySolrRunner$DebugFilter.doFilter(JettySolrRunner.java:111)
  at org.eclipse.jetty.servlet.ServletHandler$CachedChain.doFilter(ServletHandler.java:1676)
  at org.eclipse.jetty.servlet.ServletHandler.doHandle(ServletHandler.java:581)
  at org.eclipse.jetty.server.session.SessionHandler.doHandle(SessionHandler.java:224)
  at org.eclipse.jetty.server.handler.ContextHandler.doHandle(ContextHandler.java:1160)
  at org.eclipse.jetty.servlet.ServletHandler.doScope(ServletHandler.java:511)
  at org.eclipse.jetty.server.session.SessionHandler.doScope(SessionHandler.java:185)
  at org.eclipse.jetty.server.handler.ContextHandler.doScope(ContextHandler.java:1092)
  at org.eclipse.jetty.server.handler.ScopedHandler.handle(ScopedHandler.java:141)
  at org.eclipse.jetty.server.handler.gzip.GzipHandler.handle(GzipHandler.java:399)
  at org.eclipse.jetty.server.handler.HandlerWrapper.handle(HandlerWrapper.java:134)
  at org.eclipse.jetty.server.Server.handle(Server.java:518)
  at org.eclipse.jetty.server.HttpChannel.handle(HttpChannel.java:308)
  at org.eclipse.jetty.server.HttpConnection.onFillable(HttpConnection.java:244)
  at org.eclipse.jetty.io.AbstractConnection$ReadCallback.succeeded(AbstractConnection.java:273)
  at org.eclipse.jetty.io.FillInterest.fillable(FillInterest.java:95)
,code=500}</pre></p>
<hr /><a href="http://eclipse.org/jetty">Powered by Jetty:// 9.3.8.v20160314</a><hr/>
</body>
[CBE03109F7964F8A:CA790065A05C638E]:0)
  at org.apache.solr.client.solrj.impl.HttpSolrClient.executeMethod(HttpSolrClient.java:574)
  at org.apache.solr.client.solrj.impl.HttpSolrClient.request(HttpSolrClient.java:259)
  at org.apache.solr.client.solrj.impl.HttpSolrClient.request(HttpSolrClient.java:248)
  at org.apache.solr.client.solrj.SolrRequest.process(SolrRequest.java:149)
  at org.apache.solr.client.solrj.SolrRequest.process(SolrRequest.java:166)
  at org.apache.solr.cloud.TestTolerantUpdateProcessorCloud.testAddsMixedWithDeletes(TestTolerantUpdateProcessorCloud.java:854)
  at org.apache.solr.cloud.TestTolerantUpdateProcessorCloud.testAddsMixedWithDeletesViaNoCollectionClient(TestTolerantUpdateProcessorCloud.java:813)
  at sun.reflect.NativeMethodAccessorImpl.invoke0(Native Method)
  at sun.reflect.NativeMethodAccessorImpl.invoke(NativeMethodAccessorImpl.java:62)
  at sun.reflect.DelegatingMethodAccessorImpl.invoke(DelegatingMethodAccessorImpl.java:43)
  at java.lang.reflect.Method.invoke(Method.java:498)
  at com.carrotsearch.randomizedtesting.RandomizedRunner.invoke(RandomizedRunner.java:1764)
  at com.carrotsearch.randomizedtesting.RandomizedRunner$8.evaluate(RandomizedRunner.java:871)
  at com.carrotsearch.randomizedtesting.RandomizedRunner$9.evaluate(RandomizedRunner.java:907)
  at com.carrotsearch.randomizedtesting.RandomizedRunner$10.evaluate(RandomizedRunner.java:921)
  at com.carrotsearch.randomizedtesting.rules.SystemPropertiesRestoreRule$1.evaluate(SystemPropertiesRestoreRule.java:57)
  at org.apache.lucene.util.TestRuleSetupTeardownChained$1.evaluate(TestRuleSetupTeardownChained.java:49)
  at org.apache.lucene.util.AbstractBeforeAfterRule$1.evaluate(AbstractBeforeAfterRule.java:45)
  at org.apache.lucene.util.TestRuleThreadAndTestName$1.evaluate(TestRuleThreadAndTestName.java:48)
  at org.apache.lucene.util.TestRuleIgnoreAfterMaxFailures$1.evaluate(TestRuleIgnoreAfterMaxFailures.java:64)
  at org.apache.lucene.util.TestRuleMarkFailure$1.evaluate(TestRuleMarkFailure.java:47)
  at com.carrotsearch.randomizedtesting.rules.StatementAdapter.evaluate(StatementAdapter.java:36)
  at com.carrotsearch.randomizedtesting.ThreadLeakControl$StatementRunner.run(ThreadLeakControl.java:367)
  at com.carrotsearch.randomizedtesting.ThreadLeakControl.forkTimeoutingTask(ThreadLeakControl.java:809)
  at com.carrotsearch.randomizedtesting.ThreadLeakControl$3.evaluate(ThreadLeakControl.java:460)
  at com.carrotsearch.randomizedtesting.RandomizedRunner.runSingleTest(RandomizedRunner.java:880)
  at com.carrotsearch.randomizedtesting.RandomizedRunner$5.evaluate(RandomizedRunner.java:781)
  at com.carrotsearch.randomizedtesting.RandomizedRunner$6.evaluate(RandomizedRunner.java:816)
  at com.carrotsearch.randomizedtesting.RandomizedRunner$7.evaluate(RandomizedRunner.java:827)
  at com.carrotsearch.randomizedtesting.rules.StatementAdapter.evaluate(StatementAdapter.java:36)
  at com.carrotsearch.randomizedtesting.rules.SystemPropertiesRestoreRule$1.evaluate(SystemPropertiesRestoreRule.java:57)
  at org.apache.lucene.util.AbstractBeforeAfterRule$1.evaluate(AbstractBeforeAfterRule.java:45)
  at com.carrotsearch.randomizedtesting.rules.StatementAdapter.evaluate(StatementAdapter.java:36)
  at org.apache.lucene.util.TestRuleStoreClassName$1.evaluate(TestRuleStoreClassName.java:41)
  at com.carrotsearch.randomizedtesting.rules.NoShadowingOrOverridesOnMethodsRule$1.evaluate(NoShadowingOrOverridesOnMethodsRule.java:40)
  at com.carrotsearch.randomizedtesting.rules.NoShadowingOrOverridesOnMethodsRule$1.evaluate(NoShadowingOrOverridesOnMethodsRule.java:40)
  at com.carrotsearch.randomizedtesting.rules.StatementAdapter.evaluate(StatementAdapter.java:36)
  at com.carrotsearch.randomizedtesting.rules.StatementAdapter.evaluate(StatementAdapter.java:36)
  at com.carrotsearch.randomizedtesting.rules.StatementAdapter.evaluate(StatementAdapter.java:36)
  at org.apache.lucene.util.TestRuleAssertionsRequired$1.evaluate(TestRuleAssertionsRequired.java:53)
  at org.apache.lucene.util.TestRuleMarkFailure$1.evaluate(TestRuleMarkFailure.java:47)
  at org.apache.lucene.util.TestRuleIgnoreAfterMaxFailures$1.evaluate(TestRuleIgnoreAfterMaxFailures.java:64)
  at org.apache.lucene.util.TestRuleIgnoreTestSuites$1.evaluate(TestRuleIgnoreTestSuites.java:54)
  at com.carrotsearch.randomizedtesting.rules.StatementAdapter.evaluate(StatementAdapter.java:36)
  at com.carrotsearch.randomizedtesting.ThreadLeakControl$StatementRunner.run(ThreadLeakControl.java:367)
  at java.lang.Thread.run(Thread.java:745)


FAILED: org.apache.solr.cloud.TestTolerantUpdateProcessorCloud.testVariousDeletesViaShard2LeaderClient

Error Message:
Timeout occured while waiting response from server at: https://127.0.0.1:41192/solr/test_col

Stack Trace:
org.apache.solr.client.solrj.SolrServerException: Timeout occured while waiting response from server at: https://127.0.0.1:41192/solr/test_col
  at __randomizedtesting.SeedInfo.seed([CBE03109F7964F8A:82598543C0AC8AAF]:0)
  at org.apache.solr.client.solrj.impl.HttpSolrClient.executeMethod(HttpSolrClient.java:617)
  at org.apache.solr.client.solrj.impl.HttpSolrClient.request(HttpSolrClient.java:259)
  at org.apache.solr.client.solrj.impl.HttpSolrClient.request(HttpSolrClient.java:248)
  at org.apache.solr.client.solrj.impl.LBHttpSolrClient.doRequest(LBHttpSolrClient.java:413)
  at org.apache.solr.client.solrj.impl.LBHttpSolrClient.request(LBHttpSolrClient.java:366)
  at org.apache.solr.client.solrj.impl.CloudSolrClient.sendRequest(CloudSolrClient.java:1228)
  at org.apache.solr.client.solrj.impl.CloudSolrClient.requestWithRetryOnStaleState(CloudSolrClient.java:998)
  at org.apache.solr.client.solrj.impl.CloudSolrClient.request(CloudSolrClient.java:934)
  at org.apache.solr.client.solrj.SolrRequest.process(SolrRequest.java:149)
  at org.apache.solr.client.solrj.SolrClient.commit(SolrClient.java:484)
  at org.apache.solr.client.solrj.SolrClient.commit(SolrClient.java:463)
  at org.apache.solr.cloud.TestTolerantUpdateProcessorCloud.clearCollection(TestTolerantUpdateProcessorCloud.java:226)
  at sun.reflect.NativeMethodAccessorImpl.invoke0(Native Method)
  at sun.reflect.NativeMethodAccessorImpl.invoke(NativeMethodAccessorImpl.java:62)
  at sun.reflect.DelegatingMethodAccessorImpl.invoke(DelegatingMethodAccessorImpl.java:43)
  at java.lang.reflect.Method.invoke(Method.java:498)
  at com.carrotsearch.randomizedtesting.RandomizedRunner.invoke(RandomizedRunner.java:1764)
  at com.carrotsearch.randomizedtesting.RandomizedRunner$9.evaluate(RandomizedRunner.java:905)
  at com.carrotsearch.randomizedtesting.RandomizedRunner$10.evaluate(RandomizedRunner.java:921)
  at com.carrotsearch.randomizedtesting.rules.SystemPropertiesRestoreRule$1.evaluate(SystemPropertiesRestoreRule.java:57)
  at org.apache.lucene.util.TestRuleSetupTeardownChained$1.evaluate(TestRuleSetupTeardownChained.java:49)
  at org.apache.lucene.util.AbstractBeforeAfterRule$1.evaluate(AbstractBeforeAfterRule.java:45)
  at org.apache.lucene.util.TestRuleThreadAndTestName$1.evaluate(TestRuleThreadAndTestName.java:48)
  at org.apache.lucene.util.TestRuleIgnoreAfterMaxFailures$1.evaluate(TestRuleIgnoreAfterMaxFailures.java:64)
  at org.apache.lucene.util.TestRuleMarkFailure$1.evaluate(TestRuleMarkFailure.java:47)
  at com.carrotsearch.randomizedtesting.rules.StatementAdapter.evaluate(StatementAdapter.java:36)
  at com.carrotsearch.randomizedtesting.ThreadLeakControl$StatementRunner.run(ThreadLeakControl.java:367)
  at com.carrotsearch.randomizedtesting.ThreadLeakControl.forkTimeoutingTask(ThreadLeakControl.java:809)
  at com.carrotsearch.randomizedtesting.ThreadLeakControl$3.evaluate(ThreadLeakControl.java:460)
  at com.carrotsearch.randomizedtesting.RandomizedRunner.runSingleTest(RandomizedRunner.java:880)
  at com.carrotsearch.randomizedtesting.RandomizedRunner$5.evaluate(RandomizedRunner.java:781)
  at com.carrotsearch.randomizedtesting.RandomizedRunner$6.evaluate(RandomizedRunner.java:816)
  at com.carrotsearch.randomizedtesting.RandomizedRunner$7.evaluate(RandomizedRunner.java:827)
  at com.carrotsearch.randomizedtesting.rules.StatementAdapter.evaluate(StatementAdapter.java:36)
  at com.carrotsearch.randomizedtesting.rules.SystemPropertiesRestoreRule$1.evaluate(SystemPropertiesRestoreRule.java:57)
  at org.apache.lucene.util.AbstractBeforeAfterRule$1.evaluate(AbstractBeforeAfterRule.java:45)
  at com.carrotsearch.randomizedtesting.rules.StatementAdapter.evaluate(StatementAdapter.java:36)
  at org.apache.lucene.util.TestRuleStoreClassName$1.evaluate(TestRuleStoreClassName.java:41)
  at com.carrotsearch.randomizedtesting.rules.NoShadowingOrOverridesOnMethodsRule$1.evaluate(NoShadowingOrOverridesOnMethodsRule.java:40)
  at com.carrotsearch.randomizedtesting.rules.NoShadowingOrOverridesOnMethodsRule$1.evaluate(NoShadowingOrOverridesOnMethodsRule.java:40)
  at com.carrotsearch.randomizedtesting.rules.StatementAdapter.evaluate(StatementAdapter.java:36)
  at com.carrotsearch.randomizedtesting.rules.StatementAdapter.evaluate(StatementAdapter.java:36)
  at com.carrotsearch.randomizedtesting.rules.StatementAdapter.evaluate(StatementAdapter.java:36)
  at org.apache.lucene.util.TestRuleAssertionsRequired$1.evaluate(TestRuleAssertionsRequired.java:53)
  at org.apache.lucene.util.TestRuleMarkFailure$1.evaluate(TestRuleMarkFailure.java:47)
  at org.apache.lucene.util.TestRuleIgnoreAfterMaxFailures$1.evaluate(TestRuleIgnoreAfterMaxFailures.java:64)
  at org.apache.lucene.util.TestRuleIgnoreTestSuites$1.evaluate(TestRuleIgnoreTestSuites.java:54)
  at com.carrotsearch.randomizedtesting.rules.StatementAdapter.evaluate(StatementAdapter.java:36)
  at com.carrotsearch.randomizedtesting.ThreadLeakControl$StatementRunner.run(ThreadLeakControl.java:367)
  at java.lang.Thread.run(Thread.java:745)
Caused by: java.net.SocketTimeoutException: Read timed out
  at java.net.SocketInputStream.socketRead0(Native Method)
  at java.net.SocketInputStream.socketRead(SocketInputStream.java:116)
  at java.net.SocketInputStream.read(SocketInputStream.java:170)
  at java.net.SocketInputStream.read(SocketInputStream.java:141)
  at sun.security.ssl.InputRecord.readFully(InputRecord.java:465)
  at sun.security.ssl.InputRecord.read(InputRecord.java:503)
  at sun.security.ssl.SSLSocketImpl.readRecord(SSLSocketImpl.java:973)
  at sun.security.ssl.SSLSocketImpl.readDataRecord(SSLSocketImpl.java:930)
  at sun.security.ssl.AppInputStream.read(AppInputStream.java:105)
  at org.apache.http.impl.io.SessionInputBufferImpl.streamRead(SessionInputBufferImpl.java:139)
  at org.apache.http.impl.io.SessionInputBufferImpl.fillBuffer(SessionInputBufferImpl.java:155)
  at org.apache.http.impl.io.SessionInputBufferImpl.readLine(SessionInputBufferImpl.java:284)
  at org.apache.http.impl.conn.DefaultHttpResponseParser.parseHead(DefaultHttpResponseParser.java:140)
  at org.apache.http.impl.conn.DefaultHttpResponseParser.parseHead(DefaultHttpResponseParser.java:57)
  at org.apache.http.impl.io.AbstractMessageParser.parse(AbstractMessageParser.java:261)
  at org.apache.http.impl.DefaultBHttpClientConnection.receiveResponseHeader(DefaultBHttpClientConnection.java:165)
  at org.apache.http.impl.conn.CPoolProxy.receiveResponseHeader(CPoolProxy.java:167)
  at org.apache.http.protocol.HttpRequestExecutor.doReceiveResponse(HttpRequestExecutor.java:272)
  at org.apache.http.protocol.HttpRequestExecutor.execute(HttpRequestExecutor.java:124)
  at org.apache.http.impl.execchain.MainClientExec.execute(MainClientExec.java:271)
  at org.apache.http.impl.execchain.ProtocolExec.execute(ProtocolExec.java:184)
  at org.apache.http.impl.execchain.RetryExec.execute(RetryExec.java:88)
  at org.apache.http.impl.execchain.RedirectExec.execute(RedirectExec.java:110)
  at org.apache.http.impl.client.InternalHttpClient.doExecute(InternalHttpClient.java:184)
  at org.apache.http.impl.client.CloseableHttpClient.execute(CloseableHttpClient.java:82)
  at org.apache.http.impl.client.CloseableHttpClient.execute(CloseableHttpClient.java:55)
  at org.apache.solr.client.solrj.impl.HttpSolrClient.executeMethod(HttpSolrClient.java:511)
  ... 49 more


FAILED: org.apache.solr.handler.component.DistributedFacetPivotLongTailTest.test

Error Message:
IOException occured when talking to server at: https://127.0.0.1:39797//collection1

Stack Trace:
org.apache.solr.client.solrj.SolrServerException: IOException occured when talking to server at: https://127.0.0.1:39797//collection1
  at __randomizedtesting.SeedInfo.seed([CBE03109F7964F8A:43B40ED3596A2272]:0)
  at org.apache.solr.client.solrj.impl.HttpSolrClient.executeMethod(HttpSolrClient.java:620)
  at org.apache.solr.client.solrj.impl.HttpSolrClient.request(HttpSolrClient.java:259)
  at org.apache.solr.client.solrj.impl.HttpSolrClient.request(HttpSolrClient.java:248)
  at org.apache.solr.client.solrj.SolrRequest.process(SolrRequest.java:149)
  at org.apache.solr.client.solrj.SolrClient.add(SolrClient.java:173)
  at org.apache.solr.client.solrj.SolrClient.add(SolrClient.java:138)
  at org.apache.solr.client.solrj.SolrClient.add(SolrClient.java:152)
  at org.apache.solr.handler.component.DistributedFacetPivotLongTailTest.test(DistributedFacetPivotLongTailTest.java:87)
  at sun.reflect.NativeMethodAccessorImpl.invoke0(Native Method)
  at sun.reflect.NativeMethodAccessorImpl.invoke(NativeMethodAccessorImpl.java:62)
  at sun.reflect.DelegatingMethodAccessorImpl.invoke(DelegatingMethodAccessorImpl.java:43)
  at java.lang.reflect.Method.invoke(Method.java:498)
  at com.carrotsearch.randomizedtesting.RandomizedRunner.invoke(RandomizedRunner.java:1764)
  at com.carrotsearch.randomizedtesting.RandomizedRunner$8.evaluate(RandomizedRunner.java:871)
  at com.carrotsearch.randomizedtesting.RandomizedRunner$9.evaluate(RandomizedRunner.java:907)
  at com.carrotsearch.randomizedtesting.RandomizedRunner$10.evaluate(RandomizedRunner.java:921)
  at org.apache.solr.BaseDistributedSearchTestCase$ShardsRepeatRule$ShardsFixedStatement.callStatement(BaseDistributedSearchTestCase.java:985)
  at org.apache.solr.BaseDistributedSearchTestCase$ShardsRepeatRule$ShardsStatement.evaluate(BaseDistributedSearchTestCase.java:960)
  at com.carrotsearch.randomizedtesting.rules.SystemPropertiesRestoreRule$1.evaluate(SystemPropertiesRestoreRule.java:57)
  at org.apache.lucene.util.TestRuleSetupTeardownChained$1.evaluate(TestRuleSetupTeardownChained.java:49)
  at org.apache.lucene.util.AbstractBeforeAfterRule$1.evaluate(AbstractBeforeAfterRule.java:45)
  at org.apache.lucene.util.TestRuleThreadAndTestName$1.evaluate(TestRuleThreadAndTestName.java:48)
  at org.apache.lucene.util.TestRuleIgnoreAfterMaxFailures$1.evaluate(TestRuleIgnoreAfterMaxFailures.java:64)
  at org.apache.lucene.util.TestRuleMarkFailure$1.evaluate(TestRuleMarkFailure.java:47)
  at com.carrotsearch.randomizedtesting.rules.StatementAdapter.evaluate(StatementAdapter.java:36)
  at com.carrotsearch.randomizedtesting.ThreadLeakControl$StatementRunner.run(ThreadLeakControl.java:367)
  at com.carrotsearch.randomizedtesting.ThreadLeakControl.forkTimeoutingTask(ThreadLeakControl.java:809)
  at com.carrotsearch.randomizedtesting.ThreadLeakControl$3.evaluate(ThreadLeakControl.java:460)
  at com.carrotsearch.randomizedtesting.RandomizedRunner.runSingleTest(RandomizedRunner.java:880)
  at com.carrotsearch.randomizedtesting.RandomizedRunner$5.evaluate(RandomizedRunner.java:781)
  at com.carrotsearch.randomizedtesting.RandomizedRunner$6.evaluate(RandomizedRunner.java:816)
  at com.carrotsearch.randomizedtesting.RandomizedRunner$7.evaluate(RandomizedRunner.java:827)
  at com.carrotsearch.randomizedtesting.rules.StatementAdapter.evaluate(StatementAdapter.java:36)
  at com.carrotsearch.randomizedtesting.rules.SystemPropertiesRestoreRule$1.evaluate(SystemPropertiesRestoreRule.java:57)
  at org.apache.lucene.util.AbstractBeforeAfterRule$1.evaluate(AbstractBeforeAfterRule.java:45)
  at com.carrotsearch.randomizedtesting.rules.StatementAdapter.evaluate(StatementAdapter.java:36)
  at org.apache.lucene.util.TestRuleStoreClassName$1.evaluate(TestRuleStoreClassName.java:41)
  at com.carrotsearch.randomizedtesting.rules.NoShadowingOrOverridesOnMethodsRule$1.evaluate(NoShadowingOrOverridesOnMethodsRule.java:40)
  at com.carrotsearch.randomizedtesting.rules.NoShadowingOrOverridesOnMethodsRule$1.evaluate(NoShadowingOrOverridesOnMethodsRule.java:40)
  at com.carrotsearch.randomizedtesting.rules.StatementAdapter.evaluate(StatementAdapter.java:36)
  at com.carrotsearch.randomizedtesting.rules.StatementAdapter.evaluate(StatementAdapter.java:36)
  at com.carrotsearch.randomizedtesting.rules.StatementAdapter.evaluate(StatementAdapter.java:36)
  at org.apache.lucene.util.TestRuleAssertionsRequired$1.evaluate(TestRuleAssertionsRequired.java:53)
  at org.apache.lucene.util.TestRuleMarkFailure$1.evaluate(TestRuleMarkFailure.java:47)
  at org.apache.lucene.util.TestRuleIgnoreAfterMaxFailures$1.evaluate(TestRuleIgnoreAfterMaxFailures.java:64)
  at org.apache.lucene.util.TestRuleIgnoreTestSuites$1.evaluate(TestRuleIgnoreTestSuites.java:54)
  at com.carrotsearch.randomizedtesting.rules.StatementAdapter.evaluate(StatementAdapter.java:36)
  at com.carrotsearch.randomizedtesting.ThreadLeakControl$StatementRunner.run(ThreadLeakControl.java:367)
  at java.lang.Thread.run(Thread.java:745)
Caused by: javax.net.ssl.SSLHandshakeException: Remote host closed connection during handshake
  at sun.security.ssl.SSLSocketImpl.readRecord(SSLSocketImpl.java:992)
  at sun.security.ssl.SSLSocketImpl.performInitialHandshake(SSLSocketImpl.java:1375)
  at sun.security.ssl.SSLSocketImpl.startHandshake(SSLSocketImpl.java:1403)
  at sun.security.ssl.SSLSocketImpl.startHandshake(SSLSocketImpl.java:1387)
  at org.apache.http.conn.ssl.SSLConnectionSocketFactory.createLayeredSocket(SSLConnectionSocketFactory.java:394)
  at org.apache.http.conn.ssl.SSLConnectionSocketFactory.connectSocket(SSLConnectionSocketFactory.java:353)
  at org.apache.http.impl.conn.DefaultHttpClientConnectionOperator.connect(DefaultHttpClientConnectionOperator.java:134)
  at org.apache.http.impl.conn.PoolingHttpClientConnectionManager.connect(PoolingHttpClientConnectionManager.java:353)
  at org.apache.http.impl.execchain.MainClientExec.establishRoute(MainClientExec.java:380)
  at org.apache.http.impl.execchain.MainClientExec.execute(MainClientExec.java:236)
  at org.apache.http.impl.execchain.ProtocolExec.execute(ProtocolExec.java:184)
  at org.apache.http.impl.execchain.RetryExec.execute(RetryExec.java:88)
  at org.apache.http.impl.execchain.RedirectExec.execute(RedirectExec.java:110)
  at org.apache.http.impl.client.InternalHttpClient.doExecute(InternalHttpClient.java:184)
  at org.apache.http.impl.client.CloseableHttpClient.execute(CloseableHttpClient.java:82)
  at org.apache.http.impl.client.CloseableHttpClient.execute(CloseableHttpClient.java:55)
  at org.apache.solr.client.solrj.impl.HttpSolrClient.executeMethod(HttpSolrClient.java:511)
  ... 48 more
Caused by: java.io.EOFException: SSL peer shut down incorrectly
  at sun.security.ssl.InputRecord.read(InputRecord.java:505)
  at sun.security.ssl.SSLSocketImpl.readRecord(SSLSocketImpl.java:973)
  ... 64 more




Build Log:
[...truncated 12141 lines...]
    [junit4] Suite: org.apache.solr.handler.component.DistributedFacetPivotLongTailTest
    [junit4] 2> Creating dataDir: /home/jenkins/workspace/Lucene-Solr-master-Linux/solr/build/solr-core/test/J0/temp/solr.handler.component.DistributedFacetPivotLongTailTest_CBE03109F7964F8A-001/init-core-data-001
    [junit4] 2> 1818358 INFO (SUITE-DistributedFacetPivotLongTailTest-seed#[CBE03109F7964F8A]-worker) [ ] o.a.s.SolrTestCaseJ4 Randomized ssl (true) and clientAuth (true) via: @org.apache.solr.util.RandomizeSSL(reason=, ssl=NaN, value=NaN, clientAuth=NaN)
    [junit4] 2> 1818359 INFO (SUITE-DistributedFacetPivotLongTailTest-seed#[CBE03109F7964F8A]-worker) [ ] o.a.s.BaseDistributedSearchTestCase Setting hostContext system property: /
    [junit4] 2> 1818426 INFO (TEST-DistributedFacetPivotLongTailTest.test-seed#[CBE03109F7964F8A]) [ ] o.a.s.SolrTestCaseJ4 Writing core.properties file to /home/jenkins/workspace/Lucene-Solr-master-Linux/solr/build/solr-core/test/J0/temp/solr.handler.component.DistributedFacetPivotLongTailTest_CBE03109F7964F8A-001/tempDir-001/control/cores/collection1
    [junit4] 2> 1818428 INFO (TEST-DistributedFacetPivotLongTailTest.test-seed#[CBE03109F7964F8A]) [ ] o.e.j.s.Server jetty-9.3.8.v20160314
    [junit4] 2> 1818428 INFO (TEST-DistributedFacetPivotLongTailTest.test-seed#[CBE03109F7964F8A]) [ ] o.e.j.s.h.ContextHandler Started o.e.j.s.ServletContextHandler@433eb61e{/,null,AVAILABLE}
    [junit4] 2> 1818431 INFO (TEST-DistributedFacetPivotLongTailTest.test-seed#[CBE03109F7964F8A]) [ ] o.e.j.s.ServerConnector Started ServerConnector@508655d5{SSL,[ssl, http/1.1]}{127.0.0.1:41310}
    [junit4] 2> 1818431 INFO (TEST-DistributedFacetPivotLongTailTest.test-seed#[CBE03109F7964F8A]) [ ] o.e.j.s.Server Started @1819068ms
    [junit4] 2> 1818431 INFO (TEST-DistributedFacetPivotLongTailTest.test-seed#[CBE03109F7964F8A]) [ ] o.a.s.c.s.e.JettySolrRunner Jetty properties: {hostContext=/, hostPort=41310, coreRootDirectory=/home/jenkins/workspace/Lucene-Solr-master-Linux/solr/build/solr-core/test/J0/temp/solr.handler.component.DistributedFacetPivotLongTailTest_CBE03109F7964F8A-001/tempDir-001/control/cores}
    [junit4] 2> 1818431 INFO (TEST-DistributedFacetPivotLongTailTest.test-seed#[CBE03109F7964F8A]) [ ] o.a.s.s.SolrDispatchFilter SolrDispatchFilter.init(): sun.misc.Launcher$AppClassLoader@73d16e93
    [junit4] 2> 1818431 INFO (TEST-DistributedFacetPivotLongTailTest.test-seed#[CBE03109F7964F8A]) [ ] o.a.s.c.SolrResourceLoader new SolrResourceLoader for directory: '/home/jenkins/workspace/Lucene-Solr-master-Linux/solr/build/solr-core/test/J0/temp/solr.handler.component.DistributedFacetPivotLongTailTest_CBE03109F7964F8A-001/tempDir-001/control'
    [junit4] 2> 1818431 INFO (TEST-DistributedFacetPivotLongTailTest.test-seed#[CBE03109F7964F8A]) [ ] o.a.s.c.SolrResourceLoader JNDI not configured for solr (NoInitialContextEx)
    [junit4] 2> 1818431 INFO (TEST-DistributedFacetPivotLongTailTest.test-seed#[CBE03109F7964F8A]) [ ] o.a.s.c.SolrResourceLoader solr home defaulted to 'solr/' (could not find system property or JNDI)
    [junit4] 2> 1818431 INFO (TEST-DistributedFacetPivotLongTailTest.test-seed#[CBE03109F7964F8A]) [ ] o.a.s.c.SolrXmlConfig Loading container configuration from /home/jenkins/workspace/Lucene-Solr-master-Linux/solr/build/solr-core/test/J0/temp/solr.handler.component.DistributedFacetPivotLongTailTest_CBE03109F7964F8A-001/tempDir-001/control/solr.xml
    [junit4] 2> 1818436 INFO (TEST-DistributedFacetPivotLongTailTest.test-seed#[CBE03109F7964F8A]) [ ] o.a.s.c.CorePropertiesLocator Config-defined core root directory: /home/jenkins/workspace/Lucene-Solr-master-Linux/solr/build/solr-core/test/J0/temp/solr.handler.component.DistributedFacetPivotLongTailTest_CBE03109F7964F8A-001/tempDir-001/control/cores
    [junit4] 2> 1818436 INFO (TEST-DistributedFacetPivotLongTailTest.test-seed#[CBE03109F7964F8A]) [ ] o.a.s.c.CoreContainer New CoreContainer 640048024
    [junit4] 2> 1818436 INFO (TEST-DistributedFacetPivotLongTailTest.test-seed#[CBE03109F7964F8A]) [ ] o.a.s.c.CoreContainer Loading cores into CoreContainer [instanceDir=/home/jenkins/workspace/Lucene-Solr-master-Linux/solr/build/solr-core/test/J0/temp/solr.handler.component.DistributedFacetPivotLongTailTest_CBE03109F7964F8A-001/tempDir-001/control]
    [junit4] 2> 1818436 WARN (TEST-DistributedFacetPivotLongTailTest.test-seed#[CBE03109F7964F8A]) [ ] o.a.s.c.CoreContainer Couldn't add files from /home/jenkins/workspace/Lucene-Solr-master-Linux/solr/build/solr-core/test/J0/temp/solr.handler.component.DistributedFacetPivotLongTailTest_CBE03109F7964F8A-001/tempDir-001/control/lib to classpath: /home/jenkins/workspace/Lucene-Solr-master-Linux/solr/build/solr-core/test/J0/temp/solr.handler.component.DistributedFacetPivotLongTailTest_CBE03109F7964F8A-001/tempDir-001/control/lib
    [junit4] 2> 1818436 INFO (TEST-DistributedFacetPivotLongTailTest.test-seed#[CBE03109F7964F8A]) [ ] o.a.s.h.c.HttpShardHandlerFactory created with socketTimeout : 90000,urlScheme : https,connTimeout : 15000,maxConnectionsPerHost : 20,maxConnections : 10000,corePoolSize : 0,maximumPoolSize : 2147483647,maxThreadIdleTime : 5,sizeOfQueue : -1,fairnessPolicy : false,
    [junit4] 2> 1818437 INFO (TEST-DistributedFacetPivotLongTailTest.test-seed#[CBE03109F7964F8A]) [ ] o.a.s.u.UpdateShardHandler Creating UpdateShardHandler HTTP client with params:
    [junit4] 2> 1818438 INFO (TEST-DistributedFacetPivotLongTailTest.test-seed#[CBE03109F7964F8A]) [ ] o.a.s.l.LogWatcher SLF4J impl is org.slf4j.impl.Log4jLoggerFactory
    [junit4] 2> 1818438 INFO (TEST-DistributedFacetPivotLongTailTest.test-seed#[CBE03109F7964F8A]) [ ] o.a.s.l.LogWatcher Registering Log Listener [Log4j (org.slf4j.impl.Log4jLoggerFactory)]
    [junit4] 2> 1818438 INFO (TEST-DistributedFacetPivotLongTailTest.test-seed#[CBE03109F7964F8A]) [ ] o.a.s.c.CoreContainer Security conf doesn't exist. Skipping setup for authorization module.
    [junit4] 2> 1818438 INFO (TEST-DistributedFacetPivotLongTailTest.test-seed#[CBE03109F7964F8A]) [ ] o.a.s.c.CoreContainer No authentication plugin used.
    [junit4] 2> 1818439 INFO (TEST-DistributedFacetPivotLongTailTest.test-seed#[CBE03109F7964F8A]) [ ] o.a.s.c.CorePropertiesLocator Looking for core definitions underneath /home/jenkins/workspace/Lucene-Solr-master-Linux/solr/build/solr-core/test/J0/temp/solr.handler.component.DistributedFacetPivotLongTailTest_CBE03109F7964F8A-001/tempDir-001/control/cores
    [junit4] 2> 1818439 INFO (TEST-DistributedFacetPivotLongTailTest.test-seed#[CBE03109F7964F8A]) [ ] o.a.s.c.CoreDescriptor Created CoreDescriptor: {name=collection1, config=solrconfig.xml, loadOnStartup=true, schema=schema.xml, configSetProperties=configsetprops.json, transient=false, dataDir=data/, configSet=collection1}
    [junit4] 2> 1818439 INFO (TEST-DistributedFacetPivotLongTailTest.test-seed#[CBE03109F7964F8A]) [ ] o.a.s.c.CorePropertiesLocator Found core collection1 in /home/jenkins/workspace/Lucene-Solr-master-Linux/solr/build/solr-core/test/J0/temp/solr.handler.component.DistributedFacetPivotLongTailTest_CBE03109F7964F8A-001/tempDir-001/control/cores/collection1
    [junit4] 2> 1818440 INFO (TEST-DistributedFacetPivotLongTailTest.test-seed#[CBE03109F7964F8A]) [ ] o.a.s.c.CorePropertiesLocator Found 1 core definitions
    [junit4] 2> 1818440 INFO (coreLoadExecutor-11942-thread-1) [ ] o.a.s.c.SolrResourceLoader new SolrResourceLoader for directory: '/home/jenkins/workspace/Lucene-Solr-master-Linux/solr/core/src/test-files/solr/collection1'
    [junit4] 2> 1818440 INFO (TEST-DistributedFacetPivotLongTailTest.test-seed#[CBE03109F7964F8A]) [ ] o.a.s.s.SolrDispatchFilter user.dir=/home/jenkins/workspace/Lucene-Solr-master-Linux/solr/build/solr-core/test/J0
    [junit4] 2> 1818440 INFO (TEST-DistributedFacetPivotLongTailTest.test-seed#[CBE03109F7964F8A]) [ ] o.a.s.s.SolrDispatchFilter SolrDispatchFilter.init() done
    [junit4] 2> 1818440 INFO (coreLoadExecutor-11942-thread-1) [ ] o.a.s.c.SolrResourceLoader JNDI not configured for solr (NoInitialContextEx)
    [junit4] 2> 1818440 INFO (coreLoadExecutor-11942-thread-1) [ ] o.a.s.c.SolrResourceLoader solr home defaulted to 'solr/' (could not find system property or JNDI)
    [junit4] 2> 1818440 INFO (coreLoadExecutor-11942-thread-1) [ ] o.a.s.c.SolrResourceLoader Adding 'file:/home/jenkins/workspace/Lucene-Solr-master-Linux/solr/core/src/test-files/solr/collection1/lib/classes/' to classloader
    [junit4] 2> 1818440 INFO (coreLoadExecutor-11942-thread-1) [ ] o.a.s.c.SolrResourceLoader Adding 'file:/home/jenkins/workspace/Lucene-Solr-master-Linux/solr/core/src/test-files/solr/collection1/lib/README' to classloader
    [junit4] 2> 1818461 INFO (coreLoadExecutor-11942-thread-1) [ ] o.a.s.c.SolrConfig current version of requestparams : -1
    [junit4] 2> 1818468 WARN (coreLoadExecutor-11942-thread-1) [ ] o.a.s.c.Config Beginning with Solr 5.5, <mergePolicy> is deprecated, use <mergePolicyFactory> instead.
    [junit4] 2> 1818471 INFO (coreLoadExecutor-11942-thread-1) [ ] o.a.s.c.SolrConfig Using Lucene MatchVersion: 7.0.0
    [junit4] 2> 1818512 INFO (coreLoadExecutor-11942-thread-1) [ ] o.a.s.c.SolrConfig Loaded SolrConfig: solrconfig.xml
    [junit4] 2> 1818516 INFO (coreLoadExecutor-11942-thread-1) [ ] o.a.s.s.IndexSchema [collection1] Schema name=test
    [junit4] 2> 1818589 INFO (coreLoadExecutor-11942-thread-1) [ ] o.a.s.s.OpenExchangeRatesOrgProvider Initialized with rates=open-exchange-rates.json, refreshInterval=1440.
    [junit4] 2> 1818594 INFO (coreLoadExecutor-11942-thread-1) [ ] o.a.s.s.IndexSchema default search field in schema is text
    [junit4] 2> 1818595 INFO (coreLoadExecutor-11942-thread-1) [ ] o.a.s.s.IndexSchema unique key field: id
    [junit4] 2> 1818597 INFO (coreLoadExecutor-11942-thread-1) [ ] o.a.s.s.FileExchangeRateProvider Reloading exchange rates from file currency.xml
    [junit4] 2> 1818598 INFO (coreLoadExecutor-11942-thread-1) [ ] o.a.s.s.FileExchangeRateProvider Reloading exchange rates from file currency.xml
    [junit4] 2> 1818599 INFO (coreLoadExecutor-11942-thread-1) [ ] o.a.s.s.OpenExchangeRatesOrgProvider Reloading exchange rates from open-exchange-rates.json
    [junit4] 2> 1818599 INFO (coreLoadExecutor-11942-thread-1) [ ] o.a.s.s.OpenExchangeRatesOrgProvider Reloading exchange rates from open-exchange-rates.json
    [junit4] 2> 1818600 INFO (coreLoadExecutor-11942-thread-1) [ ] o.a.s.c.ConfigSetProperties Did not find ConfigSet properties, assuming default properties: Can't find resource 'configsetprops.json' in classpath or '/home/jenkins/workspace/Lucene-Solr-master-Linux/solr/core/src/test-files/solr/collection1'
    [junit4] 2> 1818600 INFO (coreLoadExecutor-11942-thread-1) [ ] o.a.s.c.CoreContainer Creating SolrCore 'collection1' using configuration from configset /home/jenkins/workspace/Lucene-Solr-master-Linux/solr/core/src/test-files/solr/collection1
    [junit4] 2> 1818600 INFO (coreLoadExecutor-11942-thread-1) [ x:collection1] o.a.s.c.SolrCore org.apache.solr.core.MockDirectoryFactory
    [junit4] 2> 1818601 INFO (coreLoadExecutor-11942-thread-1) [ x:collection1] o.a.s.c.SolrCore [[collection1] ] Opening new SolrCore at [/home/jenkins/workspace/Lucene-Solr-master-Linux/solr/core/src/test-files/solr/collection1], dataDir=[/home/jenkins/workspace/Lucene-Solr-master-Linux/solr/build/solr-core/test/J0/temp/solr.handler.component.DistributedFacetPivotLongTailTest_CBE03109F7964F8A-001/tempDir-001/control/cores/collection1/data/]
    [junit4] 2> 1818601 INFO (coreLoadExecutor-11942-thread-1) [ x:collection1] o.a.s.c.JmxMonitoredMap JMX monitoring is enabled. Adding Solr mbeans to JMX Server: com.sun.jmx.mbeanserver.JmxMBeanServer@3605f795
    [junit4] 2> 1818601 INFO (coreLoadExecutor-11942-thread-1) [ x:collection1] o.a.s.c.CachingDirectoryFactory return new directory for /home/jenkins/workspace/Lucene-Solr-master-Linux/solr/build/solr-core/test/J0/temp/solr.handler.component.DistributedFacetPivotLongTailTest_CBE03109F7964F8A-001/tempDir-001/control/cores/collection1/data
    [junit4] 2> 1818601 INFO (coreLoadExecutor-11942-thread-1) [ x:collection1] o.a.s.c.SolrCore New index directory detected: old=null new=/home/jenkins/workspace/Lucene-Solr-master-Linux/solr/build/solr-core/test/J0/temp/solr.handler.component.DistributedFacetPivotLongTailTest_CBE03109F7964F8A-001/tempDir-001/control/cores/collection1/data/index/
    [junit4] 2> 1818601 WARN (coreLoadExecutor-11942-thread-1) [ x:collection1] o.a.s.c.SolrCore [collection1] Solr index directory '/home/jenkins/workspace/Lucene-Solr-master-Linux/solr/build/solr-core/test/J0/temp/solr.handler.component.DistributedFacetPivotLongTailTest_CBE03109F7964F8A-001/tempDir-001/control/cores/collection1/data/index' doesn't exist. Creating new index...
    [junit4] 2> 1818602 INFO (coreLoadExecutor-11942-thread-1) [ x:collection1] o.a.s.c.CachingDirectoryFactory return new directory for /home/jenkins/workspace/Lucene-Solr-master-Linux/solr/build/solr-core/test/J0/temp/solr.handler.component.DistributedFacetPivotLongTailTest_CBE03109F7964F8A-001/tempDir-001/control/cores/collection1/data/index
    [junit4] 2> 1818603 INFO (coreLoadExecutor-11942-thread-1) [ x:collection1] o.a.s.u.RandomMergePolicy RandomMergePolicy wrapping class org.apache.lucene.index.TieredMergePolicy: [TieredMergePolicy: maxMergeAtOnce=45, maxMergeAtOnceExplicit=45, maxMergedSegmentMB=11.9560546875, floorSegmentMB=1.7626953125, forceMergeDeletesPctAllowed=27.734807702220845, segmentsPerTier=35.0, maxCFSSegmentSizeMB=8.796093022207999E12, noCFSRatio=1.0
    [junit4] 2> 1818603 INFO (coreLoadExecutor-11942-thread-1) [ x:collection1] o.a.s.c.SolrDeletionPolicy SolrDeletionPolicy.onCommit: commits: num=1
    [junit4] 2> commit{dir=MockDirectoryWrapper(RAMDirectory@65ee793b lockFactory=org.apache.lucene.store.SingleInstanceLockFactory@18aede6),segFN=segments_1,generation=1}
    [junit4] 2> 1818603 INFO (coreLoadExecutor-11942-thread-1) [ x:collection1] o.a.s.c.SolrDeletionPolicy newest commit generation = 1
    [junit4] 2> 1818603 INFO (OldIndexDirectoryCleanupThreadForCore-collection1) [ x:collection1] o.a.s.c.SolrCore Looking for old index directories to cleanup for core collection1 in /home/jenkins/workspace/Lucene-Solr-master-Linux/solr/build/solr-core/test/J0/temp/solr.handler.component.DistributedFacetPivotLongTailTest_CBE03109F7964F8A-001/tempDir-001/control/cores/collection1/data/
    [junit4] 2> 1818604 WARN (OldIndexDirectoryCleanupThreadForCore-collection1) [ x:collection1] o.a.s.c.DirectoryFactory /home/jenkins/workspace/Lucene-Solr-master-Linux/solr/build/solr-core/test/J0/temp/solr.handler.component.DistributedFacetPivotLongTailTest_CBE03109F7964F8A-001/tempDir-001/control/cores/collection1/data/ does not point to a valid data directory; skipping clean-up of old index directories.
    [junit4] 2> 1818606 INFO (coreLoadExecutor-11942-thread-1) [ x:collection1] o.a.s.u.p.UpdateRequestProcessorChain creating updateRequestProcessorChain "dedupe"
    [junit4] 2> 1818606 INFO (coreLoadExecutor-11942-thread-1) [ x:collection1] o.a.s.u.p.UpdateRequestProcessorChain inserting DistributedUpdateProcessorFactory into updateRequestProcessorChain "dedupe"
    [junit4] 2> 1818606 INFO (coreLoadExecutor-11942-thread-1) [ x:collection1] o.a.s.u.p.UpdateRequestProcessorChain creating updateRequestProcessorChain "dedupe-allfields"
    [junit4] 2> 1818606 INFO (coreLoadExecutor-11942-thread-1) [ x:collection1] o.a.s.u.p.UpdateRequestProcessorChain inserting DistributedUpdateProcessorFactory into updateRequestProcessorChain "dedupe-allfields"
    [junit4] 2> 1818606 INFO (coreLoadExecutor-11942-thread-1) [ x:collection1] o.a.s.u.p.UpdateRequestProcessorChain creating updateRequestProcessorChain "stored_sig"
    [junit4] 2> 1818606 INFO (coreLoadExecutor-11942-thread-1) [ x:collection1] o.a.s.u.p.UpdateRequestProcessorChain inserting DistributedUpdateProcessorFactory into updateRequestProcessorChain "stored_sig"
    [junit4] 2> 1818606 INFO (coreLoadExecutor-11942-thread-1) [ x:collection1] o.a.s.u.p.UpdateRequestProcessorChain creating updateRequestProcessorChain "uniq-fields"
    [junit4] 2> 1818606 INFO (coreLoadExecutor-11942-thread-1) [ x:collection1] o.a.s.u.p.UpdateRequestProcessorChain inserting DistributedUpdateProcessorFactory into updateRequestProcessorChain "uniq-fields"
    [junit4] 2> 1818606 INFO (coreLoadExecutor-11942-thread-1) [ x:collection1] o.a.s.u.p.UpdateRequestProcessorChain creating updateRequestProcessorChain "distrib-dup-test-chain-explicit"
    [junit4] 2> 1818606 INFO (coreLoadExecutor-11942-thread-1) [ x:collection1] o.a.s.u.p.UpdateRequestProcessorChain creating updateRequestProcessorChain "distrib-dup-test-chain-implicit"
    [junit4] 2> 1818606 INFO (coreLoadExecutor-11942-thread-1) [ x:collection1] o.a.s.u.p.UpdateRequestProcessorChain inserting DistributedUpdateProcessorFactory into updateRequestProcessorChain "distrib-dup-test-chain-implicit"
    [junit4] 2> 1818606 INFO (coreLoadExecutor-11942-thread-1) [ x:collection1] o.a.s.c.SolrCore no updateRequestProcessorChain defined as default, creating implicit default
    [junit4] 2> 1818607 INFO (coreLoadExecutor-11942-thread-1) [ x:collection1] o.a.s.h.l.XMLLoader xsltCacheLifetimeSeconds=60
    [junit4] 2> 1818608 INFO (coreLoadExecutor-11942-thread-1) [ x:collection1] o.a.s.h.l.XMLLoader xsltCacheLifetimeSeconds=60
    [junit4] 2> 1818609 INFO (coreLoadExecutor-11942-thread-1) [ x:collection1] o.a.s.h.l.XMLLoader xsltCacheLifetimeSeconds=60
    [junit4] 2> 1818609 INFO (coreLoadExecutor-11942-thread-1) [ x:collection1] o.a.s.h.l.XMLLoader xsltCacheLifetimeSeconds=60
    [junit4] 2> 1818611 INFO (coreLoadExecutor-11942-thread-1) [ x:collection1] o.a.s.c.PluginBag requestHandler : 'lazy' created with startup=lazy
    [junit4] 2> 1818612 INFO (coreLoadExecutor-11942-thread-1) [ x:collection1] o.a.s.c.RequestHandlers Registered paths: /admin/mbeans,standard,spellCheckCompRH,lazy,/update/json/docs,/admin/luke,/export,spellCheckWithWordbreak_Direct,tvrh,/get,/admin/properties,/update/json,mltrh,/admin/threads,/search-facet-def,/update/csv,/sql,/graph,/search-facet-invariants,/admin/segments,spellCheckCompRH1,/mlt,/admin/system,/replication,dismax,defaults,/config,/stream,/schema,/admin/plugins,/admin/logging,spellCheckWithWordbreak,mock,/admin/ping,/update,/admin/file,/terms,spellCheckCompRH_Direct,/debug/dump
    [junit4] 2> 1818612 INFO (coreLoadExecutor-11942-thread-1) [ x:collection1] o.a.s.c.SolrCore Using default statsCache cache: org.apache.solr.search.stats.LocalStatsCache
    [junit4] 2> 1818612 INFO (coreLoadExecutor-11942-thread-1) [ x:collection1] o.a.s.u.UpdateHandler Using UpdateLog implementation: org.apache.solr.update.UpdateLog
    [junit4] 2> 1818612 INFO (coreLoadExecutor-11942-thread-1) [ x:collection1] o.a.s.u.UpdateLog Initializing UpdateLog: dataDir= defaultSyncLevel=FLUSH numRecordsToKeep=100 maxNumLogsToKeep=10 numVersionBuckets=65536
    [junit4] 2> 1818613 INFO (coreLoadExecutor-11942-thread-1) [ x:collection1] o.a.s.u.CommitTracker Hard AutoCommit: disabled
    [junit4] 2> 1818613 INFO (coreLoadExecutor-11942-thread-1) [ x:collection1] o.a.s.u.CommitTracker Soft AutoCommit: disabled
    [junit4] 2> 1818614 INFO (coreLoadExecutor-11942-thread-1) [ x:collection1] o.a.s.u.RandomMergePolicy RandomMergePolicy wrapping class org.apache.lucene.index.TieredMergePolicy: [TieredMergePolicy: maxMergeAtOnce=20, maxMergeAtOnceExplicit=39, maxMergedSegmentMB=33.89453125, floorSegmentMB=0.712890625, forceMergeDeletesPctAllowed=12.65925450751287, segmentsPerTier=30.0, maxCFSSegmentSizeMB=8.796093022207999E12, noCFSRatio=1.0
    [junit4] 2> 1818614 INFO (coreLoadExecutor-11942-thread-1) [ x:collection1] o.a.s.c.SolrDeletionPolicy SolrDeletionPolicy.onInit: commits: num=1
    [junit4] 2> commit{dir=MockDirectoryWrapper(RAMDirectory@65ee793b lockFactory=org.apache.lucene.store.SingleInstanceLockFactory@18aede6),segFN=segments_1,generation=1}
    [junit4] 2> 1818614 INFO (coreLoadExecutor-11942-thread-1) [ x:collection1] o.a.s.c.SolrDeletionPolicy newest commit generation = 1
    [junit4] 2> 1818614 INFO (coreLoadExecutor-11942-thread-1) [ x:collection1] o.a.s.s.SolrIndexSearcher Opening [Searcher@574b70d4[collection1] main]
    [junit4] 2> 1818615 INFO (coreLoadExecutor-11942-thread-1) [ x:collection1] o.a.s.r.RestManager Initializing RestManager with initArgs: {storageIO=org.apache.solr.rest.ManagedResourceStorage$InMemoryStorageIO}
    [junit4] 2> 1818615 INFO (coreLoadExecutor-11942-thread-1) [ x:collection1] o.a.s.r.ManagedResourceStorage Reading _rest_managed.json using InMemoryStorage
    [junit4] 2> 1818615 INFO (coreLoadExecutor-11942-thread-1) [ x:collection1] o.a.s.r.RestManager Initializing 0 registered ManagedResources
    [junit4] 2> 1818615 INFO (coreLoadExecutor-11942-thread-1) [ x:collection1] o.a.s.h.c.SpellCheckComponent Initializing spell checkers
    [junit4] 2> 1818644 INFO (coreLoadExecutor-11942-thread-1) [ x:collection1] o.a.s.s.DirectSolrSpellChecker init: {name=direct,classname=DirectSolrSpellChecker,field=lowerfilt,minQueryLength=3}
    [junit4] 2> 1818725 INFO (coreLoadExecutor-11942-thread-1) [ x:collection1] o.a.s.h.ReplicationHandler Commits will be reserved for 10000
    [junit4] 2> 1818726 INFO (searcherExecutor-11943-thread-1-processing-x:collection1) [ x:collection1] o.a.s.h.c.SpellCheckComponent Loading spell index for spellchecker: default
    [junit4] 2> 1818726 INFO (searcherExecutor-11943-thread-1-processing-x:collection1) [ x:collection1] o.a.s.h.c.SpellCheckComponent Loading spell index for spellchecker: direct
    [junit4] 2> 1818726 INFO (searcherExecutor-11943-thread-1-processing-x:collection1) [ x:collection1] o.a.s.h.c.SpellCheckComponent Loading spell index for spellchecker: wordbreak
    [junit4] 2> 1818726 INFO (searcherExecutor-11943-thread-1-processing-x:collection1) [ x:collection1] o.a.s.h.c.SpellCheckComponent Loading spell index for spellchecker: multipleFields
    [junit4] 2> 1818726 INFO (searcherExecutor-11943-thread-1-processing-x:collection1) [ x:collection1] o.a.s.h.c.SpellCheckComponent Loading spell index for spellchecker: jarowinkler
    [junit4] 2> 1818726 INFO (coreLoadExecutor-11942-thread-1) [ x:collection1] o.a.s.u.UpdateLog Looking up max value of version field to seed version buckets
    [junit4] 2> 1818726 INFO (searcherExecutor-11943-thread-1-processing-x:collection1) [ x:collection1] o.a.s.h.c.SpellCheckComponent Loading spell index for spellchecker: external
    [junit4] 2> 1818726 INFO (coreLoadExecutor-11942-thread-1) [ x:collection1] o.a.s.u.VersionInfo Refreshing highest value of _version_ for 65536 version buckets from index
    [junit4] 2> 1818726 INFO (coreLoadExecutor-11942-thread-1) [ x:collection1] o.a.s.u.VersionInfo No terms found for _version_, cannot seed version bucket highest value from index
    [junit4] 2> 1818726 INFO (searcherExecutor-11943-thread-1-processing-x:collection1) [ x:collection1] o.a.s.h.c.SpellCheckComponent Loading spell index for spellchecker: freq
    [junit4] 2> 1818726 INFO (coreLoadExecutor-11942-thread-1) [ x:collection1] o.a.s.u.UpdateLog Could not find max version in index or recent updates, using new clock 1536907278349762560
    [junit4] 2> 1818727 INFO (searcherExecutor-11943-thread-1-processing-x:collection1) [ x:collection1] o.a.s.h.c.SpellCheckComponent Loading spell index for spellchecker: fqcn
    [junit4] 2> 1818727 INFO (searcherExecutor-11943-thread-1-processing-x:collection1) [ x:collection1] o.a.s.h.c.SpellCheckComponent Loading spell index for spellchecker: perDict
    [junit4] 2> 1818727 INFO (searcherExecutor-11943-thread-1-processing-x:collection1) [ x:collection1] o.a.s.c.SolrCore [collection1] Registered new searcher Searcher@574b70d4[collection1] main{ExitableDirectoryReader(UninvertingDirectoryReader())}
    [junit4] 2> 1818728 INFO (coreLoadExecutor-11942-thread-1) [ x:collection1] o.a.s.u.UpdateLog Took 2.0ms to seed version buckets with highest version 1536907278349762560
    [junit4] 2> 1818729 INFO (coreLoadExecutor-11942-thread-1) [ x:collection1] o.a.s.c.CoreContainer registering core: collection1
    [junit4] 2> 1819008 INFO (TEST-DistributedFacetPivotLongTailTest.test-seed#[CBE03109F7964F8A]) [ ] o.a.s.SolrTestCaseJ4 Writing core.properties file to /home/jenkins/workspace/Lucene-Solr-master-Linux/solr/build/solr-core/test/J0/temp/solr.handler.component.DistributedFacetPivotLongTailTest_CBE03109F7964F8A-001/tempDir-001/shard0/cores/collection1
    [junit4] 2> 1819010 INFO (TEST-DistributedFacetPivotLongTailTest.test-seed#[CBE03109F7964F8A]) [ ] o.e.j.s.Server jetty-9.3.8.v20160314
    [junit4] 2> 1819011 INFO (TEST-DistributedFacetPivotLongTailTest.test-seed#[CBE03109F7964F8A]) [ ] o.e.j.s.h.ContextHandler Started o.e.j.s.ServletContextHandler@789f5039{/,null,AVAILABLE}
    [junit4] 2> 1819013 INFO (TEST-DistributedFacetPivotLongTailTest.test-seed#[CBE03109F7964F8A]) [ ] o.e.j.s.ServerConnector Started ServerConnector@2f30f913{SSL,[ssl, http/1.1]}{127.0.0.1:39797}
    [junit4] 2> 1819013 INFO (TEST-DistributedFacetPivotLongTailTest.test-seed#[CBE03109F7964F8A]) [ ] o.e.j.s.Server Started @1819650ms
    [junit4] 2> 1819013 INFO (TEST-DistributedFacetPivotLongTailTest.test-seed#[CBE03109F7964F8A]) [ ] o.a.s.c.s.e.JettySolrRunner Jetty properties: {hostContext=/, hostPort=39797, coreRootDirectory=/home/jenkins/workspace/Lucene-Solr-master-Linux/solr/build/solr-core/test/J0/temp/solr.handler.component.DistributedFacetPivotLongTailTest_CBE03109F7964F8A-001/tempDir-001/shard0/cores}
    [junit4] 2> 1819014 INFO (TEST-DistributedFacetPivotLongTailTest.test-seed#[CBE03109F7964F8A]) [ ] o.a.s.s.SolrDispatchFilter SolrDispatchFilter.init(): sun.misc.Launcher$AppClassLoader@73d16e93
    [junit4] 2> 1819014 INFO (TEST-DistributedFacetPivotLongTailTest.test-seed#[CBE03109F7964F8A]) [ ] o.a.s.c.SolrResourceLoader new SolrResourceLoader for directory: '/home/jenkins/workspace/Lucene-Solr-master-Linux/solr/build/solr-core/test/J0/temp/solr.handler.component.DistributedFacetPivotLongTailTest_CBE03109F7964F8A-001/tempDir-001/shard0'
    [junit4] 2> 1819014 INFO (TEST-DistributedFacetPivotLongTailTest.test-seed#[CBE03109F7964F8A]) [ ] o.a.s.c.SolrResourceLoader JNDI not configured for solr (NoInitialContextEx)
    [junit4] 2> 1819014 INFO (TEST-DistributedFacetPivotLongTailTest.test-seed#[CBE03109F7964F8A]) [ ] o.a.s.c.SolrResourceLoader solr home defaulted to 'solr/' (could not find system property or JNDI)
    [junit4] 2> 1819014 INFO (TEST-DistributedFacetPivotLongTailTest.test-seed#[CBE03109F7964F8A]) [ ] o.a.s.c.SolrXmlConfig Loading container configuration from /home/jenkins/workspace/Lucene-Solr-master-Linux/solr/build/solr-core/test/J0/temp/solr.handler.component.DistributedFacetPivotLongTailTest_CBE03109F7964F8A-001/tempDir-001/shard0/solr.xml
    [junit4] 2> 1819017 INFO (TEST-DistributedFacetPivotLongTailTest.test-seed#[CBE03109F7964F8A]) [ ] o.a.s.c.CorePropertiesLocator Config-defined core root directory: /home/jenkins/workspace/Lucene-Solr-master-Linux/solr/build/solr-core/test/J0/temp/solr.handler.component.DistributedFacetPivotLongTailTest_CBE03109F7964F8A-001/tempDir-001/shard0/cores
    [junit4] 2> 1819018 INFO (TEST-DistributedFacetPivotLongTailTest.test-seed#[CBE03109F7964F8A]) [ ] o.a.s.c.CoreContainer New CoreContainer 167414191
    [junit4] 2> 1819018 INFO (TEST-DistributedFacetPivotLongTailTest.test-seed#[CBE03109F7964F8A]) [ ] o.a.s.c.CoreContainer Loading cores into CoreContainer [instanceDir=/home/jenkins/workspace/Lucene-Solr-master-Linux/solr/build/solr-core/test/J0/temp/solr.handler.component.DistributedFacetPivotLongTailTest_CBE03109F7964F8A-001/tempDir-001/shard0]
    [junit4] 2> 1819018 WARN (TEST-DistributedFacetPivotLongTailTest.test-seed#[CBE03109F7964F8A]) [ ] o.a.s.c.CoreContainer Couldn't add files from /home/jenkins/workspace/Lucene-Solr-master-Linux/solr/build/solr-core/test/J0/temp/solr.handler.component.DistributedFacetPivotLongTailTest_CBE03109F7964F8A-001/tempDir-001/shard0/lib to classpath: /home/jenkins/workspace/Lucene-Solr-master-Linux/solr/build/solr-core/test/J0/temp/solr.handler.component.DistributedFacetPivotLongTailTest_CBE03109F7964F8A-001/tempDir-001/shard0/lib
    [junit4] 2> 1819018 INFO (TEST-DistributedFacetPivotLongTailTest.test-seed#[CBE03109F7964F8A]) [ ] o.a.s.h.c.HttpShardHandlerFactory created with socketTimeout : 90000,urlScheme : https,connTimeout : 15000,maxConnectionsPerHost : 20,maxConnections : 10000,corePoolSize : 0,maximumPoolSize : 2147483647,maxThreadIdleTime : 5,sizeOfQueue : -1,fairnessPolicy : false,
    [junit4] 2> 1819019 INFO (TEST-DistributedFacetPivotLongTailTest.test-seed#[CBE03109F7964F8A]) [ ] o.a.s.u.UpdateShardHandler Creating UpdateShardHandler HTTP client with params:
    [junit4] 2> 1819019 INFO (TEST-DistributedFacetPivotLongTailTest.test-seed#[CBE03109F7964F8A]) [ ] o.a.s.l.LogWatcher SLF4J impl is org.slf4j.impl.Log4jLoggerFactory
    [junit4] 2> 1819019 INFO (TEST-DistributedFacetPivotLongTailTest.test-seed#[CBE03109F7964F8A]) [ ] o.a.s.l.LogWatcher Registering Log Listener [Log4j (org.slf4j.impl.Log4jLoggerFactory)]
    [junit4] 2> 1819019 INFO (TEST-DistributedFacetPivotLongTailTest.test-seed#[CBE03109F7964F8A]) [ ] o.a.s.c.CoreContainer Security conf doesn't exist. Skipping setup for authorization module.
    [junit4] 2> 1819019 INFO (TEST-DistributedFacetPivotLongTailTest.test-seed#[CBE03109F7964F8A]) [ ] o.a.s.c.CoreContainer No authentication plugin used.
    [junit4] 2> 1819020 INFO (TEST-DistributedFacetPivotLongTailTest.test-seed#[CBE03109F7964F8A]) [ ] o.a.s.c.CorePropertiesLocator Looking for core definitions underneath /home/jenkins/workspace/Lucene-Solr-master-Linux/solr/build/solr-core/test/J0/temp/solr.handler.component.DistributedFacetPivotLongTailTest_CBE03109F7964F8A-001/tempDir-001/shard0/cores
    [junit4] 2> 1819020 INFO (TEST-DistributedFacetPivotLongTailTest.test-seed#[CBE03109F7964F8A]) [ ] o.a.s.c.CoreDescriptor Created CoreDescriptor: {name=collection1, config=solrconfig.xml, loadOnStartup=true, schema=schema.xml, configSetProperties=configsetprops.json, transient=false, dataDir=data/, configSet=collection1}
    [junit4] 2> 1819020 INFO (TEST-DistributedFacetPivotLongTailTest.test-seed#[CBE03109F7964F8A]) [ ] o.a.s.c.CorePropertiesLocator Found core collection1 in /home/jenkins/workspace/Lucene-Solr-master-Linux/solr/build/solr-core/test/J0/temp/solr.handler.component.DistributedFacetPivotLongTailTest_CBE03109F7964F8A-001/tempDir-001/shard0/cores/collection1
    [junit4] 2> 1819020 INFO (TEST-DistributedFacetPivotLongTailTest.test-seed#[CBE03109F7964F8A]) [ ] o.a.s.c.CorePropertiesLocator Found 1 core definitions
    [junit4] 2> 1819020 INFO (coreLoadExecutor-11953-thread-1) [ ] o.a.s.c.SolrResourceLoader new SolrResourceLoader for directory: '/home/jenkins/workspace/Lucene-Solr-master-Linux/solr/core/src/test-files/solr/collection1'
    [junit4] 2> 1819021 INFO (TEST-DistributedFacetPivotLongTailTest.test-seed#[CBE03109F7964F8A]) [ ] o.a.s.s.SolrDispatchFilter user.dir=/home/jenkins/workspace/Lucene-Solr-master-Linux/solr/build/solr-core/test/J0
    [junit4] 2> 1819021 INFO (TEST-DistributedFacetPivotLongTailTest.test-seed#[CBE03109F7964F8A]) [ ] o.a.s.s.SolrDispatchFilter SolrDispatchFilter.init() done
    [junit4] 2> 1819021 INFO (coreLoadExecutor-11953-thread-1) [ ] o.a.s.c.SolrResourceLoader JNDI not configured for solr (NoInitialContextEx)
    [junit4] 2> 1819021 INFO (coreLoadExecutor-11953-thread-1) [ ] o.a.s.c.SolrResourceLoader solr home defaulted to 'solr/' (could not find system property or JNDI)
    [junit4] 2> 1819021 INFO (coreLoadExecutor-11953-thread-1) [ ] o.a.s.c.SolrResourceLoader Adding 'file:/home/jenkins/workspace/Lucene-Solr-master-Linux/solr/core/src/test-files/solr/collection1/lib/classes/' to classloader
    [junit4] 2> 1819021 INFO (coreLoadExecutor-11953-thread-1) [ ] o.a.s.c.SolrResourceLoader Adding 'file:/home/jenkins/workspace/Lucene-Solr-master-Linux/solr/core/src/test-files/solr/collection1/lib/README' to classloader
    [junit4] 2> 1819037 INFO (coreLoadExecutor-11953-thread-1) [ ] o.a.s.c.SolrConfig current version of requestparams : -1
    [junit4] 2> 1819042 WARN (coreLoadExecutor-11953-thread-1) [ ] o.a.s.c.Config Beginning with Solr 5.5, <mergePolicy> is deprecated, use <mergePolicyFactory> instead.
    [junit4] 2> 1819044 INFO (coreLoadExecutor-11953-thread-1) [ ] o.a.s.c.SolrConfig Using Lucene MatchVersion: 7.0.0
    [junit4] 2> 1819059 INFO (coreLoadExecutor-11953-thread-1) [ ] o.a.s.c.SolrConfig Loaded SolrConfig: solrconfig.xml
    [junit4] 2> 1819062 INFO (coreLoadExecutor-11953-thread-1) [ ] o.a.s.s.IndexSchema [collection1] Schema name=test
    [junit4] 2> 1819156 INFO (coreLoadExecutor-11953-thread-1) [ ] o.a.s.s.OpenExchangeRatesOrgProvider Initialized with rates=open-exchange-rates.json, refreshInterval=1440.
    [junit4] 2> 1819159 INFO (coreLoadExecutor-11953-thread-1) [ ] o.a.s.s.IndexSchema default search field in schema is text
    [junit4] 2> 1819160 INFO (coreLoadExecutor-11953-thread-1) [ ] o.a.s.s.IndexSchema unique key field: id
    [junit4] 2> 1819163 INFO (coreLoadExecutor-11953-thread-1) [ ] o.a.s.s.FileExchangeRateProvider Reloading exchange rates from file currency.xml
    [junit4] 2> 1819164 INFO (coreLoadExecutor-11953-thread-1) [ ] o.a.s.s.FileExchangeRateProvider Reloading exchange rates from file currency.xml
    [junit4] 2> 1819165 INFO (coreLoadExecutor-11953-thread-1) [ ] o.a.s.s.OpenExchangeRatesOrgProvider Reloading exchange rates from open-exchange-rates.json
    [junit4] 2> 1819165 INFO (coreLoadExecutor-11953-thread-1) [ ] o.a.s.s.OpenExchangeRatesOrgProvider Reloading exchange rates from open-exchange-rates.json
    [junit4] 2> 1819167 INFO (coreLoadExecutor-11953-thread-1) [ ] o.a.s.c.ConfigSetProperties Did not find ConfigSet properties, assuming default properties: Can't find resource 'configsetprops.json' in classpath or '/home/jenkins/workspace/Lucene-Solr-master-Linux/solr/core/src/test-files/solr/collection1'
    [junit4] 2> 1819167 INFO (coreLoadExecutor-11953-thread-1) [ ] o.a.s.c.CoreContainer Creating SolrCore 'collection1' using configuration from configset /home/jenkins/workspace/Lucene-Solr-master-Linux/solr/core/src/test-files/solr/collection1
    [junit4] 2> 1819167 INFO (coreLoadExecutor-11953-thread-1) [ x:collection1] o.a.s.c.SolrCore org.apache.solr.core.MockDirectoryFactory
    [junit4] 2> 1819167 INFO (coreLoadExecutor-11953-thread-1) [ x:collection1] o.a.s.c.SolrCore [[collection1] ] Opening new SolrCore at [/home/jenkins/workspace/Lucene-Solr-master-Linux/solr/core/src/test-files/solr/collection1], dataDir=[/home/jenkins/workspace/Lucene-Solr-master-Linux/solr/build/solr-core/test/J0/temp/solr.handler.component.DistributedFacetPivotLongTailTest_CBE03109F7964F8A-001/tempDir-001/shard0/cores/collection1/data/]
    [junit4] 2> 1819167 INFO (coreLoadExecutor-11953-thread-1) [ x:collection1] o.a.s.c.JmxMonitoredMap JMX monitoring is enabled. Adding Solr mbeans to JMX Server: com.sun.jmx.mbeanserver.JmxMBeanServer@3605f795
    [junit4] 2> 1819167 INFO (coreLoadExecutor-11953-thread-1) [ x:collection1] o.a.s.c.CachingDirectoryFactory return new directory for /home/jenkins/workspace/Lucene-Solr-master-Linux/solr/build/solr-core/test/J0/temp/solr.handler.component.DistributedFacetPivotLongTailTest_CBE03109F7964F8A-001/tempDir-001/shard0/cores/collection1/data
    [junit4] 2> 1819167 INFO (coreLoadExecutor-11953-thread-1) [ x:collection1] o.a.s.c.SolrCore New index directory detected: old=null new=/home/jenkins/workspace/Lucene-Solr-master-Linux/solr/build/solr-core/test/J0/temp/solr.handler.component.DistributedFacetPivotLongTailTest_CBE03109F7964F8A-001/tempDir-001/shard0/cores/collection1/data/index/
    [junit4] 2> 1819167 WARN (coreLoadExecutor-11953-thread-1) [ x:collection1] o.a.s.c.SolrCore [collection1] Solr index directory '/home/jenkins/workspace/Lucene-Solr-master-Linux/solr/build/solr-core/test/J0/temp/solr.handler.component.DistributedFacetPivotLongTailTest_CBE03109F7964F8A-001/tempDir-001/shard0/cores/collection1/data/index' doesn't exist. Creating new index...
    [junit4] 2> 1819168 INFO (coreLoadExecutor-11953-thread-1) [ x:collection1] o.a.s.c.CachingDirectoryFactory return new directory for /home/jenkins/workspace/Lucene-Solr-master-Linux/solr/build/solr-core/test/J0/temp/solr.handler.component.DistributedFacetPivotLongTailTest_CBE03109F7964F8A-001/tempDir-001/shard0/cores/collection1/data/index
    [junit4] 2> 1819168 INFO (coreLoadExecutor-11953-thread-1) [ x:collection1] o.a.s.u.RandomMergePolicy RandomMergePolicy wrapping class org.apache.lucene.index.TieredMergePolicy: [TieredMergePolicy: maxMergeAtOnce=45, maxMergeAtOnceExplicit=45, maxMergedSegmentMB=11.9560546875, floorSegmentMB=1.7626953125, forceMergeDeletesPctAllowed=27.734807702220845, segmentsPerTier=35.0, maxCFSSegmentSizeMB=8.796093022207999E12, noCFSRatio=1.0
    [junit4] 2> 1819168 INFO (coreLoadExecutor-11953-thread-1) [ x:collection1] o.a.s.c.SolrDeletionPolicy SolrDeletionPolicy.onCommit: commits: num=1
    [junit4] 2> commit{dir=MockDirectoryWrapper(RAMDirectory@74a70255 lockFactory=org.apache.lucene.store.SingleInstanceLockFactory@15fb8d),segFN=segments_1,generation=1}
    [junit4] 2> 1819168 INFO (coreLoadExecutor-11953-thread-1) [ x:collection1] o.a.s.c.SolrDeletionPolicy newest commit generation = 1
    [junit4] 2> 1819168 INFO (OldIndexDirectoryCleanupThreadForCore-collection1) [ x:collection1] o.a.s.c.SolrCore Looking for old index directories to cleanup for core collection1 in /home/jenkins/workspace/Lucene-Solr-master-Linux/solr/build/solr-core/test/J0/temp/solr.handler.component.DistributedFacetPivotLongTailTest_CBE03109F7964F8A-001/tempDir-001/shard0/cores/collection1/data/
    [junit4] 2> 1819168 WARN (OldIndexDirectoryCleanupThreadForCore-collection1) [ x:collection1] o.a.s.c.DirectoryFactory /home/jenkins/workspace/Lucene-Solr-master-Linux/solr/build/solr-core/test/J0/temp/solr.handler.component.DistributedFacetPivotLongTailTest_CBE03109F7964F8A-001/tempDir-001/shard0/cores/collection1/data/ does not point to a valid data directory; skipping clean-up of old index directories.
    [junit4] 2> 1819171 INFO (coreLoadExecutor-11953-thread-1) [ x:collection1] o.a.s.u.p.UpdateRequestProcessorChain creating updateRequestProcessorChain "dedupe"
    [junit4] 2> 1819171 INFO (coreLoadExecutor-11953-thread-1) [ x:collection1] o.a.s.u.p.UpdateRequestProcessorChain inserting DistributedUpdateProcessorFactory into updateRequestProcessorChain "dedupe"
    [junit4] 2> 1819171 INFO (coreLoadExecutor-11953-thread-1) [ x:collection1] o.a.s.u.p.UpdateRequestProcessorChain creating updateRequestProcessorChain "dedupe-allfields"
    [junit4] 2> 1819171 INFO (coreLoadExecutor-11953-thread-1) [ x:collection1] o.a.s.u.p.UpdateRequestProcessorChain inserting DistributedUpdateProcessorFactory into updateRequestProcessorChain "dedupe-allfields"
    [junit4] 2> 1819171 INFO (coreLoadExecutor-11953-thread-1) [ x:collection1] o.a.s.u.p.UpdateRequestProcessorChain creating updateRequestProcessorChain "stored_sig"
    [junit4] 2> 1819171 INFO (coreLoadExecutor-11953-thread-1) [ x:collection1] o.a.s.u.p.UpdateRequestProcessorChain inserting DistributedUpdateProcessorFactory into updateRequestProcessorChain "stored_sig"
    [junit4] 2> 1819171 INFO (coreLoadExecutor-11953-thread-1) [ x:collection1] o.a.s.u.p.UpdateRequestProcessorChain creating updateRequestProcessorChain "uniq-fields"
    [junit4] 2> 1819171 INFO (coreLoadExecutor-11953-thread-1) [ x:collection1] o.a.s.u.p.UpdateRequestProcessorChain inserting DistributedUpdateProcessorFactory into updateRequestProcessorChain "uniq-fields"
    [junit4] 2> 1819171 INFO (coreLoadExecutor-11953-thread-1) [ x:collection1] o.a.s.u.p.UpdateRequestProcessorChain creating updateRequestProcessorChain "distrib-dup-test-chain-explicit"
    [junit4] 2> 1819171 INFO (coreLoadExecutor-11953-thread-1) [ x:collection1] o.a.s.u.p.UpdateRequestProcessorChain creating updateRequestProcessorChain "distrib-dup-test-chain-implicit"
    [junit4] 2> 1819171 INFO (coreLoadExecutor-11953-thread-1) [ x:collection1] o.a.s.u.p.UpdateRequestProcessorChain inserting DistributedUpdateProcessorFactory into updateRequestProcessorChain "distrib-dup-test-chain-implicit"
    [junit4] 2> 1819171 INFO (coreLoadExecutor-11953-thread-1) [ x:collection1] o.a.s.c.SolrCore no updateRequestProcessorChain defined as default, creating implicit default
    [junit4] 2> 1819172 INFO (coreLoadExecutor-11953-thread-1) [ x:collection1] o.a.s.h.l.XMLLoader xsltCacheLifetimeSeconds=60
    [junit4] 2> 1819173 INFO (coreLoadExecutor-11953-thread-1) [ x:collection1] o.a.s.h.l.XMLLoader xsltCacheLifetimeSeconds=60
    [junit4] 2> 1819173 INFO (coreLoadExecutor-11953-thread-1) [ x:collection1] o.a.s.h.l.XMLLoader xsltCacheLifetimeSeconds=60
    [junit4] 2> 1819174 INFO (coreLoadExecutor-11953-thread-1) [ x:collection1] o.a.s.h.l.XMLLoader xsltCacheLifetimeSeconds=60
    [junit4] 2> 1819177 INFO (coreLoadExecutor-11953-thread-1) [ x:collection1] o.a.s.c.PluginBag requestHandler : 'lazy' created with startup=lazy
    [junit4] 2> 1819179 INFO (coreLoadExecutor-11953-thread-1) [ x:collection1] o.a.s.c.RequestHandlers Registered paths: /admin/mbeans,standard,spellCheckCompRH,lazy,/update/json/docs,/admin/luke,/export,spellCheckWithWordbreak_Direct,tvrh,/get,/admin/properties,/update/json,mltrh,/admin/threads,/search-facet-def,/update/csv,/sql,/graph,/search-facet-invariants,/admin/segments,spellCheckCompRH1,/mlt,/admin/system,/replication,dismax,defaults,/config,/stream,/schema,/admin/plugins,/admin/logging,spellCheckWithWordbreak,mock,/admin/ping,/update,/admin/file,/terms,spellCheckCompRH_Direct,/debug/dump
    [junit4] 2> 1819179 INFO (coreLoadExecutor-11953-thread-1) [ x:collection1] o.a.s.c.SolrCore Using default statsCache cache: org.apache.solr.search.stats.LocalStatsCache
    [junit4] 2> 1819179 INFO (coreLoadExecutor-11953-thread-1) [ x:collection1] o.a.s.u.UpdateHandler Using UpdateLog implementation: org.apache.solr.update.UpdateLog
    [junit4] 2> 1819179 INFO (coreLoadExecutor-11953-thread-1) [ x:collection1] o.a.s.u.UpdateLog Initializing UpdateLog: dataDir= defaultSyncLevel=FLUSH numRecordsToKeep=100 maxNumLogsToKeep=10 numVersionBuckets=65536
    [junit4] 2> 1819180 INFO (coreLoadExecutor-11953-thread-1) [ x:collection1] o.a.s.u.CommitTracker Hard AutoCommit: disabled
    [junit4] 2> 1819180 INFO (coreLoadExecutor-11953-thread-1) [ x:collection1] o.a.s.u.CommitTracker Soft AutoCommit: disabled
    [junit4] 2> 1819181 INFO (coreLoadExecutor-11953-thread-1) [ x:collection1] o.a.s.u.RandomMergePolicy RandomMergePolicy wrapping class org.apache.lucene.index.TieredMergePolicy: [TieredMergePolicy: maxMergeAtOnce=20, maxMergeAtOnceExplicit=39, maxMergedSegmentMB=33.89453125, floorSegmentMB=0.712890625, forceMergeDeletesPctAllowed=12.65925450751287, segmentsPerTier=30.0, maxCFSSegmentSizeMB=8.796093022207999E12, noCFSRatio=1.0
    [junit4] 2> 1819181 INFO (coreLoadExecutor-11953-thread-1) [ x:collection1] o.a.s.c.SolrDeletionPolicy SolrDeletionPolicy.onInit: commits: num=1
    [junit4] 2> commit{dir=MockDirectoryWrapper(RAMDirectory@74a70255 lockFactory=org.apache.lucene.store.SingleInstanceLockFactory@15fb8d),segFN=segments_1,generation=1}
    [junit4] 2> 1819181 INFO (coreLoadExecutor-11953-thread-1) [ x:collection1] o.a.s.c.SolrDeletionPolicy newest commit generation = 1
    [junit4] 2> 1819181 INFO (coreLoadExecutor-11953-thread-1) [ x:collection1] o.a.s.s.SolrIndexSearcher Opening [Searcher@270f4a1e[collection1] main]
    [junit4] 2> 1819181 INFO (coreLoadExecutor-11953-thread-1) [ x:collection1] o.a.s.r.RestManager Initializing RestManager with initArgs: {storageIO=org.apache.solr.rest.ManagedResourceStorage$InMemoryStorageIO}
    [junit4] 2> 1819181 INFO (coreLoadExecutor-11953-thread-1) [ x:collection1] o.a.s.r.ManagedResourceStorage Reading _rest_managed.json using InMemoryStorage
    [junit4] 2> 1819182 INFO (coreLoadExecutor-11953-thread-1) [ x:collection1] o.a.s.r.RestManager Initializing 0 registered ManagedResources
    [junit4] 2> 1819182 INFO (coreLoadExecutor-11953-thread-1) [ x:collection1] o.a.s.h.c.SpellCheckComponent Initializing spell checkers
    [junit4] 2> 1819209 INFO (coreLoadExecutor-11953-thread-1) [ x:collection1] o.a.s.s.DirectSolrSpellChecker init: {name=direct,classname=DirectSolrSpellChecker,field=lowerfilt,minQueryLength=3}
    [junit4] 2> 1819299 INFO (coreLoadExecutor-11953-thread-1) [ x:collection1] o.a.s.h.ReplicationHandler Commits will be reserved for 10000
    [junit4] 2> 1819299 INFO (searcherExecutor-11954-thread-1-processing-x:collection1) [ x:collection1] o.a.s.h.c.SpellCheckComponent Loading spell index for spellchecker: default
    [junit4] 2> 1819300 INFO (searcherExecutor-11954-thread-1-processing-x:collection1) [ x:collection1] o.a.s.h.c.SpellCheckComponent Loading spell index for spellchecker: direct
    [junit4] 2> 1819300 INFO (searcherExecutor-11954-thread-1-processing-x:collection1) [ x:collection1] o.a.s.h.c.SpellCheckComponent Loading spell index for spellchecker: wordbreak
    [junit4] 2> 1819300 INFO (searcherExecutor-11954-thread-1-processing-x:collection1) [ x:collection1] o.a.s.h.c.SpellCheckComponent Loading spell index for spellchecker: multipleFields
    [junit4] 2> 1819300 INFO (searcherExecutor-11954-thread-1-processing-x:collection1) [ x:collection1] o.a.s.h.c.SpellCheckComponent Loading spell index for spellchecker: jarowinkler
    [junit4] 2> 1819300 INFO (searcherExecutor-11954-thread-1-processing-x:collection1) [ x:collection1] o.a.s.h.c.SpellCheckComponent Loading spell index for spellchecker: external
    [junit4] 2> 1819300 INFO (searcherExecutor-11954-thread-1-processing-x:collection1) [ x:collection1] o.a.s.h.c.SpellCheckComponent Loading spell index for spellchecker: freq
    [junit4] 2> 1819300 INFO (searcherExecutor-11954-thread-1-processing-x:collection1) [ x:collection1] o.a.s.h.c.SpellCheckComponent Loading spell index for spellchecker: fqcn
    [junit4] 2> 1819301 INFO (searcherExecutor-11954-thread-1-processing-x:collection1) [ x:collection1] o.a.s.h.c.SpellCheckComponent Loading spell index for spellchecker: perDict
    [junit4] 2> 1819301 INFO (searcherExecutor-11954-thread-1-processing-x:collection1) [ x:collection1] o.a.s.c.SolrCore [collection1] Registered new searcher Searcher@270f4a1e[collection1] main{ExitableDirectoryReader(UninvertingDirectoryReader())}
    [junit4] 2> 1819302 INFO (coreLoadExecutor-11953-thread-1) [ x:collection1] o.a.s.u.UpdateLog Looking up max value of version field to seed version buckets
    [junit4] 2> 1819302 INFO (coreLoadExecutor-11953-thread-1) [ x:collection1] o.a.s.u.VersionInfo Refreshing highest value of _version_ for 65536 version buckets from index
    [junit4] 2> 1819302 INFO (coreLoadExecutor-11953-thread-1) [ x:collection1] o.a.s.u.VersionInfo No terms found for _version_, cannot seed version bucket highest value from index
    [junit4] 2> 1819302 INFO (coreLoadExecutor-11953-thread-1) [ x:collection1] o.a.s.u.UpdateLog Could not find max version in index or recent updates, using new clock 1536907278953742336
    [junit4] 2> 1819304 INFO (coreLoadExecutor-11953-thread-1) [ x:collection1] o.a.s.u.UpdateLog Took 1.0ms to seed version buckets with highest version 1536907278953742336
    [junit4] 2> 1819304 INFO (coreLoadExecutor-11953-thread-1) [ x:collection1] o.a.s.c.CoreContainer registering core: collection1
    [junit4] 2> 1819618 INFO (TEST-DistributedFacetPivotLongTailTest.test-seed#[CBE03109F7964F8A]) [ ] o.a.s.SolrTestCaseJ4 Writing core.properties file to /home/jenkins/workspace/Lucene-Solr-master-Linux/solr/build/solr-core/test/J0/temp/solr.handler.component.DistributedFacetPivotLongTailTest_CBE03109F7964F8A-001/tempDir-001/shard1/cores/collection1
    [junit4] 2> 1819619 INFO (TEST-DistributedFacetPivotLongTailTest.test-seed#[CBE03109F7964F8A]) [ ] o.e.j.s.Server jetty-9.3.8.v20160314
    [junit4] 2> 1819620 INFO (TEST-DistributedFacetPivotLongTailTest.test-seed#[CBE03109F7964F8A]) [ ] o.e.j.s.h.ContextHandler Started o.e.j.s.ServletContextHandler@3ef4ab43{/,null,AVAILABLE}
    [junit4] 2> 1819623 INFO (TEST-DistributedFacetPivotLongTailTest.test-seed#[CBE03109F7964F8A]) [ ] o.e.j.s.ServerConnector Started ServerConnector@7344ca09{SSL,[ssl, http/1.1]}{127.0.0.1:41518}
    [junit4] 2> 1819623 INFO (TEST-DistributedFacetPivotLongTailTest.test-seed#[CBE03109F7964F8A]) [ ] o.e.j.s.Server Started @1820260ms
    [junit4] 2> 1819623 INFO (TEST-DistributedFacetPivotLongTailTest.test-seed#[CBE03109F7964F8A]) [ ] o.a.s.c.s.e.JettySolrRunner Jetty properties: {hostContext=/, hostPort=41518, coreRootDirectory=/home/jenkins/workspace/Lucene-Solr-master-Linux/solr/build/solr-core/test/J0/temp/solr.handler.component.DistributedFacetPivotLongTailTest_CBE03109F7964F8A-001/tempDir-001/shard1/cores}
    [junit4] 2> 1819623 INFO (TEST-DistributedFacetPivotLongTailTest.test-seed#[CBE03109F7964F8A]) [ ] o.a.s.s.SolrDispatchFilter SolrDispatchFilter.init(): sun.misc.Launcher$AppClassLoader@73d16e93
    [junit4] 2> 1819623 INFO (TEST-DistributedFacetPivotLongTailTest.test-seed#[CBE03109F7964F8A]) [ ] o.a.s.c.SolrResourceLoader new SolrResourceLoader for directory: '/home/jenkins/workspace/Lucene-Solr-master-Linux/solr/build/solr-core/test/J0/temp/solr.handler.component.DistributedFacetPivotLongTailTest_CBE03109F7964F8A-001/tempDir-001/shard1'
    [junit4] 2> 1819623 INFO (TEST-DistributedFacetPivotLongTailTest.test-seed#[CBE03109F7964F8A]) [ ] o.a.s.c.SolrResourceLoader JNDI not configured for solr (NoInitialContextEx)
    [junit4] 2> 1819623 INFO (TEST-DistributedFacetPivotLongTailTest.test-seed#[CBE03109F7964F8A]) [ ] o.a.s.c.SolrResourceLoader solr home defaulted to 'solr/' (could not find system property or JNDI)
    [junit4] 2> 1819624 INFO (TEST-DistributedFacetPivotLongTailTest.test-seed#[CBE03109F7964F8A]) [ ] o.a.s.c.SolrXmlConfig Loading container configuration from /home/jenkins/workspace/Lucene-Solr-master-Linux/solr/build/solr-core/test/J0/temp/solr.handler.component.DistributedFacetPivotLongTailTest_CBE03109F7964F8A-001/tempDir-001/shard1/solr.xml
    [junit4] 2> 1819628 INFO (TEST-DistributedFacetPivotLongTailTest.test-seed#[CBE03109F7964F8A]) [ ] o.a.s.c.CorePropertiesLocator Config-defined core root directory: /home/jenkins/workspace/Lucene-Solr-master-Linux/solr/build/solr-core/test/J0/temp/solr.handler.component.DistributedFacetPivotLongTailTest_CBE03109F7964F8A-001/tempDir-001/shard1/cores
    [junit4] 2> 1819628 INFO (TEST-DistributedFacetPivotLongTailTest.test-seed#[CBE03109F7964F8A]) [ ] o.a.s.c.CoreContainer New CoreContainer 840862099
    [junit4] 2> 1819628 INFO (TEST-DistributedFacetPivotLongTailTest.test-seed#[CBE03109F7964F8A]) [ ] o.a.s.c.CoreContainer Loading cores into CoreContainer [instanceDir=/home/jenkins/workspace/Lucene-Solr-master-Linux/solr/build/solr-core/test/J0/temp/solr.handler.component.DistributedFacetPivotLongTailTest_CBE03109F7964F8A-001/tempDir-001/shard1]
    [junit4] 2> 1819628 WARN (TEST-DistributedFacetPivotLongTailTest.test-seed#[CBE03109F7964F8A]) [ ] o.a.s.c.CoreContainer Couldn't add files from /home/jenkins/workspace/Lucene-Solr-master-Linux/solr/build/solr-core/test/J0/temp/solr.handler.component.DistributedFacetPivotLongTailTest_CBE03109F7964F8A-001/tempDir-001/shard1/lib to classpath: /home/jenkins/workspace/Lucene-Solr-master-Linux/solr/build/solr-core/test/J0/temp/solr.handler.component.DistributedFacetPivotLongTailTest_CBE03109F7964F8A-001/tempDir-001/shard1/lib
    [junit4] 2> 1819628 INFO (TEST-DistributedFacetPivotLongTailTest.test-seed#[CBE03109F7964F8A]) [ ] o.a.s.h.c.HttpShardHandlerFactory created with socketTimeout : 90000,urlScheme : https,connTimeout : 15000,maxConnectionsPerHost : 20,maxConnections : 10000,corePoolSize : 0,maximumPoolSize : 2147483647,maxThreadIdleTime : 5,sizeOfQueue : -1,fairnessPolicy : false,
    [junit4] 2> 1819630 INFO (TEST-DistributedFacetPivotLongTailTest.test-seed#[CBE03109F7964F8A]) [ ] o.a.s.u.UpdateShardHandler Creating UpdateShardHandler HTTP client with params:
    [junit4] 2> 1819630 INFO (TEST-DistributedFacetPivotLongTailTest.test-seed#[CBE03109F7964F8A]) [ ] o.a.s.l.LogWatcher SLF4J impl is org.slf4j.impl.Log4jLoggerFactory
    [junit4] 2> 1819630 INFO (TEST-DistributedFacetPivotLongTailTest.test-seed#[CBE03109F7964F8A]) [ ] o.a.s.l.LogWatcher Registering Log Listener [Log4j (org.slf4j.impl.Log4jLoggerFactory)]
    [junit4] 2> 1819631 INFO (TEST-DistributedFacetPivotLongTailTest.test-seed#[CBE03109F7964F8A]) [ ] o.a.s.c.CoreContainer Security conf doesn't exist. Skipping setup for authorization module.
    [junit4] 2> 1819631 INFO (TEST-DistributedFacetPivotLongTailTest.test-seed#[CBE03109F7964F8A]) [ ] o.a.s.c.CoreContainer No authentication plugin used.
    [junit4] 2> 1819631 INFO (TEST-DistributedFacetPivotLongTailTest.test-seed#[CBE03109F7964F8A]) [ ] o.a.s.c.CorePropertiesLocator Looking for core definitions underneath /home/jenkins/workspace/Lucene-Solr-master-Linux/solr/build/solr-core/test/J0/temp/solr.handler.component.DistributedFacetPivotLongTailTest_CBE03109F7964F8A-001/tempDir-001/shard1/cores
    [junit4] 2> 1819632 INFO (TEST-DistributedFacetPivotLongTailTest.test-seed#[CBE03109F7964F8A]) [ ] o.a.s.c.CoreDescriptor Created CoreDescriptor: {name=collection1, config=solrconfig.xml, loadOnStartup=true, schema=schema.xml, configSetProperties=configsetprops.json, transient=false, dataDir=data/, configSet=collection1}
    [junit4] 2> 1819632 INFO (TEST-DistributedFacetPivotLongTailTest.test-seed#[CBE03109F7964F8A]) [ ] o.a.s.c.CorePropertiesLocator Found core collection1 in /home/jenkins/workspace/Lucene-Solr-master-Linux/solr/build/solr-core/test/J0/temp/solr.handler.component.DistributedFacetPivotLongTailTest_CBE03109F7964F8A-001/tempDir-001/shard1/cores/collection1
    [junit4] 2> 1819632 INFO (TEST-DistributedFacetPivotLongTailTest.test-seed#[CBE03109F7964F8A]) [ ] o.a.s.c.CorePropertiesLocator Found 1 core definitions
    [junit4] 2> 1819632 INFO (coreLoadExecutor-11964-thread-1) [ ] o.a.s.c.SolrResourceLoader new SolrResourceLoader for directory: '/home/jenkins/workspace/Lucene-Solr-master-Linux/solr/core/src/test-files/solr/collection1'
    [junit4] 2> 1819632 INFO (coreLoadExecutor-11964-thread-1) [ ] o.a.s.c.SolrResourceLoader JNDI not configured for solr (NoInitialContextEx)
    [junit4] 2> 1819632 INFO (coreLoadExecutor-11964-thread-1) [ ] o.a.s.c.SolrResourceLoader solr home defaulted to 'solr/' (could not find system property or JNDI)
    [junit4] 2> 1819632 INFO (coreLoadExecutor-11964-thread-1) [ ] o.a.s.c.SolrResourceLoader Adding 'file:/home/jenkins/workspace/Lucene-Solr-master-Linux/solr/core/src/test-files/solr/collection1/lib/classes/' to classloader
    [junit4] 2> 1819633 INFO (coreLoadExecutor-11964-thread-1) [ ] o.a.s.c.SolrResourceLoader Adding 'file:/home/jenkins/workspace/Lucene-Solr-master-Linux/solr/core/src/test-files/solr/collection1/lib/README' to classloader
    [junit4] 2> 1819634 INFO (TEST-DistributedFacetPivotLongTailTest.test-seed#[CBE03109F7964F8A]) [ ] o.a.s.s.SolrDispatchFilter user.dir=/home/jenkins/workspace/Lucene-Solr-master-Linux/solr/build/solr-core/test/J0
    [junit4] 2> 1819634 INFO (TEST-DistributedFacetPivotLongTailTest.test-seed#[CBE03109F7964F8A]) [ ] o.a.s.s.SolrDispatchFilter SolrDispatchFilter.init() done
    [junit4] 2> 1819656 INFO (coreLoadExecutor-11964-thread-1) [ ] o.a.s.c.SolrConfig current version of requestparams : -1
    [junit4] 2> 1819665 WARN (coreLoadExecutor-11964-thread-1) [ ] o.a.s.c.Config Beginning with Solr 5.5, <mergePolicy> is deprecated, use <mergePolicyFactory> instead.
    [junit4] 2> 1819667 INFO (coreLoadExecutor-11964-thread-1) [ ] o.a.s.c.SolrConfig Using Lucene MatchVersion: 7.0.0
    [junit4] 2> 1819691 INFO (coreLoadExecutor-11964-thread-1) [ ] o.a.s.c.SolrConfig Loaded SolrConfig: solrconfig.xml
    [junit4] 2> 1819696 INFO (coreLoadExecutor-11964-thread-1) [ ] o.a.s.s.IndexSchema [collection1] Schema name=test
    [junit4] 2> 1819767 INFO (coreLoadExecutor-11964-thread-1) [ ] o.a.s.s.OpenExchangeRatesOrgProvider Initialized with rates=open-exchange-rates.json, refreshInterval=1440.
    [junit4] 2> 1819772 INFO (coreLoadExecutor-11964-thread-1) [ ] o.a.s.s.IndexSchema default search field in schema is text
    [junit4] 2> 1819773 INFO (coreLoadExecutor-11964-thread-1) [ ] o.a.s.s.IndexSchema unique key field: id
    [junit4] 2> 1819775 INFO (coreLoadExecutor-11964-thread-1) [ ] o.a.s.s.FileExchangeRateProvider Reloading exchange rates from file currency.xml
    [junit4] 2> 1819777 INFO (coreLoadExecutor-11964-thread-1) [ ] o.a.s.s.FileExchangeRateProvider Reloading exchange rates from file currency.xml
    [junit4] 2> 1819778 INFO (coreLoadExecutor-11964-thread-1) [ ] o.a.s.s.OpenExchangeRatesOrgProvider Reloading exchange rates from open-exchange-rates.json
    [junit4] 2> 1819778 INFO (coreLoadExecutor-11964-thread-1) [ ] o.a.s.s.OpenExchangeRatesOrgProvider Reloading exchange rates from open-exchange-rates.json
    [junit4] 2> 1819779 INFO (coreLoadExecutor-11964-thread-1) [ ] o.a.s.c.ConfigSetProperties Did not find ConfigSet properties, assuming default properties: Can't find resource 'configsetprops.json' in classpath or '/home/jenkins/workspace/Lucene-Solr-master-Linux/solr/core/src/test-files/solr/collection1'
    [junit4] 2> 1819779 INFO (coreLoadExecutor-11964-thread-1) [ ] o.a.s.c.CoreContainer Creating SolrCore 'collection1' using configuration from configset /home/jenkins/workspace/Lucene-Solr-master-Linux/solr/core/src/test-files/solr/collection1
    [junit4] 2> 1819779 INFO (coreLoadExecutor-11964-thread-1) [ x:collection1] o.a.s.c.SolrCore org.apache.solr.core.MockDirectoryFactory
    [junit4] 2> 1819780 INFO (coreLoadExecutor-11964-thread-1) [ x:collection1] o.a.s.c.SolrCore [[collection1] ] Opening new SolrCore at [/home/jenkins/workspace/Lucene-Solr-master-Linux/solr/core/src/test-files/solr/collection1], dataDir=[/home/jenkins/workspace/Lucene-Solr-master-Linux/solr/build/solr-core/test/J0/temp/solr.handler.component.DistributedFacetPivotLongTailTest_CBE03109F7964F8A-001/tempDir-001/shard1/cores/collection1/data/]
    [junit4] 2> 1819780 INFO (coreLoadExecutor-11964-thread-1) [ x:collection1] o.a.s.c.JmxMonitoredMap JMX monitoring is enabled. Adding Solr mbeans to JMX Server: com.sun.jmx.mbeanserver.JmxMBeanServer@3605f795
    [junit4] 2> 1819780 INFO (coreLoadExecutor-11964-thread-1) [ x:collection1] o.a.s.c.CachingDirectoryFactory return new directory for /home/jenkins/workspace/Lucene-Solr-master-Linux/solr/build/solr-core/test/J0/temp/solr.handler.component.DistributedFacetPivotLongTailTest_CBE03109F7964F8A-001/tempDir-001/shard1/cores/collection1/data
    [junit4] 2> 1819780 INFO (coreLoadExecutor-11964-thread-1) [ x:collection1] o.a.s.c.SolrCore New index directory detected: old=null new=/home/jenkins/workspace/Lucene-Solr-master-Linux/solr/build/solr-core/test/J0/temp/solr.handler.component.DistributedFacetPivotLongTailTest_CBE03109F7964F8A-001/tempDir-001/shard1/cores/collection1/data/index/
    [junit4] 2> 1819780 WARN (coreLoadExecutor-11964-thread-1) [ x:collection1] o.a.s.c.SolrCore [collection1] Solr index directory '/home/jenkins/workspace/Lucene-Solr-master-Linux/solr/build/solr-core/test/J0/temp/solr.handler.component.DistributedFacetPivotLongTailTest_CBE03109F7964F8A-001/tempDir-001/shard1/cores/collection1/data/index' doesn't exist. Creating new index...
    [junit4] 2> 1819780 INFO (coreLoadExecutor-11964-thread-1) [ x:collection1] o.a.s.c.CachingDirectoryFactory return new directory for /home/jenkins/workspace/Lucene-Solr-master-Linux/solr/build/solr-core/test/J0/temp/solr.handler.component.DistributedFacetPivotLongTailTest_CBE03109F7964F8A-001/tempDir-001/shard1/cores/collection1/data/index
    [junit4] 2> 1819780 INFO (coreLoadExecutor-11964-thread-1) [ x:collection1] o.a.s.u.RandomMergePolicy RandomMergePolicy wrapping class org.apache.lucene.index.TieredMergePolicy: [TieredMergePolicy: maxMergeAtOnce=45, maxMergeAtOnceExplicit=45, maxMergedSegmentMB=11.9560546875, floorSegmentMB=1.7626953125, forceMergeDeletesPctAllowed=27.734807702220845, segmentsPerTier=35.0, maxCFSSegmentSizeMB=8.796093022207999E12, noCFSRatio=1.0
    [junit4] 2> 1819781 INFO (coreLoadExecutor-11964-thread-1) [ x:collection1] o.a.s.c.SolrDeletionPolicy SolrDeletionPolicy.onCommit: commits: num=1
    [junit4] 2> commit{dir=MockDirectoryWrapper(RAMDirectory@20a58136 lockFactory=org.apache.lucene.store.SingleInstanceLockFactory@2dfa2bbe),segFN=segments_1,generation=1}
    [junit4] 2> 1819781 INFO (coreLoadExecutor-11964-thread-1) [ x:collection1] o.a.s.c.SolrDeletionPolicy newest commit generation = 1
    [junit4] 2> 1819781 INFO (OldIndexDirectoryCleanupThreadForCore-collection1) [ x:collection1] o.a.s.c.SolrCore Looking for old index directories to cleanup for core collection1 in /home/jenkins/workspace/Lucene-Solr-master-Linux/solr/build/solr-core/test/J0/temp/solr.handler.component.DistributedFacetPivotLongTailTest_CBE03109F7964F8A-001/tempDir-001/shard1/cores/collection1/data/
    [junit4] 2> 1819781 WARN (OldIndexDirectoryCleanupThreadForCore-collection1) [ x:collection1] o.a.s.c.DirectoryFactory /home/jenkins/workspace/Lucene-Solr-master-Linux/solr/build/solr-core/test/J0/temp/solr.handler.component.DistributedFacetPivotLongTailTest_CBE03109F7964F8A-001/tempDir-001/shard1/cores/collection1/data/ does not point to a valid data directory; skipping clean-up of old index directories.
    [junit4] 2> 1819783 INFO (coreLoadExecutor-11964-thread-1) [ x:collection1] o.a.s.u.p.UpdateRequestProcessorChain creating updateRequestProcessorChain "dedupe"
    [junit4] 2> 1819783 INFO (coreLoadExecutor-11964-thread-1) [ x:collection1] o.a.s.u.p.UpdateRequestProcessorChain inserting DistributedUpdateProcessorFactory into updateRequestProcessorChain "dedupe"
    [junit4] 2> 1819783 INFO (coreLoadExecutor-11964-thread-1) [ x:collection1] o.a.s.u.p.UpdateRequestProcessorChain creating updateRequestProcessorChain "dedupe-allfields"
    [junit4] 2> 1819783 INFO (coreLoadExecutor-11964-thread-1) [ x:collection1] o.a.s.u.p.UpdateRequestProcessorChain inserting DistributedUpdateProcessorFactory into updateRequestProcessorChain "dedupe-allfields"
    [junit4] 2> 1819783 INFO (coreLoadExecutor-11964-thread-1) [ x:collection1] o.a.s.u.p.UpdateRequestProcessorChain creating updateRequestProcessorChain "stored_sig"
    [junit4] 2> 1819783 INFO (coreLoadExecutor-11964-thread-1) [ x:collection1] o.a.s.u.p.UpdateRequestProcessorChain inserting DistributedUpdateProcessorFactory into updateRequestProcessorChain "stored_sig"
    [junit4] 2> 1819783 INFO (coreLoadExecutor-11964-thread-1) [ x:collection1] o.a.s.u.p.UpdateRequestProcessorChain creating updateRequestProcessorChain "u

[...truncated too long message...]

r ] o.a.s.c.Overseer According to ZK I (id=96056695460790279-127.0.0.1:41192_solr-n_0000000002) am no longer a leader.
    [junit4] 2> 2333615 INFO (OverseerCollectionConfigSetProcessor-96056695460790279-127.0.0.1:41192_solr-n_0000000002) [n:127.0.0.1:41192_solr ] o.a.s.c.OverseerTaskProcessor According to ZK I (id=96056695460790279-127.0.0.1:41192_solr-n_0000000002) am no longer a leader.
    [junit4] 2> 2333615 INFO (OverseerStateUpdate-96056695460790279-127.0.0.1:41192_solr-n_0000000002) [n:127.0.0.1:41192_solr ] o.a.s.c.Overseer Starting to work on the main queue
    [junit4] 2> 2333616 ERROR (OverseerCollectionConfigSetProcessor-96056695460790279-127.0.0.1:41192_solr-n_0000000002) [n:127.0.0.1:41192_solr ] o.a.s.c.OverseerTaskProcessor Unable to prioritize overseer
    [junit4] 2> java.lang.InterruptedException
    [junit4] 2> at org.apache.solr.common.cloud.ZkCmdExecutor.retryOperation(ZkCmdExecutor.java:67)
    [junit4] 2> at org.apache.solr.common.cloud.SolrZkClient.exists(SolrZkClient.java:311)
    [junit4] 2> at org.apache.solr.cloud.OverseerNodePrioritizer.prioritizeOverseerNodes(OverseerNodePrioritizer.java:60)
    [junit4] 2> at org.apache.solr.cloud.OverseerTaskProcessor.run(OverseerTaskProcessor.java:154)
    [junit4] 2> at java.lang.Thread.run(Thread.java:745)
    [junit4] 2> 2333616 INFO (zkCallback-2342-thread-4-processing-n:127.0.0.1:41192_solr) [n:127.0.0.1:41192_solr ] o.a.s.c.c.ZkStateReader A live node change: [WatchedEvent state:SyncConnected type:NodeChildrenChanged path:/live_nodes], has occurred - updating... (live nodes size: [1])
    [junit4] 2> 2333616 INFO (OverseerStateUpdate-96056695460790279-127.0.0.1:41192_solr-n_0000000002) [n:127.0.0.1:41192_solr ] o.a.s.c.Overseer Overseer Loop exiting : 127.0.0.1:41192_solr
    [junit4] 2> 2333616 WARN (zkCallback-2342-thread-4-processing-n:127.0.0.1:41192_solr) [n:127.0.0.1:41192_solr ] o.a.s.c.c.ZkStateReader ZooKeeper watch triggered, but Solr cannot talk to ZK: [KeeperErrorCode = Session expired for /live_nodes]
    [junit4] 2> 2333616 INFO (jetty-launcher-2332-thread-6) [ ] o.e.j.s.h.ContextHandler Stopped o.e.j.s.ServletContextHandler@1976753b{/solr,null,UNAVAILABLE}
    [junit4] 2> 2335105 WARN (zkCallback-2356-thread-5-processing-n:127.0.0.1:45404_solr) [n:127.0.0.1:45404_solr ] o.a.s.c.c.ZkStateReader ZooKeeper watch triggered, but Solr cannot talk to ZK: [KeeperErrorCode = Session expired for /live_nodes]
    [junit4] 2> 2335105 INFO (jetty-launcher-2332-thread-9) [ ] o.e.j.s.h.ContextHandler Stopped o.e.j.s.ServletContextHandler@5ffd7c0d{/solr,null,UNAVAILABLE}
    [junit4] 2> 2335106 INFO (SUITE-TestTolerantUpdateProcessorCloud-seed#[CBE03109F7964F8A]-worker) [ ] o.a.s.c.ZkTestServer connecting to 127.0.0.1:45264 45264
    [junit4] 2> 2335124 INFO (Thread-4141) [ ] o.a.s.c.ZkTestServer connecting to 127.0.0.1:45264 45264
    [junit4] 2> 2335124 WARN (Thread-4141) [ ] o.a.s.c.ZkTestServer Watch limit violations:
    [junit4] 2> Maximum concurrent create/delete watches above limit:
    [junit4] 2>
    [junit4] 2> 6 /solr/aliases.json
    [junit4] 2> 5 /solr/security.json
    [junit4] 2> 4 /solr/configs/solrCloudCollectionConfig/managed-schema
    [junit4] 2> 4 /solr/configs/solrCloudCollectionConfig
    [junit4] 2>
    [junit4] 2> Maximum concurrent data watches above limit:
    [junit4] 2>
    [junit4] 2> 6 /solr/clusterstate.json
    [junit4] 2> 6 /solr/clusterprops.json
    [junit4] 2> 4 /solr/collections/test_col/state.json
    [junit4] 2>
    [junit4] 2> Maximum concurrent children watches above limit:
    [junit4] 2>
    [junit4] 2> 651 /solr/overseer/collection-queue-work
    [junit4] 2> 16 /solr/overseer/queue
    [junit4] 2> 6 /solr/live_nodes
    [junit4] 2> 6 /solr/collections
    [junit4] 2> 3 /solr/overseer/queue-work
    [junit4] 2>
    [junit4] 2> 2335125 INFO (SUITE-TestTolerantUpdateProcessorCloud-seed#[CBE03109F7964F8A]-worker) [ ] o.a.s.SolrTestCaseJ4 ###deleteCore
    [junit4] 2> NOTE: leaving temporary files on disk at: /home/jenkins/workspace/Lucene-Solr-master-Linux/solr/build/solr-core/test/J1/temp/solr.cloud.TestTolerantUpdateProcessorCloud_CBE03109F7964F8A-001
    [junit4] 2> Jun 12, 2016 5:31:55 AM com.carrotsearch.randomizedtesting.ThreadLeakControl checkThreadLeaks
    [junit4] 2> WARNING: Will linger awaiting termination of 1 leaked thread(s).
    [junit4] 2> NOTE: test params are: codec=CheapBastard, sim=ClassicSimilarity, locale=el-GR, timezone=Africa/Banjul
    [junit4] 2> NOTE: Linux 4.4.0-21-generic amd64/Oracle Corporation 1.8.0_92 (64-bit)/cpus=12,threads=1,free=190544800,total=469762048
    [junit4] 2> NOTE: All tests run in this JVM: [HdfsRecoveryZkTest, TestBM25SimilarityFactory, CollectionsAPIDistributedZkTest, BigEndianAscendingWordSerializerTest, HighlighterTest, IndexBasedSpellCheckerTest, TestCollectionAPI, IgnoreCommitOptimizeUpdateProcessorFactoryTest, SuggestComponentTest, SpellingQueryConverterTest, TestDefaultStatsCache, TestComplexPhraseQParserPlugin, ConfigSetsAPITest, TestSolrCoreProperties, DistanceUnitsTest, BasicFunctionalityTest, TestReplicaProperties, ZkSolrClientTest, ChaosMonkeySafeLeaderTest, TestConfigSets, LeaderInitiatedRecoveryOnShardRestartTest, TestReqParamsAPI, TestSolrDynamicMBean, BlockCacheTest, TestSolrCLIRunExample, ShardRoutingCustomTest, MoreLikeThisHandlerTest, AnalyticsMergeStrategyTest, TestQuerySenderListener, HttpPartitionTest, DocValuesTest, TriLevelCompositeIdRoutingTest, AliasIntegrationTest, MergeStrategyTest, DocumentBuilderTest, FileUtilsTest, TestBlobHandler, DistributedQueryComponentCustomSortTest, DistributedTermsComponentTest, AnalysisErrorHandlingTest, NotRequiredUniqueKeyTest, ChaosMonkeyNothingIsSafeTest, TestRuleBasedAuthorizationPlugin, DOMUtilTest, ClusterStateUpdateTest, SimplePostToolTest, TestDynamicFieldCollectionResource, ZkStateReaderTest, EnumFieldTest, TestQuerySenderNoQuery, TestDocumentBuilder, TestPivotHelperCode, WordBreakSolrSpellCheckerTest, TestSolrFieldCacheMBean, DistribCursorPagingTest, TestFieldCacheWithThreads, SuggesterFSTTest, TestEmbeddedSolrServerConstructors, SolrInfoMBeanTest, TestMinMaxOnMultiValuedField, HdfsWriteToMultipleCollectionsTest, TestCollationFieldDocValues, ChangedSchemaMergeTest, CollectionReloadTest, TestSchemaManager, HdfsThreadLeakTest, TestSolrCloudWithKerberosAlt, ZkCLITest, TestCustomDocTransformer, MultiTermTest, BlockJoinFacetSimpleTest, TestSolrDeletionPolicy2, SchemaVersionSpecificBehaviorTest, TestFiltering, TestReloadAndDeleteDocs, DistributedMLTComponentTest, OpenExchangeRatesOrgProviderTest, TestFilteredDocIdSet, TestAddFieldRealTimeGet, DistributedQueueTest, TestQueryUtils, DeleteReplicaTest, TestRandomCollapseQParserPlugin, PKIAuthenticationIntegrationTest, SolrPluginUtilsTest, RestartWhileUpdatingTest, DistanceFunctionTest, FullHLLTest, NumericFieldsTest, TestFieldCache, TestNamedUpdateProcessors, OpenCloseCoreStressTest, TestSchemaVersionResource, SoftAutoCommitTest, OverseerRolesTest, TestMiniSolrCloudClusterBase, SparseHLLTest, TimeZoneUtilsTest, CSVRequestHandlerTest, TestSolrIndexConfig, SolrIndexConfigTest, MinimalSchemaTest, TestConfig, SpellPossibilityIteratorTest, TestCodecSupport, EchoParamsTest, TestDFRSimilarityFactory, TestPerFieldSimilarity, TestLMJelinekMercerSimilarityFactory, TestIBSimilarityFactory, ResourceLoaderTest, ScriptEngineTest, RAMDirectoryFactoryTest, TestUtils, SliceStateTest, DistributedIntervalFacetingTest, TestTolerantSearch, ActionThrottleTest, AsyncMigrateRouteKeyTest, CollectionsAPISolrJTest, DistributedVersionInfoTest, MultiThreadedOCPTest, OverriddenZkACLAndCredentialsProvidersTest, OverseerTaskQueueTest, RecoveryAfterSoftCommitTest, SharedFSAutoReplicaFailoverUtilsTest, SolrCloudExampleTest, TestConfigSetsAPI, TestConfigSetsAPIZkFailure, TestCryptoKeys, TestDownShardTolerantSearch, TestLeaderInitiatedRecoveryThread, TestMiniSolrCloudClusterSSL, TestOnReconnectListenerSupport, TestRequestStatusCollectionAPI, TestShortCircuitedRequests, TestTolerantUpdateProcessorCloud]
    [junit4] Completed [614/614 (2!)] on J1 in 662.13s, 19 tests, 2 errors <<< FAILURES!

[...truncated 1 lines...]
    [junit4] JVM J1: stdout was not empty, see: /home/jenkins/workspace/Lucene-Solr-master-Linux/solr/build/solr-core/test/temp/junit4-J1-20160612_045258_664.sysout
    [junit4] >>> JVM J1 emitted unexpected output (verbatim) ----
    [junit4] java.lang.OutOfMemoryError: GC overhead limit exceeded
    [junit4] Dumping heap to /home/jenkins/workspace/Lucene-Solr-master-Linux/heapdumps/java_pid28505.hprof ...
    [junit4] Heap dump file created [435520023 bytes in 1.261 secs]
    [junit4] <<< JVM J1: EOF ----

[...truncated 12 lines...]
BUILD FAILED
/home/jenkins/workspace/Lucene-Solr-master-Linux/build.xml:740: The following error occurred while executing this line:
/home/jenkins/workspace/Lucene-Solr-master-Linux/build.xml:684: The following error occurred while executing this line:
/home/jenkins/workspace/Lucene-Solr-master-Linux/build.xml:59: The following error occurred while executing this line:
/home/jenkins/workspace/Lucene-Solr-master-Linux/solr/build.xml:233: The following error occurred while executing this line:
/home/jenkins/workspace/Lucene-Solr-master-Linux/solr/common-build.xml:531: The following error occurred while executing this line:
/home/jenkins/workspace/Lucene-Solr-master-Linux/lucene/common-build.xml:1427: The following error occurred while executing this line:
/home/jenkins/workspace/Lucene-Solr-master-Linux/lucene/common-build.xml:984: There were test failures: 614 suites (10 ignored), 2583 tests, 3 errors, 116 ignored (72 assumptions) [seed: CBE03109F7964F8A]

Total time: 60 minutes 50 seconds
Build step 'Invoke Ant' marked build as failure
Archiving artifacts
[WARNINGS] Skipping publisher since build result is FAILURE
Recording test results
Email was triggered for: Failure - Any
Sending email for trigger: Failure - Any

Search Discussions

  • Policeman Jenkins Server at Jun 12, 2016 at 8:48 am
    Build: http://jenkins.thetaphi.de/job/Lucene-Solr-master-Linux/16973/
    Java: 64bit/jdk1.8.0_92 -XX:-UseCompressedOops -XX:+UseParallelGC

    4 tests failed.
    FAILED: org.apache.solr.cloud.TestTolerantUpdateProcessorCloud.testVariousAddsViaCloudClient

    Error Message:
    Error from server at https://127.0.0.1:40633/solr/test_col: Async exception during distributed update: Connect to 127.0.0.1:39833 [/127.0.0.1] failed: Read timed out

    Stack Trace:
    org.apache.solr.client.solrj.impl.HttpSolrClient$RemoteSolrException: Error from server at https://127.0.0.1:40633/solr/test_col: Async exception during distributed update: Connect to 127.0.0.1:39833 [/127.0.0.1] failed: Read timed out
      at __randomizedtesting.SeedInfo.seed([1D7A2691847F5CD4:20CBAAE5BB96650D]:0)
      at org.apache.solr.client.solrj.impl.HttpSolrClient.executeMethod(HttpSolrClient.java:606)
      at org.apache.solr.client.solrj.impl.HttpSolrClient.request(HttpSolrClient.java:259)
      at org.apache.solr.client.solrj.impl.HttpSolrClient.request(HttpSolrClient.java:248)
      at org.apache.solr.client.solrj.impl.LBHttpSolrClient.doRequest(LBHttpSolrClient.java:413)
      at org.apache.solr.client.solrj.impl.LBHttpSolrClient.request(LBHttpSolrClient.java:366)
      at org.apache.solr.client.solrj.impl.CloudSolrClient.sendRequest(CloudSolrClient.java:1228)
      at org.apache.solr.client.solrj.impl.CloudSolrClient.requestWithRetryOnStaleState(CloudSolrClient.java:998)
      at org.apache.solr.client.solrj.impl.CloudSolrClient.request(CloudSolrClient.java:934)
      at org.apache.solr.client.solrj.SolrRequest.process(SolrRequest.java:149)
      at org.apache.solr.client.solrj.SolrClient.deleteByQuery(SolrClient.java:895)
      at org.apache.solr.client.solrj.SolrClient.deleteByQuery(SolrClient.java:858)
      at org.apache.solr.client.solrj.SolrClient.deleteByQuery(SolrClient.java:873)
      at org.apache.solr.cloud.TestTolerantUpdateProcessorCloud.testVariousAdds(TestTolerantUpdateProcessorCloud.java:511)
      at org.apache.solr.cloud.TestTolerantUpdateProcessorCloud.testVariousAddsViaCloudClient(TestTolerantUpdateProcessorCloud.java:396)
      at sun.reflect.NativeMethodAccessorImpl.invoke0(Native Method)
      at sun.reflect.NativeMethodAccessorImpl.invoke(NativeMethodAccessorImpl.java:62)
      at sun.reflect.DelegatingMethodAccessorImpl.invoke(DelegatingMethodAccessorImpl.java:43)
      at java.lang.reflect.Method.invoke(Method.java:498)
      at com.carrotsearch.randomizedtesting.RandomizedRunner.invoke(RandomizedRunner.java:1764)
      at com.carrotsearch.randomizedtesting.RandomizedRunner$8.evaluate(RandomizedRunner.java:871)
      at com.carrotsearch.randomizedtesting.RandomizedRunner$9.evaluate(RandomizedRunner.java:907)
      at com.carrotsearch.randomizedtesting.RandomizedRunner$10.evaluate(RandomizedRunner.java:921)
      at com.carrotsearch.randomizedtesting.rules.SystemPropertiesRestoreRule$1.evaluate(SystemPropertiesRestoreRule.java:57)
      at org.apache.lucene.util.TestRuleSetupTeardownChained$1.evaluate(TestRuleSetupTeardownChained.java:49)
      at org.apache.lucene.util.AbstractBeforeAfterRule$1.evaluate(AbstractBeforeAfterRule.java:45)
      at org.apache.lucene.util.TestRuleThreadAndTestName$1.evaluate(TestRuleThreadAndTestName.java:48)
      at org.apache.lucene.util.TestRuleIgnoreAfterMaxFailures$1.evaluate(TestRuleIgnoreAfterMaxFailures.java:64)
      at org.apache.lucene.util.TestRuleMarkFailure$1.evaluate(TestRuleMarkFailure.java:47)
      at com.carrotsearch.randomizedtesting.rules.StatementAdapter.evaluate(StatementAdapter.java:36)
      at com.carrotsearch.randomizedtesting.ThreadLeakControl$StatementRunner.run(ThreadLeakControl.java:367)
      at com.carrotsearch.randomizedtesting.ThreadLeakControl.forkTimeoutingTask(ThreadLeakControl.java:809)
      at com.carrotsearch.randomizedtesting.ThreadLeakControl$3.evaluate(ThreadLeakControl.java:460)
      at com.carrotsearch.randomizedtesting.RandomizedRunner.runSingleTest(RandomizedRunner.java:880)
      at com.carrotsearch.randomizedtesting.RandomizedRunner$5.evaluate(RandomizedRunner.java:781)
      at com.carrotsearch.randomizedtesting.RandomizedRunner$6.evaluate(RandomizedRunner.java:816)
      at com.carrotsearch.randomizedtesting.RandomizedRunner$7.evaluate(RandomizedRunner.java:827)
      at com.carrotsearch.randomizedtesting.rules.StatementAdapter.evaluate(StatementAdapter.java:36)
      at com.carrotsearch.randomizedtesting.rules.SystemPropertiesRestoreRule$1.evaluate(SystemPropertiesRestoreRule.java:57)
      at org.apache.lucene.util.AbstractBeforeAfterRule$1.evaluate(AbstractBeforeAfterRule.java:45)
      at com.carrotsearch.randomizedtesting.rules.StatementAdapter.evaluate(StatementAdapter.java:36)
      at org.apache.lucene.util.TestRuleStoreClassName$1.evaluate(TestRuleStoreClassName.java:41)
      at com.carrotsearch.randomizedtesting.rules.NoShadowingOrOverridesOnMethodsRule$1.evaluate(NoShadowingOrOverridesOnMethodsRule.java:40)
      at com.carrotsearch.randomizedtesting.rules.NoShadowingOrOverridesOnMethodsRule$1.evaluate(NoShadowingOrOverridesOnMethodsRule.java:40)
      at com.carrotsearch.randomizedtesting.rules.StatementAdapter.evaluate(StatementAdapter.java:36)
      at com.carrotsearch.randomizedtesting.rules.StatementAdapter.evaluate(StatementAdapter.java:36)
      at com.carrotsearch.randomizedtesting.rules.StatementAdapter.evaluate(StatementAdapter.java:36)
      at org.apache.lucene.util.TestRuleAssertionsRequired$1.evaluate(TestRuleAssertionsRequired.java:53)
      at org.apache.lucene.util.TestRuleMarkFailure$1.evaluate(TestRuleMarkFailure.java:47)
      at org.apache.lucene.util.TestRuleIgnoreAfterMaxFailures$1.evaluate(TestRuleIgnoreAfterMaxFailures.java:64)
      at org.apache.lucene.util.TestRuleIgnoreTestSuites$1.evaluate(TestRuleIgnoreTestSuites.java:54)
      at com.carrotsearch.randomizedtesting.rules.StatementAdapter.evaluate(StatementAdapter.java:36)
      at com.carrotsearch.randomizedtesting.ThreadLeakControl$StatementRunner.run(ThreadLeakControl.java:367)
      at java.lang.Thread.run(Thread.java:745)


    FAILED: org.apache.solr.handler.TestReqParamsAPI.test

    Error Message:
    Could not get expected value 'first' for path 'response/params/x/_appends_/add' full output: { "responseHeader":{ "status":0, "QTime":0}, "response":{ "znodeVersion":3, "params":{ "x":{ "a":"A val", "b":"B val", "":{"v":0}}, "y":{ "p":"P val", "q":"Q val", "":{"v":2}}}}}, from server: https://127.0.0.1:41729/collection1

    Stack Trace:
    java.lang.AssertionError: Could not get expected value 'first' for path 'response/params/x/_appends_/add' full output: {
       "responseHeader":{
         "status":0,
         "QTime":0},
       "response":{
         "znodeVersion":3,
         "params":{
           "x":{
             "a":"A val",
             "b":"B val",
             "":{"v":0}},
           "y":{
             "p":"P val",
             "q":"Q val",
             "":{"v":2}}}}}, from server: https://127.0.0.1:41729/collection1
      at __randomizedtesting.SeedInfo.seed([1D7A2691847F5CD4:952E194B2A83312C]:0)
      at org.junit.Assert.fail(Assert.java:93)
      at org.junit.Assert.assertTrue(Assert.java:43)
      at org.apache.solr.core.TestSolrConfigHandler.testForResponseElement(TestSolrConfigHandler.java:481)
      at org.apache.solr.handler.TestReqParamsAPI.testReqParams(TestReqParamsAPI.java:231)
      at org.apache.solr.handler.TestReqParamsAPI.test(TestReqParamsAPI.java:62)
      at sun.reflect.NativeMethodAccessorImpl.invoke0(Native Method)
      at sun.reflect.NativeMethodAccessorImpl.invoke(NativeMethodAccessorImpl.java:62)
      at sun.reflect.DelegatingMethodAccessorImpl.invoke(DelegatingMethodAccessorImpl.java:43)
      at java.lang.reflect.Method.invoke(Method.java:498)
      at com.carrotsearch.randomizedtesting.RandomizedRunner.invoke(RandomizedRunner.java:1764)
      at com.carrotsearch.randomizedtesting.RandomizedRunner$8.evaluate(RandomizedRunner.java:871)
      at com.carrotsearch.randomizedtesting.RandomizedRunner$9.evaluate(RandomizedRunner.java:907)
      at com.carrotsearch.randomizedtesting.RandomizedRunner$10.evaluate(RandomizedRunner.java:921)
      at org.apache.solr.BaseDistributedSearchTestCase$ShardsRepeatRule$ShardsFixedStatement.callStatement(BaseDistributedSearchTestCase.java:985)
      at org.apache.solr.BaseDistributedSearchTestCase$ShardsRepeatRule$ShardsStatement.evaluate(BaseDistributedSearchTestCase.java:960)
      at com.carrotsearch.randomizedtesting.rules.SystemPropertiesRestoreRule$1.evaluate(SystemPropertiesRestoreRule.java:57)
      at org.apache.lucene.util.TestRuleSetupTeardownChained$1.evaluate(TestRuleSetupTeardownChained.java:49)
      at org.apache.lucene.util.AbstractBeforeAfterRule$1.evaluate(AbstractBeforeAfterRule.java:45)
      at org.apache.lucene.util.TestRuleThreadAndTestName$1.evaluate(TestRuleThreadAndTestName.java:48)
      at org.apache.lucene.util.TestRuleIgnoreAfterMaxFailures$1.evaluate(TestRuleIgnoreAfterMaxFailures.java:64)
      at org.apache.lucene.util.TestRuleMarkFailure$1.evaluate(TestRuleMarkFailure.java:47)
      at com.carrotsearch.randomizedtesting.rules.StatementAdapter.evaluate(StatementAdapter.java:36)
      at com.carrotsearch.randomizedtesting.ThreadLeakControl$StatementRunner.run(ThreadLeakControl.java:367)
      at com.carrotsearch.randomizedtesting.ThreadLeakControl.forkTimeoutingTask(ThreadLeakControl.java:809)
      at com.carrotsearch.randomizedtesting.ThreadLeakControl$3.evaluate(ThreadLeakControl.java:460)
      at com.carrotsearch.randomizedtesting.RandomizedRunner.runSingleTest(RandomizedRunner.java:880)
      at com.carrotsearch.randomizedtesting.RandomizedRunner$5.evaluate(RandomizedRunner.java:781)
      at com.carrotsearch.randomizedtesting.RandomizedRunner$6.evaluate(RandomizedRunner.java:816)
      at com.carrotsearch.randomizedtesting.RandomizedRunner$7.evaluate(RandomizedRunner.java:827)
      at com.carrotsearch.randomizedtesting.rules.StatementAdapter.evaluate(StatementAdapter.java:36)
      at com.carrotsearch.randomizedtesting.rules.SystemPropertiesRestoreRule$1.evaluate(SystemPropertiesRestoreRule.java:57)
      at org.apache.lucene.util.AbstractBeforeAfterRule$1.evaluate(AbstractBeforeAfterRule.java:45)
      at com.carrotsearch.randomizedtesting.rules.StatementAdapter.evaluate(StatementAdapter.java:36)
      at org.apache.lucene.util.TestRuleStoreClassName$1.evaluate(TestRuleStoreClassName.java:41)
      at com.carrotsearch.randomizedtesting.rules.NoShadowingOrOverridesOnMethodsRule$1.evaluate(NoShadowingOrOverridesOnMethodsRule.java:40)
      at com.carrotsearch.randomizedtesting.rules.NoShadowingOrOverridesOnMethodsRule$1.evaluate(NoShadowingOrOverridesOnMethodsRule.java:40)
      at com.carrotsearch.randomizedtesting.rules.StatementAdapter.evaluate(StatementAdapter.java:36)
      at com.carrotsearch.randomizedtesting.rules.StatementAdapter.evaluate(StatementAdapter.java:36)
      at com.carrotsearch.randomizedtesting.rules.StatementAdapter.evaluate(StatementAdapter.java:36)
      at org.apache.lucene.util.TestRuleAssertionsRequired$1.evaluate(TestRuleAssertionsRequired.java:53)
      at org.apache.lucene.util.TestRuleMarkFailure$1.evaluate(TestRuleMarkFailure.java:47)
      at org.apache.lucene.util.TestRuleIgnoreAfterMaxFailures$1.evaluate(TestRuleIgnoreAfterMaxFailures.java:64)
      at org.apache.lucene.util.TestRuleIgnoreTestSuites$1.evaluate(TestRuleIgnoreTestSuites.java:54)
      at com.carrotsearch.randomizedtesting.rules.StatementAdapter.evaluate(StatementAdapter.java:36)
      at com.carrotsearch.randomizedtesting.ThreadLeakControl$StatementRunner.run(ThreadLeakControl.java:367)
      at java.lang.Thread.run(Thread.java:745)


    FAILED: org.apache.solr.schema.TestManagedSchemaAPI.test

    Error Message:
    Error from server at http://127.0.0.1:37868/solr/testschemaapi_shard1_replica1: ERROR: [doc=2] unknown field 'myNewField1'

    Stack Trace:
    org.apache.solr.client.solrj.impl.CloudSolrClient$RouteException: Error from server at http://127.0.0.1:37868/solr/testschemaapi_shard1_replica1: ERROR: [doc=2] unknown field 'myNewField1'
      at __randomizedtesting.SeedInfo.seed([1D7A2691847F5CD4:952E194B2A83312C]:0)
      at org.apache.solr.client.solrj.impl.CloudSolrClient.directUpdate(CloudSolrClient.java:697)
      at org.apache.solr.client.solrj.impl.CloudSolrClient.sendRequest(CloudSolrClient.java:1109)
      at org.apache.solr.client.solrj.impl.CloudSolrClient.requestWithRetryOnStaleState(CloudSolrClient.java:998)
      at org.apache.solr.client.solrj.impl.CloudSolrClient.request(CloudSolrClient.java:934)
      at org.apache.solr.schema.TestManagedSchemaAPI.testAddFieldAndDocument(TestManagedSchemaAPI.java:86)
      at org.apache.solr.schema.TestManagedSchemaAPI.test(TestManagedSchemaAPI.java:55)
      at sun.reflect.NativeMethodAccessorImpl.invoke0(Native Method)
      at sun.reflect.NativeMethodAccessorImpl.invoke(NativeMethodAccessorImpl.java:62)
      at sun.reflect.DelegatingMethodAccessorImpl.invoke(DelegatingMethodAccessorImpl.java:43)
      at java.lang.reflect.Method.invoke(Method.java:498)
      at com.carrotsearch.randomizedtesting.RandomizedRunner.invoke(RandomizedRunner.java:1764)
      at com.carrotsearch.randomizedtesting.RandomizedRunner$8.evaluate(RandomizedRunner.java:871)
      at com.carrotsearch.randomizedtesting.RandomizedRunner$9.evaluate(RandomizedRunner.java:907)
      at com.carrotsearch.randomizedtesting.RandomizedRunner$10.evaluate(RandomizedRunner.java:921)
      at com.carrotsearch.randomizedtesting.rules.SystemPropertiesRestoreRule$1.evaluate(SystemPropertiesRestoreRule.java:57)
      at org.apache.lucene.util.TestRuleSetupTeardownChained$1.evaluate(TestRuleSetupTeardownChained.java:49)
      at org.apache.lucene.util.AbstractBeforeAfterRule$1.evaluate(AbstractBeforeAfterRule.java:45)
      at org.apache.lucene.util.TestRuleThreadAndTestName$1.evaluate(TestRuleThreadAndTestName.java:48)
      at org.apache.lucene.util.TestRuleIgnoreAfterMaxFailures$1.evaluate(TestRuleIgnoreAfterMaxFailures.java:64)
      at org.apache.lucene.util.TestRuleMarkFailure$1.evaluate(TestRuleMarkFailure.java:47)
      at com.carrotsearch.randomizedtesting.rules.StatementAdapter.evaluate(StatementAdapter.java:36)
      at com.carrotsearch.randomizedtesting.ThreadLeakControl$StatementRunner.run(ThreadLeakControl.java:367)
      at com.carrotsearch.randomizedtesting.ThreadLeakControl.forkTimeoutingTask(ThreadLeakControl.java:809)
      at com.carrotsearch.randomizedtesting.ThreadLeakControl$3.evaluate(ThreadLeakControl.java:460)
      at com.carrotsearch.randomizedtesting.RandomizedRunner.runSingleTest(RandomizedRunner.java:880)
      at com.carrotsearch.randomizedtesting.RandomizedRunner$5.evaluate(RandomizedRunner.java:781)
      at com.carrotsearch.randomizedtesting.RandomizedRunner$6.evaluate(RandomizedRunner.java:816)
      at com.carrotsearch.randomizedtesting.RandomizedRunner$7.evaluate(RandomizedRunner.java:827)
      at com.carrotsearch.randomizedtesting.rules.StatementAdapter.evaluate(StatementAdapter.java:36)
      at com.carrotsearch.randomizedtesting.rules.SystemPropertiesRestoreRule$1.evaluate(SystemPropertiesRestoreRule.java:57)
      at org.apache.lucene.util.AbstractBeforeAfterRule$1.evaluate(AbstractBeforeAfterRule.java:45)
      at com.carrotsearch.randomizedtesting.rules.StatementAdapter.evaluate(StatementAdapter.java:36)
      at org.apache.lucene.util.TestRuleStoreClassName$1.evaluate(TestRuleStoreClassName.java:41)
      at com.carrotsearch.randomizedtesting.rules.NoShadowingOrOverridesOnMethodsRule$1.evaluate(NoShadowingOrOverridesOnMethodsRule.java:40)
      at com.carrotsearch.randomizedtesting.rules.NoShadowingOrOverridesOnMethodsRule$1.evaluate(NoShadowingOrOverridesOnMethodsRule.java:40)
      at com.carrotsearch.randomizedtesting.rules.StatementAdapter.evaluate(StatementAdapter.java:36)
      at com.carrotsearch.randomizedtesting.rules.StatementAdapter.evaluate(StatementAdapter.java:36)
      at com.carrotsearch.randomizedtesting.rules.StatementAdapter.evaluate(StatementAdapter.java:36)
      at org.apache.lucene.util.TestRuleAssertionsRequired$1.evaluate(TestRuleAssertionsRequired.java:53)
      at org.apache.lucene.util.TestRuleMarkFailure$1.evaluate(TestRuleMarkFailure.java:47)
      at org.apache.lucene.util.TestRuleIgnoreAfterMaxFailures$1.evaluate(TestRuleIgnoreAfterMaxFailures.java:64)
      at org.apache.lucene.util.TestRuleIgnoreTestSuites$1.evaluate(TestRuleIgnoreTestSuites.java:54)
      at com.carrotsearch.randomizedtesting.rules.StatementAdapter.evaluate(StatementAdapter.java:36)
      at com.carrotsearch.randomizedtesting.ThreadLeakControl$StatementRunner.run(ThreadLeakControl.java:367)
      at java.lang.Thread.run(Thread.java:745)
    Caused by: org.apache.solr.client.solrj.impl.HttpSolrClient$RemoteSolrException: Error from server at http://127.0.0.1:37868/solr/testschemaapi_shard1_replica1: ERROR: [doc=2] unknown field 'myNewField1'
      at org.apache.solr.client.solrj.impl.HttpSolrClient.executeMethod(HttpSolrClient.java:606)
      at org.apache.solr.client.solrj.impl.HttpSolrClient.request(HttpSolrClient.java:259)
      at org.apache.solr.client.solrj.impl.HttpSolrClient.request(HttpSolrClient.java:248)
      at org.apache.solr.client.solrj.impl.LBHttpSolrClient.doRequest(LBHttpSolrClient.java:413)
      at org.apache.solr.client.solrj.impl.LBHttpSolrClient.request(LBHttpSolrClient.java:366)
      at org.apache.solr.client.solrj.impl.CloudSolrClient.lambda$directUpdate$0(CloudSolrClient.java:674)
      at java.util.concurrent.FutureTask.run(FutureTask.java:266)
      at org.apache.solr.common.util.ExecutorUtil$MDCAwareThreadPoolExecutor.lambda$execute$0(ExecutorUtil.java:229)
      at java.util.concurrent.ThreadPoolExecutor.runWorker(ThreadPoolExecutor.java:1142)
      at java.util.concurrent.ThreadPoolExecutor$Worker.run(ThreadPoolExecutor.java:617)
      ... 1 more


    FAILED: org.apache.solr.handler.component.DistributedFacetPivotLongTailTest.test

    Error Message:
    Error from server at https://127.0.0.1:34661//collection1: Expected mime type application/octet-stream but got text/html. <html> <head> <meta http-equiv="Content-Type" content="text/html;charset=ISO-8859-1"/> <title>Error 500 </title> </head> <body> <h2>HTTP ERROR: 500</h2> <p>Problem accessing /collection1/select. Reason: <pre> java.lang.OutOfMemoryError: GC overhead limit exceeded</pre></p> <hr /><a href="http://eclipse.org/jetty">Powered by Jetty:// 9.3.8.v20160314</a><hr/> </body> </html>

    Stack Trace:
    org.apache.solr.client.solrj.impl.HttpSolrClient$RemoteSolrException: Error from server at https://127.0.0.1:34661//collection1: Expected mime type application/octet-stream but got text/html. <html>
    <head>
    <meta http-equiv="Content-Type" content="text/html;charset=ISO-8859-1"/>
    <title>Error 500 </title>
    </head>
    <body>
    <h2>HTTP ERROR: 500</h2>
    <p>Problem accessing /collection1/select. Reason:
    <pre> java.lang.OutOfMemoryError: GC overhead limit exceeded</pre></p>
    <hr /><a href="http://eclipse.org/jetty">Powered by Jetty:// 9.3.8.v20160314</a><hr/>
    </body>
    [1D7A2691847F5CD4:952E194B2A83312C]:0)
      at org.apache.solr.client.solrj.impl.HttpSolrClient.executeMethod(HttpSolrClient.java:574)
      at org.apache.solr.client.solrj.impl.HttpSolrClient.request(HttpSolrClient.java:259)
      at org.apache.solr.client.solrj.impl.HttpSolrClient.request(HttpSolrClient.java:248)
      at org.apache.solr.client.solrj.SolrRequest.process(SolrRequest.java:149)
      at org.apache.solr.client.solrj.SolrClient.query(SolrClient.java:942)
      at org.apache.solr.client.solrj.SolrClient.query(SolrClient.java:957)
      at org.apache.solr.BaseDistributedSearchTestCase.queryServer(BaseDistributedSearchTestCase.java:557)
      at org.apache.solr.handler.component.DistributedFacetPivotLongTailTest.test(DistributedFacetPivotLongTailTest.java:209)
      at sun.reflect.NativeMethodAccessorImpl.invoke0(Native Method)
      at sun.reflect.NativeMethodAccessorImpl.invoke(NativeMethodAccessorImpl.java:62)
      at sun.reflect.DelegatingMethodAccessorImpl.invoke(DelegatingMethodAccessorImpl.java:43)
      at java.lang.reflect.Method.invoke(Method.java:498)
      at com.carrotsearch.randomizedtesting.RandomizedRunner.invoke(RandomizedRunner.java:1764)
      at com.carrotsearch.randomizedtesting.RandomizedRunner$8.evaluate(RandomizedRunner.java:871)
      at com.carrotsearch.randomizedtesting.RandomizedRunner$9.evaluate(RandomizedRunner.java:907)
      at com.carrotsearch.randomizedtesting.RandomizedRunner$10.evaluate(RandomizedRunner.java:921)
      at org.apache.solr.BaseDistributedSearchTestCase$ShardsRepeatRule$ShardsFixedStatement.callStatement(BaseDistributedSearchTestCase.java:985)
      at org.apache.solr.BaseDistributedSearchTestCase$ShardsRepeatRule$ShardsStatement.evaluate(BaseDistributedSearchTestCase.java:960)
      at com.carrotsearch.randomizedtesting.rules.SystemPropertiesRestoreRule$1.evaluate(SystemPropertiesRestoreRule.java:57)
      at org.apache.lucene.util.TestRuleSetupTeardownChained$1.evaluate(TestRuleSetupTeardownChained.java:49)
      at org.apache.lucene.util.AbstractBeforeAfterRule$1.evaluate(AbstractBeforeAfterRule.java:45)
      at org.apache.lucene.util.TestRuleThreadAndTestName$1.evaluate(TestRuleThreadAndTestName.java:48)
      at org.apache.lucene.util.TestRuleIgnoreAfterMaxFailures$1.evaluate(TestRuleIgnoreAfterMaxFailures.java:64)
      at org.apache.lucene.util.TestRuleMarkFailure$1.evaluate(TestRuleMarkFailure.java:47)
      at com.carrotsearch.randomizedtesting.rules.StatementAdapter.evaluate(StatementAdapter.java:36)
      at com.carrotsearch.randomizedtesting.ThreadLeakControl$StatementRunner.run(ThreadLeakControl.java:367)
      at com.carrotsearch.randomizedtesting.ThreadLeakControl.forkTimeoutingTask(ThreadLeakControl.java:809)
      at com.carrotsearch.randomizedtesting.ThreadLeakControl$3.evaluate(ThreadLeakControl.java:460)
      at com.carrotsearch.randomizedtesting.RandomizedRunner.runSingleTest(RandomizedRunner.java:880)
      at com.carrotsearch.randomizedtesting.RandomizedRunner$5.evaluate(RandomizedRunner.java:781)
      at com.carrotsearch.randomizedtesting.RandomizedRunner$6.evaluate(RandomizedRunner.java:816)
      at com.carrotsearch.randomizedtesting.RandomizedRunner$7.evaluate(RandomizedRunner.java:827)
      at com.carrotsearch.randomizedtesting.rules.StatementAdapter.evaluate(StatementAdapter.java:36)
      at com.carrotsearch.randomizedtesting.rules.SystemPropertiesRestoreRule$1.evaluate(SystemPropertiesRestoreRule.java:57)
      at org.apache.lucene.util.AbstractBeforeAfterRule$1.evaluate(AbstractBeforeAfterRule.java:45)
      at com.carrotsearch.randomizedtesting.rules.StatementAdapter.evaluate(StatementAdapter.java:36)
      at org.apache.lucene.util.TestRuleStoreClassName$1.evaluate(TestRuleStoreClassName.java:41)
      at com.carrotsearch.randomizedtesting.rules.NoShadowingOrOverridesOnMethodsRule$1.evaluate(NoShadowingOrOverridesOnMethodsRule.java:40)
      at com.carrotsearch.randomizedtesting.rules.NoShadowingOrOverridesOnMethodsRule$1.evaluate(NoShadowingOrOverridesOnMethodsRule.java:40)
      at com.carrotsearch.randomizedtesting.rules.StatementAdapter.evaluate(StatementAdapter.java:36)
      at com.carrotsearch.randomizedtesting.rules.StatementAdapter.evaluate(StatementAdapter.java:36)
      at com.carrotsearch.randomizedtesting.rules.StatementAdapter.evaluate(StatementAdapter.java:36)
      at org.apache.lucene.util.TestRuleAssertionsRequired$1.evaluate(TestRuleAssertionsRequired.java:53)
      at org.apache.lucene.util.TestRuleMarkFailure$1.evaluate(TestRuleMarkFailure.java:47)
      at org.apache.lucene.util.TestRuleIgnoreAfterMaxFailures$1.evaluate(TestRuleIgnoreAfterMaxFailures.java:64)
      at org.apache.lucene.util.TestRuleIgnoreTestSuites$1.evaluate(TestRuleIgnoreTestSuites.java:54)
      at com.carrotsearch.randomizedtesting.rules.StatementAdapter.evaluate(StatementAdapter.java:36)
      at com.carrotsearch.randomizedtesting.ThreadLeakControl$StatementRunner.run(ThreadLeakControl.java:367)
      at java.lang.Thread.run(Thread.java:745)




    Build Log:
    [...truncated 10605 lines...]
        [junit4] Suite: org.apache.solr.handler.TestReqParamsAPI
        [junit4] 2> Creating dataDir: /home/jenkins/workspace/Lucene-Solr-master-Linux/solr/build/solr-core/test/J1/temp/solr.handler.TestReqParamsAPI_1D7A2691847F5CD4-001/init-core-data-001
        [junit4] 2> 61616 INFO (SUITE-TestReqParamsAPI-seed#[1D7A2691847F5CD4]-worker) [ ] o.a.s.SolrTestCaseJ4 Randomized ssl (true) and clientAuth (true) via: @org.apache.solr.util.RandomizeSSL(reason=, ssl=NaN, value=NaN, clientAuth=NaN)
        [junit4] 2> 61618 INFO (SUITE-TestReqParamsAPI-seed#[1D7A2691847F5CD4]-worker) [ ] o.a.s.BaseDistributedSearchTestCase Setting hostContext system property: /
        [junit4] 2> 61622 INFO (TEST-TestReqParamsAPI.test-seed#[1D7A2691847F5CD4]) [ ] o.a.s.c.ZkTestServer STARTING ZK TEST SERVER
        [junit4] 2> 61622 INFO (Thread-74) [ ] o.a.s.c.ZkTestServer client port:0.0.0.0/0.0.0.0:0
        [junit4] 2> 61622 INFO (Thread-74) [ ] o.a.s.c.ZkTestServer Starting server
        [junit4] 2> 61722 INFO (TEST-TestReqParamsAPI.test-seed#[1D7A2691847F5CD4]) [ ] o.a.s.c.ZkTestServer start zk server on port:41613
        [junit4] 2> 61722 INFO (TEST-TestReqParamsAPI.test-seed#[1D7A2691847F5CD4]) [ ] o.a.s.c.c.SolrZkClient Using default ZkCredentialsProvider
        [junit4] 2> 61723 INFO (TEST-TestReqParamsAPI.test-seed#[1D7A2691847F5CD4]) [ ] o.a.s.c.c.ConnectionManager Waiting for client to connect to ZooKeeper
        [junit4] 2> 61725 INFO (zkCallback-47-thread-1) [ ] o.a.s.c.c.ConnectionManager Watcher org.apache.solr.common.cloud.ConnectionManager@edadea0 name:ZooKeeperConnection Watcher:127.0.0.1:41613 got event WatchedEvent state:SyncConnected type:None path:null path:null type:None
        [junit4] 2> 61725 INFO (TEST-TestReqParamsAPI.test-seed#[1D7A2691847F5CD4]) [ ] o.a.s.c.c.ConnectionManager Client is connected to ZooKeeper
        [junit4] 2> 61725 INFO (TEST-TestReqParamsAPI.test-seed#[1D7A2691847F5CD4]) [ ] o.a.s.c.c.SolrZkClient Using default ZkACLProvider
        [junit4] 2> 61725 INFO (TEST-TestReqParamsAPI.test-seed#[1D7A2691847F5CD4]) [ ] o.a.s.c.c.SolrZkClient makePath: /solr
        [junit4] 2> 61727 INFO (TEST-TestReqParamsAPI.test-seed#[1D7A2691847F5CD4]) [ ] o.a.s.c.c.SolrZkClient Using default ZkCredentialsProvider
        [junit4] 2> 61727 INFO (TEST-TestReqParamsAPI.test-seed#[1D7A2691847F5CD4]) [ ] o.a.s.c.c.ConnectionManager Waiting for client to connect to ZooKeeper
        [junit4] 2> 61728 INFO (zkCallback-48-thread-1) [ ] o.a.s.c.c.ConnectionManager Watcher org.apache.solr.common.cloud.ConnectionManager@7f1008d3 name:ZooKeeperConnection Watcher:127.0.0.1:41613/solr got event WatchedEvent state:SyncConnected type:None path:null path:null type:None
        [junit4] 2> 61728 INFO (TEST-TestReqParamsAPI.test-seed#[1D7A2691847F5CD4]) [ ] o.a.s.c.c.ConnectionManager Client is connected to ZooKeeper
        [junit4] 2> 61728 INFO (TEST-TestReqParamsAPI.test-seed#[1D7A2691847F5CD4]) [ ] o.a.s.c.c.SolrZkClient Using default ZkACLProvider
        [junit4] 2> 61729 INFO (TEST-TestReqParamsAPI.test-seed#[1D7A2691847F5CD4]) [ ] o.a.s.c.c.SolrZkClient makePath: /collections/collection1
        [junit4] 2> 61730 INFO (TEST-TestReqParamsAPI.test-seed#[1D7A2691847F5CD4]) [ ] o.a.s.c.c.SolrZkClient makePath: /collections/collection1/shards
        [junit4] 2> 61731 INFO (TEST-TestReqParamsAPI.test-seed#[1D7A2691847F5CD4]) [ ] o.a.s.c.c.SolrZkClient makePath: /collections/control_collection
        [junit4] 2> 61732 INFO (TEST-TestReqParamsAPI.test-seed#[1D7A2691847F5CD4]) [ ] o.a.s.c.c.SolrZkClient makePath: /collections/control_collection/shards
        [junit4] 2> 61733 INFO (TEST-TestReqParamsAPI.test-seed#[1D7A2691847F5CD4]) [ ] o.a.s.c.AbstractZkTestCase put /home/jenkins/workspace/Lucene-Solr-master-Linux/solr/core/src/test-files/solr/collection1/conf/solrconfig-tlog.xml to /configs/conf1/solrconfig.xml
        [junit4] 2> 61733 INFO (TEST-TestReqParamsAPI.test-seed#[1D7A2691847F5CD4]) [ ] o.a.s.c.c.SolrZkClient makePath: /configs/conf1/solrconfig.xml
        [junit4] 2> 61735 INFO (TEST-TestReqParamsAPI.test-seed#[1D7A2691847F5CD4]) [ ] o.a.s.c.AbstractZkTestCase put /home/jenkins/workspace/Lucene-Solr-master-Linux/solr/core/src/test-files/solr/collection1/conf/schema.xml to /configs/conf1/schema.xml
        [junit4] 2> 61736 INFO (TEST-TestReqParamsAPI.test-seed#[1D7A2691847F5CD4]) [ ] o.a.s.c.c.SolrZkClient makePath: /configs/conf1/schema.xml
        [junit4] 2> 61737 INFO (TEST-TestReqParamsAPI.test-seed#[1D7A2691847F5CD4]) [ ] o.a.s.c.AbstractZkTestCase put /home/jenkins/workspace/Lucene-Solr-master-Linux/solr/core/src/test-files/solr/collection1/conf/solrconfig.snippet.randomindexconfig.xml to /configs/conf1/solrconfig.snippet.randomindexconfig.xml
        [junit4] 2> 61737 INFO (TEST-TestReqParamsAPI.test-seed#[1D7A2691847F5CD4]) [ ] o.a.s.c.c.SolrZkClient makePath: /configs/conf1/solrconfig.snippet.randomindexconfig.xml
        [junit4] 2> 61738 INFO (TEST-TestReqParamsAPI.test-seed#[1D7A2691847F5CD4]) [ ] o.a.s.c.AbstractZkTestCase put /home/jenkins/workspace/Lucene-Solr-master-Linux/solr/core/src/test-files/solr/collection1/conf/stopwords.txt to /configs/conf1/stopwords.txt
        [junit4] 2> 61738 INFO (TEST-TestReqParamsAPI.test-seed#[1D7A2691847F5CD4]) [ ] o.a.s.c.c.SolrZkClient makePath: /configs/conf1/stopwords.txt
        [junit4] 2> 61739 INFO (TEST-TestReqParamsAPI.test-seed#[1D7A2691847F5CD4]) [ ] o.a.s.c.AbstractZkTestCase put /home/jenkins/workspace/Lucene-Solr-master-Linux/solr/core/src/test-files/solr/collection1/conf/protwords.txt to /configs/conf1/protwords.txt
        [junit4] 2> 61739 INFO (TEST-TestReqParamsAPI.test-seed#[1D7A2691847F5CD4]) [ ] o.a.s.c.c.SolrZkClient makePath: /configs/conf1/protwords.txt
        [junit4] 2> 61740 INFO (TEST-TestReqParamsAPI.test-seed#[1D7A2691847F5CD4]) [ ] o.a.s.c.AbstractZkTestCase put /home/jenkins/workspace/Lucene-Solr-master-Linux/solr/core/src/test-files/solr/collection1/conf/currency.xml to /configs/conf1/currency.xml
        [junit4] 2> 61740 INFO (TEST-TestReqParamsAPI.test-seed#[1D7A2691847F5CD4]) [ ] o.a.s.c.c.SolrZkClient makePath: /configs/conf1/currency.xml
        [junit4] 2> 61741 INFO (TEST-TestReqParamsAPI.test-seed#[1D7A2691847F5CD4]) [ ] o.a.s.c.AbstractZkTestCase put /home/jenkins/workspace/Lucene-Solr-master-Linux/solr/core/src/test-files/solr/collection1/conf/enumsConfig.xml to /configs/conf1/enumsConfig.xml
        [junit4] 2> 61741 INFO (TEST-TestReqParamsAPI.test-seed#[1D7A2691847F5CD4]) [ ] o.a.s.c.c.SolrZkClient makePath: /configs/conf1/enumsConfig.xml
        [junit4] 2> 61742 INFO (TEST-TestReqParamsAPI.test-seed#[1D7A2691847F5CD4]) [ ] o.a.s.c.AbstractZkTestCase put /home/jenkins/workspace/Lucene-Solr-master-Linux/solr/core/src/test-files/solr/collection1/conf/open-exchange-rates.json to /configs/conf1/open-exchange-rates.json
        [junit4] 2> 61742 INFO (TEST-TestReqParamsAPI.test-seed#[1D7A2691847F5CD4]) [ ] o.a.s.c.c.SolrZkClient makePath: /configs/conf1/open-exchange-rates.json
        [junit4] 2> 61743 INFO (TEST-TestReqParamsAPI.test-seed#[1D7A2691847F5CD4]) [ ] o.a.s.c.AbstractZkTestCase put /home/jenkins/workspace/Lucene-Solr-master-Linux/solr/core/src/test-files/solr/collection1/conf/mapping-ISOLatin1Accent.txt to /configs/conf1/mapping-ISOLatin1Accent.txt
        [junit4] 2> 61743 INFO (TEST-TestReqParamsAPI.test-seed#[1D7A2691847F5CD4]) [ ] o.a.s.c.c.SolrZkClient makePath: /configs/conf1/mapping-ISOLatin1Accent.txt
        [junit4] 2> 61744 INFO (TEST-TestReqParamsAPI.test-seed#[1D7A2691847F5CD4]) [ ] o.a.s.c.AbstractZkTestCase put /home/jenkins/workspace/Lucene-Solr-master-Linux/solr/core/src/test-files/solr/collection1/conf/old_synonyms.txt to /configs/conf1/old_synonyms.txt
        [junit4] 2> 61744 INFO (TEST-TestReqParamsAPI.test-seed#[1D7A2691847F5CD4]) [ ] o.a.s.c.c.SolrZkClient makePath: /configs/conf1/old_synonyms.txt
        [junit4] 2> 61745 INFO (TEST-TestReqParamsAPI.test-seed#[1D7A2691847F5CD4]) [ ] o.a.s.c.AbstractZkTestCase put /home/jenkins/workspace/Lucene-Solr-master-Linux/solr/core/src/test-files/solr/collection1/conf/synonyms.txt to /configs/conf1/synonyms.txt
        [junit4] 2> 61745 INFO (TEST-TestReqParamsAPI.test-seed#[1D7A2691847F5CD4]) [ ] o.a.s.c.c.SolrZkClient makePath: /configs/conf1/synonyms.txt
        [junit4] 2> 61748 INFO (TEST-TestReqParamsAPI.test-seed#[1D7A2691847F5CD4]) [ ] o.a.s.c.c.SolrZkClient Using default ZkCredentialsProvider
        [junit4] 2> 61748 INFO (TEST-TestReqParamsAPI.test-seed#[1D7A2691847F5CD4]) [ ] o.a.s.c.c.ConnectionManager Waiting for client to connect to ZooKeeper
        [junit4] 2> 61749 INFO (zkCallback-50-thread-1) [ ] o.a.s.c.c.ConnectionManager Watcher org.apache.solr.common.cloud.ConnectionManager@3c4347c4 name:ZooKeeperConnection Watcher:127.0.0.1:41613/solr got event WatchedEvent state:SyncConnected type:None path:null path:null type:None
        [junit4] 2> 61749 INFO (TEST-TestReqParamsAPI.test-seed#[1D7A2691847F5CD4]) [ ] o.a.s.c.c.ConnectionManager Client is connected to ZooKeeper
        [junit4] 2> 61749 INFO (TEST-TestReqParamsAPI.test-seed#[1D7A2691847F5CD4]) [ ] o.a.s.c.c.SolrZkClient Using default ZkACLProvider
        [junit4] 2> 61812 INFO (TEST-TestReqParamsAPI.test-seed#[1D7A2691847F5CD4]) [ ] o.a.s.SolrTestCaseJ4 Writing core.properties file to /home/jenkins/workspace/Lucene-Solr-master-Linux/solr/build/solr-core/test/J1/temp/solr.handler.TestReqParamsAPI_1D7A2691847F5CD4-001/control-001/cores/collection1
        [junit4] 2> 61823 INFO (TEST-TestReqParamsAPI.test-seed#[1D7A2691847F5CD4]) [ ] o.e.j.s.Server jetty-9.3.8.v20160314
        [junit4] 2> 61824 INFO (TEST-TestReqParamsAPI.test-seed#[1D7A2691847F5CD4]) [ ] o.e.j.s.h.ContextHandler Started o.e.j.s.ServletContextHandler@4b15a26e{/,null,AVAILABLE}
        [junit4] 2> 61848 INFO (TEST-TestReqParamsAPI.test-seed#[1D7A2691847F5CD4]) [ ] o.e.j.s.ServerConnector Started ServerConnector@5e102478{SSL,[ssl, http/1.1]}{127.0.0.1:45351}
        [junit4] 2> 61848 INFO (TEST-TestReqParamsAPI.test-seed#[1D7A2691847F5CD4]) [ ] o.e.j.s.Server Started @63599ms
        [junit4] 2> 61848 INFO (TEST-TestReqParamsAPI.test-seed#[1D7A2691847F5CD4]) [ ] o.a.s.c.s.e.JettySolrRunner Jetty properties: {solr.data.dir=/home/jenkins/workspace/Lucene-Solr-master-Linux/solr/build/solr-core/test/J1/temp/solr.handler.TestReqParamsAPI_1D7A2691847F5CD4-001/tempDir-001/control/data, hostContext=/, hostPort=45351, coreRootDirectory=/home/jenkins/workspace/Lucene-Solr-master-Linux/solr/build/solr-core/test/J1/temp/solr.handler.TestReqParamsAPI_1D7A2691847F5CD4-001/control-001/cores}
        [junit4] 2> 61848 INFO (TEST-TestReqParamsAPI.test-seed#[1D7A2691847F5CD4]) [ ] o.a.s.s.SolrDispatchFilter SolrDispatchFilter.init(): sun.misc.Launcher$AppClassLoader@73d16e93
        [junit4] 2> 61848 INFO (TEST-TestReqParamsAPI.test-seed#[1D7A2691847F5CD4]) [ ] o.a.s.c.SolrResourceLoader new SolrResourceLoader for directory: '/home/jenkins/workspace/Lucene-Solr-master-Linux/solr/build/solr-core/test/J1/temp/solr.handler.TestReqParamsAPI_1D7A2691847F5CD4-001/control-001'
        [junit4] 2> 61849 INFO (TEST-TestReqParamsAPI.test-seed#[1D7A2691847F5CD4]) [ ] o.a.s.c.SolrResourceLoader JNDI not configured for solr (NoInitialContextEx)
        [junit4] 2> 61849 INFO (TEST-TestReqParamsAPI.test-seed#[1D7A2691847F5CD4]) [ ] o.a.s.c.SolrResourceLoader solr home defaulted to 'solr/' (could not find system property or JNDI)
        [junit4] 2> 61849 INFO (TEST-TestReqParamsAPI.test-seed#[1D7A2691847F5CD4]) [ ] o.a.s.c.c.SolrZkClient Using default ZkCredentialsProvider
        [junit4] 2> 61849 INFO (TEST-TestReqParamsAPI.test-seed#[1D7A2691847F5CD4]) [ ] o.a.s.c.c.ConnectionManager Waiting for client to connect to ZooKeeper
        [junit4] 2> 61850 INFO (zkCallback-51-thread-1) [ ] o.a.s.c.c.ConnectionManager Watcher org.apache.solr.common.cloud.ConnectionManager@2ec7cdc7 name:ZooKeeperConnection Watcher:127.0.0.1:41613/solr got event WatchedEvent state:SyncConnected type:None path:null path:null type:None
        [junit4] 2> 61850 INFO (TEST-TestReqParamsAPI.test-seed#[1D7A2691847F5CD4]) [ ] o.a.s.c.c.ConnectionManager Client is connected to ZooKeeper
        [junit4] 2> 61851 INFO (TEST-TestReqParamsAPI.test-seed#[1D7A2691847F5CD4]) [ ] o.a.s.c.c.SolrZkClient Using default ZkACLProvider
        [junit4] 2> 61851 INFO (TEST-TestReqParamsAPI.test-seed#[1D7A2691847F5CD4]) [ ] o.a.s.s.SolrDispatchFilter Loading solr.xml from SolrHome (not found in ZooKeeper)
        [junit4] 2> 61851 INFO (TEST-TestReqParamsAPI.test-seed#[1D7A2691847F5CD4]) [ ] o.a.s.c.SolrXmlConfig Loading container configuration from /home/jenkins/workspace/Lucene-Solr-master-Linux/solr/build/solr-core/test/J1/temp/solr.handler.TestReqParamsAPI_1D7A2691847F5CD4-001/control-001/solr.xml
        [junit4] 2> 61858 INFO (TEST-TestReqParamsAPI.test-seed#[1D7A2691847F5CD4]) [ ] o.a.s.c.CorePropertiesLocator Config-defined core root directory: /home/jenkins/workspace/Lucene-Solr-master-Linux/solr/build/solr-core/test/J1/temp/solr.handler.TestReqParamsAPI_1D7A2691847F5CD4-001/control-001/cores
        [junit4] 2> 61859 INFO (TEST-TestReqParamsAPI.test-seed#[1D7A2691847F5CD4]) [ ] o.a.s.c.CoreContainer New CoreContainer 656566393
        [junit4] 2> 61859 INFO (TEST-TestReqParamsAPI.test-seed#[1D7A2691847F5CD4]) [ ] o.a.s.c.CoreContainer Loading cores into CoreContainer [instanceDir=/home/jenkins/workspace/Lucene-Solr-master-Linux/solr/build/solr-core/test/J1/temp/solr.handler.TestReqParamsAPI_1D7A2691847F5CD4-001/control-001]
        [junit4] 2> 61859 WARN (TEST-TestReqParamsAPI.test-seed#[1D7A2691847F5CD4]) [ ] o.a.s.c.CoreContainer Couldn't add files from /home/jenkins/workspace/Lucene-Solr-master-Linux/solr/build/solr-core/test/J1/temp/solr.handler.TestReqParamsAPI_1D7A2691847F5CD4-001/control-001/lib to classpath: /home/jenkins/workspace/Lucene-Solr-master-Linux/solr/build/solr-core/test/J1/temp/solr.handler.TestReqParamsAPI_1D7A2691847F5CD4-001/control-001/lib
        [junit4] 2> 61859 INFO (TEST-TestReqParamsAPI.test-seed#[1D7A2691847F5CD4]) [ ] o.a.s.h.c.HttpShardHandlerFactory created with socketTimeout : 90000,urlScheme : ,connTimeout : 15000,maxConnectionsPerHost : 20,maxConnections : 10000,corePoolSize : 0,maximumPoolSize : 2147483647,maxThreadIdleTime : 5,sizeOfQueue : -1,fairnessPolicy : false,
        [junit4] 2> 61860 INFO (TEST-TestReqParamsAPI.test-seed#[1D7A2691847F5CD4]) [ ] o.a.s.u.UpdateShardHandler Creating UpdateShardHandler HTTP client with params:
        [junit4] 2> 61861 INFO (TEST-TestReqParamsAPI.test-seed#[1D7A2691847F5CD4]) [ ] o.a.s.l.LogWatcher SLF4J impl is org.slf4j.impl.Log4jLoggerFactory
        [junit4] 2> 61861 INFO (TEST-TestReqParamsAPI.test-seed#[1D7A2691847F5CD4]) [ ] o.a.s.l.LogWatcher Registering Log Listener [Log4j (org.slf4j.impl.Log4jLoggerFactory)]
        [junit4] 2> 61861 INFO (TEST-TestReqParamsAPI.test-seed#[1D7A2691847F5CD4]) [ ] o.a.s.c.ZkContainer Zookeeper client=127.0.0.1:41613/solr
        [junit4] 2> 61861 INFO (TEST-TestReqParamsAPI.test-seed#[1D7A2691847F5CD4]) [ ] o.a.s.c.ZkController zkHost includes chroot
        [junit4] 2> 61861 INFO (TEST-TestReqParamsAPI.test-seed#[1D7A2691847F5CD4]) [ ] o.a.s.c.c.SolrZkClient Using default ZkCredentialsProvider
        [junit4] 2> 61861 INFO (TEST-TestReqParamsAPI.test-seed#[1D7A2691847F5CD4]) [ ] o.a.s.c.c.ConnectionManager Waiting for client to connect to ZooKeeper
        [junit4] 2> 61863 INFO (zkCallback-54-thread-1) [ ] o.a.s.c.c.ConnectionManager Watcher org.apache.solr.common.cloud.ConnectionManager@7529e3d0 name:ZooKeeperConnection Watcher:127.0.0.1:41613 got event WatchedEvent state:SyncConnected type:None path:null path:null type:None
        [junit4] 2> 61863 INFO (TEST-TestReqParamsAPI.test-seed#[1D7A2691847F5CD4]) [ ] o.a.s.c.c.ConnectionManager Client is connected to ZooKeeper
        [junit4] 2> 61863 INFO (TEST-TestReqParamsAPI.test-seed#[1D7A2691847F5CD4]) [ ] o.a.s.c.c.SolrZkClient Using default ZkACLProvider
        [junit4] 2> 61864 INFO (TEST-TestReqParamsAPI.test-seed#[1D7A2691847F5CD4]) [n:127.0.0.1:45351_ ] o.a.s.c.ZkController Added new OnReconnect listener org.apache.solr.cloud.ZkController$$Lambda$13/1094467280@5b5e6e37
        [junit4] 2> 61864 INFO (TEST-TestReqParamsAPI.test-seed#[1D7A2691847F5CD4]) [n:127.0.0.1:45351_ ] o.a.s.c.c.ConnectionManager Waiting for client to connect to ZooKeeper
        [junit4] 2> 61867 INFO (zkCallback-55-thread-1-processing-n:127.0.0.1:45351_) [n:127.0.0.1:45351_ ] o.a.s.c.c.ConnectionManager Watcher org.apache.solr.common.cloud.ConnectionManager@216e4e7f name:ZooKeeperConnection Watcher:127.0.0.1:41613/solr got event WatchedEvent state:SyncConnected type:None path:null path:null type:None
        [junit4] 2> 61867 INFO (TEST-TestReqParamsAPI.test-seed#[1D7A2691847F5CD4]) [n:127.0.0.1:45351_ ] o.a.s.c.c.ConnectionManager Client is connected to ZooKeeper
        [junit4] 2> 61868 INFO (TEST-TestReqParamsAPI.test-seed#[1D7A2691847F5CD4]) [n:127.0.0.1:45351_ ] o.a.s.c.c.SolrZkClient makePath: /overseer/queue
        [junit4] 2> 61869 INFO (TEST-TestReqParamsAPI.test-seed#[1D7A2691847F5CD4]) [n:127.0.0.1:45351_ ] o.a.s.c.c.SolrZkClient makePath: /overseer/collection-queue-work
        [junit4] 2> 61870 INFO (TEST-TestReqParamsAPI.test-seed#[1D7A2691847F5CD4]) [n:127.0.0.1:45351_ ] o.a.s.c.c.SolrZkClient makePath: /overseer/collection-map-running
        [junit4] 2> 61871 INFO (TEST-TestReqParamsAPI.test-seed#[1D7A2691847F5CD4]) [n:127.0.0.1:45351_ ] o.a.s.c.c.SolrZkClient makePath: /overseer/collection-map-completed
        [junit4] 2> 61872 INFO (TEST-TestReqParamsAPI.test-seed#[1D7A2691847F5CD4]) [n:127.0.0.1:45351_ ] o.a.s.c.c.SolrZkClient makePath: /overseer/collection-map-failure
        [junit4] 2> 61873 INFO (TEST-TestReqParamsAPI.test-seed#[1D7A2691847F5CD4]) [n:127.0.0.1:45351_ ] o.a.s.c.c.SolrZkClient makePath: /live_nodes
        [junit4] 2> 61873 INFO (TEST-TestReqParamsAPI.test-seed#[1D7A2691847F5CD4]) [n:127.0.0.1:45351_ ] o.a.s.c.c.SolrZkClient makePath: /aliases.json
        [junit4] 2> 61874 INFO (TEST-TestReqParamsAPI.test-seed#[1D7A2691847F5CD4]) [n:127.0.0.1:45351_ ] o.a.s.c.c.SolrZkClient makePath: /clusterstate.json
        [junit4] 2> 61874 INFO (TEST-TestReqParamsAPI.test-seed#[1D7A2691847F5CD4]) [n:127.0.0.1:45351_ ] o.a.s.c.c.SolrZkClient makePath: /security.json
        [junit4] 2> 61875 INFO (TEST-TestReqParamsAPI.test-seed#[1D7A2691847F5CD4]) [n:127.0.0.1:45351_ ] o.a.s.c.c.ZkStateReader Updating cluster state from ZooKeeper...
        [junit4] 2> 61876 INFO (TEST-TestReqParamsAPI.test-seed#[1D7A2691847F5CD4]) [n:127.0.0.1:45351_ ] o.a.s.c.c.ZkStateReader Loaded cluster properties: {urlScheme=https}
        [junit4] 2> 61876 INFO (TEST-TestReqParamsAPI.test-seed#[1D7A2691847F5CD4]) [n:127.0.0.1:45351_ ] o.a.s.c.c.ZkStateReader Updated live nodes from ZooKeeper... (0) -> (0)
        [junit4] 2> 61877 INFO (TEST-TestReqParamsAPI.test-seed#[1D7A2691847F5CD4]) [n:127.0.0.1:45351_ ] o.a.s.c.c.SolrZkClient makePath: /overseer_elect
        [junit4] 2> 61879 INFO (TEST-TestReqParamsAPI.test-seed#[1D7A2691847F5CD4]) [n:127.0.0.1:45351_ ] o.a.s.c.c.SolrZkClient makePath: /overseer_elect/election
        [junit4] 2> 61880 INFO (TEST-TestReqParamsAPI.test-seed#[1D7A2691847F5CD4]) [n:127.0.0.1:45351_ ] o.a.s.c.Overseer Overseer (id=null) closing
        [junit4] 2> 61880 INFO (TEST-TestReqParamsAPI.test-seed#[1D7A2691847F5CD4]) [n:127.0.0.1:45351_ ] o.a.s.c.LeaderElector Joined leadership election with path: /overseer_elect/election/96057378129379333-127.0.0.1:45351_-n_0000000000
        [junit4] 2> 61880 INFO (TEST-TestReqParamsAPI.test-seed#[1D7A2691847F5CD4]) [n:127.0.0.1:45351_ ] o.a.s.c.OverseerElectionContext I am going to be the leader 127.0.0.1:45351_
        [junit4] 2> 61880 INFO (TEST-TestReqParamsAPI.test-seed#[1D7A2691847F5CD4]) [n:127.0.0.1:45351_ ] o.a.s.c.c.SolrZkClient makePath: /overseer_elect/leader
        [junit4] 2> 61881 INFO (TEST-TestReqParamsAPI.test-seed#[1D7A2691847F5CD4]) [n:127.0.0.1:45351_ ] o.a.s.c.Overseer Overseer (id=96057378129379333-127.0.0.1:45351_-n_0000000000) starting
        [junit4] 2> 61881 INFO (TEST-TestReqParamsAPI.test-seed#[1D7A2691847F5CD4]) [n:127.0.0.1:45351_ ] o.a.s.c.c.SolrZkClient makePath: /overseer/queue-work
        [junit4] 2> 61884 INFO (TEST-TestReqParamsAPI.test-seed#[1D7A2691847F5CD4]) [n:127.0.0.1:45351_ ] o.a.s.c.OverseerAutoReplicaFailoverThread Starting OverseerAutoReplicaFailoverThread autoReplicaFailoverWorkLoopDelay=10000 autoReplicaFailoverWaitAfterExpiration=30000 autoReplicaFailoverBadNodeExpiration=60000
        [junit4] 2> 61884 INFO (OverseerCollectionConfigSetProcessor-96057378129379333-127.0.0.1:45351_-n_0000000000) [n:127.0.0.1:45351_ ] o.a.s.c.OverseerTaskProcessor Process current queue of overseer operations
        [junit4] 2> 61885 INFO (TEST-TestReqParamsAPI.test-seed#[1D7A2691847F5CD4]) [n:127.0.0.1:45351_ ] o.a.s.c.ZkController Register node as live in ZooKeeper:/live_nodes/127.0.0.1:45351_
        [junit4] 2> 61885 INFO (OverseerStateUpdate-96057378129379333-127.0.0.1:45351_-n_0000000000) [n:127.0.0.1:45351_ ] o.a.s.c.Overseer Starting to work on the main queue
        [junit4] 2> 61885 INFO (TEST-TestReqParamsAPI.test-seed#[1D7A2691847F5CD4]) [n:127.0.0.1:45351_ ] o.a.s.c.c.SolrZkClient makePath: /live_nodes/127.0.0.1:45351_
        [junit4] 2> 61886 INFO (zkCallback-55-thread-1-processing-n:127.0.0.1:45351_) [n:127.0.0.1:45351_ ] o.a.s.c.c.ZkStateReader A live node change: [WatchedEvent state:SyncConnected type:NodeChildrenChanged path:/live_nodes], has occurred - updating... (live nodes size: [0])
        [junit4] 2> 61886 INFO (OverseerStateUpdate-96057378129379333-127.0.0.1:45351_-n_0000000000) [n:127.0.0.1:45351_ ] o.a.s.c.c.ZkStateReader Updated live nodes from ZooKeeper... (0) -> (1)
        [junit4] 2> 61886 INFO (zkCallback-55-thread-1-processing-n:127.0.0.1:45351_) [n:127.0.0.1:45351_ ] o.a.s.c.c.ZkStateReader Updated live nodes from ZooKeeper... (1) -> (1)
        [junit4] 2> 61895 INFO (TEST-TestReqParamsAPI.test-seed#[1D7A2691847F5CD4]) [n:127.0.0.1:45351_ ] o.a.s.c.CoreContainer Security conf doesn't exist. Skipping setup for authorization module.
        [junit4] 2> 61895 INFO (TEST-TestReqParamsAPI.test-seed#[1D7A2691847F5CD4]) [n:127.0.0.1:45351_ ] o.a.s.c.CoreContainer No authentication plugin used.
        [junit4] 2> 61896 INFO (TEST-TestReqParamsAPI.test-seed#[1D7A2691847F5CD4]) [n:127.0.0.1:45351_ ] o.a.s.c.CorePropertiesLocator Looking for core definitions underneath /home/jenkins/workspace/Lucene-Solr-master-Linux/solr/build/solr-core/test/J1/temp/solr.handler.TestReqParamsAPI_1D7A2691847F5CD4-001/control-001/cores
        [junit4] 2> 61896 INFO (TEST-TestReqParamsAPI.test-seed#[1D7A2691847F5CD4]) [n:127.0.0.1:45351_ ] o.a.s.c.CoreDescriptor Created CoreDescriptor: {name=collection1, config=solrconfig.xml, transient=false, schema=schema.xml, loadOnStartup=true, configSetProperties=configsetprops.json, collection=control_collection, coreNodeName=, dataDir=data/, shard=}
        [junit4] 2> 61896 INFO (TEST-TestReqParamsAPI.test-seed#[1D7A2691847F5CD4]) [n:127.0.0.1:45351_ ] o.a.s.c.CorePropertiesLocator Found core collection1 in /home/jenkins/workspace/Lucene-Solr-master-Linux/solr/build/solr-core/test/J1/temp/solr.handler.TestReqParamsAPI_1D7A2691847F5CD4-001/control-001/cores/collection1
        [junit4] 2> 61896 INFO (TEST-TestReqParamsAPI.test-seed#[1D7A2691847F5CD4]) [n:127.0.0.1:45351_ ] o.a.s.c.CorePropertiesLocator Found 1 core definitions
        [junit4] 2> 61897 INFO (TEST-TestReqParamsAPI.test-seed#[1D7A2691847F5CD4]) [n:127.0.0.1:45351_ ] o.a.s.s.SolrDispatchFilter user.dir=/home/jenkins/workspace/Lucene-Solr-master-Linux/solr/build/solr-core/test/J1
        [junit4] 2> 61897 INFO (TEST-TestReqParamsAPI.test-seed#[1D7A2691847F5CD4]) [n:127.0.0.1:45351_ ] o.a.s.s.SolrDispatchFilter SolrDispatchFilter.init() done
        [junit4] 2> 61897 INFO (coreLoadExecutor-77-thread-1-processing-n:127.0.0.1:45351_) [n:127.0.0.1:45351_ c:control_collection x:collection1] o.a.s.c.ZkController publishing state=down
        [junit4] 2> 61897 INFO (coreLoadExecutor-77-thread-1-processing-n:127.0.0.1:45351_) [n:127.0.0.1:45351_ c:control_collection x:collection1] o.a.s.c.ZkController numShards not found on descriptor - reading it from system property
        [junit4] 2> 61898 INFO (coreLoadExecutor-77-thread-1-processing-n:127.0.0.1:45351_) [n:127.0.0.1:45351_ c:control_collection x:collection1] o.a.s.c.ZkController Collection control_collection not visible yet, but flagging it so a watch is registered when it becomes visible
        [junit4] 2> 61898 INFO (OverseerStateUpdate-96057378129379333-127.0.0.1:45351_-n_0000000000) [n:127.0.0.1:45351_ ] o.a.s.c.Overseer processMessage: queueSize: 1, message = {
        [junit4] 2> "core":"collection1",
        [junit4] 2> "roles":null,
        [junit4] 2> "base_url":"https://127.0.0.1:45351",
        [junit4] 2> "node_name":"127.0.0.1:45351_",
        [junit4] 2> "numShards":"1",
        [junit4] 2> "state":"down",
        [junit4] 2> "shard":null,
        [junit4] 2> "collection":"control_collection",
        [junit4] 2> "operation":"state"} current state version: 0
        [junit4] 2> 61898 INFO (coreLoadExecutor-77-thread-1-processing-n:127.0.0.1:45351_) [n:127.0.0.1:45351_ c:control_collection x:collection1] o.a.s.c.c.ZkStateReader Deleting data for [control_collection]
        [junit4] 2> 61898 INFO (OverseerStateUpdate-96057378129379333-127.0.0.1:45351_-n_0000000000) [n:127.0.0.1:45351_ ] o.a.s.c.o.ReplicaMutator Update state numShards=1 message={
        [junit4] 2> "core":"collection1",
        [junit4] 2> "roles":null,
        [junit4] 2> "base_url":"https://127.0.0.1:45351",
        [junit4] 2> "node_name":"127.0.0.1:45351_",
        [junit4] 2> "numShards":"1",
        [junit4] 2> "state":"down",
        [junit4] 2> "shard":null,
        [junit4] 2> "collection":"control_collection",
        [junit4] 2> "operation":"state"}
        [junit4] 2> 61899 INFO (OverseerStateUpdate-96057378129379333-127.0.0.1:45351_-n_0000000000) [n:127.0.0.1:45351_ ] o.a.s.c.o.ClusterStateMutator building a new cName: control_collection
        [junit4] 2> 61899 INFO (coreLoadExecutor-77-thread-1-processing-n:127.0.0.1:45351_) [n:127.0.0.1:45351_ c:control_collection x:collection1] o.a.s.c.ZkController look for our core node name
        [junit4] 2> 61899 INFO (OverseerStateUpdate-96057378129379333-127.0.0.1:45351_-n_0000000000) [n:127.0.0.1:45351_ ] o.a.s.c.o.ReplicaMutator Assigning new node to shard shard=shard1
        [junit4] 2> 61900 INFO (zkCallback-55-thread-1-processing-n:127.0.0.1:45351_) [n:127.0.0.1:45351_ ] o.a.s.c.c.ZkStateReader A cluster state change: [WatchedEvent state:SyncConnected type:NodeDataChanged path:/clusterstate.json], has occurred - updating... (live nodes size: [1])
        [junit4] 2> 62899 INFO (coreLoadExecutor-77-thread-1-processing-n:127.0.0.1:45351_) [n:127.0.0.1:45351_ c:control_collection x:collection1] o.a.s.c.ZkController waiting to find shard id in clusterstate for collection1
        [junit4] 2> 62899 INFO (coreLoadExecutor-77-thread-1-processing-n:127.0.0.1:45351_) [n:127.0.0.1:45351_ c:control_collection x:collection1] o.a.s.c.ZkController Check for collection zkNode:control_collection
        [junit4] 2> 62899 INFO (coreLoadExecutor-77-thread-1-processing-n:127.0.0.1:45351_) [n:127.0.0.1:45351_ c:control_collection x:collection1] o.a.s.c.ZkController Collection zkNode exists
        [junit4] 2> 62899 INFO (coreLoadExecutor-77-thread-1-processing-n:127.0.0.1:45351_) [n:127.0.0.1:45351_ c:control_collection x:collection1] o.a.s.c.c.ZkStateReader Load collection config from: [/collections/control_collection]
        [junit4] 2> 62900 INFO (coreLoadExecutor-77-thread-1-processing-n:127.0.0.1:45351_) [n:127.0.0.1:45351_ c:control_collection x:collection1] o.a.s.c.c.ZkStateReader path=[/collections/control_collection] [configName]=[conf1] specified config exists in ZooKeeper
        [junit4] 2> 62900 INFO (coreLoadExecutor-77-thread-1-processing-n:127.0.0.1:45351_) [n:127.0.0.1:45351_ c:control_collection x:collection1] o.a.s.c.SolrResourceLoader new SolrResourceLoader for directory: '/home/jenkins/workspace/Lucene-Solr-master-Linux/solr/build/solr-core/test/J1/temp/solr.handler.TestReqParamsAPI_1D7A2691847F5CD4-001/control-001/cores/collection1'
        [junit4] 2> 62900 INFO (coreLoadExecutor-77-thread-1-processing-n:127.0.0.1:45351_) [n:127.0.0.1:45351_ c:control_collection x:collection1] o.a.s.c.SolrResourceLoader JNDI not configured for solr (NoInitialContextEx)
        [junit4] 2> 62900 INFO (coreLoadExecutor-77-thread-1-processing-n:127.0.0.1:45351_) [n:127.0.0.1:45351_ c:control_collection x:collection1] o.a.s.c.SolrResourceLoader solr home defaulted to 'solr/' (could not find system property or JNDI)
        [junit4] 2> 62901 INFO (coreLoadExecutor-77-thread-1-processing-n:127.0.0.1:45351_) [n:127.0.0.1:45351_ c:control_collection x:collection1] o.a.s.c.Config loaded config solrconfig.xml with version 0
        [junit4] 2> 62906 INFO (coreLoadExecutor-77-thread-1-processing-n:127.0.0.1:45351_) [n:127.0.0.1:45351_ c:control_collection x:collection1] o.a.s.c.SolrConfig current version of requestparams : -1
        [junit4] 2> 62911 INFO (coreLoadExecutor-77-thread-1-processing-n:127.0.0.1:45351_) [n:127.0.0.1:45351_ c:control_collection x:collection1] o.a.s.c.SolrConfig Using Lucene MatchVersion: 7.0.0
        [junit4] 2> 62920 INFO (coreLoadExecutor-77-thread-1-processing-n:127.0.0.1:45351_) [n:127.0.0.1:45351_ c:control_collection x:collection1] o.a.s.c.SolrConfig Loaded SolrConfig: solrconfig.xml
        [junit4] 2> 62931 INFO (coreLoadExecutor-77-thread-1-processing-n:127.0.0.1:45351_) [n:127.0.0.1:45351_ c:control_collection x:collection1] o.a.s.s.IndexSchema [collection1] Schema name=test
        [junit4] 2> 63041 INFO (coreLoadExecutor-77-thread-1-processing-n:127.0.0.1:45351_) [n:127.0.0.1:45351_ c:control_collection x:collection1] o.a.s.s.OpenExchangeRatesOrgProvider Initialized with rates=open-exchange-rates.json, refreshInterval=1440.
        [junit4] 2> 63048 INFO (coreLoadExecutor-77-thread-1-processing-n:127.0.0.1:45351_) [n:127.0.0.1:45351_ c:control_collection x:collection1] o.a.s.s.IndexSchema default search field in schema is text
        [junit4] 2> 63049 INFO (coreLoadExecutor-77-thread-1-processing-n:127.0.0.1:45351_) [n:127.0.0.1:45351_ c:control_collection x:collection1] o.a.s.s.IndexSchema unique key field: id
        [junit4] 2> 63061 INFO (coreLoadExecutor-77-thread-1-processing-n:127.0.0.1:45351_) [n:127.0.0.1:45351_ c:control_collection x:collection1] o.a.s.s.FileExchangeRateProvider Reloading exchange rates from file currency.xml
        [junit4] 2> 63063 INFO (coreLoadExecutor-77-thread-1-processing-n:127.0.0.1:45351_) [n:127.0.0.1:45351_ c:control_collection x:collection1] o.a.s.s.FileExchangeRateProvider Reloading exchange rates from file currency.xml
        [junit4] 2> 63065 INFO (coreLoadExecutor-77-thread-1-processing-n:127.0.0.1:45351_) [n:127.0.0.1:45351_ c:control_collection x:collection1] o.a.s.s.OpenExchangeRatesOrgProvider Reloading exchange rates from open-exchange-rates.json
        [junit4] 2> 63067 INFO (coreLoadExecutor-77-thread-1-processing-n:127.0.0.1:45351_) [n:127.0.0.1:45351_ c:control_collection x:collection1] o.a.s.s.OpenExchangeRatesOrgProvider Reloading exchange rates from open-exchange-rates.json
        [junit4] 2> 63068 INFO (coreLoadExecutor-77-thread-1-processing-n:127.0.0.1:45351_) [n:127.0.0.1:45351_ c:control_collection x:collection1] o.a.s.c.ConfigSetProperties Did not find ConfigSet properties, assuming default properties: Can't find resource 'configsetprops.json' in classpath or '/configs/conf1', cwd=/home/jenkins/workspace/Lucene-Solr-master-Linux/solr/build/solr-core/test/J1
        [junit4] 2> 63068 INFO (coreLoadExecutor-77-thread-1-processing-n:127.0.0.1:45351_) [n:127.0.0.1:45351_ c:control_collection x:collection1] o.a.s.c.CoreContainer Creating SolrCore 'collection1' using configuration from collection control_collection
        [junit4] 2> 63068 INFO (coreLoadExecutor-77-thread-1-processing-n:127.0.0.1:45351_) [n:127.0.0.1:45351_ c:control_collection s:shard1 r:core_node1 x:collection1] o.a.s.c.SolrCore org.apache.solr.core.MockDirectoryFactory
        [junit4] 2> 63068 INFO (coreLoadExecutor-77-thread-1-processing-n:127.0.0.1:45351_) [n:127.0.0.1:45351_ c:control_collection s:shard1 r:core_node1 x:collection1] o.a.s.c.SolrCore [[collection1] ] Opening new SolrCore at [/home/jenkins/workspace/Lucene-Solr-master-Linux/solr/build/solr-core/test/J1/temp/solr.handler.TestReqParamsAPI_1D7A2691847F5CD4-001/control-001/cores/collection1], dataDir=[/home/jenkins/workspace/Lucene-Solr-master-Linux/solr/build/solr-core/test/J1/temp/solr.handler.TestReqParamsAPI_1D7A2691847F5CD4-001/control-001/cores/collection1/data/]
        [junit4] 2> 63068 INFO (coreLoadExecutor-77-thread-1-processing-n:127.0.0.1:45351_) [n:127.0.0.1:45351_ c:control_collection s:shard1 r:core_node1 x:collection1] o.a.s.c.JmxMonitoredMap JMX monitoring is enabled. Adding Solr mbeans to JMX Server: com.sun.jmx.mbeanserver.JmxMBeanServer@100f0695
        [junit4] 2> 63068 INFO (coreLoadExecutor-77-thread-1-processing-n:127.0.0.1:45351_) [n:127.0.0.1:45351_ c:control_collection s:shard1 r:core_node1 x:collection1] o.a.s.c.CachingDirectoryFactory return new directory for /home/jenkins/workspace/Lucene-Solr-master-Linux/solr/build/solr-core/test/J1/temp/solr.handler.TestReqParamsAPI_1D7A2691847F5CD4-001/control-001/cores/collection1/data
        [junit4] 2> 63069 INFO (coreLoadExecutor-77-thread-1-processing-n:127.0.0.1:45351_) [n:127.0.0.1:45351_ c:control_collection s:shard1 r:core_node1 x:collection1] o.a.s.c.SolrCore New index directory detected: old=null new=/home/jenkins/workspace/Lucene-Solr-master-Linux/solr/build/solr-core/test/J1/temp/solr.handler.TestReqParamsAPI_1D7A2691847F5CD4-001/control-001/cores/collection1/data/index/
        [junit4] 2> 63069 WARN (coreLoadExecutor-77-thread-1-processing-n:127.0.0.1:45351_) [n:127.0.0.1:45351_ c:control_collection s:shard1 r:core_node1 x:collection1] o.a.s.c.SolrCore [collection1] Solr index directory '/home/jenkins/workspace/Lucene-Solr-master-Linux/solr/build/solr-core/test/J1/temp/solr.handler.TestReqParamsAPI_1D7A2691847F5CD4-001/control-001/cores/collection1/data/index' doesn't exist. Creating new index...
        [junit4] 2> 63069 INFO (coreLoadExecutor-77-thread-1-processing-n:127.0.0.1:45351_) [n:127.0.0.1:45351_ c:control_collection s:shard1 r:core_node1 x:collection1] o.a.s.c.CachingDirectoryFactory return new directory for /home/jenkins/workspace/Lucene-Solr-master-Linux/solr/build/solr-core/test/J1/temp/solr.handler.TestReqParamsAPI_1D7A2691847F5CD4-001/control-001/cores/collection1/data/index
        [junit4] 2> 63070 INFO (coreLoadExecutor-77-thread-1-processing-n:127.0.0.1:45351_) [n:127.0.0.1:45351_ c:control_collection s:shard1 r:core_node1 x:collection1] o.a.s.u.RandomMergePolicy RandomMergePolicy wrapping class org.apache.lucene.index.TieredMergePolicy: [TieredMergePolicy: maxMergeAtOnce=48, maxMergeAtOnceExplicit=46, maxMergedSegmentMB=67.62109375, floorSegmentMB=0.8095703125, forceMergeDeletesPctAllowed=24.399059977697085, segmentsPerTier=24.0, maxCFSSegmentSizeMB=8.796093022207999E12, noCFSRatio=1.0
        [junit4] 2> 63071 INFO (coreLoadExecutor-77-thread-1-processing-n:127.0.0.1:45351_) [n:127.0.0.1:45351_ c:control_collection s:shard1 r:core_node1 x:collection1] o.a.s.c.SolrDeletionPolicy SolrDeletionPolicy.onCommit: commits: num=1
        [junit4] 2> commit{dir=MockDirectoryWrapper(RAMDirectory@27e0cddf lockFactory=org.apache.lucene.store.SingleInstanceLockFactory@ac3d6c1),segFN=segments_1,generation=1}
        [junit4] 2> 63071 INFO (coreLoadExecutor-77-thread-1-processing-n:127.0.0.1:45351_) [n:127.0.0.1:45351_ c:control_collection s:shard1 r:core_node1 x:collection1] o.a.s.c.SolrDeletionPolicy newest commit generation = 1
        [junit4] 2> 63071 INFO (OldIndexDirectoryCleanupThreadForCore-collection1) [n:127.0.0.1:45351_ c:control_collection s:shard1 r:core_node1 x:collection1] o.a.s.c.SolrCore Looking for old index directories to cleanup for core collection1 in /home/jenkins/workspace/Lucene-Solr-master-Linux/solr/build/solr-core/test/J1/temp/solr.handler.TestReqParamsAPI_1D7A2691847F5CD4-001/control-001/cores/collection1/data/
        [junit4] 2> 63072 WARN (OldIndexDirectoryCleanupThreadForCore-collection1) [n:127.0.0.1:45351_ c:control_collection s:shard1 r:core_node1 x:collection1] o.a.s.c.DirectoryFactory /home/jenkins/workspace/Lucene-Solr-master-Linux/solr/build/solr-core/test/J1/temp/solr.handler.TestReqParamsAPI_1D7A2691847F5CD4-001/control-001/cores/collection1/data/ does not point to a valid data directory; skipping clean-up of old index directories.
        [junit4] 2> 63076 INFO (coreLoadExecutor-77-thread-1-processing-n:127.0.0.1:45351_) [n:127.0.0.1:45351_ c:control_collection s:shard1 r:core_node1 x:collection1] o.a.s.u.p.UpdateRequestProcessorChain creating updateRequestProcessorChain "nodistrib"
        [junit4] 2> 63076 INFO (coreLoadExecutor-77-thread-1-processing-n:127.0.0.1:45351_) [n:127.0.0.1:45351_ c:control_collection s:shard1 r:core_node1 x:collection1] o.a.s.u.p.UpdateRequestProcessorChain creating updateRequestProcessorChain "dedupe"
        [junit4] 2> 63076 INFO (coreLoadExecutor-77-thread-1-processing-n:127.0.0.1:45351_) [n:127.0.0.1:45351_ c:control_collection s:shard1 r:core_node1 x:collection1] o.a.s.u.p.UpdateRequestProcessorChain inserting DistributedUpdateProcessorFactory into updateRequestProcessorChain "dedupe"
        [junit4] 2> 63076 INFO (coreLoadExecutor-77-thread-1-processing-n:127.0.0.1:45351_) [n:127.0.0.1:45351_ c:control_collection s:shard1 r:core_node1 x:collection1] o.a.s.u.p.UpdateRequestProcessorChain creating updateRequestProcessorChain "stored_sig"
        [junit4] 2> 63076 INFO (coreLoadExecutor-77-thread-1-processing-n:127.0.0.1:45351_) [n:127.0.0.1:45351_ c:control_collection s:shard1 r:core_node1 x:collection1] o.a.s.u.p.UpdateRequestProcessorChain inserting DistributedUpdateProcessorFactory into updateRequestProcessorChain "stored_sig"
        [junit4] 2> 63076 INFO (coreLoadExecutor-77-thread-1-processing-n:127.0.0.1:45351_) [n:127.0.0.1:45351_ c:control_collection s:shard1 r:core_node1 x:collection1] o.a.s.u.p.UpdateRequestProcessorChain creating updateRequestProcessorChain "distrib-dup-test-chain-explicit"
        [junit4] 2> 63077 INFO (coreLoadExecutor-77-thread-1-processing-n:127.0.0.1:45351_) [n:127.0.0.1:45351_ c:control_collection s:shard1 r:core_node1 x:collection1] o.a.s.u.p.UpdateRequestProcessorChain creating updateRequestProcessorChain "distrib-dup-test-chain-implicit"
        [junit4] 2> 63077 INFO (coreLoadExecutor-77-thread-1-processing-n:127.0.0.1:45351_) [n:127.0.0.1:45351_ c:control_collection s:shard1 r:core_node1 x:collection1] o.a.s.u.p.UpdateRequestProcessorChain inserting DistributedUpdateProcessorFactory into updateRequestProcessorChain "distrib-dup-test-chain-implicit"
        [junit4] 2> 63077 INFO (coreLoadExecutor-77-thread-1-processing-n:127.0.0.1:45351_) [n:127.0.0.1:45351_ c:control_collection s:shard1 r:core_node1 x:collection1] o.a.s.c.SolrCore no updateRequestProcessorChain defined as default, creating implicit default
        [junit4] 2> 63077 WARN (coreLoadExecutor-77-thread-1-processing-n:127.0.0.1:45351_) [n:127.0.0.1:45351_ c:control_collection s:shard1 r:core_node1 x:collection1] o.a.s.c.RequestHandlers INVALID paramSet a in requestHandler {type = requestHandler,name = /dump,class = DumpRequestHandler,args = {defaults={a=A,b=B}}}
        [junit4] 2> 63080 INFO (coreLoadExecutor-77-thread-1-processing-n:127.0.0.1:45351_) [n:127.0.0.1:45351_ c:control_collection s:shard1 r:core_node1 x:collection1] o.a.s.h.l.XMLLoader xsltCacheLifetimeSeconds=60
        [junit4] 2> 63081 INFO (coreLoadExecutor-77-thread-1-processing-n:127.0.0.1:45351_) [n:127.0.0.1:45351_ c:control_collection s:shard1 r:core_node1 x:collection1] o.a.s.h.l.XMLLoader xsltCacheLifetimeSeconds=60
        [junit4] 2> 63082 INFO (coreLoadExecutor-77-thread-1-processing-n:127.0.0.1:45351_) [n:127.0.0.1:45351_ c:control_collection s:shard1 r:core_node1 x:collection1] o.a.s.h.l.XMLLoader xsltCacheLifetimeSeconds=60
        [junit4] 2> 63083 INFO (coreLoadExecutor-77-thread-1-processing-n:127.0.0.1:45351_) [n:127.0.0.1:45351_ c:control_collection s:shard1 r:core_node1 x:collection1] o.a.s.h.l.XMLLoader xsltCacheLifetimeSeconds=60
        [junit4] 2> 63086 INFO (coreLoadExecutor-77-thread-1-processing-n:127.0.0.1:45351_) [n:127.0.0.1:45351_ c:control_collection s:shard1 r:core_node1 x:collection1] o.a.s.c.RequestHandlers Registered paths: /admin/mbeans,standard,/update/json/docs,/admin/luke,/export,/get,/admin/properties,/update/json,/admin/threads,/dump,/update/csv,/sql,/graph,/admin/segments,/admin/system,/replication,/config,/stream,/schema,/admin/plugins,/admin/logging,/admin/ping,/update,/admin/file
        [junit4] 2> 63086 INFO (coreLoadExecutor-77-thread-1-processing-n:127.0.0.1:45351_) [n:127.0.0.1:45351_ c:control_collection s:shard1 r:core_node1 x:collection1] o.a.s.c.SolrCore Using default statsCache cache: org.apache.solr.search.stats.LocalStatsCache
        [junit4] 2> 63086 INFO (coreLoadExecutor-77-thread-1-processing-n:127.0.0.1:45351_) [n:127.0.0.1:45351_ c:control_collection s:shard1 r:core_node1 x:collection1] o.a.s.u.UpdateHandler Using UpdateLog implementation: org.apache.solr.update.UpdateLog
        [junit4] 2> 63086 INFO (coreLoadExecutor-77-thread-1-processing-n:127.0.0.1:45351_) [n:127.0.0.1:45351_ c:control_collection s:shard1 r:core_node1 x:collection1] o.a.s.u.UpdateLog Initializing UpdateLog: dataDir= defaultSyncLevel=FLUSH numRecordsToKeep=100 maxNumLogsToKeep=10 numVersionBuckets=65536
        [junit4] 2> 63087 INFO (coreLoadExecutor-77-thread-1-processing-n:127.0.0.1:45351_) [n:127.0.0.1:45351_ c:control_collection s:shard1 r:core_node1 x:collection1] o.a.s.u.CommitTracker Hard AutoCommit: disabled
        [junit4] 2> 63087 INFO (coreLoadExecutor-77-thread-1-processing-n:127.0.0.1:45351_) [n:127.0.0.1:45351_ c:control_collection s:shard1 r:core_node1 x:collection1] o.a.s.u.CommitTracker Soft AutoCommit: disabled
        [junit4] 2> 63087 INFO (coreLoadExecutor-77-thread-1-processing-n:127.0.0.1:45351_) [n:127.0.0.1:45351_ c:control_collection s:shard1 r:core_node1 x:collection1] o.a.s.u.RandomMergePolicy RandomMergePolicy wrapping class org.apache.lucene.index.LogDocMergePolicy: [LogDocMergePolicy: minMergeSize=1000, mergeFactor=11, maxMergeSize=9223372036854775807, maxMergeSizeForForcedMerge=9223372036854775807, calibrateSizeByDeletes=true, maxMergeDocs=2147483647, maxCFSSegmentSizeMB=8.796093022207999E12, noCFSRatio=0.0]
        [junit4] 2> 63088 INFO (coreLoadExecutor-77-thread-1-processing-n:127.0.0.1:45351_) [n:127.0.0.1:45351_ c:control_collection s:shard1 r:core_node1 x:collection1] o.a.s.c.SolrDeletionPolicy SolrDeletionPolicy.onInit: commits: num=1
        [junit4] 2> commit{dir=MockDirectoryWrapper(RAMDirectory@27e0cddf lockFactory=org.apache.lucene.store.SingleInstanceLockFactory@ac3d6c1),segFN=segments_1,generation=1}
        [junit4] 2> 63088 INFO (coreLoadExecutor-77-thread-1-processing-n:127.0.0.1:45351_) [n:127.0.0.1:45351_ c:control_collection s:shard1 r:core_node1 x:collection1] o.a.s.c.SolrDeletionPolicy newest commit generation = 1
        [junit4] 2> 63088 INFO (coreLoadExecutor-77-thread-1-processing-n:127.0.0.1:45351_) [n:127.0.0.1:45351_ c:control_collection s:shard1 r:core_node1 x:collection1] o.a.s.s.SolrIndexSearcher Opening [Searcher@51d90d16[collection1] main]
        [junit4] 2> 63089 INFO (coreLoadExecutor-77-thread-1-processing-n:127.0.0.1:45351_) [n:127.0.0.1:45351_ c:control_collection s:shard1 r:core_node1 x:collection1] o.a.s.c.c.ZkStateReader Load collection config from: [/collections/control_collection]
        [junit4] 2> 63090 INFO (coreLoadExecutor-77-thread-1-processing-n:127.0.0.1:45351_) [n:127.0.0.1:45351_ c:control_collection s:shard1 r:core_node1 x:collection1] o.a.s.c.c.ZkStateReader path=[/collections/control_collection] [configName]=[conf1] specified config exists in ZooKeeper
        [junit4] 2> 63090 INFO (coreLoadExecutor-77-thread-1-processing-n:127.0.0.1:45351_) [n:127.0.0.1:45351_ c:control_collection s:shard1 r:core_node1 x:collection1] o.a.s.r.ManagedResourceStorage Setting up ZooKeeper-based storage for the RestManager with znodeBase: /configs/conf1
        [junit4] 2> 63091 INFO (coreLoadExecutor-77-thread-1-processing-n:127.0.0.1:45351_) [n:127.0.0.1:45351_ c:control_collection s:shard1 r:core_node1 x:collection1] o.a.s.r.ManagedResourceStorage Configured ZooKeeperStorageIO with znodeBase: /configs/conf1
        [junit4] 2> 63091 INFO (coreLoadExecutor-77-thread-1-processing-n:127.0.0.1:45351_) [n:127.0.0.1:45351_ c:control_collection s:shard1 r:core_node1 x:collection1] o.a.s.r.RestManager Initializing RestManager with initArgs: {}
        [junit4] 2> 63091 INFO (coreLoadExecutor-77-thread-1-processing-n:127.0.0.1:45351_) [n:127.0.0.1:45351_ c:control_collection s:shard1 r:core_node1 x:collection1] o.a.s.r.ManagedResourceStorage Reading _rest_managed.json using ZooKeeperStorageIO:path=/configs/conf1
        [junit4] 2> 63091 INFO (coreLoadExecutor-77-thread-1-processing-n:127.0.0.1:45351_) [n:127.0.0.1:45351_ c:control_collection s:shard1 r:core_node1 x:collection1] o.a.s.r.ManagedResourceStorage No data found for znode /configs/conf1/_rest_managed.json
        [junit4] 2> 63091 INFO (coreLoadExecutor-77-thread-1-processing-n:127.0.0.1:45351_) [n:127.0.0.1:45351_ c:control_collection s:shard1 r:core_node1 x:collection1] o.a.s.r.ManagedResourceStorage Loaded null at path _rest_managed.json using ZooKeeperStorageIO:path=/configs/conf1
        [junit4] 2> 63091 INFO (coreLoadExecutor-77-thread-1-processing-n:127.0.0.1:45351_) [n:127.0.0.1:45351_ c:control_collection s:shard1 r:core_node1 x:collection1] o.a.s.r.RestManager Initializing 0 registered ManagedResources
        [junit4] 2> 63091 INFO (coreLoadExecutor-77-thread-1-processing-n:127.0.0.1:45351_) [n:127.0.0.1:45351_ c:control_collection s:shard1 r:core_node1 x:collection1] o.a.s.h.ReplicationHandler Commits will be reserved for 10000
        [junit4] 2> 63092 INFO (searcherExecutor-78-thread-1-processing-n:127.0.0.1:45351_ x:collection1 s:shard1 c:control_collection r:core_node1) [n:127.0.0.1:45351_ c:control_collection s:shard1 r:core_node1 x:collection1] o.a.s.c.SolrCore [collection1] Registered new searcher Searcher@51d90d16[collection1] main{ExitableDirectoryReader(UninvertingDirectoryReader())}
        [junit4] 2> 63092 INFO (coreLoadExecutor-77-thread-1-processing-n:127.0.0.1:45351_) [n:127.0.0.1:45351_ c:control_collection s:shard1 r:core_node1 x:collection1] o.a.s.u.UpdateLog Looking up max value of version field to seed version buckets
        [junit4] 2> 63092 INFO (coreLoadExecutor-77-thread-1-processing-n:127.0.0.1:45351_) [n:127.0.0.1:45351_ c:control_collection s:shard1 r:core_node1 x:collection1] o.a.s.u.VersionInfo Refreshing highest value of _version_ for 65536 version buckets from index
        [junit4] 2> 63092 INFO (coreLoadExecutor-77-thread-1-processing-n:127.0.0.1:45351_) [n:127.0.0.1:45351_ c:control_collection s:shard1 r:core_node1 x:collection1] o.a.s.u.VersionInfo No terms found for _version_, cannot seed version bucket highest value from index
        [junit4] 2> 63092 INFO (coreLoadExecutor-77-thread-1-processing-n:127.0.0.1:45351_) [n:127.0.0.1:45351_ c:control_collection s:shard1 r:core_node1 x:collection1] o.a.s.u.UpdateLog Could not find max version in index or recent updates, using new clock 1536918051610427392
        [junit4] 2> 63093 INFO (coreLoadExecutor-77-thread-1-processing-n:127.0.0.1:45351_) [n:127.0.0.1:45351_ c:control_collection s:shard1 r:core_node1 x:collection1] o.a.s.u.UpdateLog Took 1.0ms to seed version buckets with highest version 1536918051610427392
        [junit4] 2> 63094 INFO (coreLoadExecutor-77-thread-1-processing-n:127.0.0.1:45351_) [n:127.0.0.1:45351_ c:control_collection s:shard1 r:core_node1 x:collection1] o.a.s.c.ZkController watch zkdir /configs/conf1
        [junit4] 2> 63094 INFO (coreLoadExecutor-77-thread-1-processing-n:127.0.0.1:45351_) [n:127.0.0.1:45351_ c:control_collection s:shard1 r:core_node1 x:collection1] o.a.s.c.CoreContainer registering core: collection1
        [junit4] 2> 63094 INFO (coreZkRegister-71-thread-1-processing-n:127.0.0.1:45351_ x:collection1 s:shard1 c:control_collection r:core_node1) [n:127.0.0.1:45351_ c:control_collection s:shard1 r:core_node1 x:collection1] o.a.s.c.ZkController Register replica - core:collection1 address:https://127.0.0.1:45351 collection:control_collection shard:shard1
        [junit4] 2> 63095 INFO (coreZkRegister-71-thread-1-processing-n:127.0.0.1:45351_ x:collection1 s:shard1 c:control_collection r:core_node1) [n:127.0.0.1:45351_ c:control_collection s:shard1 r:core_node1 x:collection1] o.a.s.c.c.SolrZkClient makePath: /collections/control_collection/leader_elect/shard1/election
        [junit4] 2> 63097 INFO (coreZkRegister-71-thread-1-processing-n:127.0.0.1:45351_ x:collection1 s:shard1 c:control_collection r:core_node1) [n:127.0.0.1:45351_ c:control_collection s:shard1 r:core_node1 x:collection1] o.a.s.c.LeaderElector Joined leadership election with path: /collections/control_collection/leader_elect/shard1/election/96057378129379333-core_node1-n_0000000000
        [junit4] 2> 63097 INFO (coreZkRegister-71-thread-1-processing-n:127.0.0.1:45351_ x:collection1 s:shard1 c:control_collection r:core_node1) [n:127.0.0.1:45351_ c:control_collection s:shard1 r:core_node1 x:collection1] o.a.s.c.ShardLeaderElectionContext Running the leader process for shard=shard1 and weAreReplacement=false and leaderVoteWait=10000
        [junit4] 2> 63098 INFO (coreZkRegister-71-thread-1-processing-n:127.0.0.1:45351_ x:collection1 s:shard1 c:control_collection r:core_node1) [n:127.0.0.1:45351_ c:control_collection s:shard1 r:core_node1 x:collection1] o.a.s.c.ShardLeaderElectionContext Enough replicas found to continue.
        [junit4] 2> 63098 INFO (coreZkRegister-71-thread-1-processing-n:127.0.0.1:45351_ x:collection1 s:shard1 c:control_collection r:core_node1) [n:127.0.0.1:45351_ c:control_collection s:shard1 r:core_node1 x:collection1] o.a.s.c.ShardLeaderElectionContext I may be the new leader - try and sync
        [junit4] 2> 63098 INFO (coreZkRegister-71-thread-1-processing-n:127.0.0.1:45351_ x:collection1 s:shard1 c:control_collection r:core_node1) [n:127.0.0.1:45351_ c:control_collection s:shard1 r:core_node1 x:collection1] o.a.s.c.SyncStrategy Sync replicas to https://127.0.0.1:45351/collection1/
        [junit4] 2> 63098 INFO (OverseerStateUpdate-96057378129379333-127.0.0.1:45351_-n_0000000000) [n:127.0.0.1:45351_ ] o.a.s.c.Overseer processMessage: queueSize: 1, message = {
        [junit4] 2> "operation":"leader",
        [junit4] 2> "shard":"shard1",
        [junit4] 2> "collection":"control_collection"} current state version: 1
        [junit4] 2> 63098 INFO (coreZkRegister-71-thread-1-processing-n:127.0.0.1:45351_ x:collection1 s:shard1 c:control_collection r:core_node1) [n:127.0.0.1:45351_ c:control_collection s:shard1 r:core_node1 x:collection1] o.a.s.c.SyncStrategy Sync Success - now sync replicas to me
        [junit4] 2> 63099 INFO (coreZkRegister-71-thread-1-processing-n:127.0.0.1:45351_ x:collection1 s:shard1 c:control_collection r:core_node1) [n:127.0.0.1:45351_ c:control_collection s:shard1 r:core_node1 x:collection1] o.a.s.c.SyncStrategy https://127.0.0.1:45351/collection1/ has no replicas
        [junit4] 2> 63099 INFO (coreZkRegister-71-thread-1-processing-n:127.0.0.1:45351_ x:collection1 s:shard1 c:control_collection r:core_node1) [n:127.0.0.1:45351_ c:control_collection s:shard1 r:core_node1 x:collection1] o.a.s.c.c.SolrZkClient makePath: /collections/control_collection/leaders/shard1
        [junit4] 2> 63101 INFO (coreZkRegister-71-thread-1-processing-n:127.0.0.1:45351_ x:collection1 s:shard1 c:control_collection r:core_node1) [n:127.0.0.1:45351_ c:control_collection s:shard1 r:core_node1 x:collection1] o.a.s.c.ShardLeaderElectionContextBase Creating leader registration node /collections/control_collection/leaders/shard1/leader after winning as /collections/control_collection/leader_elect/shard1/election/96057378129379333-core_node1-n_0000000000
        [junit4] 2> 63104 INFO (coreZkRegister-71-thread-1-processing-n:127.0.0.1:45351_ x:collection1 s:shard1 c:control_collection r:core_node1) [n:127.0.0.1:45351_ c:control_collection s:shard1 r:core_node1 x:collection1] o.a.s.c.ShardLeaderElectionContext I am the new leader: https://127.0.0.1:45351/collection1/ shard1
        [junit4] 2> 63104 INFO (OverseerStateUpdate-96057378129379333-127.0.0.1:45351_-n_0000000000) [n:127.0.0.1:45351_ ] o.a.s.c.Overseer processMessage: queueSize: 1, message = {
        [junit4] 2> "operation":"leader",
        [junit4] 2> "shard":"shard1",
        [junit4] 2> "collection":"control_collection",
        [junit4] 2> "base_url":"https://127.0.0.1:45351",
        [junit4] 2> "core":"collection1",
        [junit4] 2> "state":"active"} current state version: 1
        [junit4] 2> 63206 INFO (zkCallback-55-thread-1-processing-n:127.0.0.1:45351_) [n:127.0.0.1:45351_ ] o.a.s.c.c.ZkStateReader A cluster state change: [WatchedEvent state:SyncConnected type:NodeDataChanged path:/clusterstate.json], has occurred - updating... (live nodes size: [1])
        [junit4] 2> 63255 INFO (coreZkRegister-71-thread-1-processing-n:127.0.0.1:45351_ x:collection1 s:shard1 c:control_collection r:core_node1) [n:127.0.0.1:45351_ c:control_collection s:shard1 r:core_node1 x:collection1] o.a.s.c.ZkController We are https://127.0.0.1:45351/collection1/ and leader is https://127.0.0.1:45351/collection1/
        [junit4] 2> 63255 INFO (coreZkRegister-71-thread-1-processing-n:127.0.0.1:45351_ x:collection1 s:shard1 c:control_collection r:core_node1) [n:127.0.0.1:45351_ c:control_collection s:shard1 r:core_node1 x:collection1] o.a.s.c.ZkController No LogReplay needed for core=collection1 baseURL=https://127.0.0.1:45351
        [junit4] 2> 63255 INFO (coreZkRegister-71-thread-1-processing-n:127.0.0.1:45351_ x:collection1 s:shard1 c:control_collection r:core_node1) [n:127.0.0.1:45351_ c:control_collection s:shard1 r:core_node1 x:collection1] o.a.s.c.ZkController I am the leader, no recovery necessary
        [junit4] 2> 63255 INFO (coreZkRegister-71-thread-1-processing-n:127.0.0.1:45351_ x:collection1 s:shard1 c:control_collection r:core_node1) [n:127.0.0.1:45351_ c:control_collection s:shard1 r:core_node1 x:collection1] o.a.s.c.ZkController publishing state=active
        [junit4] 2> 63255 INFO (coreZkRegister-71-thread-1-processing-n:127.0.0.1:45351_ x:collection1 s:shard1 c:control_collection r:core_node1) [n:127.0.0.1:45351_ c:control_collection s:shard1 r:core_node1 x:collection1] o.a.s.c.ZkController numShards not found on descriptor - reading it from system property
        [junit4] 2> 63256 INFO (OverseerStateUpdate-96057378129379333-127.0.0.1:45351_-n_0000000000) [n:127.0.0.1:45351_ ] o.a.s.c.Overseer processMessage: queueSize: 1, message = {
        [junit4] 2> "core":"collection1",
        [junit4] 2> "core_node_name":"core_node1",
        [junit4] 2> "roles":null,
        [junit4] 2> "base_url":"https://127.0.0.1:45351",
        [junit4] 2> "node_name":"127.0.0.1:45351_",
        [junit4] 2> "numShards":"1",
        [junit4] 2> "state":"active",
        [junit4] 2> "shard":"shard1",
        [junit4] 2> "collection":"control_collection",
        [junit4] 2> "operation":"state"} current state version: 2
        [junit4] 2> 63256 INFO (OverseerStateUpdate-96057378129379333-127.0.0.1:45351_-n_0000000000) [n:127.0.0.1:45351_ ] o.a.s.c.o.ReplicaMutator Update state numShards=1 message={
        [junit4] 2> "core":"collection1",
        [junit4] 2> "core_node_name":"core_node1",
        [junit4] 2> "roles":null,
        [junit4] 2> "base_url":"https://127.0.0.1:45351",
        [junit4] 2> "node_name":"127.0.0.1:45351_",
        [junit4] 2> "numShards":"1",
        [junit4] 2> "state":"active",
        [junit4] 2> "shard":"shard1",
        [junit4] 2> "collection":"control_collection",
        [junit4] 2> "operation":"state"}
        [junit4] 2> 63358 INFO (zkCallback-55-thread-1-processing-n:127.0.0.1:45351_) [n:127.0.0.1:45351_ ] o.a.s.c.c.ZkStateReader A cluster state change: [WatchedEvent state:SyncConnected type:NodeDataChanged path:/clusterstate.json], has occurred - updating... (live nodes size: [1])
        [junit4] 2> 63399 INFO (TEST-TestReqParamsAPI.test-seed#[1D7A2691847F5CD4]) [ ] o.a.s.c.s.i.CloudSolrClient Final constructed zkHost string: 127.0.0.1:41613/solr
        [junit4] 2> 63400 INFO (TEST-TestReqParamsAPI.test-seed#[1D7A2691847F5CD4]) [ ] o.a.s.c.c.SolrZkClient Using default ZkCredentialsProvider
        [junit4] 2> 63400 INFO (TEST-TestReqParamsAPI.test-seed#[1D7A2691847F5CD4]) [ ] o.a.s.c.c.ConnectionManager Waiting for client to connect to ZooKeeper
        [junit4] 2> 63402 INFO (zkCallback-59-thread-1) [ ] o.a.s.c.c.ConnectionManager Watcher org.apache.solr.common.cloud.ConnectionManager@2b3a731b name:ZooKeeperConnection Watcher:127.0.0.1:41613/solr got event WatchedEvent state:SyncConnected type:None path:null path:null type:None
        [junit4] 2> 63402 INFO (TEST-TestReqParamsAPI.test-seed#[1D7A2691847F5CD4]) [ ] o.a.s.c.c.ConnectionManager Client is connected to ZooKeeper
        [junit4] 2> 63402 INFO (TEST-TestReqParamsAPI.test-seed#[1D7A2691847F5CD4]) [ ] o.a.s.c.c.SolrZkClient Using default ZkACLProvider
        [junit4] 2> 63402 INFO (TEST-TestReqParamsAPI.test-seed#[1D7A2691847F5CD4]) [ ] o.a.s.c.c.ZkStateReader Updating cluster state from ZooKeeper...
        [junit4] 2> 63402 INFO (TEST-TestReqParamsAPI.test-seed#[1D7A2691847F5CD4]) [ ] o.a.s.c.c.ZkStateReader Loaded cluster properties: {urlScheme=https}
        [junit4] 2> 63403 INFO (TEST-TestReqParamsAPI.test-seed#[1D7A2691847F5CD4]) [ ] o.a.s.c.c.ZkStateReader Updated live nodes from ZooKeeper... (0) -> (1)
        [junit4] 2> 63403 INFO (TEST-TestReqParamsAPI.test-seed#[1D7A2691847F5CD4]) [ ] o.a.s.c.ChaosMonkey monkey: init - expire sessions:false cause connection loss:false
        [junit4] 2> 63453 INFO (TEST-TestReqParamsAPI.test-seed#[1D7A2691847F5CD4]) [ ] o.a.s.SolrTestCaseJ4 Writing core.properties file to /home/jenkins/workspace/Lucene-Solr-master-Linux/solr/build/solr-core/test/J1/temp/solr.handler.TestReqParamsAPI_1D7A2691847F5CD4-001/shard-1-001/cores/collection1
        [junit4] 2> 63453 INFO (TEST-TestReqParamsAPI.test-seed#[1D7A2691847F5CD4]) [ ] o.a.s.c.AbstractFullDistribZkTestBase create jetty 1 in directory /home/jenkins/workspace/Lucene-Solr-master-Linux/solr/build/solr-core/test/J1/temp/solr.handler.TestReqParamsAPI_1D7A2691847F5CD4-001/shard-1-001
        [junit4] 2> 63455 INFO (TEST-TestReqParamsAPI.test-seed#[1D7A2691847F5CD4]) [ ] o.e.j.s.Server jetty-9.3.8.v20160314
        [junit4] 2> 63456 INFO (TEST-TestReqParamsAPI.test-seed#[1D7A2691847F5CD4]) [ ] o.e.j.s.h.ContextHandler Started o.e.j.s.ServletContextHandler@7a924c41{/,null,AVAILABLE}
        [junit4] 2> 63460 INFO (TEST-TestReqParamsAPI.test-seed#[1D7A2691847F5CD4]) [ ] o.e.j.s.ServerConnector Started ServerConnector@2938c20b{SSL,[ssl, http/1.1]}{127.0.0.1:46279}
        [junit4] 2> 63460 INFO (TEST-TestReqParamsAPI.test-seed#[1D7A2691847F5CD4]) [ ] o.e.j.s.Server Started @65211ms
        [junit4] 2> 63460 INFO (TEST-TestReqParamsAPI.test-seed#[1D7A2691847F5CD4]) [ ] o.a.s.c.s.e.JettySolrRunner Jetty properties: {solr.data.dir=/home/jenkins/workspace/Lucene-Solr-master-Linux/solr/build/solr-core/test/J1/temp/solr.handler.TestReqParamsAPI_1D7A2691847F5CD4-001/tempDir-001/jetty1, solrconfig=solrconfig.xml, hostContext=/, hostPort=46279, coreRootDirectory=/home/jenkins/workspace/Lucene-Solr-master-Linux/solr/build/solr-core/test/J1/../../../../../../../../../home/jenkins/workspace/Lucene-Solr-master-Linux/solr/build/solr-core/test/J1/temp/solr.handler.TestReqParamsAPI_1D7A2691847F5CD4-001/shard-1-001/cores}
        [junit4] 2> 63460 INFO (TEST-TestReqParamsAPI.test-seed#[1D7A2691847F5CD4]) [ ] o.a.s.s.SolrDispatchFilter SolrDispatchFilter.init(): sun.misc.Launcher$AppClassLoader@73d16e93
        [junit4] 2> 63460 INFO (TEST-TestReqParamsAPI.test-seed#[1D7A2691847F5CD4]) [ ] o.a.s.c.SolrResourceLoader new SolrResourceLoader for directory: '/home/jenkins/workspace/Lucene-Solr-master-Linux/solr/build/solr-core/test/J1/temp/solr.handler.TestReqParamsAPI_1D7A2691847F5CD4-001/shard-1-001'
        [junit4] 2> 63460 INFO (TEST-TestReqParamsAPI.test-seed#[1D7A2691847F5CD4]) [ ] o.a.s.c.SolrResourceLoader JNDI not configured for solr (NoInitialContextEx)
        [junit4] 2> 63460 INFO (TEST-TestReqParamsAPI.test-seed#[1D7A2691847F5CD4]) [ ] o.a.s.c.SolrResourceLoader solr home defaulted to 'solr/' (could not find system property or JNDI)
        [junit4] 2> 63460 INFO (TEST-TestReqParamsAPI.test-seed#[1D7A2691847F5CD4]) [ ] o.a.s.c.c.SolrZkClient Using default ZkCredentialsProvider
        [junit4] 2> 63461 INFO (TEST-TestReqParamsAPI.test-seed#[1D7A2691847F5CD4]) [ ] o.a.s.c.c.ConnectionManager Waiting for client to connect to ZooKeeper
        [junit4] 2> 63462 INFO (zkCallback-60-thread-1) [ ] o.a.s.c.c.ConnectionManager Watcher org.apache.solr.common.cloud.ConnectionManager@2d5d6966 name:ZooKeeperConnection Watcher:127.0.0.1:41613/solr got event WatchedEvent state:SyncConnected type:None path:null path:null type:None
        [junit4] 2> 63462 INFO (TEST-TestReqParamsAPI.test-seed#[1D7A2691847F5CD4]) [ ] o.a.s.c.c.ConnectionManager Client is connected to ZooKeeper
        [junit4] 2> 63463 INFO (TEST-TestReqParamsAPI.test-seed#[1D7A2691847F5CD4]) [ ] o.a.s.c.c.SolrZkClient Using default ZkACLProvider
        [junit4] 2> 63463 INFO (TEST-TestReqParamsAPI.test-seed#[1D7A2691847F5CD4]) [ ] o.a.s.s.SolrDispatchFilter Loading solr.xml from SolrHome (not found in ZooKeeper)
        [junit4] 2> 63464 INFO (TEST-TestReqParamsAPI.test-seed#[1D7A2691847F5CD4]) [ ] o.a.s.c.SolrXmlConfig Loading container configuration from /home/jenkins/workspace/Lucene-Solr-master-Linux/solr/build/solr-core/test/J1/temp/solr.handler.TestReqParamsAPI_1D7A2691847F5CD4-001/shard-1-001/solr.xml
        [junit4] 2> 63468 INFO (TEST-TestReqParamsAPI.test-seed#[1D7A2691847F5CD4]) [ ] o.a.s.c.CorePropertiesLocator Config-defined core root directory: /home/jenkins/workspace/Lucene-Solr-master-Linux/solr/build/solr-core/test/J1/../../../../../../../../../home/jenkins/workspace/Lucene-Solr-master-Linux/solr/build/solr-core/test/J1/temp/solr.handler.TestReqParamsAPI_1D7A2691847F5CD4-001/shard-1-001/cores
        [junit4] 2> 63468 INFO (TEST-TestReqParamsAPI.test-seed#[1D7A2691847F5CD4]) [ ] o.a.s.c.CoreContainer New CoreContainer 106160285
        [junit4] 2> 63468 INFO (TEST-TestReqParamsAPI.test-seed#[1D7A2691847F5CD4]) [ ] o.a.s.c.CoreContainer Loading cores into CoreContainer [instanceDir=/home/jenkins/workspace/Lucene-Solr-master-Linux/solr/build/solr-core/test/J1/temp/solr.handler.TestReqParamsAPI_1D7A2691847F5CD4-001/shard-1-001]
        [junit4] 2> 63469 WARN (TEST-TestReqParamsAPI.test-seed#[1D7A2691847F5CD4]) [ ] o.a.s.c.CoreContainer Couldn't add files from /home/jenkins/workspace/Lucene-Solr-master-Linux/solr/build/solr-core/test/J1/temp/solr.handler.TestReqParamsAPI_1D7A2691847F5CD4-001/shard-1-001/lib to classpath: /home/jenkins/workspace/Lucene-Solr-master-Linux/solr/build/solr-core/test/J1/temp/solr.handler.TestReqParamsAPI_1D7A2691847F5CD4-001/shard-1-001/lib
        [junit4] 2> 63469 INFO (TEST-TestReqParamsAPI.test-seed#[1D7A2691847F5CD4]) [ ] o.a.s.h.c.HttpShardHandlerFactory created with socketTimeout : 90000,urlScheme : ,connTimeout : 15000,maxConnectionsPerHost : 20,maxConnections : 10000,corePoolSize : 0,maximumPoolSize : 2147483647,maxThreadIdleTime : 5,sizeOfQueue : -1,fairnessPolicy : false,
        [junit4] 2> 63470 INFO (TEST-TestReqParamsAPI.test-seed#[1D7A2691847F5CD4]) [ ] o.a.s.u.UpdateShardHandler Creating UpdateShardHandler HTTP client with params:
        [junit4] 2> 63470 INFO (TEST-TestReqParamsAPI.test-seed#[1D7A2691847F5CD4]) [ ] o.a.s.l.LogWatcher SLF4J impl is org.slf4j.impl.Log4jLoggerFactory
        [junit4] 2> 63471 INFO (TEST-TestReqParamsAPI.test-seed#[1D7A2691847F5CD4]) [ ] o.a.s.l.LogWatcher Registering Log Listener [Log4j (org.slf4j.impl.Log4jLoggerFactory)]
        [junit4] 2> 63471 INFO (TEST-TestReqParamsAPI.test-seed#[1D7A2691847F5CD4]) [ ] o.a.s.c.ZkContainer Zookeeper client=127.0.0.1:41613/solr
        [junit4] 2> 63471 INFO (TEST-TestReqParamsAPI.test-seed#[1D7A2691847F5CD4]) [ ] o.a.s.c.ZkController zkHost includes chroot
        [junit4] 2> 63471 INFO (TEST-TestReqParamsAPI.test-seed#[1D7A2691847F5CD4]) [ ] o.a.s.c.c.SolrZkClient Using default ZkCredentialsProvider
        [junit4] 2> 63471 INFO (TEST-TestReqParamsAPI.test-seed#[1D7A2691847F5CD4]) [ ] o.a.s.c.c.ConnectionManager Waiting for client to connect to ZooKeeper
        [junit4] 2> 63472 INFO (zkCallback-63-thread-1) [ ] o.a.s.c.c.ConnectionManager Watcher org.apache.solr.common.cloud.ConnectionManager@1de53a09 name:ZooKeeperConnection Watcher:127.0.0.1:41613 got event WatchedEvent state:SyncConnected type:None path:null path:null type:None
        [junit4] 2> 63472 INFO (TEST-TestReqParamsAPI.test-seed#[1D7A2691847F5CD4]) [ ] o.a.s.c.c.ConnectionManager Client is connected to ZooKeeper
        [junit4] 2> 63473 INFO (TEST-TestReqParamsAPI.test-seed#[1D7A2691847F5CD4]) [ ] o.a.s.c.c.SolrZkClient Using default ZkACLProvider
        [junit4] 2> 63475 INFO (TEST-TestReqParamsAPI.test-seed#[1D7A2691847F5CD4]) [n:127.0.0.1:46279_ ] o.a.s.c.ZkController Added new OnReconnect listener org.apache.solr.cloud.ZkController$$Lambda$13/1094467280@71333717
        [junit4] 2> 63475 INFO (TEST-TestReqParamsAPI.test-seed#[1D7A2691847F5CD4]) [n:127.0.0.1:46279_ ] o.a.s.c.c.ConnectionManager Waiting for client to connect to ZooKeeper
        [junit4] 2> 63476 INFO (zkCallback-64-thread-1-processing-n:127.0.0.1:46279_) [n:127.0.0.1:46279_ ] o.a.s.c.c.ConnectionManager Watcher org.apache.solr.common.cloud.ConnectionManager@77742a1f name:ZooKeeperConnection Watcher:127.0.0.1:41613/solr got event WatchedEvent state:SyncConnected type:None path:null path:null type:None
        [junit4] 2> 63476 INFO (TEST-TestReqParamsAPI.test-seed#[1D7A2691847F5CD4]) [n:127.0.0.1:46279_ ] o.a.s.c.c.ConnectionManager Client is connected to ZooKeeper
        [junit4] 2> 63478 INFO (TEST-TestReqParamsAPI.test-seed#[1D7A2691847F5CD4]) [n:127.0.0.1:46279_ ] o.a.s.c.c.ZkStateReader Updating cluster state from

    [...truncated too long message...]

    86)
        [junit4] 2> at org.apache.solr.core.CoreContainer.reload(CoreContainer.java:936)
        [junit4] 2> ... 2 more
        [junit4] 2> Caused by: org.apache.solr.common.SolrException: Unable to load reader for ConfigSet properties: configsetprops.json
        [junit4] 2> at org.apache.solr.core.ConfigSetProperties.readFromResourceLoader(ConfigSetProperties.java:57)
        [junit4] 2> at org.apache.solr.core.ConfigSetService.createConfigSetProperties(ConfigSetService.java:118)
        [junit4] 2> at org.apache.solr.core.ConfigSetService.getConfig(ConfigSetService.java:80)
        [junit4] 2> ... 3 more
        [junit4] 2> Caused by: java.io.IOException: We re-tried 10 times but was still unable to fetch resource=configsetprops.json from ZK
        [junit4] 2> at org.apache.solr.cloud.ZkSolrResourceLoader.openResource(ZkSolrResourceLoader.java:116)
        [junit4] 2> at org.apache.solr.core.ConfigSetProperties.readFromResourceLoader(ConfigSetProperties.java:52)
        [junit4] 2> ... 5 more
        [junit4] 2> Caused by: org.apache.zookeeper.KeeperException$SessionExpiredException: KeeperErrorCode = Session expired for /configs/conf1/configsetprops.json
        [junit4] 2> at org.apache.zookeeper.KeeperException.create(KeeperException.java:127)
        [junit4] 2> at org.apache.zookeeper.KeeperException.create(KeeperException.java:51)
        [junit4] 2> at org.apache.zookeeper.ZooKeeper.exists(ZooKeeper.java:1045)
        [junit4] 2> at org.apache.solr.common.cloud.SolrZkClient$5.execute(SolrZkClient.java:314)
        [junit4] 2> at org.apache.solr.common.cloud.SolrZkClient$5.execute(SolrZkClient.java:311)
        [junit4] 2> at org.apache.solr.common.cloud.ZkCmdExecutor.retryOperation(ZkCmdExecutor.java:60)
        [junit4] 2> at org.apache.solr.common.cloud.SolrZkClient.exists(SolrZkClient.java:311)
        [junit4] 2> at org.apache.solr.cloud.ZkController.pathExists(ZkController.java:793)
        [junit4] 2> at org.apache.solr.cloud.ZkSolrResourceLoader.openResource(ZkSolrResourceLoader.java:89)
        [junit4] 2> ... 6 more
        [junit4] 2> NOTE: test params are: codec=CheapBastard, sim=RandomSimilarity(queryNorm=true,coord=no): {}, locale=en-CA, timezone=Kwajalein
        [junit4] 2> NOTE: Linux 4.4.0-21-generic amd64/Oracle Corporation 1.8.0_92 (64-bit)/cpus=12,threads=1,free=201581992,total=513277952
        [junit4] 2> NOTE: All tests run in this JVM: [HardAutoCommitTest, TestOverriddenPrefixQueryForCustomFieldType, BaseCdcrDistributedZkTest, TermVectorComponentDistributedTest, TestFieldTypeCollectionResource, TestSolrQueryParser, DeleteInactiveReplicaTest, AnalyticsQueryTest, TestSolrIndexConfig, CloneFieldUpdateProcessorFactoryTest, TolerantUpdateProcessorTest, DocValuesMultiTest, BadComponentTest, TestFuzzyAnalyzedSuggestions, TestXIncludeConfig, TestLRUStatsCache, CachingDirectoryFactoryTest, ClusterStateTest, TestDynamicLoading, CleanupOldIndexTest, XmlUpdateRequestHandlerTest, SuggesterTSTTest, TestIndexSearcher, TestGeoJSONResponseWriter, HdfsNNFailoverTest, AddSchemaFieldsUpdateProcessorFactoryTest, TestRestManager, TestElisionMultitermQuery, DistributedQueryComponentOptimizationTest, SpatialRPTFieldTypeTest, LukeRequestHandlerTest, TestRecovery, BlockDirectoryTest, TestFreeTextSuggestions, FieldMutatingUpdateProcessorTest, ParsingFieldUpdateProcessorsTest, PrimitiveFieldTypeTest, SimpleFacetsTest, SuggesterTest, CoreAdminHandlerTest, OverriddenZkACLAndCredentialsProvidersTest, TestSerializedLuceneMatchVersion, StatsComponentTest, DateRangeFieldTest, SpatialHeatmapFacetsTest, TestManagedSchema, LeaderFailoverAfterPartitionTest, TestDistributedMissingSort, TestTolerantSearch, StressHdfsTest, TestConfigSetsAPI, DistributedVersionInfoTest, SimpleCollectionCreateDeleteTest, GraphQueryTest, TestTrackingShardHandlerFactory, BitVectorTest, CollectionsAPISolrJTest, VMParamsZkACLAndCredentialsProvidersTest, TestRawTransformer, TestSort, HdfsChaosMonkeyNothingIsSafeTest, AssignTest, TestZkChroot, TestStressRecovery, SegmentsInfoRequestHandlerTest, TestReload, TestUniqueKeyFieldResource, TestCryptoKeys, TestJettySolrRunner, DistributedFacetPivotSmallTest, DistributedFacetPivotLargeTest, TestSha256AuthenticationProvider, OverseerTest, TestJmxMonitoredMap, SearchHandlerTest, DirectUpdateHandlerOptimizeTest, TestTolerantUpdateProcessorRandomCloud, RequestHandlersTest, TestPHPSerializedResponseWriter, TestGraphTermsQParserPlugin, TestSolrDeletionPolicy1, TestCoreDiscovery, TestFastWriter, TestExtendedDismaxParser, TestPerFieldSimilarity, TestUseDocValuesAsStored, TestMaxScoreQueryParser, TestDistributedStatsComponentCardinality, RegexBoostProcessorTest, TestReloadDeadlock, SolrCoreCheckLockOnStartupTest, TestFieldCacheSortRandom, TestLegacyFieldCache, DateMathParserTest, ZkStateWriterTest, TestSolrXml, BinaryUpdateRequestHandlerTest, AutoCommitTest, BadIndexSchemaTest, SolrTestCaseJ4Test, UnloadDistributedZkTest, BasicZkTest, RecoveryZkTest, FullSolrCloudDistribCmdsTest, DistributedSpellCheckComponentTest, TestStressReorder, TestStressVersions, DistributedTermsComponentTest, TestSolr4Spatial, TestGroupingSearch, QueryElevationComponentTest, DirectUpdateHandlerTest, ShowFileRequestHandlerTest, CurrencyFieldXmlFileTest, SimplePostToolTest, AnalysisAfterCoreReloadTest, SignatureUpdateProcessorFactoryTest, SuggesterFSTTest, SolrRequestParserTest, TestFoldingMultitermQuery, SuggesterWFSTTest, TestCSVLoader, NoCacheHeaderTest, TestUpdate, TestAtomicUpdateErrorCases, StatelessScriptUpdateProcessorFactoryTest, IndexBasedSpellCheckerTest, DisMaxRequestHandlerTest, DirectSolrSpellCheckerTest, TestQueryTypes, TermsComponentTest, DocumentBuilderTest, FieldAnalysisRequestHandlerTest, TestCollationField, TestCSVResponseWriter, QueryParsingTest, PingRequestHandlerTest, TestSystemIdResolver, PrimUtilsTest, TestSuggestSpellingConverter, DateFieldTest, SpellingQueryConverterTest, DOMUtilTest, RAMDirectoryFactoryTest, TestSolrJ, TestLRUCache, TestUtils, TestDocumentBuilder, ZkNodePropsTest, SliceStateTest, SystemInfoHandlerTest, FileUtilsTest, CircularListTest, DistributedMLTComponentTest, CursorPagingTest, DistributedIntervalFacetingTest, ConnectionReuseTest, AsyncCallRequestStatusResponseTest, CdcrReplicationDistributedZkTest, CdcrReplicationHandlerTest, CdcrRequestHandlerTest, CollectionStateFormat2Test, DeleteShardTest, DeleteStatusTest, DistributedQueueTest, LeaderInitiatedRecoveryOnCommitTest, MultiThreadedOCPTest, RemoteQueryErrorTest, SharedFSAutoReplicaFailoverUtilsTest, SolrCloudExampleTest, TestCloudInspectUtil, TestExclusionRuleCollectionAccess, TestLockTree, TestMiniSolrCloudCluster, TestOnReconnectListenerSupport, TestRebalanceLeaders, TestStressCloudBlindAtomicUpdates, BlobRepositoryCloudTest, ExitableDirectoryReaderTest, HdfsDirectoryFactoryTest, TestConfigSetImmutable, TestConfigSets, TestInitParams, TestReloadAndDeleteDocs, TestShardHandlerFactory, TestSolrConfigHandler, TestSolrDynamicMBean, TestBlobHandler, TestConfigReload, TestReplicationHandlerBackup, TestRestoreCore, TestSQLHandler, TestSolrConfigHandlerConcurrent, CoreAdminCreateDiscoverTest, CoreAdminRequestStatusTest, SecurityConfHandlerTest, DistributedExpandComponentTest, DistributedFacetPivotSmallAdvancedTest, DistributedFacetPivotWhiteBoxTest, DistributedQueryComponentCustomSortTest, DistributedSuggestComponentTest, FacetPivotSmallTest, SuggestComponentContextFilterQueryTest, TestPivotHelperCode, HighlighterMaxOffsetTest, TestSlowCompositeReaderWrapper, SmileWriterTest, TestIntervalFaceting, TestMacros, TestCustomDocTransformer, TestChildDocTransformer, TestSubQueryTransformerDistrib, TestManagedSchemaAPI]
        [junit4] Completed [557/614 (4!)] on J2 in 24.20s, 1 test, 1 error <<< FAILURES!

    [...truncated 200 lines...]
        [junit4] JVM J1: stdout was not empty, see: /home/jenkins/workspace/Lucene-Solr-master-Linux/solr/build/solr-core/test/temp/junit4-J1-20160612_081327_355.sysout
        [junit4] >>> JVM J1 emitted unexpected output (verbatim) ----
        [junit4] java.lang.OutOfMemoryError: GC overhead limit exceeded
        [junit4] Dumping heap to /home/jenkins/workspace/Lucene-Solr-master-Linux/heapdumps/java_pid7463.hprof ...
        [junit4] Heap dump file created [508812870 bytes in 1.528 secs]
        [junit4] <<< JVM J1: EOF ----

    [...truncated 3 lines...]
        [junit4] JVM J0: stdout was not empty, see: /home/jenkins/workspace/Lucene-Solr-master-Linux/solr/build/solr-core/test/temp/junit4-J0-20160612_081327_354.sysout
        [junit4] >>> JVM J0 emitted unexpected output (verbatim) ----
        [junit4] java.lang.OutOfMemoryError: GC overhead limit exceeded
        [junit4] Dumping heap to /home/jenkins/workspace/Lucene-Solr-master-Linux/heapdumps/java_pid7458.hprof ...
        [junit4] Heap dump file created [503441479 bytes in 1.259 secs]
        [junit4] <<< JVM J0: EOF ----

    [...truncated 16 lines...]
    BUILD FAILED
    /home/jenkins/workspace/Lucene-Solr-master-Linux/build.xml:740: The following error occurred while executing this line:
    /home/jenkins/workspace/Lucene-Solr-master-Linux/build.xml:684: The following error occurred while executing this line:
    /home/jenkins/workspace/Lucene-Solr-master-Linux/build.xml:59: The following error occurred while executing this line:
    /home/jenkins/workspace/Lucene-Solr-master-Linux/solr/build.xml:233: The following error occurred while executing this line:
    /home/jenkins/workspace/Lucene-Solr-master-Linux/solr/common-build.xml:531: The following error occurred while executing this line:
    /home/jenkins/workspace/Lucene-Solr-master-Linux/lucene/common-build.xml:1427: The following error occurred while executing this line:
    /home/jenkins/workspace/Lucene-Solr-master-Linux/lucene/common-build.xml:984: There were test failures: 614 suites (10 ignored), 2583 tests, 3 errors, 1 failure, 115 ignored (71 assumptions) [seed: 1D7A2691847F5CD4]

    Total time: 56 minutes 36 seconds
    Build step 'Invoke Ant' marked build as failure
    Archiving artifacts
    [WARNINGS] Skipping publisher since build result is FAILURE
    Recording test results
    Email was triggered for: Failure - Any
    Sending email for trigger: Failure - Any

Related Discussions

Discussion Navigation
viewthread | post
Discussion Overview
groupdev @
categorieslucene
postedJun 12, '16 at 5:32a
activeJun 12, '16 at 8:48a
posts2
users1
websitelucene.apache.org

1 user in discussion

Policeman Jenkins Server: 2 posts

People

Translate

site design / logo © 2018 Grokbase