Grokbase Groups Lucene dev June 2016
FAQ
Build: http://jenkins.thetaphi.de/job/Lucene-Solr-6.x-MacOSX/194/
Java: 64bit/jdk1.8.0 -XX:+UseCompressedOops -XX:+UseParallelGC

1 tests failed.
FAILED: org.apache.solr.schema.TestManagedSchemaAPI.test

Error Message:
Error from server at http://127.0.0.1:55843/solr/testschemaapi_shard1_replica2: ERROR: [doc=2] unknown field 'myNewField1'

Stack Trace:
org.apache.solr.client.solrj.impl.CloudSolrClient$RouteException: Error from server at http://127.0.0.1:55843/solr/testschemaapi_shard1_replica2: ERROR: [doc=2] unknown field 'myNewField1'
  at __randomizedtesting.SeedInfo.seed([C01793FB2788D995:4843AC218974B46D]:0)
  at org.apache.solr.client.solrj.impl.CloudSolrClient.directUpdate(CloudSolrClient.java:697)
  at org.apache.solr.client.solrj.impl.CloudSolrClient.sendRequest(CloudSolrClient.java:1109)
  at org.apache.solr.client.solrj.impl.CloudSolrClient.requestWithRetryOnStaleState(CloudSolrClient.java:998)
  at org.apache.solr.client.solrj.impl.CloudSolrClient.request(CloudSolrClient.java:934)
  at org.apache.solr.schema.TestManagedSchemaAPI.testAddFieldAndDocument(TestManagedSchemaAPI.java:86)
  at org.apache.solr.schema.TestManagedSchemaAPI.test(TestManagedSchemaAPI.java:55)
  at sun.reflect.NativeMethodAccessorImpl.invoke0(Native Method)
  at sun.reflect.NativeMethodAccessorImpl.invoke(NativeMethodAccessorImpl.java:62)
  at sun.reflect.DelegatingMethodAccessorImpl.invoke(DelegatingMethodAccessorImpl.java:43)
  at java.lang.reflect.Method.invoke(Method.java:498)
  at com.carrotsearch.randomizedtesting.RandomizedRunner.invoke(RandomizedRunner.java:1764)
  at com.carrotsearch.randomizedtesting.RandomizedRunner$8.evaluate(RandomizedRunner.java:871)
  at com.carrotsearch.randomizedtesting.RandomizedRunner$9.evaluate(RandomizedRunner.java:907)
  at com.carrotsearch.randomizedtesting.RandomizedRunner$10.evaluate(RandomizedRunner.java:921)
  at com.carrotsearch.randomizedtesting.rules.SystemPropertiesRestoreRule$1.evaluate(SystemPropertiesRestoreRule.java:57)
  at org.apache.lucene.util.TestRuleSetupTeardownChained$1.evaluate(TestRuleSetupTeardownChained.java:49)
  at org.apache.lucene.util.AbstractBeforeAfterRule$1.evaluate(AbstractBeforeAfterRule.java:45)
  at org.apache.lucene.util.TestRuleThreadAndTestName$1.evaluate(TestRuleThreadAndTestName.java:48)
  at org.apache.lucene.util.TestRuleIgnoreAfterMaxFailures$1.evaluate(TestRuleIgnoreAfterMaxFailures.java:64)
  at org.apache.lucene.util.TestRuleMarkFailure$1.evaluate(TestRuleMarkFailure.java:47)
  at com.carrotsearch.randomizedtesting.rules.StatementAdapter.evaluate(StatementAdapter.java:36)
  at com.carrotsearch.randomizedtesting.ThreadLeakControl$StatementRunner.run(ThreadLeakControl.java:367)
  at com.carrotsearch.randomizedtesting.ThreadLeakControl.forkTimeoutingTask(ThreadLeakControl.java:809)
  at com.carrotsearch.randomizedtesting.ThreadLeakControl$3.evaluate(ThreadLeakControl.java:460)
  at com.carrotsearch.randomizedtesting.RandomizedRunner.runSingleTest(RandomizedRunner.java:880)
  at com.carrotsearch.randomizedtesting.RandomizedRunner$5.evaluate(RandomizedRunner.java:781)
  at com.carrotsearch.randomizedtesting.RandomizedRunner$6.evaluate(RandomizedRunner.java:816)
  at com.carrotsearch.randomizedtesting.RandomizedRunner$7.evaluate(RandomizedRunner.java:827)
  at com.carrotsearch.randomizedtesting.rules.StatementAdapter.evaluate(StatementAdapter.java:36)
  at com.carrotsearch.randomizedtesting.rules.SystemPropertiesRestoreRule$1.evaluate(SystemPropertiesRestoreRule.java:57)
  at org.apache.lucene.util.AbstractBeforeAfterRule$1.evaluate(AbstractBeforeAfterRule.java:45)
  at com.carrotsearch.randomizedtesting.rules.StatementAdapter.evaluate(StatementAdapter.java:36)
  at org.apache.lucene.util.TestRuleStoreClassName$1.evaluate(TestRuleStoreClassName.java:41)
  at com.carrotsearch.randomizedtesting.rules.NoShadowingOrOverridesOnMethodsRule$1.evaluate(NoShadowingOrOverridesOnMethodsRule.java:40)
  at com.carrotsearch.randomizedtesting.rules.NoShadowingOrOverridesOnMethodsRule$1.evaluate(NoShadowingOrOverridesOnMethodsRule.java:40)
  at com.carrotsearch.randomizedtesting.rules.StatementAdapter.evaluate(StatementAdapter.java:36)
  at com.carrotsearch.randomizedtesting.rules.StatementAdapter.evaluate(StatementAdapter.java:36)
  at com.carrotsearch.randomizedtesting.rules.StatementAdapter.evaluate(StatementAdapter.java:36)
  at org.apache.lucene.util.TestRuleAssertionsRequired$1.evaluate(TestRuleAssertionsRequired.java:53)
  at org.apache.lucene.util.TestRuleMarkFailure$1.evaluate(TestRuleMarkFailure.java:47)
  at org.apache.lucene.util.TestRuleIgnoreAfterMaxFailures$1.evaluate(TestRuleIgnoreAfterMaxFailures.java:64)
  at org.apache.lucene.util.TestRuleIgnoreTestSuites$1.evaluate(TestRuleIgnoreTestSuites.java:54)
  at com.carrotsearch.randomizedtesting.rules.StatementAdapter.evaluate(StatementAdapter.java:36)
  at com.carrotsearch.randomizedtesting.ThreadLeakControl$StatementRunner.run(ThreadLeakControl.java:367)
  at java.lang.Thread.run(Thread.java:745)
Caused by: org.apache.solr.client.solrj.impl.HttpSolrClient$RemoteSolrException: Error from server at http://127.0.0.1:55843/solr/testschemaapi_shard1_replica2: ERROR: [doc=2] unknown field 'myNewField1'
  at org.apache.solr.client.solrj.impl.HttpSolrClient.executeMethod(HttpSolrClient.java:590)
  at org.apache.solr.client.solrj.impl.HttpSolrClient.request(HttpSolrClient.java:259)
  at org.apache.solr.client.solrj.impl.HttpSolrClient.request(HttpSolrClient.java:248)
  at org.apache.solr.client.solrj.impl.LBHttpSolrClient.doRequest(LBHttpSolrClient.java:404)
  at org.apache.solr.client.solrj.impl.LBHttpSolrClient.request(LBHttpSolrClient.java:357)
  at org.apache.solr.client.solrj.impl.CloudSolrClient.lambda$directUpdate$0(CloudSolrClient.java:674)
  at java.util.concurrent.FutureTask.run(FutureTask.java:266)
  at org.apache.solr.common.util.ExecutorUtil$MDCAwareThreadPoolExecutor.lambda$execute$0(ExecutorUtil.java:229)
  at java.util.concurrent.ThreadPoolExecutor.runWorker(ThreadPoolExecutor.java:1142)
  at java.util.concurrent.ThreadPoolExecutor$Worker.run(ThreadPoolExecutor.java:617)
  ... 1 more




Build Log:
[...truncated 12265 lines...]
    [junit4] Suite: org.apache.solr.schema.TestManagedSchemaAPI
    [junit4] 2> Creating dataDir: /Users/jenkins/workspace/Lucene-Solr-6.x-MacOSX/solr/build/solr-core/test/J1/temp/solr.schema.TestManagedSchemaAPI_C01793FB2788D995-001/init-core-data-001
    [junit4] 2> 3204043 INFO (SUITE-TestManagedSchemaAPI-seed#[C01793FB2788D995]-worker) [ ] o.a.s.SolrTestCaseJ4 Randomized ssl (false) and clientAuth (false) via: @org.apache.solr.util.RandomizeSSL(reason=, value=NaN, ssl=NaN, clientAuth=NaN) w/ MAC_OS_X supressed clientAuth
    [junit4] 2> 3204045 INFO (SUITE-TestManagedSchemaAPI-seed#[C01793FB2788D995]-worker) [ ] o.a.s.c.ZkTestServer STARTING ZK TEST SERVER
    [junit4] 2> 3204045 INFO (Thread-7298) [ ] o.a.s.c.ZkTestServer client port:0.0.0.0/0.0.0.0:0
    [junit4] 2> 3204046 INFO (Thread-7298) [ ] o.a.s.c.ZkTestServer Starting server
    [junit4] 2> 3204147 INFO (SUITE-TestManagedSchemaAPI-seed#[C01793FB2788D995]-worker) [ ] o.a.s.c.ZkTestServer start zk server on port:55841
    [junit4] 2> 3204147 INFO (SUITE-TestManagedSchemaAPI-seed#[C01793FB2788D995]-worker) [ ] o.a.s.c.c.SolrZkClient Using default ZkCredentialsProvider
    [junit4] 2> 3204147 INFO (SUITE-TestManagedSchemaAPI-seed#[C01793FB2788D995]-worker) [ ] o.a.s.c.c.ConnectionManager Waiting for client to connect to ZooKeeper
    [junit4] 2> 3204158 INFO (zkCallback-4127-thread-1) [ ] o.a.s.c.c.ConnectionManager Watcher org.apache.solr.common.cloud.ConnectionManager@23d7660e name:ZooKeeperConnection Watcher:127.0.0.1:55841 got event WatchedEvent state:SyncConnected type:None path:null path:null type:None
    [junit4] 2> 3204159 INFO (SUITE-TestManagedSchemaAPI-seed#[C01793FB2788D995]-worker) [ ] o.a.s.c.c.ConnectionManager Client is connected to ZooKeeper
    [junit4] 2> 3204159 INFO (SUITE-TestManagedSchemaAPI-seed#[C01793FB2788D995]-worker) [ ] o.a.s.c.c.SolrZkClient Using default ZkACLProvider
    [junit4] 2> 3204159 INFO (SUITE-TestManagedSchemaAPI-seed#[C01793FB2788D995]-worker) [ ] o.a.s.c.c.SolrZkClient makePath: /solr/solr.xml
    [junit4] 2> 3204165 INFO (jetty-launcher-4126-thread-1) [ ] o.e.j.s.Server jetty-9.3.8.v20160314
    [junit4] 2> 3204165 INFO (jetty-launcher-4126-thread-2) [ ] o.e.j.s.Server jetty-9.3.8.v20160314
    [junit4] 2> 3204169 INFO (jetty-launcher-4126-thread-2) [ ] o.e.j.s.h.ContextHandler Started o.e.j.s.ServletContextHandler@46d7c3c8{/solr,null,AVAILABLE}
    [junit4] 2> 3204169 INFO (jetty-launcher-4126-thread-1) [ ] o.e.j.s.h.ContextHandler Started o.e.j.s.ServletContextHandler@fc78c06{/solr,null,AVAILABLE}
    [junit4] 2> 3204175 INFO (jetty-launcher-4126-thread-2) [ ] o.e.j.s.ServerConnector Started ServerConnector@49b687ca{HTTP/1.1,[http/1.1]}{127.0.0.1:55843}
    [junit4] 2> 3204175 INFO (jetty-launcher-4126-thread-1) [ ] o.e.j.s.ServerConnector Started ServerConnector@168e9ab3{HTTP/1.1,[http/1.1]}{127.0.0.1:55844}
    [junit4] 2> 3204175 INFO (jetty-launcher-4126-thread-2) [ ] o.e.j.s.Server Started @3209731ms
    [junit4] 2> 3204175 INFO (jetty-launcher-4126-thread-1) [ ] o.e.j.s.Server Started @3209731ms
    [junit4] 2> 3204175 INFO (jetty-launcher-4126-thread-2) [ ] o.a.s.c.s.e.JettySolrRunner Jetty properties: {hostContext=/solr, hostPort=55843}
    [junit4] 2> 3204175 INFO (jetty-launcher-4126-thread-1) [ ] o.a.s.c.s.e.JettySolrRunner Jetty properties: {hostContext=/solr, hostPort=55844}
    [junit4] 2> 3204176 INFO (jetty-launcher-4126-thread-2) [ ] o.a.s.s.SolrDispatchFilter SolrDispatchFilter.init(): sun.misc.Launcher$AppClassLoader@4554617c
    [junit4] 2> 3204176 INFO (jetty-launcher-4126-thread-1) [ ] o.a.s.s.SolrDispatchFilter SolrDispatchFilter.init(): sun.misc.Launcher$AppClassLoader@4554617c
    [junit4] 2> 3204176 INFO (jetty-launcher-4126-thread-2) [ ] o.a.s.c.SolrResourceLoader new SolrResourceLoader for directory: '/Users/jenkins/workspace/Lucene-Solr-6.x-MacOSX/solr/build/solr-core/test/J1/temp/solr.schema.TestManagedSchemaAPI_C01793FB2788D995-001/tempDir-001/node2'
    [junit4] 2> 3204176 INFO (jetty-launcher-4126-thread-1) [ ] o.a.s.c.SolrResourceLoader new SolrResourceLoader for directory: '/Users/jenkins/workspace/Lucene-Solr-6.x-MacOSX/solr/build/solr-core/test/J1/temp/solr.schema.TestManagedSchemaAPI_C01793FB2788D995-001/tempDir-001/node1'
    [junit4] 2> 3204176 INFO (jetty-launcher-4126-thread-2) [ ] o.a.s.c.SolrResourceLoader JNDI not configured for solr (NoInitialContextEx)
    [junit4] 2> 3204176 INFO (jetty-launcher-4126-thread-1) [ ] o.a.s.c.SolrResourceLoader JNDI not configured for solr (NoInitialContextEx)
    [junit4] 2> 3204176 INFO (jetty-launcher-4126-thread-2) [ ] o.a.s.c.SolrResourceLoader solr home defaulted to 'solr/' (could not find system property or JNDI)
    [junit4] 2> 3204176 INFO (jetty-launcher-4126-thread-1) [ ] o.a.s.c.SolrResourceLoader solr home defaulted to 'solr/' (could not find system property or JNDI)
    [junit4] 2> 3204177 INFO (jetty-launcher-4126-thread-2) [ ] o.a.s.c.c.SolrZkClient Using default ZkCredentialsProvider
    [junit4] 2> 3204177 INFO (jetty-launcher-4126-thread-1) [ ] o.a.s.c.c.SolrZkClient Using default ZkCredentialsProvider
    [junit4] 2> 3204177 INFO (jetty-launcher-4126-thread-2) [ ] o.a.s.c.c.ConnectionManager Waiting for client to connect to ZooKeeper
    [junit4] 2> 3204178 INFO (jetty-launcher-4126-thread-1) [ ] o.a.s.c.c.ConnectionManager Waiting for client to connect to ZooKeeper
    [junit4] 2> 3204179 INFO (zkCallback-4128-thread-1) [ ] o.a.s.c.c.ConnectionManager Watcher org.apache.solr.common.cloud.ConnectionManager@4c4bff22 name:ZooKeeperConnection Watcher:127.0.0.1:55841/solr got event WatchedEvent state:SyncConnected type:None path:null path:null type:None
    [junit4] 2> 3204179 INFO (zkCallback-4129-thread-1) [ ] o.a.s.c.c.ConnectionManager Watcher org.apache.solr.common.cloud.ConnectionManager@6cb41d09 name:ZooKeeperConnection Watcher:127.0.0.1:55841/solr got event WatchedEvent state:SyncConnected type:None path:null path:null type:None
    [junit4] 2> 3204179 INFO (jetty-launcher-4126-thread-2) [ ] o.a.s.c.c.ConnectionManager Client is connected to ZooKeeper
    [junit4] 2> 3204179 INFO (jetty-launcher-4126-thread-1) [ ] o.a.s.c.c.ConnectionManager Client is connected to ZooKeeper
    [junit4] 2> 3204179 INFO (jetty-launcher-4126-thread-2) [ ] o.a.s.c.c.SolrZkClient Using default ZkACLProvider
    [junit4] 2> 3204179 INFO (jetty-launcher-4126-thread-1) [ ] o.a.s.c.c.SolrZkClient Using default ZkACLProvider
    [junit4] 2> 3204180 INFO (jetty-launcher-4126-thread-2) [ ] o.a.s.s.SolrDispatchFilter solr.xml found in ZooKeeper. Loading...
    [junit4] 2> 3204180 INFO (jetty-launcher-4126-thread-1) [ ] o.a.s.s.SolrDispatchFilter solr.xml found in ZooKeeper. Loading...
    [junit4] 2> 3204188 INFO (jetty-launcher-4126-thread-1) [ ] o.a.s.c.CorePropertiesLocator Config-defined core root directory: /Users/jenkins/workspace/Lucene-Solr-6.x-MacOSX/solr/build/solr-core/test/J1/temp/solr.schema.TestManagedSchemaAPI_C01793FB2788D995-001/tempDir-001/node1/.
    [junit4] 2> 3204188 INFO (jetty-launcher-4126-thread-2) [ ] o.a.s.c.CorePropertiesLocator Config-defined core root directory: /Users/jenkins/workspace/Lucene-Solr-6.x-MacOSX/solr/build/solr-core/test/J1/temp/solr.schema.TestManagedSchemaAPI_C01793FB2788D995-001/tempDir-001/node2/.
    [junit4] 2> 3204188 INFO (jetty-launcher-4126-thread-1) [ ] o.a.s.c.CoreContainer New CoreContainer 681480599
    [junit4] 2> 3204188 INFO (jetty-launcher-4126-thread-2) [ ] o.a.s.c.CoreContainer New CoreContainer 797582621
    [junit4] 2> 3204188 INFO (jetty-launcher-4126-thread-2) [ ] o.a.s.c.CoreContainer Loading cores into CoreContainer [instanceDir=/Users/jenkins/workspace/Lucene-Solr-6.x-MacOSX/solr/build/solr-core/test/J1/temp/solr.schema.TestManagedSchemaAPI_C01793FB2788D995-001/tempDir-001/node2]
    [junit4] 2> 3204188 INFO (jetty-launcher-4126-thread-1) [ ] o.a.s.c.CoreContainer Loading cores into CoreContainer [instanceDir=/Users/jenkins/workspace/Lucene-Solr-6.x-MacOSX/solr/build/solr-core/test/J1/temp/solr.schema.TestManagedSchemaAPI_C01793FB2788D995-001/tempDir-001/node1]
    [junit4] 2> 3204188 WARN (jetty-launcher-4126-thread-2) [ ] o.a.s.c.CoreContainer Couldn't add files from /Users/jenkins/workspace/Lucene-Solr-6.x-MacOSX/solr/build/solr-core/test/J1/temp/solr.schema.TestManagedSchemaAPI_C01793FB2788D995-001/tempDir-001/node2/lib to classpath: /Users/jenkins/workspace/Lucene-Solr-6.x-MacOSX/solr/build/solr-core/test/J1/temp/solr.schema.TestManagedSchemaAPI_C01793FB2788D995-001/tempDir-001/node2/lib
    [junit4] 2> 3204188 WARN (jetty-launcher-4126-thread-1) [ ] o.a.s.c.CoreContainer Couldn't add files from /Users/jenkins/workspace/Lucene-Solr-6.x-MacOSX/solr/build/solr-core/test/J1/temp/solr.schema.TestManagedSchemaAPI_C01793FB2788D995-001/tempDir-001/node1/lib to classpath: /Users/jenkins/workspace/Lucene-Solr-6.x-MacOSX/solr/build/solr-core/test/J1/temp/solr.schema.TestManagedSchemaAPI_C01793FB2788D995-001/tempDir-001/node1/lib
    [junit4] 2> 3204189 INFO (jetty-launcher-4126-thread-2) [ ] o.a.s.h.c.HttpShardHandlerFactory created with socketTimeout : 90000,urlScheme : ,connTimeout : 15000,maxConnectionsPerHost : 20,maxConnections : 10000,corePoolSize : 0,maximumPoolSize : 2147483647,maxThreadIdleTime : 5,sizeOfQueue : -1,fairnessPolicy : false,useRetries : false,
    [junit4] 2> 3204189 INFO (jetty-launcher-4126-thread-1) [ ] o.a.s.h.c.HttpShardHandlerFactory created with socketTimeout : 90000,urlScheme : ,connTimeout : 15000,maxConnectionsPerHost : 20,maxConnections : 10000,corePoolSize : 0,maximumPoolSize : 2147483647,maxThreadIdleTime : 5,sizeOfQueue : -1,fairnessPolicy : false,useRetries : false,
    [junit4] 2> 3204191 INFO (jetty-launcher-4126-thread-2) [ ] o.a.s.u.UpdateShardHandler Creating UpdateShardHandler HTTP client with params: socketTimeout=340000&connTimeout=45000&retry=true
    [junit4] 2> 3204191 INFO (jetty-launcher-4126-thread-1) [ ] o.a.s.u.UpdateShardHandler Creating UpdateShardHandler HTTP client with params: socketTimeout=340000&connTimeout=45000&retry=true
    [junit4] 2> 3204191 INFO (jetty-launcher-4126-thread-2) [ ] o.a.s.l.LogWatcher SLF4J impl is org.slf4j.impl.Log4jLoggerFactory
    [junit4] 2> 3204191 INFO (jetty-launcher-4126-thread-2) [ ] o.a.s.l.LogWatcher Registering Log Listener [Log4j (org.slf4j.impl.Log4jLoggerFactory)]
    [junit4] 2> 3204191 INFO (jetty-launcher-4126-thread-1) [ ] o.a.s.l.LogWatcher SLF4J impl is org.slf4j.impl.Log4jLoggerFactory
    [junit4] 2> 3204191 INFO (jetty-launcher-4126-thread-2) [ ] o.a.s.c.ZkContainer Zookeeper client=127.0.0.1:55841/solr
    [junit4] 2> 3204191 INFO (jetty-launcher-4126-thread-1) [ ] o.a.s.l.LogWatcher Registering Log Listener [Log4j (org.slf4j.impl.Log4jLoggerFactory)]
    [junit4] 2> 3204192 INFO (jetty-launcher-4126-thread-2) [ ] o.a.s.c.ZkController zkHost includes chroot
    [junit4] 2> 3204192 INFO (jetty-launcher-4126-thread-2) [ ] o.a.s.c.c.SolrZkClient Using default ZkCredentialsProvider
    [junit4] 2> 3204192 INFO (jetty-launcher-4126-thread-1) [ ] o.a.s.c.ZkContainer Zookeeper client=127.0.0.1:55841/solr
    [junit4] 2> 3204192 INFO (jetty-launcher-4126-thread-1) [ ] o.a.s.c.ZkController zkHost includes chroot
    [junit4] 2> 3204192 INFO (jetty-launcher-4126-thread-1) [ ] o.a.s.c.c.SolrZkClient Using default ZkCredentialsProvider
    [junit4] 2> 3204192 INFO (jetty-launcher-4126-thread-2) [ ] o.a.s.c.c.ConnectionManager Waiting for client to connect to ZooKeeper
    [junit4] 2> 3204193 INFO (jetty-launcher-4126-thread-1) [ ] o.a.s.c.c.ConnectionManager Waiting for client to connect to ZooKeeper
    [junit4] 2> 3204194 INFO (zkCallback-4134-thread-1) [ ] o.a.s.c.c.ConnectionManager Watcher org.apache.solr.common.cloud.ConnectionManager@310c16b6 name:ZooKeeperConnection Watcher:127.0.0.1:55841 got event WatchedEvent state:SyncConnected type:None path:null path:null type:None
    [junit4] 2> 3204194 INFO (jetty-launcher-4126-thread-2) [ ] o.a.s.c.c.ConnectionManager Client is connected to ZooKeeper
    [junit4] 2> 3204194 INFO (zkCallback-4135-thread-1) [ ] o.a.s.c.c.ConnectionManager Watcher org.apache.solr.common.cloud.ConnectionManager@45949e9 name:ZooKeeperConnection Watcher:127.0.0.1:55841 got event WatchedEvent state:SyncConnected type:None path:null path:null type:None
    [junit4] 2> 3204194 INFO (jetty-launcher-4126-thread-2) [ ] o.a.s.c.c.SolrZkClient Using default ZkACLProvider
    [junit4] 2> 3204194 INFO (jetty-launcher-4126-thread-1) [ ] o.a.s.c.c.ConnectionManager Client is connected to ZooKeeper
    [junit4] 2> 3204194 INFO (jetty-launcher-4126-thread-1) [ ] o.a.s.c.c.SolrZkClient Using default ZkACLProvider
    [junit4] 2> 3204196 INFO (jetty-launcher-4126-thread-2) [n:127.0.0.1:55843_solr ] o.a.s.c.ZkController Added new OnReconnect listener org.apache.solr.cloud.ZkController$$Lambda$12/1782677902@64d6fdf4
    [junit4] 2> 3204196 INFO (jetty-launcher-4126-thread-1) [n:127.0.0.1:55844_solr ] o.a.s.c.ZkController Added new OnReconnect listener org.apache.solr.cloud.ZkController$$Lambda$12/1782677902@694d76a
    [junit4] 2> 3204197 INFO (jetty-launcher-4126-thread-1) [n:127.0.0.1:55844_solr ] o.a.s.c.c.ConnectionManager Waiting for client to connect to ZooKeeper
    [junit4] 2> 3204197 INFO (jetty-launcher-4126-thread-2) [n:127.0.0.1:55843_solr ] o.a.s.c.c.ConnectionManager Waiting for client to connect to ZooKeeper
    [junit4] 2> 3204198 INFO (zkCallback-4136-thread-1-processing-n:127.0.0.1:55843_solr) [n:127.0.0.1:55843_solr ] o.a.s.c.c.ConnectionManager Watcher org.apache.solr.common.cloud.ConnectionManager@7354cf26 name:ZooKeeperConnection Watcher:127.0.0.1:55841/solr got event WatchedEvent state:SyncConnected type:None path:null path:null type:None
    [junit4] 2> 3204198 INFO (jetty-launcher-4126-thread-2) [n:127.0.0.1:55843_solr ] o.a.s.c.c.ConnectionManager Client is connected to ZooKeeper
    [junit4] 2> 3204198 INFO (zkCallback-4137-thread-1-processing-n:127.0.0.1:55844_solr) [n:127.0.0.1:55844_solr ] o.a.s.c.c.ConnectionManager Watcher org.apache.solr.common.cloud.ConnectionManager@7d68c1b0 name:ZooKeeperConnection Watcher:127.0.0.1:55841/solr got event WatchedEvent state:SyncConnected type:None path:null path:null type:None
    [junit4] 2> 3204198 INFO (jetty-launcher-4126-thread-1) [n:127.0.0.1:55844_solr ] o.a.s.c.c.ConnectionManager Client is connected to ZooKeeper
    [junit4] 2> 3204199 INFO (jetty-launcher-4126-thread-2) [n:127.0.0.1:55843_solr ] o.a.s.c.c.SolrZkClient makePath: /overseer/queue
    [junit4] 2> 3204200 INFO (jetty-launcher-4126-thread-1) [n:127.0.0.1:55844_solr ] o.a.s.c.c.SolrZkClient makePath: /overseer/queue
    [junit4] 2> 3204203 INFO (jetty-launcher-4126-thread-1) [n:127.0.0.1:55844_solr ] o.a.s.c.c.SolrZkClient makePath: /overseer/collection-queue-work
    [junit4] 2> 3204203 INFO (jetty-launcher-4126-thread-2) [n:127.0.0.1:55843_solr ] o.a.s.c.c.SolrZkClient makePath: /overseer/collection-queue-work
    [junit4] 2> 3204209 INFO (jetty-launcher-4126-thread-2) [n:127.0.0.1:55843_solr ] o.a.s.c.c.SolrZkClient makePath: /overseer/collection-map-running
    [junit4] 2> 3204209 INFO (jetty-launcher-4126-thread-1) [n:127.0.0.1:55844_solr ] o.a.s.c.c.SolrZkClient makePath: /overseer/collection-map-running
    [junit4] 2> 3204212 INFO (jetty-launcher-4126-thread-1) [n:127.0.0.1:55844_solr ] o.a.s.c.c.SolrZkClient makePath: /overseer/collection-map-completed
    [junit4] 2> 3204212 INFO (jetty-launcher-4126-thread-2) [n:127.0.0.1:55843_solr ] o.a.s.c.c.SolrZkClient makePath: /overseer/collection-map-completed
    [junit4] 2> 3204216 INFO (jetty-launcher-4126-thread-1) [n:127.0.0.1:55844_solr ] o.a.s.c.c.SolrZkClient makePath: /overseer/collection-map-failure
    [junit4] 2> 3204216 INFO (jetty-launcher-4126-thread-2) [n:127.0.0.1:55843_solr ] o.a.s.c.c.SolrZkClient makePath: /overseer/collection-map-failure
    [junit4] 2> 3204218 INFO (jetty-launcher-4126-thread-2) [n:127.0.0.1:55843_solr ] o.a.s.c.c.SolrZkClient makePath: /live_nodes
    [junit4] 2> 3204219 INFO (jetty-launcher-4126-thread-1) [n:127.0.0.1:55844_solr ] o.a.s.c.c.SolrZkClient makePath: /live_nodes
    [junit4] 2> 3204220 INFO (jetty-launcher-4126-thread-1) [n:127.0.0.1:55844_solr ] o.a.s.c.c.SolrZkClient makePath: /collections
    [junit4] 2> 3204221 INFO (jetty-launcher-4126-thread-2) [n:127.0.0.1:55843_solr ] o.a.s.c.c.SolrZkClient makePath: /collections
    [junit4] 2> 3204222 INFO (jetty-launcher-4126-thread-1) [n:127.0.0.1:55844_solr ] o.a.s.c.c.SolrZkClient makePath: /aliases.json
    [junit4] 2> 3204223 INFO (jetty-launcher-4126-thread-2) [n:127.0.0.1:55843_solr ] o.a.s.c.c.SolrZkClient makePath: /aliases.json
    [junit4] 2> 3204224 INFO (jetty-launcher-4126-thread-1) [n:127.0.0.1:55844_solr ] o.a.s.c.c.SolrZkClient makePath: /clusterstate.json
    [junit4] 2> 3204225 INFO (jetty-launcher-4126-thread-2) [n:127.0.0.1:55843_solr ] o.a.s.c.c.SolrZkClient makePath: /clusterstate.json
    [junit4] 2> 3204226 INFO (jetty-launcher-4126-thread-1) [n:127.0.0.1:55844_solr ] o.a.s.c.c.SolrZkClient makePath: /security.json
    [junit4] 2> 3204227 INFO (jetty-launcher-4126-thread-2) [n:127.0.0.1:55843_solr ] o.a.s.c.c.SolrZkClient makePath: /security.json
    [junit4] 2> 3204228 INFO (jetty-launcher-4126-thread-1) [n:127.0.0.1:55844_solr ] o.a.s.c.c.ZkStateReader Updating cluster state from ZooKeeper...
    [junit4] 2> 3204229 INFO (jetty-launcher-4126-thread-2) [n:127.0.0.1:55843_solr ] o.a.s.c.c.ZkStateReader Updating cluster state from ZooKeeper...
    [junit4] 2> 3204230 INFO (jetty-launcher-4126-thread-1) [n:127.0.0.1:55844_solr ] o.a.s.c.c.ZkStateReader Loaded empty cluster properties
    [junit4] 2> 3204231 INFO (jetty-launcher-4126-thread-2) [n:127.0.0.1:55843_solr ] o.a.s.c.c.ZkStateReader Loaded empty cluster properties
    [junit4] 2> 3204231 INFO (jetty-launcher-4126-thread-1) [n:127.0.0.1:55844_solr ] o.a.s.c.c.ZkStateReader Updated live nodes from ZooKeeper... (0) -> (0)
    [junit4] 2> 3204232 INFO (jetty-launcher-4126-thread-2) [n:127.0.0.1:55843_solr ] o.a.s.c.c.ZkStateReader Updated live nodes from ZooKeeper... (0) -> (0)
    [junit4] 2> 3204235 INFO (jetty-launcher-4126-thread-1) [n:127.0.0.1:55844_solr ] o.a.s.c.c.SolrZkClient makePath: /overseer_elect
    [junit4] 2> 3204236 INFO (jetty-launcher-4126-thread-2) [n:127.0.0.1:55843_solr ] o.a.s.c.c.SolrZkClient makePath: /overseer_elect
    [junit4] 2> 3204238 INFO (jetty-launcher-4126-thread-1) [n:127.0.0.1:55844_solr ] o.a.s.c.c.SolrZkClient makePath: /overseer_elect/election
    [junit4] 2> 3204238 INFO (jetty-launcher-4126-thread-2) [n:127.0.0.1:55843_solr ] o.a.s.c.c.SolrZkClient makePath: /overseer_elect/election
    [junit4] 2> 3204240 INFO (jetty-launcher-4126-thread-2) [n:127.0.0.1:55843_solr ] o.a.s.c.Overseer Overseer (id=null) closing
    [junit4] 2> 3204240 INFO (jetty-launcher-4126-thread-1) [n:127.0.0.1:55844_solr ] o.a.s.c.Overseer Overseer (id=null) closing
    [junit4] 2> 3204240 INFO (jetty-launcher-4126-thread-2) [n:127.0.0.1:55843_solr ] o.a.s.c.LeaderElector Joined leadership election with path: /overseer_elect/election/96037172397342725-127.0.0.1:55843_solr-n_0000000000
    [junit4] 2> 3204241 INFO (jetty-launcher-4126-thread-1) [n:127.0.0.1:55844_solr ] o.a.s.c.LeaderElector Joined leadership election with path: /overseer_elect/election/96037172397342726-127.0.0.1:55844_solr-n_0000000001
    [junit4] 2> 3204241 INFO (jetty-launcher-4126-thread-2) [n:127.0.0.1:55843_solr ] o.a.s.c.OverseerElectionContext I am going to be the leader 127.0.0.1:55843_solr
    [junit4] 2> 3204242 INFO (jetty-launcher-4126-thread-2) [n:127.0.0.1:55843_solr ] o.a.s.c.c.SolrZkClient makePath: /overseer_elect/leader
    [junit4] 2> 3204243 INFO (jetty-launcher-4126-thread-1) [n:127.0.0.1:55844_solr ] o.a.s.c.LeaderElector Watching path /overseer_elect/election/96037172397342725-127.0.0.1:55843_solr-n_0000000000 to know if I could be the leader
    [junit4] 2> 3204243 INFO (jetty-launcher-4126-thread-1) [n:127.0.0.1:55844_solr ] o.a.s.c.ZkController Register node as live in ZooKeeper:/live_nodes/127.0.0.1:55844_solr
    [junit4] 2> 3204244 INFO (jetty-launcher-4126-thread-1) [n:127.0.0.1:55844_solr ] o.a.s.c.c.SolrZkClient makePath: /live_nodes/127.0.0.1:55844_solr
    [junit4] 2> 3204245 INFO (jetty-launcher-4126-thread-2) [n:127.0.0.1:55843_solr ] o.a.s.c.Overseer Overseer (id=96037172397342725-127.0.0.1:55843_solr-n_0000000000) starting
    [junit4] 2> 3204247 INFO (zkCallback-4137-thread-1-processing-n:127.0.0.1:55844_solr) [n:127.0.0.1:55844_solr ] o.a.s.c.c.ZkStateReader A live node change: [WatchedEvent state:SyncConnected type:NodeChildrenChanged path:/live_nodes], has occurred - updating... (live nodes size: [0])
    [junit4] 2> 3204247 INFO (zkCallback-4136-thread-1-processing-n:127.0.0.1:55843_solr) [n:127.0.0.1:55843_solr ] o.a.s.c.c.ZkStateReader A live node change: [WatchedEvent state:SyncConnected type:NodeChildrenChanged path:/live_nodes], has occurred - updating... (live nodes size: [0])
    [junit4] 2> 3204248 INFO (zkCallback-4136-thread-1-processing-n:127.0.0.1:55843_solr) [n:127.0.0.1:55843_solr ] o.a.s.c.c.ZkStateReader Updated live nodes from ZooKeeper... (0) -> (1)
    [junit4] 2> 3204250 INFO (zkCallback-4137-thread-1-processing-n:127.0.0.1:55844_solr) [n:127.0.0.1:55844_solr ] o.a.s.c.c.ZkStateReader Updated live nodes from ZooKeeper... (0) -> (1)
    [junit4] 2> 3204250 INFO (jetty-launcher-4126-thread-2) [n:127.0.0.1:55843_solr ] o.a.s.c.c.SolrZkClient makePath: /overseer/queue-work
    [junit4] 2> 3204259 INFO (jetty-launcher-4126-thread-1) [n:127.0.0.1:55844_solr ] o.a.s.c.CoreContainer Security conf doesn't exist. Skipping setup for authorization module.
    [junit4] 2> 3204260 INFO (jetty-launcher-4126-thread-1) [n:127.0.0.1:55844_solr ] o.a.s.c.CoreContainer No authentication plugin used.
    [junit4] 2> 3204261 INFO (jetty-launcher-4126-thread-1) [n:127.0.0.1:55844_solr ] o.a.s.c.CorePropertiesLocator Looking for core definitions underneath /Users/jenkins/workspace/Lucene-Solr-6.x-MacOSX/solr/build/solr-core/test/J1/temp/solr.schema.TestManagedSchemaAPI_C01793FB2788D995-001/tempDir-001/node1/.
    [junit4] 2> 3204262 INFO (jetty-launcher-4126-thread-1) [n:127.0.0.1:55844_solr ] o.a.s.c.CorePropertiesLocator Found 0 core definitions
    [junit4] 2> 3204262 INFO (jetty-launcher-4126-thread-2) [n:127.0.0.1:55843_solr ] o.a.s.c.OverseerAutoReplicaFailoverThread Starting OverseerAutoReplicaFailoverThread autoReplicaFailoverWorkLoopDelay=10000 autoReplicaFailoverWaitAfterExpiration=30000 autoReplicaFailoverBadNodeExpiration=60000
    [junit4] 2> 3204263 INFO (OverseerCollectionConfigSetProcessor-96037172397342725-127.0.0.1:55843_solr-n_0000000000) [n:127.0.0.1:55843_solr ] o.a.s.c.OverseerTaskProcessor Process current queue of overseer operations
    [junit4] 2> 3204263 INFO (jetty-launcher-4126-thread-1) [n:127.0.0.1:55844_solr ] o.a.s.s.SolrDispatchFilter user.dir=/Users/jenkins/workspace/Lucene-Solr-6.x-MacOSX/solr/build/solr-core/test/J1
    [junit4] 2> 3204263 INFO (jetty-launcher-4126-thread-1) [n:127.0.0.1:55844_solr ] o.a.s.s.SolrDispatchFilter SolrDispatchFilter.init() done
    [junit4] 2> 3204263 INFO (OverseerStateUpdate-96037172397342725-127.0.0.1:55843_solr-n_0000000000) [n:127.0.0.1:55843_solr ] o.a.s.c.Overseer Starting to work on the main queue
    [junit4] 2> 3204264 INFO (jetty-launcher-4126-thread-2) [n:127.0.0.1:55843_solr ] o.a.s.c.ZkController Publish node=127.0.0.1:55843_solr as DOWN
    [junit4] 2> 3204268 INFO (OverseerStateUpdate-96037172397342725-127.0.0.1:55843_solr-n_0000000000) [n:127.0.0.1:55843_solr ] o.a.s.c.c.ZkStateReader Updated live nodes from ZooKeeper... (1) -> (1)
    [junit4] 2> 3204270 INFO (OverseerStateUpdate-96037172397342725-127.0.0.1:55843_solr-n_0000000000) [n:127.0.0.1:55843_solr ] o.a.s.c.Overseer processMessage: queueSize: 1, message = {
    [junit4] 2> "operation":"downnode",
    [junit4] 2> "node_name":"127.0.0.1:55843_solr"} current state version: 0
    [junit4] 2> 3204270 INFO (OverseerStateUpdate-96037172397342725-127.0.0.1:55843_solr-n_0000000000) [n:127.0.0.1:55843_solr ] o.a.s.c.o.NodeMutator DownNode state invoked for node: 127.0.0.1:55843_solr
    [junit4] 2> 3205268 INFO (jetty-launcher-4126-thread-2) [n:127.0.0.1:55843_solr ] o.a.s.c.ZkController Register node as live in ZooKeeper:/live_nodes/127.0.0.1:55843_solr
    [junit4] 2> 3205269 INFO (jetty-launcher-4126-thread-2) [n:127.0.0.1:55843_solr ] o.a.s.c.c.SolrZkClient makePath: /live_nodes/127.0.0.1:55843_solr
    [junit4] 2> 3205271 INFO (zkCallback-4136-thread-1-processing-n:127.0.0.1:55843_solr) [n:127.0.0.1:55843_solr ] o.a.s.c.c.ZkStateReader A live node change: [WatchedEvent state:SyncConnected type:NodeChildrenChanged path:/live_nodes], has occurred - updating... (live nodes size: [1])
    [junit4] 2> 3205271 INFO (zkCallback-4137-thread-1-processing-n:127.0.0.1:55844_solr) [n:127.0.0.1:55844_solr ] o.a.s.c.c.ZkStateReader A live node change: [WatchedEvent state:SyncConnected type:NodeChildrenChanged path:/live_nodes], has occurred - updating... (live nodes size: [1])
    [junit4] 2> 3205271 INFO (zkCallback-4136-thread-1-processing-n:127.0.0.1:55843_solr) [n:127.0.0.1:55843_solr ] o.a.s.c.c.ZkStateReader Updated live nodes from ZooKeeper... (1) -> (2)
    [junit4] 2> 3205271 INFO (zkCallback-4137-thread-1-processing-n:127.0.0.1:55844_solr) [n:127.0.0.1:55844_solr ] o.a.s.c.c.ZkStateReader Updated live nodes from ZooKeeper... (1) -> (2)
    [junit4] 2> 3205281 INFO (jetty-launcher-4126-thread-2) [n:127.0.0.1:55843_solr ] o.a.s.c.CoreContainer Security conf doesn't exist. Skipping setup for authorization module.
    [junit4] 2> 3205281 INFO (jetty-launcher-4126-thread-2) [n:127.0.0.1:55843_solr ] o.a.s.c.CoreContainer No authentication plugin used.
    [junit4] 2> 3205282 INFO (jetty-launcher-4126-thread-2) [n:127.0.0.1:55843_solr ] o.a.s.c.CorePropertiesLocator Looking for core definitions underneath /Users/jenkins/workspace/Lucene-Solr-6.x-MacOSX/solr/build/solr-core/test/J1/temp/solr.schema.TestManagedSchemaAPI_C01793FB2788D995-001/tempDir-001/node2/.
    [junit4] 2> 3205282 INFO (jetty-launcher-4126-thread-2) [n:127.0.0.1:55843_solr ] o.a.s.c.CorePropertiesLocator Found 0 core definitions
    [junit4] 2> 3205283 INFO (jetty-launcher-4126-thread-2) [n:127.0.0.1:55843_solr ] o.a.s.s.SolrDispatchFilter user.dir=/Users/jenkins/workspace/Lucene-Solr-6.x-MacOSX/solr/build/solr-core/test/J1
    [junit4] 2> 3205283 INFO (jetty-launcher-4126-thread-2) [n:127.0.0.1:55843_solr ] o.a.s.s.SolrDispatchFilter SolrDispatchFilter.init() done
    [junit4] 2> 3205284 INFO (SUITE-TestManagedSchemaAPI-seed#[C01793FB2788D995]-worker) [ ] o.a.s.c.c.SolrZkClient Using default ZkCredentialsProvider
    [junit4] 2> 3205284 INFO (SUITE-TestManagedSchemaAPI-seed#[C01793FB2788D995]-worker) [ ] o.a.s.c.c.ConnectionManager Waiting for client to connect to ZooKeeper
    [junit4] 2> 3205285 INFO (zkCallback-4140-thread-1) [ ] o.a.s.c.c.ConnectionManager Watcher org.apache.solr.common.cloud.ConnectionManager@38b5f8c1 name:ZooKeeperConnection Watcher:127.0.0.1:55841 got event WatchedEvent state:SyncConnected type:None path:null path:null type:None
    [junit4] 2> 3205285 INFO (SUITE-TestManagedSchemaAPI-seed#[C01793FB2788D995]-worker) [ ] o.a.s.c.c.ConnectionManager Client is connected to ZooKeeper
    [junit4] 2> 3205286 INFO (SUITE-TestManagedSchemaAPI-seed#[C01793FB2788D995]-worker) [ ] o.a.s.c.c.SolrZkClient Using default ZkACLProvider
    [junit4] 2> 3205287 INFO (SUITE-TestManagedSchemaAPI-seed#[C01793FB2788D995]-worker) [ ] o.a.s.c.s.i.CloudSolrClient Final constructed zkHost string: 127.0.0.1:55841/solr
    [junit4] 2> 3205288 INFO (SUITE-TestManagedSchemaAPI-seed#[C01793FB2788D995]-worker) [ ] o.a.s.c.c.SolrZkClient Using default ZkCredentialsProvider
    [junit4] 2> 3205288 INFO (SUITE-TestManagedSchemaAPI-seed#[C01793FB2788D995]-worker) [ ] o.a.s.c.c.ConnectionManager Waiting for client to connect to ZooKeeper
    [junit4] 2> 3205289 INFO (zkCallback-4143-thread-1) [ ] o.a.s.c.c.ConnectionManager Watcher org.apache.solr.common.cloud.ConnectionManager@1452bb87 name:ZooKeeperConnection Watcher:127.0.0.1:55841/solr got event WatchedEvent state:SyncConnected type:None path:null path:null type:None
    [junit4] 2> 3205289 INFO (SUITE-TestManagedSchemaAPI-seed#[C01793FB2788D995]-worker) [ ] o.a.s.c.c.ConnectionManager Client is connected to ZooKeeper
    [junit4] 2> 3205290 INFO (SUITE-TestManagedSchemaAPI-seed#[C01793FB2788D995]-worker) [ ] o.a.s.c.c.SolrZkClient Using default ZkACLProvider
    [junit4] 2> 3205290 INFO (SUITE-TestManagedSchemaAPI-seed#[C01793FB2788D995]-worker) [ ] o.a.s.c.c.ZkStateReader Updating cluster state from ZooKeeper...
    [junit4] 2> 3205291 INFO (SUITE-TestManagedSchemaAPI-seed#[C01793FB2788D995]-worker) [ ] o.a.s.c.c.ZkStateReader Loaded empty cluster properties
    [junit4] 2> 3205292 INFO (SUITE-TestManagedSchemaAPI-seed#[C01793FB2788D995]-worker) [ ] o.a.s.c.c.ZkStateReader Updated live nodes from ZooKeeper... (0) -> (2)
    [junit4] 2> 3205295 INFO (SUITE-TestManagedSchemaAPI-seed#[C01793FB2788D995]-worker) [ ] o.a.s.c.c.SolrZkClient makePath: /configs/conf1/managed-schema
    [junit4] 2> 3205299 INFO (SUITE-TestManagedSchemaAPI-seed#[C01793FB2788D995]-worker) [ ] o.a.s.c.c.SolrZkClient makePath: /configs/conf1/solrconfig.xml
    [junit4] 2> 3205319 INFO (TEST-TestManagedSchemaAPI.test-seed#[C01793FB2788D995]) [ ] o.a.s.SolrTestCaseJ4 ###Starting test
    [junit4] 2> 3205322 INFO (qtp1375143936-21800) [n:127.0.0.1:55843_solr ] o.a.s.h.a.CollectionsHandler Invoked Collection Action :create with params replicationFactor=2&collection.configName=conf1&name=testschemaapi&action=CREATE&numShards=1&wt=javabin&version=2 and sendToOCPQueue=true
    [junit4] 2> 3205327 INFO (OverseerCollectionConfigSetProcessor-96037172397342725-127.0.0.1:55843_solr-n_0000000000) [n:127.0.0.1:55843_solr ] o.a.s.c.OverseerTaskProcessor Overseer Collection Message Handler: Get the message id:/overseer/collection-queue-work/qn-0000000000 message:{
    [junit4] 2> "name":"testschemaapi",
    [junit4] 2> "fromApi":"true",
    [junit4] 2> "replicationFactor":"2",
    [junit4] 2> "collection.configName":"conf1",
    [junit4] 2> "numShards":"1",
    [junit4] 2> "stateFormat":"2",
    [junit4] 2> "operation":"create"}
    [junit4] 2> 3205327 INFO (OverseerThreadFactory-10518-thread-1-processing-n:127.0.0.1:55843_solr) [n:127.0.0.1:55843_solr ] o.a.s.c.OverseerCollectionMessageHandler OverseerCollectionMessageHandler.processMessage : create , {
    [junit4] 2> "name":"testschemaapi",
    [junit4] 2> "fromApi":"true",
    [junit4] 2> "replicationFactor":"2",
    [junit4] 2> "collection.configName":"conf1",
    [junit4] 2> "numShards":"1",
    [junit4] 2> "stateFormat":"2",
    [junit4] 2> "operation":"create"}
    [junit4] 2> 3205328 INFO (OverseerThreadFactory-10518-thread-1-processing-n:127.0.0.1:55843_solr) [n:127.0.0.1:55843_solr ] o.a.s.c.OverseerCollectionMessageHandler Create collection testschemaapi
    [junit4] 2> 3205328 INFO (OverseerThreadFactory-10518-thread-1-processing-n:127.0.0.1:55843_solr) [n:127.0.0.1:55843_solr ] o.a.s.c.OverseerCollectionMessageHandler creating collections conf node /collections/testschemaapi
    [junit4] 2> 3205329 INFO (OverseerThreadFactory-10518-thread-1-processing-n:127.0.0.1:55843_solr) [n:127.0.0.1:55843_solr ] o.a.s.c.c.SolrZkClient makePath: /collections/testschemaapi
    [junit4] 2> 3205331 INFO (zkCallback-4137-thread-1-processing-n:127.0.0.1:55844_solr) [n:127.0.0.1:55844_solr ] o.a.s.c.c.ZkStateReader A collections change: [WatchedEvent state:SyncConnected type:NodeChildrenChanged path:/collections], has occurred - updating...
    [junit4] 2> 3205331 INFO (zkCallback-4143-thread-1) [ ] o.a.s.c.c.ZkStateReader A collections change: [WatchedEvent state:SyncConnected type:NodeChildrenChanged path:/collections], has occurred - updating...
    [junit4] 2> 3205331 INFO (zkCallback-4136-thread-1-processing-n:127.0.0.1:55843_solr) [n:127.0.0.1:55843_solr ] o.a.s.c.c.ZkStateReader A collections change: [WatchedEvent state:SyncConnected type:NodeChildrenChanged path:/collections], has occurred - updating...
    [junit4] 2> 3205336 INFO (OverseerStateUpdate-96037172397342725-127.0.0.1:55843_solr-n_0000000000) [n:127.0.0.1:55843_solr ] o.a.s.c.Overseer processMessage: queueSize: 1, message = {
    [junit4] 2> "name":"testschemaapi",
    [junit4] 2> "fromApi":"true",
    [junit4] 2> "replicationFactor":"2",
    [junit4] 2> "collection.configName":"conf1",
    [junit4] 2> "numShards":"1",
    [junit4] 2> "stateFormat":"2",
    [junit4] 2> "operation":"create"} current state version: 0
    [junit4] 2> 3205336 INFO (OverseerStateUpdate-96037172397342725-127.0.0.1:55843_solr-n_0000000000) [n:127.0.0.1:55843_solr ] o.a.s.c.o.ClusterStateMutator building a new cName: testschemaapi
    [junit4] 2> 3205338 INFO (OverseerStateUpdate-96037172397342725-127.0.0.1:55843_solr-n_0000000000) [n:127.0.0.1:55843_solr ] o.a.s.c.o.ZkStateWriter going to create_collection /collections/testschemaapi/state.json
    [junit4] 2> 3205436 INFO (OverseerThreadFactory-10518-thread-1-processing-n:127.0.0.1:55843_solr) [n:127.0.0.1:55843_solr ] o.a.s.c.OverseerCollectionMessageHandler Creating SolrCores for new collection testschemaapi, shardNames [shard1] , replicationFactor : 2
    [junit4] 2> 3205436 INFO (OverseerThreadFactory-10518-thread-1-processing-n:127.0.0.1:55843_solr) [n:127.0.0.1:55843_solr ] o.a.s.c.OverseerCollectionMessageHandler Creating core testschemaapi_shard1_replica2 as part of shard shard1 of collection testschemaapi on 127.0.0.1:55843_solr
    [junit4] 2> 3205437 INFO (OverseerThreadFactory-10518-thread-1-processing-n:127.0.0.1:55843_solr) [n:127.0.0.1:55843_solr ] o.a.s.c.OverseerCollectionMessageHandler Creating core testschemaapi_shard1_replica1 as part of shard shard1 of collection testschemaapi on 127.0.0.1:55844_solr
    [junit4] 2> 3205438 INFO (qtp1375143936-21801) [n:127.0.0.1:55843_solr ] o.a.s.h.a.CoreAdminOperation core create command qt=/admin/cores&collection.configName=conf1&name=testschemaapi_shard1_replica2&action=CREATE&numShards=1&collection=testschemaapi&shard=shard1&wt=javabin&version=2
    [junit4] 2> 3205440 INFO (qtp1375143936-21801) [n:127.0.0.1:55843_solr ] o.a.s.c.CoreDescriptor Created CoreDescriptor: {name=testschemaapi_shard1_replica2, collection.configName=conf1, config=solrconfig.xml, transient=false, schema=schema.xml, loadOnStartup=true, configSetProperties=configsetprops.json, collection=testschemaapi, numShards=1, dataDir=data/, shard=shard1}
    [junit4] 2> 3205440 INFO (qtp1150356700-21794) [n:127.0.0.1:55844_solr ] o.a.s.h.a.CoreAdminOperation core create command qt=/admin/cores&collection.configName=conf1&name=testschemaapi_shard1_replica1&action=CREATE&numShards=1&collection=testschemaapi&shard=shard1&wt=javabin&version=2
    [junit4] 2> 3205441 INFO (qtp1375143936-21801) [n:127.0.0.1:55843_solr c:testschemaapi s:shard1 x:testschemaapi_shard1_replica2] o.a.s.c.ZkController publishing state=down
    [junit4] 2> 3205441 INFO (qtp1150356700-21794) [n:127.0.0.1:55844_solr ] o.a.s.c.CoreDescriptor Created CoreDescriptor: {name=testschemaapi_shard1_replica1, collection.configName=conf1, config=solrconfig.xml, transient=false, schema=schema.xml, loadOnStartup=true, configSetProperties=configsetprops.json, collection=testschemaapi, numShards=1, dataDir=data/, shard=shard1}
    [junit4] 2> 3205442 INFO (qtp1150356700-21794) [n:127.0.0.1:55844_solr c:testschemaapi s:shard1 x:testschemaapi_shard1_replica1] o.a.s.c.ZkController publishing state=down
    [junit4] 2> 3205443 INFO (qtp1375143936-21801) [n:127.0.0.1:55843_solr c:testschemaapi s:shard1 x:testschemaapi_shard1_replica2] o.a.s.c.ZkController Registering watch for collection testschemaapi
    [junit4] 2> 3205444 INFO (qtp1375143936-21801) [n:127.0.0.1:55843_solr c:testschemaapi s:shard1 x:testschemaapi_shard1_replica2] o.a.s.c.c.ZkStateReader Add data for [testschemaapi] ver [0]
    [junit4] 2> 3205444 INFO (OverseerStateUpdate-96037172397342725-127.0.0.1:55843_solr-n_0000000000) [n:127.0.0.1:55843_solr ] o.a.s.c.Overseer processMessage: queueSize: 1, message = {
    [junit4] 2> "core":"testschemaapi_shard1_replica2",
    [junit4] 2> "roles":null,
    [junit4] 2> "base_url":"http://127.0.0.1:55843/solr",
    [junit4] 2> "node_name":"127.0.0.1:55843_solr",
    [junit4] 2> "numShards":"1",
    [junit4] 2> "state":"down",
    [junit4] 2> "shard":"shard1",
    [junit4] 2> "collection":"testschemaapi",
    [junit4] 2> "operation":"state"} current state version: 0
    [junit4] 2> 3205444 INFO (OverseerStateUpdate-96037172397342725-127.0.0.1:55843_solr-n_0000000000) [n:127.0.0.1:55843_solr ] o.a.s.c.o.ReplicaMutator Update state numShards=1 message={
    [junit4] 2> "core":"testschemaapi_shard1_replica2",
    [junit4] 2> "roles":null,
    [junit4] 2> "base_url":"http://127.0.0.1:55843/solr",
    [junit4] 2> "node_name":"127.0.0.1:55843_solr",
    [junit4] 2> "numShards":"1",
    [junit4] 2> "state":"down",
    [junit4] 2> "shard":"shard1",
    [junit4] 2> "collection":"testschemaapi",
    [junit4] 2> "operation":"state"}
    [junit4] 2> 3205444 INFO (qtp1375143936-21801) [n:127.0.0.1:55843_solr c:testschemaapi s:shard1 x:testschemaapi_shard1_replica2] o.a.s.c.ZkController look for our core node name
    [junit4] 2> 3205444 INFO (qtp1150356700-21794) [n:127.0.0.1:55844_solr c:testschemaapi s:shard1 x:testschemaapi_shard1_replica1] o.a.s.c.ZkController Registering watch for collection testschemaapi
    [junit4] 2> 3205445 INFO (qtp1150356700-21794) [n:127.0.0.1:55844_solr c:testschemaapi s:shard1 x:testschemaapi_shard1_replica1] o.a.s.c.c.ZkStateReader Add data for [testschemaapi] ver [0]
    [junit4] 2> 3205445 INFO (qtp1150356700-21794) [n:127.0.0.1:55844_solr c:testschemaapi s:shard1 x:testschemaapi_shard1_replica1] o.a.s.c.ZkController look for our core node name
    [junit4] 2> 3205447 INFO (OverseerStateUpdate-96037172397342725-127.0.0.1:55843_solr-n_0000000000) [n:127.0.0.1:55843_solr ] o.a.s.c.Overseer processMessage: queueSize: 1, message = {
    [junit4] 2> "core":"testschemaapi_shard1_replica1",
    [junit4] 2> "roles":null,
    [junit4] 2> "base_url":"http://127.0.0.1:55844/solr",
    [junit4] 2> "node_name":"127.0.0.1:55844_solr",
    [junit4] 2> "numShards":"1",
    [junit4] 2> "state":"down",
    [junit4] 2> "shard":"shard1",
    [junit4] 2> "collection":"testschemaapi",
    [junit4] 2> "operation":"state"} current state version: 0
    [junit4] 2> 3205448 INFO (OverseerStateUpdate-96037172397342725-127.0.0.1:55843_solr-n_0000000000) [n:127.0.0.1:55843_solr ] o.a.s.c.o.ReplicaMutator Update state numShards=1 message={
    [junit4] 2> "core":"testschemaapi_shard1_replica1",
    [junit4] 2> "roles":null,
    [junit4] 2> "base_url":"http://127.0.0.1:55844/solr",
    [junit4] 2> "node_name":"127.0.0.1:55844_solr",
    [junit4] 2> "numShards":"1",
    [junit4] 2> "state":"down",
    [junit4] 2> "shard":"shard1",
    [junit4] 2> "collection":"testschemaapi",
    [junit4] 2> "operation":"state"}
    [junit4] 2> 3205552 INFO (OverseerStateUpdate-96037172397342725-127.0.0.1:55843_solr-n_0000000000) [n:127.0.0.1:55843_solr ] o.a.s.c.o.ZkStateWriter going to update_collection /collections/testschemaapi/state.json version: 0
    [junit4] 2> 3205553 INFO (zkCallback-4136-thread-1-processing-n:127.0.0.1:55843_solr) [n:127.0.0.1:55843_solr ] o.a.s.c.c.ZkStateReader A cluster state change: [WatchedEvent state:SyncConnected type:NodeDataChanged path:/collections/testschemaapi/state.json] for collection [testschemaapi] has occurred - updating... (live nodes size: [2])
    [junit4] 2> 3205553 INFO (zkCallback-4137-thread-1-processing-n:127.0.0.1:55844_solr) [n:127.0.0.1:55844_solr ] o.a.s.c.c.ZkStateReader A cluster state change: [WatchedEvent state:SyncConnected type:NodeDataChanged path:/collections/testschemaapi/state.json] for collection [testschemaapi] has occurred - updating... (live nodes size: [2])
    [junit4] 2> 3205554 INFO (zkCallback-4137-thread-1-processing-n:127.0.0.1:55844_solr) [n:127.0.0.1:55844_solr ] o.a.s.c.c.ZkStateReader Updating data for [testschemaapi] from [0] to [1]
    [junit4] 2> 3205554 INFO (zkCallback-4136-thread-1-processing-n:127.0.0.1:55843_solr) [n:127.0.0.1:55843_solr ] o.a.s.c.c.ZkStateReader Updating data for [testschemaapi] from [0] to [1]
    [junit4] 2> 3206445 INFO (qtp1375143936-21801) [n:127.0.0.1:55843_solr c:testschemaapi s:shard1 x:testschemaapi_shard1_replica2] o.a.s.c.ZkController waiting to find shard id in clusterstate for testschemaapi_shard1_replica2
    [junit4] 2> 3206445 INFO (qtp1375143936-21801) [n:127.0.0.1:55843_solr c:testschemaapi s:shard1 x:testschemaapi_shard1_replica2] o.a.s.c.ZkController Check for collection zkNode:testschemaapi
    [junit4] 2> 3206445 INFO (qtp1375143936-21801) [n:127.0.0.1:55843_solr c:testschemaapi s:shard1 x:testschemaapi_shard1_replica2] o.a.s.c.ZkController Collection zkNode exists
    [junit4] 2> 3206445 INFO (qtp1375143936-21801) [n:127.0.0.1:55843_solr c:testschemaapi s:shard1 x:testschemaapi_shard1_replica2] o.a.s.c.c.ZkStateReader Load collection config from: [/collections/testschemaapi]
    [junit4] 2> 3206446 INFO (qtp1150356700-21794) [n:127.0.0.1:55844_solr c:testschemaapi s:shard1 x:testschemaapi_shard1_replica1] o.a.s.c.ZkController waiting to find shard id in clusterstate for testschemaapi_shard1_replica1
    [junit4] 2> 3206446 INFO (qtp1150356700-21794) [n:127.0.0.1:55844_solr c:testschemaapi s:shard1 x:testschemaapi_shard1_replica1] o.a.s.c.ZkController Check for collection zkNode:testschemaapi
    [junit4] 2> 3206446 INFO (qtp1150356700-21794) [n:127.0.0.1:55844_solr c:testschemaapi s:shard1 x:testschemaapi_shard1_replica1] o.a.s.c.ZkController Collection zkNode exists
    [junit4] 2> 3206446 INFO (qtp1150356700-21794) [n:127.0.0.1:55844_solr c:testschemaapi s:shard1 x:testschemaapi_shard1_replica1] o.a.s.c.c.ZkStateReader Load collection config from: [/collections/testschemaapi]
    [junit4] 2> 3206447 INFO (qtp1375143936-21801) [n:127.0.0.1:55843_solr c:testschemaapi s:shard1 x:testschemaapi_shard1_replica2] o.a.s.c.c.ZkStateReader path=[/collections/testschemaapi] [configName]=[conf1] specified config exists in ZooKeeper
    [junit4] 2> 3206447 INFO (qtp1375143936-21801) [n:127.0.0.1:55843_solr c:testschemaapi s:shard1 x:testschemaapi_shard1_replica2] o.a.s.c.SolrResourceLoader new SolrResourceLoader for directory: '/Users/jenkins/workspace/Lucene-Solr-6.x-MacOSX/solr/build/solr-core/test/J1/temp/solr.schema.TestManagedSchemaAPI_C01793FB2788D995-001/tempDir-001/node2/testschemaapi_shard1_replica2'
    [junit4] 2> 3206447 INFO (qtp1375143936-21801) [n:127.0.0.1:55843_solr c:testschemaapi s:shard1 x:testschemaapi_shard1_replica2] o.a.s.c.SolrResourceLoader JNDI not configured for solr (NoInitialContextEx)
    [junit4] 2> 3206447 INFO (qtp1375143936-21801) [n:127.0.0.1:55843_solr c:testschemaapi s:shard1 x:testschemaapi_shard1_replica2] o.a.s.c.SolrResourceLoader solr home defaulted to 'solr/' (could not find system property or JNDI)
    [junit4] 2> 3206447 INFO (qtp1150356700-21794) [n:127.0.0.1:55844_solr c:testschemaapi s:shard1 x:testschemaapi_shard1_replica1] o.a.s.c.c.ZkStateReader path=[/collections/testschemaapi] [configName]=[conf1] specified config exists in ZooKeeper
    [junit4] 2> 3206447 INFO (qtp1150356700-21794) [n:127.0.0.1:55844_solr c:testschemaapi s:shard1 x:testschemaapi_shard1_replica1] o.a.s.c.SolrResourceLoader new SolrResourceLoader for directory: '/Users/jenkins/workspace/Lucene-Solr-6.x-MacOSX/solr/build/solr-core/test/J1/temp/solr.schema.TestManagedSchemaAPI_C01793FB2788D995-001/tempDir-001/node1/testschemaapi_shard1_replica1'
    [junit4] 2> 3206448 INFO (qtp1150356700-21794) [n:127.0.0.1:55844_solr c:testschemaapi s:shard1 x:testschemaapi_shard1_replica1] o.a.s.c.SolrResourceLoader JNDI not configured for solr (NoInitialContextEx)
    [junit4] 2> 3206448 INFO (qtp1150356700-21794) [n:127.0.0.1:55844_solr c:testschemaapi s:shard1 x:testschemaapi_shard1_replica1] o.a.s.c.SolrResourceLoader solr home defaulted to 'solr/' (could not find system property or JNDI)
    [junit4] 2> 3206449 INFO (qtp1375143936-21801) [n:127.0.0.1:55843_solr c:testschemaapi s:shard1 x:testschemaapi_shard1_replica2] o.a.s.c.Config loaded config solrconfig.xml with version 0
    [junit4] 2> 3206450 INFO (qtp1150356700-21794) [n:127.0.0.1:55844_solr c:testschemaapi s:shard1 x:testschemaapi_shard1_replica1] o.a.s.c.Config loaded config solrconfig.xml with version 0
    [junit4] 2> 3206453 INFO (qtp1150356700-21794) [n:127.0.0.1:55844_solr c:testschemaapi s:shard1 x:testschemaapi_shard1_replica1] o.a.s.c.SolrConfig current version of requestparams : -1
    [junit4] 2> 3206453 INFO (qtp1375143936-21801) [n:127.0.0.1:55843_solr c:testschemaapi s:shard1 x:testschemaapi_shard1_replica2] o.a.s.c.SolrConfig current version of requestparams : -1
    [junit4] 2> 3206462 INFO (qtp1150356700-21794) [n:127.0.0.1:55844_solr c:testschemaapi s:shard1 x:testschemaapi_shard1_replica1] o.a.s.c.SolrConfig Using Lucene MatchVersion: 6.2.0
    [junit4] 2> 3206463 INFO (qtp1375143936-21801) [n:127.0.0.1:55843_solr c:testschemaapi s:shard1 x:testschemaapi_shard1_replica2] o.a.s.c.SolrConfig Using Lucene MatchVersion: 6.2.0
    [junit4] 2> 3206466 INFO (qtp1150356700-21794) [n:127.0.0.1:55844_solr c:testschemaapi s:shard1 x:testschemaapi_shard1_replica1] o.a.s.c.SolrConfig Loaded SolrConfig: solrconfig.xml
    [junit4] 2> 3206466 INFO (qtp1375143936-21801) [n:127.0.0.1:55843_solr c:testschemaapi s:shard1 x:testschemaapi_shard1_replica2] o.a.s.c.SolrConfig Loaded SolrConfig: solrconfig.xml
    [junit4] 2> 3206469 INFO (qtp1375143936-21801) [n:127.0.0.1:55843_solr c:testschemaapi s:shard1 x:testschemaapi_shard1_replica2] o.a.s.s.IndexSchema [testschemaapi_shard1_replica2] Schema name=minimal
    [junit4] 2> 3206469 INFO (qtp1150356700-21794) [n:127.0.0.1:55844_solr c:testschemaapi s:shard1 x:testschemaapi_shard1_replica1] o.a.s.s.IndexSchema [testschemaapi_shard1_replica1] Schema name=minimal
    [junit4] 2> 3206474 INFO (qtp1375143936-21801) [n:127.0.0.1:55843_solr c:testschemaapi s:shard1 x:testschemaapi_shard1_replica2] o.a.s.s.IndexSchema unique key field: id
    [junit4] 2> 3206474 INFO (qtp1150356700-21794) [n:127.0.0.1:55844_solr c:testschemaapi s:shard1 x:testschemaapi_shard1_replica1] o.a.s.s.IndexSchema unique key field: id
    [junit4] 2> 3206476 INFO (qtp1150356700-21794) [n:127.0.0.1:55844_solr c:testschemaapi s:shard1 x:testschemaapi_shard1_replica1] o.a.s.c.ConfigSetProperties Did not find ConfigSet properties, assuming default properties: Can't find resource 'configsetprops.json' in classpath or '/configs/conf1', cwd=/Users/jenkins/workspace/Lucene-Solr-6.x-MacOSX/solr/build/solr-core/test/J1
    [junit4] 2> 3206476 INFO (qtp1375143936-21801) [n:127.0.0.1:55843_solr c:testschemaapi s:shard1 x:testschemaapi_shard1_replica2] o.a.s.c.ConfigSetProperties Did not find ConfigSet properties, assuming default properties: Can't find resource 'configsetprops.json' in classpath or '/configs/conf1', cwd=/Users/jenkins/workspace/Lucene-Solr-6.x-MacOSX/solr/build/solr-core/test/J1
    [junit4] 2> 3206477 INFO (qtp1375143936-21801) [n:127.0.0.1:55843_solr c:testschemaapi s:shard1 x:testschemaapi_shard1_replica2] o.a.s.c.CoreContainer Creating SolrCore 'testschemaapi_shard1_replica2' using configuration from collection testschemaapi
    [junit4] 2> 3206476 INFO (qtp1150356700-21794) [n:127.0.0.1:55844_solr c:testschemaapi s:shard1 x:testschemaapi_shard1_replica1] o.a.s.c.CoreContainer Creating SolrCore 'testschemaapi_shard1_replica1' using configuration from collection testschemaapi
    [junit4] 2> 3206477 INFO (qtp1375143936-21801) [n:127.0.0.1:55843_solr c:testschemaapi s:shard1 r:core_node1 x:testschemaapi_shard1_replica2] o.a.s.c.SolrCore org.apache.solr.core.MockDirectoryFactory
    [junit4] 2> 3206477 INFO (qtp1150356700-21794) [n:127.0.0.1:55844_solr c:testschemaapi s:shard1 r:core_node2 x:testschemaapi_shard1_replica1] o.a.s.c.SolrCore org.apache.solr.core.MockDirectoryFactory
    [junit4] 2> 3206477 INFO (qtp1375143936-21801) [n:127.0.0.1:55843_solr c:testschemaapi s:shard1 r:core_node1 x:testschemaapi_shard1_replica2] o.a.s.c.SolrCore [[testschemaapi_shard1_replica2] ] Opening new SolrCore at [/Users/jenkins/workspace/Lucene-Solr-6.x-MacOSX/solr/build/solr-core/test/J1/temp/solr.schema.TestManagedSchemaAPI_C01793FB2788D995-001/tempDir-001/node2/testschemaapi_shard1_replica2], dataDir=[/Users/jenkins/workspace/Lucene-Solr-6.x-MacOSX/solr/build/solr-core/test/J1/temp/solr.schema.TestManagedSchemaAPI_C01793FB2788D995-001/tempDir-001/node2/./testschemaapi_shard1_replica2/data/]
    [junit4] 2> 3206477 INFO (qtp1375143936-21801) [n:127.0.0.1:55843_solr c:testschemaapi s:shard1 r:core_node1 x:testschemaapi_shard1_replica2] o.a.s.c.SolrCore JMX monitoring not detected for core: testschemaapi_shard1_replica2
    [junit4] 2> 3206477 INFO (qtp1150356700-21794) [n:127.0.0.1:55844_solr c:testschemaapi s:shard1 r:core_node2 x:testschemaapi_shard1_replica1] o.a.s.c.SolrCore [[testschemaapi_shard1_replica1] ] Opening new SolrCore at [/Users/jenkins/workspace/Lucene-Solr-6.x-MacOSX/solr/build/solr-core/test/J1/temp/solr.schema.TestManagedSchemaAPI_C01793FB2788D995-001/tempDir-001/node1/testschemaapi_shard1_replica1], dataDir=[/Users/jenkins/workspace/Lucene-Solr-6.x-MacOSX/solr/build/solr-core/test/J1/temp/solr.schema.TestManagedSchemaAPI_C01793FB2788D995-001/tempDir-001/node1/./testschemaapi_shard1_replica1/data/]
    [junit4] 2> 3206477 INFO (qtp1150356700-21794) [n:127.0.0.1:55844_solr c:testschemaapi s:shard1 r:core_node2 x:testschemaapi_shard1_replica1] o.a.s.c.SolrCore JMX monitoring not detected for core: testschemaapi_shard1_replica1
    [junit4] 2> 3206478 INFO (qtp1375143936-21801) [n:127.0.0.1:55843_solr c:testschemaapi s:shard1 r:core_node1 x:testschemaapi_shard1_replica2] o.a.s.c.CachingDirectoryFactory return new directory for /Users/jenkins/workspace/Lucene-Solr-6.x-MacOSX/solr/build/solr-core/test/J1/temp/solr.schema.TestManagedSchemaAPI_C01793FB2788D995-001/tempDir-001/node2/./testschemaapi_shard1_replica2/data
    [junit4] 2> 3206478 INFO (qtp1150356700-21794) [n:127.0.0.1:55844_solr c:testschemaapi s:shard1 r:core_node2 x:testschemaapi_shard1_replica1] o.a.s.c.CachingDirectoryFactory return new directory for /Users/jenkins/workspace/Lucene-Solr-6.x-MacOSX/solr/build/solr-core/test/J1/temp/solr.schema.TestManagedSchemaAPI_C01793FB2788D995-001/tempDir-001/node1/./testschemaapi_shard1_replica1/data
    [junit4] 2> 3206478 INFO (qtp1375143936-21801) [n:127.0.0.1:55843_solr c:testschemaapi s:shard1 r:core_node1 x:testschemaapi_shard1_replica2] o.a.s.c.SolrCore New index directory detected: old=null new=/Users/jenkins/workspace/Lucene-Solr-6.x-MacOSX/solr/build/solr-core/test/J1/temp/solr.schema.TestManagedSchemaAPI_C01793FB2788D995-001/tempDir-001/node2/./testschemaapi_shard1_replica2/data/index/
    [junit4] 2> 3206478 INFO (qtp1150356700-21794) [n:127.0.0.1:55844_solr c:testschemaapi s:shard1 r:core_node2 x:testschemaapi_shard1_replica1] o.a.s.c.SolrCore New index directory detected: old=null new=/Users/jenkins/workspace/Lucene-Solr-6.x-MacOSX/solr/build/solr-core/test/J1/temp/solr.schema.TestManagedSchemaAPI_C01793FB2788D995-001/tempDir-001/node1/./testschemaapi_shard1_replica1/data/index/
    [junit4] 2> 3206479 WARN (qtp1150356700-21794) [n:127.0.0.1:55844_solr c:testschemaapi s:shard1 r:core_node2 x:testschemaapi_shard1_replica1] o.a.s.c.SolrCore [testschemaapi_shard1_replica1] Solr index directory '/Users/jenkins/workspace/Lucene-Solr-6.x-MacOSX/solr/build/solr-core/test/J1/temp/solr.schema.TestManagedSchemaAPI_C01793FB2788D995-001/tempDir-001/node1/./testschemaapi_shard1_replica1/data/index' doesn't exist. Creating new index...
    [junit4] 2> 3206478 WARN (qtp1375143936-21801) [n:127.0.0.1:55843_solr c:testschemaapi s:shard1 r:core_node1 x:testschemaapi_shard1_replica2] o.a.s.c.SolrCore [testschemaapi_shard1_replica2] Solr index directory '/Users/jenkins/workspace/Lucene-Solr-6.x-MacOSX/solr/build/solr-core/test/J1/temp/solr.schema.TestManagedSchemaAPI_C01793FB2788D995-001/tempDir-001/node2/./testschemaapi_shard1_replica2/data/index' doesn't exist. Creating new index...
    [junit4] 2> 3206479 INFO (qtp1150356700-21794) [n:127.0.0.1:55844_solr c:testschemaapi s:shard1 r:core_node2 x:testschemaapi_shard1_replica1] o.a.s.c.CachingDirectoryFactory return new directory for /Users/jenkins/workspace/Lucene-Solr-6.x-MacOSX/solr/build/solr-core/test/J1/temp/solr.schema.TestManagedSchemaAPI_C01793FB2788D995-001/tempDir-001/node1/./testschemaapi_shard1_replica1/data/index
    [junit4] 2> 3206480 INFO (qtp1375143936-21801) [n:127.0.0.1:55843_solr c:testschemaapi s:shard1 r:core_node1 x:testschemaapi_shard1_replica2] o.a.s.c.CachingDirectoryFactory return new directory for /Users/jenkins/workspace/Lucene-Solr-6.x-MacOSX/solr/build/solr-core/test/J1/temp/solr.schema.TestManagedSchemaAPI_C01793FB2788D995-001/tempDir-001/node2/./testschemaapi_shard1_replica2/data/index
    [junit4] 2> 3206480 INFO (qtp1375143936-21801) [n:127.0.0.1:55843_solr c:testschemaapi s:shard1 r:core_node1 x:testschemaapi_shard1_replica2] o.a.s.c.SolrDeletionPolicy SolrDeletionPolicy.onCommit: commits: num=1
    [junit4] 2> commit{dir=MockDirectoryWrapper(RAMDirectory@24f4637 lockFactory=org.apache.lucene.store.SingleInstanceLockFactory@72f3ac57),segFN=segments_1,generation=1}
    [junit4] 2> 3206480 INFO (qtp1150356700-21794) [n:127.0.0.1:55844_solr c:testschemaapi s:shard1 r:core_node2 x:testschemaapi_shard1_replica1] o.a.s.c.SolrDeletionPolicy SolrDeletionPolicy.onCommit: commits: num=1
    [junit4] 2> commit{dir=MockDirectoryWrapper(RAMDirectory@9ea1833 lockFactory=org.apache.lucene.store.SingleInstanceLockFactory@132ca7cf),segFN=segments_1,generation=1}
    [junit4] 2> 3206480 INFO (qtp1150356700-21794) [n:127.0.0.1:55844_solr c:testschemaapi s:shard1 r:core_node2 x:testschemaapi_shard1_replica1] o.a.s.c.SolrDeletionPolicy newest commit generation = 1
    [junit4] 2> 3206480 INFO (qtp1375143936-21801) [n:127.0.0.1:55843_solr c:testschemaapi s:shard1 r:core_node1 x:testschemaapi_shard1_replica2] o.a.s.c.SolrDeletionPolicy newest commit generation = 1
    [junit4] 2> 3206481 INFO (OldIndexDirectoryCleanupThreadForCore-testschemaapi_shard1_replica1) [n:127.0.0.1:55844_solr c:testschemaapi s:shard1 r:core_node2 x:testschemaapi_shard1_replica1] o.a.s.c.SolrCore Looking for old index directories to cleanup for core testschemaapi_shard1_replica1 in /Users/jenkins/workspace/Lucene-Solr-6.x-MacOSX/solr/build/solr-core/test/J1/temp/solr.schema.TestManagedSchemaAPI_C01793FB2788D995-001/tempDir-001/node1/./testschemaapi_shard1_replica1/data/
    [junit4] 2> 3206481 WARN (OldIndexDirectoryCleanupThreadForCore-testschemaapi_shard1_replica1) [n:127.0.0.1:55844_solr c:testschemaapi s:shard1 r:core_node2 x:testschemaapi_shard1_replica1] o.a.s.c.DirectoryFactory /Users/jenkins/workspace/Lucene-Solr-6.x-MacOSX/solr/build/solr-core/test/J1/temp/solr.schema.TestManagedSchemaAPI_C01793FB2788D995-001/tempDir-001/node1/./testschemaapi_shard1_replica1/data/ does not point to a valid data directory; skipping clean-up of old index directories.
    [junit4] 2> 3206482 INFO (OldIndexDirectoryCleanupThreadForCore-testschemaapi_shard1_replica2) [n:127.0.0.1:55843_solr c:testschemaapi s:shard1 r:core_node1 x:testschemaapi_shard1_replica2] o.a.s.c.SolrCore Looking for old index directories to cleanup for core testschemaapi_shard1_replica2 in /Users/jenkins/workspace/Lucene-Solr-6.x-MacOSX/solr/build/solr-core/test/J1/temp/solr.schema.TestManagedSchemaAPI_C01793FB2788D995-001/tempDir-001/node2/./testschemaapi_shard1_replica2/data/
    [junit4] 2> 3206482 WARN (OldIndexDirectoryCleanupThreadForCore-testschemaapi_shard1_replica2) [n:127.0.0.1:55843_solr c:testschemaapi s:shard1 r:core_node1 x:testschemaapi_shard1_replica2] o.a.s.c.DirectoryFactory /Users/jenkins/workspace/Lucene-Solr-6.x-MacOSX/solr/build/solr-core/test/J1/temp/solr.schema.TestManagedSchemaAPI_C01793FB2788D995-001/tempDir-001/node2/./testschemaapi_shard1_replica2/data/ does not point to a valid data directory; skipping clean-up of old index directories.
    [junit4] 2> 3206483 INFO (qtp1150356700-21794) [n:127.0.0.1:55844_solr c:testschemaapi s:shard1 r:core_node2 x:testschemaapi_shard1_replica1] o.a.s.c.SolrCore no updateRequestProcessorChain defined as default, creating implicit default
    [junit4] 2> 3206483 INFO (qtp1375143936-21801) [n:127.0.0.1:55843_solr c:testschemaapi s:shard1 r:core_node1 x:testschemaapi_shard1_replica2] o.a.s.c.SolrCore no updateRequestProcessorChain defined as default, creating implicit default
    [junit4] 2> 3206488 INFO (qtp1150356700-21794) [n:127.0.0.1:55844_solr c:testschemaapi s:shard1 r:core_node2 x:testschemaapi_shard1_replica1] o.a.s.h.l.XMLLoader xsltCacheLifetimeSeconds=60
    [junit4] 2> 3206488 INFO (qtp1375143936-21801) [n:127.0.0.1:55843_solr c:testschemaapi s:shard1 r:core_node1 x:testschemaapi_shard1_replica2] o.a.s.h.l.XMLLoader xsltCacheLifetimeSeconds=60
    [junit4] 2> 3206489 INFO (qtp1150356700-21794) [n:127.0.0.1:55844_solr c:testschemaapi s:shard1 r:core_node2 x:testschemaapi_shard1_replica1] o.a.s.h.l.XMLLoader xsltCacheLifetimeSeconds=60
    [junit4] 2> 3206489 INFO (qtp1375143936-21801) [n:127.0.0.1:55843_solr c:testschemaapi s:shard1 r:core_node1 x:testschemaapi_shard1_replica2] o.a.s.h.l.XMLLoader xsltCacheLifetimeSeconds=60
    [junit4] 2> 3206489 INFO (qtp1150356700-21794) [n:127.0.0.1:55844_solr c:testschemaapi s:shard1 r:core_node2 x:testschemaapi_shard1_replica1] o.a.s.h.l.XMLLoader xsltCacheLifetimeSeconds=60
    [junit4] 2> 3206490 INFO (qtp1375143936-21801) [n:127.0.0.1:55843_solr c:testschemaapi s:shard1 r:core_node1 x:testschemaapi_shard1_replica2] o.a.s.h.l.XMLLoader xsltCacheLifetimeSeconds=60
    [junit4] 2> 3206490 INFO (qtp1150356700-21794) [n:127.0.0.1:55844_solr c:testschemaapi s:shard1 r:core_node2 x:testschemaapi_shard1_replica1] o.a.s.h.l.XMLLoader xsltCacheLifetimeSeconds=60
    [junit4] 2> 3206491 INFO (qtp1375143936-21801) [n:127.0.0.1:55843_solr c:testschemaapi s:shard1 r:core_node1 x:testschemaapi_shard1_replica2] o.a.s.h.l.XMLLoader xsltCacheLifetimeSeconds=60
    [junit4] 2> 3206496 INFO (qtp1150356700-21794) [n:127.0.0.1:55844_solr c:testschemaapi s:shard1 r:core_node2 x:testschemaapi_shard1_replica1] o.a.s.c.RequestHandlers Registered paths: /admin/mbeans,/update/csv,/sql,/update/json/docs,/admin/luke,/graph,/export,/select,/admin/segments,/get,/admin/system,/replication,/admin/properties,/config,/stream,/schema,/admin/plugins,/admin/logging,/update/json,/admin/ping,/admin/threads,/update,/admin/file
    [junit4] 2> 3206496 INFO (qtp1150356700-21794) [n:127.0.0.1:55844_solr c:testschemaapi s:shard1 r:core_node2 x:testschemaapi_shard1_replica1] o.a.s.c.SolrCore Using default statsCache cache: org.apache.solr.search.stats.LocalStatsCache
    [junit4] 2> 3206497 INFO (qtp1150356700-21794) [n:127.0.0.1:55844_solr c:testschemaapi s:shard1 r:core_node2 x:testschemaapi_shard1_replica1] o.a.s.u.UpdateHandler Using UpdateLog implementation: org.apache.solr.update.UpdateLog
    [junit4] 2> 3206497 INFO (qtp1150356700-21794) [n:127.0.0.1:55844_solr c:testschemaapi s:shard1 r:core_node2 x:testschemaapi_shard1_replica1] o.a.s.u.UpdateLog Initializing UpdateLog: dataDir=null defaultSyncLevel=FLUSH numRecordsToKeep=100 maxNumLogsToKeep=10 numVersionBuckets=65536
    [junit4] 2> 3206497 INFO (qtp1375143936-21801) [n:127.0.0.1:55843_solr c:testschemaapi s:shard1 r:core_node1 x:testschemaapi_shard1_replica2] o.a.s.c.RequestHandlers Registered paths: /admin/mbeans,/update/csv,/sql,/update/json/docs,/admin/luke,/graph,/export,/select,/admin/segments,/get,/admin/system,/replication,/admin/properties,/config,/stream,/schema,/admin/plugins,/admin/logging,/update/json,/admin/ping,/admin/threads,/update,/admin/file
    [junit4] 2> 3206498 INFO (qtp1375143936-21801) [n:127.0.0.1:55843_solr c:testschemaapi s:shard1 r:core_node1 x:testschemaapi_shard1_replica2] o.a.s.c.SolrCore Using default statsCache cache: org.apache.solr.search.stats.LocalStatsCache
    [junit4] 2> 3206499 INFO (qtp1375143936-21801) [n:127.0.0.1:55843_solr c:testschemaapi s:shard1 r:core_node1 x:testschemaapi_shard1_replica2] o.a.s.u.UpdateHandler Using UpdateLog implementation: org.apache.solr.update.UpdateLog
    [junit4] 2> 3206499 INFO (qtp1375143936-21801) [n:127.0.0.1:55843_solr c:testschemaapi s:shard1 r:core_node1 x:testschemaapi_shard1_replica2] o.a.s.u.UpdateLog Initializing UpdateLog: dataDir=null defaultSyncLevel=FLUSH numRecordsToKeep=100 maxNumLogsToKeep=10 numVersionBuckets=65536
    [junit4] 2> 3206500 INFO (qtp1150356700-21794) [n:127.0.0.1:55844_solr c:testschemaapi s:shard1 r:core_node2 x:testschemaapi_shard1_replica1] o.a.s.u.CommitTracker Hard AutoCommit: disabled
    [junit4] 2> 3206500 INFO (qtp1150356700-21794) [n:127.0.0.1:55844_solr c:testschemaapi s:shard1 r:core_node2 x:testschemaapi_shard1_replica1] o.a.s.u.CommitTracker Soft AutoCommit: disabled
    [junit4] 2> 3206500 INFO (qtp1150356700-21794) [n:127.0.0.1:55844_solr c:testschemaapi s:shard1 r:core_node2 x:testschemaapi_shard1_replica1] o.a.s.c.SolrDeletionPolicy SolrDeletionPolicy.onInit: commits: num=1
    [junit4] 2> commit{dir=MockDirectoryWrapper(RAMDirectory@9ea1833 lockFactory=org.apache.lucene.store.SingleInstanceLockFactory@132ca7cf),segFN=segments_1,generation=1}
    [junit4] 2> 3206500 INFO (qtp1150356700-21794) [n:127.0.0.1:55844_solr c:testschemaapi s:shard1 r:core_node2 x:testschemaapi_shard1_replica1] o.a.s.c.SolrDeletionPolicy newest commit generation = 1
    [junit4] 2> 3206500 INFO (qtp1150356700-21794) [n:127.0.0.1:55844_solr c:testschemaapi s:shard1 r:core_node2 x:testschemaapi_shard1_replica1] o.a.s.s.SolrIndexSearcher Opening [Searcher@4628fc23[testschemaapi_shard1_replica1] main]
    [junit4] 2> 3206501 INFO (qtp1150356700-21794) [n:127.0.0.1:55844_solr c:testschemaapi s:shard1 r:core_node2 x:testschemaapi_shard1_replica1] o.a.s.c.c.ZkStateReader Load collection config from: [/collections/testschemaapi]
    [junit4] 2> 3206501 INFO (qtp1375143936-21801) [n:127.0.0.1:55843_solr c:testschemaapi s:shard1 r:core_node1 x:testschemaapi_shard1_replica2] o.a.s.u.CommitTracker Hard AutoCommit: disabled
    [junit4] 2> 3206501 INFO (qtp1375143936-21801) [n:127.0.0.1:55843_solr c:testschemaapi s:shard1 r:core_node1 x:testschemaapi_shard1_replica2] o.a.s.u.CommitTracker Soft AutoCommit: disabled
    [junit4] 2> 3206501 INFO (qtp1375143936-21801) [n:127.0.0.1:55843_solr c:testschemaapi s:shard1 r:core_node1 x:testschemaapi_shard1_replica2] o.a.s.c.SolrDeletionPolicy SolrDeletionPolicy.onInit: commits: num=1
    [junit4] 2> commit{dir=MockDirectoryWrapper(RAMDirectory@24f4637 lockFactory=org.apache.lucene.store.SingleInstanceLockFactory@72f3ac57),segFN=segments_1,generation=1}
    [junit4] 2> 3206501 INFO (qtp1375143936-21801) [n:127.0.0.1:55843_solr c:testschemaapi s:shard1 r:core_node1 x:testschemaapi_shard1_replica2] o.a.s.c.SolrDeletionPolicy newest commit generation = 1
    [junit4] 2> 3206501 INFO (qtp1375143936-21801) [n:127.0.0.1:55843_solr c:testschemaapi s:shard1 r:core_node1 x:testschemaapi_shard1_replica2] o.a.s.s.SolrIndexSearcher Opening [Searcher@bb4fccf[testschemaapi_shard1_replica2] main]
    [junit4] 2> 3206501 INFO (qtp1375143936-21801) [n:127.0.0.1:55843_solr c:testschemaapi s:shard1 r:core_node1 x:testschemaapi_shard1_replica2] o.a.s.c.c.ZkStateReader Load collection config from: [/collections/testschemaapi]
    [junit4] 2> 3206501 INFO (qtp1150356700-21794) [n:127.0.0.1:55844_solr c:testschemaapi s:shard1 r:core_node2 x:testschemaapi_shard1_replica1] o.a.s.c.c.ZkStateReader path=[/collections/testschemaapi] [configName]=[conf1] specified config exists in ZooKeeper
    [junit4] 2> 3206502 INFO (qtp1150356700-21794) [n:127.0.0.1:55844_solr c:testschemaapi s:shard1 r:core_node2 x:testschemaapi_shard1_replica1] o.a.s.r.ManagedResourceStorage Setting up ZooKeeper-based storage for the RestManager with znodeBase: /configs/conf1
    [junit4] 2> 3206502 INFO (qtp1150356700-21794) [n:127.0.0.1:55844_solr c:testschemaapi s:shard1 r:core_node2 x:testschemaapi_shard1_replica1] o.a.s.r.ManagedResourceStorage Configured ZooKeeperStorageIO with znodeBase: /configs/conf1
    [junit4] 2> 3206502 INFO (qtp1150356700-21794) [n:127.0.0.1:55844_solr c:testschemaapi s:shard1 r:core_node2 x:testschemaapi_shard1_replica1] o.a.s.r.RestManager Initializing RestManager with initArgs: {}
    [junit4] 2> 3206502 INFO (qtp1150356700-21794) [n:127.0.0.1:55844_solr c:testschemaapi s:shard1 r:core_node2 x:testschemaapi_shard1_replica1] o.a.s.r.ManagedResourceStorage Reading _rest_managed.json using ZooKeeperStorageIO:path=/configs/conf1
    [junit4] 2> 3206503 INFO (qtp1375143936-21801) [n:127.0.0.1:55843_solr c:testschemaapi s:shard1 r:core_node1 x:testschemaapi_shard1_replica2] o.a.s.c.c.ZkStateReader path=[/collections/testschemaapi] [configName]=[conf1] specified config exists in ZooKeeper
    [junit4] 2> 3206503 INFO (qtp1375143936-21801) [n:127.0.0.1:55843_solr c:testschemaapi s:shard1 r:core_node1 x:testschemaapi_shard1_replica2] o.a.s.r.ManagedResourceStorage Setting up ZooKeeper-based storage for the RestManager with znodeBase: /configs/conf1
    [junit4] 2> 3206503 INFO (qtp1150356700-21794) [n:127.0.0.1:55844_solr c:testschemaapi s:shard1 r:core_node2 x:testschemaapi_shard1_replica1] o.a.s.r.ManagedResourceStorage No data found for znode /configs/conf1/_rest_managed.json
    [junit4] 2> 3206503 INFO (qtp1150356700-21794) [n:127.0.0.1:55844_solr c:testschemaapi s:shard1 r:core_node2 x:testschemaapi_shard1_replica1] o.a.s.r.ManagedResourceStorage Loaded null at path _rest_managed.json using ZooKeeperStorageIO:path=/configs/conf1
    [junit4] 2> 3206503 INFO (qtp1150356700-21794) [n:127.0.0.1:55844_solr c:testschemaapi s:shard1 r:core_node2 x:testschemaapi_shard1_replica1] o.a.s.r.RestManager Initializing 0 registered ManagedResources
    [junit4] 2> 3206503 INFO (qtp1150356700-21794) [n:127.0.0.1:55844_solr c:testschemaapi s:shard1 r:core_node2 x:testschemaapi_shard1_replica1] o.a.s.s.ZkIndexSchemaReader Creating ZooKeeper watch for the managed schema at /configs/conf1/managed-schema
    [junit4] 2> 3206503 INFO (qtp1375143936-21801) [n:127.0.0.1:55843_solr c:testschemaapi s:shard1 r:core_node1 x:testschemaapi_shard1_replica2] o.a.s.r.ManagedResourceStorage Configured ZooKeeperStorageIO with znodeBase: /configs/conf1
    [junit4] 2> 3206503 INFO (qtp1375143936-21801) [n:127.0.0.1:55843_solr c:testschemaapi s:shard1 r:core_node1 x:testschemaapi_shard1_replica2] o.a.s.r.RestManager Initializing RestManager with initArgs: {}
    [junit4] 2> 3206503 INFO (qtp1375143936-21801) [n:127.0.0.1:55843_solr c:testschemaapi s:shard1 r:core_node1 x:testschemaapi_shard1_replica2] o.a.s.r.ManagedResourceStorage Reading _rest_managed.json using ZooKeeperStorageIO:path=/configs/conf1
    [junit4] 2> 3206504 INFO (qtp1150356700-21794) [n:127.0.0.1:55844_solr c:testschemaapi s:shard1 r:core_node2 x:testschemaapi_shard1_replica1] o.a.s.c.ZkController Added new OnReconnect listener ZkIndexSchemaReader: /configs/conf1/managed-schema, uniqueCoreId: testschemaapi_shard1_replica1:2869092102120405
    [junit4] 2> 3206504 INFO (qtp1150356700-21794) [n:127.0.0.1:55844_solr c:testschemaapi s:shard1 r:core_node2 x:testschemaapi_shard1_replica1] o.a.s.h.ReplicationHandler Commits will be reserved for 10000
    [junit4] 2> 3206504 INFO (qtp1150356700-21794) [n:127.0.0.1:55844_solr c:testschemaapi s:shard1 r:core_node2 x:testschemaapi_shard1_replica1] o.a.s.u.UpdateLog Looking up max value of version field to seed version buckets
    [junit4] 2> 3206504 INFO (searcherExecutor-10522-thread-1-processing-n:127.0.0.1:55844_solr x:testschemaapi_shard1_replica1 s:shard1 c:testschemaapi r:core_node2) [n:127.0.0.1:55844_solr c:testschemaapi s:shard1 r:core_node2 x:testschemaapi_shard1_replica1] o.a.s.c.SolrCore [testschemaapi_shard1_replica1] Registered new searcher Searcher@4628fc23[testschemaapi_shard1_replica1] main{ExitableDirectoryReader(UninvertingDirectoryReader())}
    [junit4] 2> 3206504 INFO (qtp1150356700-21794) [n:127.0.0.1:55844_solr c:testschemaapi s:shard1 r:core_node2 x:testschemaapi_shard1_replica1] o.a.s.u.VersionInfo Refreshing highest value of _version_ for 65536 version buckets from index
    [junit4] 2> 3206504 INFO (qtp1150356700-21794) [n:127.0.0.1:55844_solr c:testschemaapi s:shard1 r:core_node2 x:testschemaapi_shard1_replica1] o.a.s.u.VersionInfo No terms found for _version_, cannot seed version bucket highest value from index
    [junit4] 2> 3206504 INFO (qtp1375143936-21801) [n:127.0.0.1:55843_solr c:testschemaapi s:shard1 r:core_node1 x:testschemaapi_shard1_replica2] o.a.s.r.ManagedResourceStorage No data found for znode /configs/conf1/_rest_managed.json
    [junit4] 2> 3206504 INFO (qtp1150356700-21794) [n:127.0.0.1:55844_solr c:testschemaapi s:shard1 r:core_node2 x:testschemaapi_shard1_replica1] o.a.s.u.UpdateLog Could not find max version in index or recent updates, using new clock 1536594760932786176
    [junit4] 2> 3206504 INFO (qtp1375143936-21801) [n:127.0.0.1:55843_solr c:testschemaapi s:shard1 r:core_node1 x:testschemaapi_shard1_replica2] o.a.s.r.ManagedResourceStorage Loaded null at path _rest_managed.json using ZooKeeperStorageIO:path=/configs/conf1
    [junit4] 2> 3206505 INFO (qtp1375143936-21801) [n:127.0.0.1:55843_solr c:testschemaapi s:shard1 r:core_node1 x:testschemaapi_shard1_replica2] o.a.s.r.RestManager Initializing 0 registered ManagedResources
    [junit4] 2> 3206505 INFO (qtp1375143936-21801) [n:127.0.0.1:55843_solr c:testschemaapi s:shard1 r:core_node1 x:testschemaapi_shard1_replica2] o.a.s.s.ZkIndexSchemaReader Creating ZooKeeper watch for the managed schema at /configs/conf1/managed-schema
    [junit4] 2> 3206505 INFO (qtp1375143936-21801) [n:127.0.0.1:55843_solr c:testschemaapi s:shard1 r:core_node1 x:testschemaapi_shard1_replica2] o.a.s.c.ZkController Added new OnReconnect listener ZkIndexSchemaReader: /configs/conf1/managed-schema, uniqueCoreId: testschemaapi_shard1_replica2:2869092102049474
    [junit4] 2> 3206505 INFO (qtp1375143936-21801) [n:127.0.0.1:55843_solr c:testschemaapi s:shard1 r:core_node1 x:testschemaapi_shard1_replica2] o.a.s.h.ReplicationHandler Commits will be reserved for 10000
    [junit4] 2> 3206505 INFO (qtp1375143936-21801) [n:127.0.0.1:55843_solr c:testschemaapi s:shard1 r:core_node1 x:testschemaapi_shard1_replica2] o.a.s.u.UpdateLog Looking up max value of version field to seed version buckets
    [junit4] 2> 3206506 INFO (searcherExecutor-10521-thread-1-processing-n:127.0.0.1:55843_solr x:testschemaapi_shard1_replica2 s:shard1 c:testschemaapi r:core_node1) [n:127.0.0.1:55843_solr c:testschemaapi s:shard1 r:core_node1 x:testschemaapi_shard1_replica2] o.a.s.c.SolrCore [testschemaapi_shard1_replica2] Registered new searcher Searcher@bb4fccf[testschemaapi_shard1_replica2] main{ExitableDirectoryReader(UninvertingDirectoryReader())}
    [junit4] 2> 3206506 INFO (qtp1375143936-21801) [n:127.0.0.1:55843_solr c:testschemaapi s:shard1 r:core_node1 x:testschemaapi_shard1_replica2] o.a.s.u.VersionInfo Refreshing highest value of _version_ for 65536 version buckets from index
    [junit4] 2> 3206506 INFO (qtp1375143936-21801) [n:127.0.0.1:55843_solr c:testschemaapi s:shard1 r:core_node1 x:testschemaapi_shard1_replica2] o.a.s.u.VersionInfo No terms found for _version_, cannot seed version bucket highest value from index
    [junit4] 2> 3206506 INFO (qtp1375143936-21801) [n:127.0.0.1:55843_solr c:testschemaapi s:shard1 r:core_node1 x:testschemaapi_shard1_replica2] o.a.s.u.UpdateLog Could not find max version in index or recent updates, using new clock 1536594760934883328
    [junit4] 2> 3206506 INFO (qtp1150356700-21794) [n:127.0.0.1:55844_solr c:testschemaapi s:shard1 r:core_node2 x:testschemaapi_shard1_replica1] o.a.s.u.UpdateLog Took 2.0ms to seed version buckets with highest version 1536594760932786176
    [junit4] 2> 3206508 INFO (qtp1150356700-21794) [n:127.0.0.1:55844_solr c:testschemaapi s:shard1 r:core_node2 x:testschemaapi_shard1_replica1] o.a.s.c.ZkController watch zkdir /configs/conf1
    [junit4] 2> 3206508 INFO (qtp1150356700-21794) [n:127.0.0.1:55844_solr c:testschemaapi s:shard1 r:core_node2 x:testschemaapi_shard1_replica1] o.a.s.c.CoreContainer registering core: testschemaapi_shard1_replica1
    [junit4] 2> 3206509 INFO (qtp1150356700-21794) [n:127.0.0.1:55844_solr c:testschemaapi s:shard1 r:core_node2 x:testschemaapi_shard1_replica1] o.a.s.c.ZkController Register replica - core:testschemaapi_shard1_replica1 address:http://127.0.0.1:55844/solr collection:testschemaapi shard:shard1
    [junit4] 2> 3206509 INFO (qtp1375143936-21801) [n:127.0.0.1:55843_solr c:testschemaapi s:shard1 r:core_node1 x:testschemaapi_shard1_replica2] o.a.s.u.UpdateLog Took 3.0ms to seed version buckets with highest version 1536594760934883328
    [junit4] 2> 3206509 INFO (qtp1375143936-21801) [n:127.0.0.1:55843_solr c:testschemaapi s:shard1 r:core_node1 x:testschemaapi_shard1_replica2] o.a.s.c.ZkController watch zkdir /configs/conf1
    [junit4] 2> 3206510 INFO (qtp1375143936-21801) [n:127.0.0.1:55843_solr c:testschemaapi s:shard1 r:core_node1 x:testschemaapi_shard1_replica2] o.a.s.c.CoreContainer registering core: testschemaapi_shard1_replica2
    [junit4] 2> 3206510 INFO (qtp1375143936-21801) [n:127.0.0.1:55843_solr c:testschemaapi s:shard1 r:core_node1 x:testschemaapi_shard1_replica2] o.a.s.c.ZkController Register replica - core:testschemaapi_shard1_replica2 address:http://127.0.0.1:55843/solr collection:testschemaapi shard:shard1
    [junit4] 2> 3206510 INFO (qtp1150356700-21794) [n:127.0.0.1:55844_solr c:testschemaapi s:shard1 r:core_node2 x:testschemaapi_shard1_replica1] o.a.s.c.c.SolrZkClient makePath: /collections/testschemaapi/leader_elect/shard1/election
    [junit4] 2> 3206511 INFO (qtp1375143936-21801) [n:127.0.0.1:55843_solr c:testschemaapi s:shard1 r:core_node1 x:testschemaapi_shard1_replica2] o.a.s.c.c.SolrZkClient makePath: /collections/testschemaapi/leader_elect/shard1/election
    [junit4] 2> 3206515 INFO (qtp1375143936-21801) [n:127.0.0.1:55843_solr c:testschemaapi s:shard1 r:core_node1 x:testschemaapi_shard1_replica2] o.a.s.c.LeaderElector Joined leadership election with path: /collections/testschemaapi/leader_elect/shard1/election/96037172397342725-core_node1-n_0000000000
    [junit4] 2> 3206516 INFO (qtp1150356700-21794) [n:127.0.0.1:55844_solr c:testschemaapi s:shard1 r:core_node2 x:testschemaapi_shard1_replica1] o.a.s.c.LeaderElector Joined leadership election with path: /collections/testschemaapi/leader_elect/shard1/election/96037172397342726-core_node2-n_0000000001
    [junit4] 2> 3206516 INFO (qtp1375143936-21801) [n:127.0.0.1:55843_solr c:testschemaapi s:shard1 r:core_node1 x:testschemaapi_shard1_replica2] o.a.s.c.ShardLeaderElectionContext Running the leader process for shard=shard1 and weAreReplacement=false and leaderVoteWait=10000
    [junit4] 2> 3206517 INFO (qtp1150356700-21794) [n:127.0.0.1:55844_solr c:testschemaapi s:shard1 r:core_node2 x:testschemaapi_shard1_replica1] o.a.s.c.LeaderElector Watching path /collections/testschemaapi/leader_elect/shard1/election/96037172397342725-core_node1-n_0000000000 to know if I could be the leader
    [junit4] 2> 3206519 INFO (qtp1375143936-21801) [n:127.0.0.1:55843_solr c:testschemaapi s:shard1 r:core_node1 x:testschemaapi_shard1_replica2] o.a.s.c.ShardLeaderElectionContext Enough replicas found to continue.
    [junit4] 2> 3206519 INFO (qtp1375143936-21801) [n:127.0.0.1:55843_solr c:testschemaapi s:shard1 r:core_node1 x:testschemaapi_shard1_replica2] o.a.s.c.ShardLeaderElectionContext I may be the new leader - try and sync
    [junit4] 2> 3206519 INFO (qtp1375143936-21801) [n:127.0.0.1:55843_solr c:testschemaapi s:shard1 r:core_node1 x:testschemaapi_shard1_replica2] o.a.s.c.SyncStrategy Sync replicas to http://127.0.0.1:55843/solr/testschemaapi_shard1_replica2/
    [junit4] 2> 3206519 INFO (qtp1375143936-21801) [n:127.0.0.1:55843_solr c:testschemaapi s:shard1 r:core_node1 x:testschemaapi_shard1_replica2] o.a.s.u.PeerSync PeerSync: core=testschemaapi_shard1_replica2 url=http://127.0.0.1:55843/solr START replicas=[http://127.0.0.1:55844/solr/testschemaapi_shard1_replica1/] nUpdates=100
    [junit4] 2> 3206519 INFO (qtp1375143936-21801) [n:127.0.0.1:55843_solr c:testschemaapi s:shard1 r:core_node1 x:testschemaapi_shard1_replica2] o.a.s.u.PeerSync PeerSync: core=testschemaapi_shard1_replica2 url=http://127.0.0.1:55843/solr DONE. We have no versions. sync failed.
    [junit4] 2> 3206519 INFO (qtp1375143936-21801) [n:127.0.0.1:55843_solr c:testschemaapi s:shard1 r:core_node1 x:testschemaapi_shard1_replica2] o.a.s.c.SyncStrategy Leader's attempt to sync with shard failed, moving to the next candidate
    [junit4] 2> 3206519 INFO (OverseerStateUpdate-96037172397342725-127.0.0.1:55843_solr-n_0000000000) [n:127.0.0.1:55843_solr ] o.a.s.c.Overseer processMessage: queueSize: 1, message = {
    [junit4] 2> "operation":"leader",
    [junit4] 2> "shard":"shard1",
    [junit4] 2> "collection":"testschemaapi"} current state version: 0
    [junit4] 2> 3206519 INFO (qtp1375143936-21801) [n:127.0.0.1:55843_solr c:testschemaapi s:shard1 r:core_node1 x:testschemaapi_shard1_replica2] o.a.s.c.ShardLeaderElectionContext We failed sync, but we have no versions - we can't sync in that case - we were active before, so become leader anyway
    [junit4] 2> 3206521 INFO (qtp1150356700-21795) [n:127.0.0.1:55844_solr c:testschemaapi s:shard1 r:core_node2 x:testschemaapi_shard1_replica1] o.a.s.c.S.Request [testschemaapi_shard1_replica1] webapp=/solr path=/get params={distrib=false&qt=/get&fingerprint=false&getVersions=100&wt=javabin&version=2} status=0 QTime=0
    [junit4] 2> 3206522 INFO (qtp1375143936-21801) [n:127.0.0.1:55843_solr c:testschemaapi s:shard1 r:core_node1 x:testschemaapi_shard1_replica2] o.a.s.c.c.SolrZkClient makePath: /collections/testschemaapi/leaders/shard1
    [junit4] 2> 3206525 INFO (qtp1375143936-21801) [n:127.0.0.1:55843_solr c:testschemaapi s:shard1 r:core_node1 x:testschemaapi_shard1_replica2] o.a.s.c.ShardLeaderElectionContextBase Creating leader registration node /collections/testschemaapi/leaders/shard1/leader after winning as /collections/testschemaapi/leader_elect/shard1/election/96037172397342725-core_node1-n_0000000000
    [junit4] 2> 3206528 INFO (qtp1375143936-21801) [n:127.0.0.1:55843_solr c:testschemaapi s:shard1 r:core_node1 x:testschemaapi_shard1_replica2] o.a.s.c.ShardLeaderElectionContext I am the new leader: http://127.0.0.1:55843/solr/testschemaapi_shard1_replica2/ shard1
    [junit4] 2> 3206529 INFO (OverseerStateUpdate-96037172397342725-127.0.0.1:55843_solr-n_0000000000) [n:127.0.0.1:55843_solr ] o.a.s.c.Overseer processMessage: queueSize: 1, message = {
    [junit4] 2> "operation":"leader",
    [junit4] 2> "shard":"shard1",
    [junit4] 2> "collection":"testschemaapi",
    [junit4] 2> "base_url":"http://127.0.0.1:55843/solr",
    [junit4] 2> "core":"testschemaapi_shard1_replica2",
    [junit4] 2> "state":"active"} current state version: 0
    [junit4] 2> 3206640 INFO (OverseerStateUpdate-96037172397342725-127.0.0.1:55843_solr-n_0000000000) [n:127.0.0.1:55843_solr ] o.a.s.c.o.ZkStateWriter going to update_collection /collections/testschemaapi/state.json version: 1
    [junit4] 2> 3206642 INFO (zkCallback-4137-thread-1-processing-n:127.0.0.1:55844_solr) [n:127.0.0.1:55844_solr ] o.a.s.c.c.ZkStateReader A cluster state change: [WatchedEvent state:SyncConnected type:NodeDataChanged path:/collections/testschemaapi/state.json] for collection [testschemaapi] has occurred - updating... (live nodes size: [2])
    [junit4] 2> 3206642 INFO (zkCallback-4136-thread-1-processing-n:127.0.0.1:55843_solr) [n:127.0.0.1:55843_solr ] o.a.s.c.c.ZkStateReader A cluster state change: [WatchedEvent state:SyncConnected type:NodeDataChanged path:/collections/testschemaapi/state.json] for collection [testschemaapi] has occurred - updating... (live nodes size: [2])
    [junit4] 2> 3206643 INFO (zkCallback-4137-thread-1-processing-n:127.0.0.1:55844_solr) [n:127.0.0.1:55844_solr ] o.a.s.c.c.ZkStateReader Updating data for [testschemaapi] from [1] to [2]
    [junit4] 2> 3206643 INFO (zkCallback-4136-thread-1-processing-n:127.0.0.1:55843_solr) [n:127.0.0.1:55843_solr ] o.a.s.c.c.ZkStateReader Updating data for [testschemaapi] from [1] to [2]
    [junit4] 2> 3206690 INFO (qtp1375143936-21801) [n:127.0.0.1:55843_solr c:testschemaapi s:shard1 r:core_node1 x:testschemaapi_shard1_replica2] o.a.s.c.ZkController We are http://127.0.0.1:55843/solr/testschemaapi_shard1_replica2/ and leader is http://127.0.0.1:55843/solr/testschemaapi_shard1_replica2/
    [junit4] 2> 3206690 INFO (qtp1375143936-21801) [n:127.0.0.1:55843_solr c:testschemaapi s:shard1 r:core_node1 x:testschemaapi_shard1_replica2] o.a.s.c.ZkController No LogReplay needed for core=testschemaapi_shard1_replica2 baseURL=http://127.0.0.1:55843/solr
    [junit4] 2> 3206690 INFO (qtp1375143936-21801) [n:127.0.0.1:55843_solr c:testschemaapi s:shard1 r:core_node1 x:testschemaapi_shard1_replica2] o.a.s.c.ZkController I am the leader, no recovery necessary
    [junit4] 2> 3206690 INFO (qtp1375143936-21801) [n:127.0.0.1:55843_solr c:testschemaapi s:shard1 r:core_node1 x:testschemaapi_shard1_replica2] o.a.s.c.ZkController publishing state=active
    [junit4] 2> 3206694 INFO (OverseerStateUpdate-96037172397342725-127.0.0.1:55843_solr-n_0000000000) [n:127.0.0.1:55843_solr ] o.a.s.c.Overseer processMessage: queueSize: 1, message = {
    [junit4] 2> "core":"testschemaapi_shard1_replica2",
    [junit4] 2> "core_node_name":"core_node1",
    [junit4] 2> "roles":null,
    [junit4] 2> "base_url":"http://127.0.0.1:55843/solr",
    [junit4] 2> "node_name":"127.0.0.1:55843_solr",
    [junit4] 2> "numShards":"1",
    [junit4] 2> "state":"active",
    [junit4] 2> "shard":"shard1",
    [junit4] 2> "collection":"testschemaapi",
    [junit4] 2> "operation":"state"} current state version: 0
    [junit4] 2> 3206694 INFO (OverseerStateUpdate-96037172397342725-127.0.0.1:55843_solr-n_0000000000) [n:127.0.0.1:55843_solr ] o.a.s.c.o.ReplicaMutator Update state numShards=1 message={
    [junit4] 2> "core":"testschemaapi_shard

[...truncated too long message...]

solr.cloud.LeaderElector.access$200(LeaderElector.java:56)
    [junit4] 2> at org.apache.solr.cloud.LeaderElector$ElectionWatcher.process(LeaderElector.java:348)
    [junit4] 2> at org.apache.solr.common.cloud.SolrZkClient$3.lambda$process$0(SolrZkClient.java:266)
    [junit4] 2> at java.util.concurrent.Executors$RunnableAdapter.call(Executors.java:511)
    [junit4] 2> at java.util.concurrent.FutureTask.run(FutureTask.java:266)
    [junit4] 2> at org.apache.solr.common.util.ExecutorUtil$MDCAwareThreadPoolExecutor.lambda$execute$0(ExecutorUtil.java:229)
    [junit4] 2> at java.util.concurrent.ThreadPoolExecutor.runWorker(ThreadPoolExecutor.java:1142)
    [junit4] 2> at java.util.concurrent.ThreadPoolExecutor$Worker.run(ThreadPoolExecutor.java:617)
    [junit4] 2> at java.lang.Thread.run(Thread.java:745)
    [junit4] 2> 3215907 INFO (jetty-launcher-4126-thread-2) [ ] o.e.j.s.h.ContextHandler Stopped o.e.j.s.ServletContextHandler@fc78c06{/solr,null,UNAVAILABLE}
    [junit4] 2> 3217410 WARN (zkCallback-4136-thread-3-processing-n:127.0.0.1:55843_solr) [n:127.0.0.1:55843_solr ] o.a.s.c.c.ZkStateReader ZooKeeper watch triggered, but Solr cannot talk to ZK: [KeeperErrorCode = Session expired for /live_nodes]
    [junit4] 2> 3217410 INFO (jetty-launcher-4126-thread-1) [ ] o.e.j.s.h.ContextHandler Stopped o.e.j.s.ServletContextHandler@46d7c3c8{/solr,null,UNAVAILABLE}
    [junit4] 2> 3217412 INFO (SUITE-TestManagedSchemaAPI-seed#[C01793FB2788D995]-worker) [ ] o.a.s.c.ZkTestServer connecting to 127.0.0.1:55841 55841
    [junit4] 2> 3217432 INFO (Thread-7298) [ ] o.a.s.c.ZkTestServer connecting to 127.0.0.1:55841 55841
    [junit4] 2> 3218738 WARN (Thread-7298) [ ] o.a.s.c.ZkTestServer Watch limit violations:
    [junit4] 2> Maximum concurrent create/delete watches above limit:
    [junit4] 2>
    [junit4] 2> 6 /solr/configs/conf1/managed-schema
    [junit4] 2> 6 /solr/configs/conf1
    [junit4] 2> 3 /solr/aliases.json
    [junit4] 2> 3 /solr/clusterprops.json
    [junit4] 2> 2 /solr/security.json
    [junit4] 2>
    [junit4] 2> Maximum concurrent data watches above limit:
    [junit4] 2>
    [junit4] 2> 3 /solr/clusterstate.json
    [junit4] 2> 2 /solr/collections/testschemaapi/state.json
    [junit4] 2>
    [junit4] 2> Maximum concurrent children watches above limit:
    [junit4] 2>
    [junit4] 2> 3 /solr/live_nodes
    [junit4] 2> 3 /solr/collections
    [junit4] 2>
    [junit4] 2> 3218739 INFO (SUITE-TestManagedSchemaAPI-seed#[C01793FB2788D995]-worker) [ ] o.a.s.SolrTestCaseJ4 ###deleteCore
    [junit4] 2> NOTE: leaving temporary files on disk at: /Users/jenkins/workspace/Lucene-Solr-6.x-MacOSX/solr/build/solr-core/test/J1/temp/solr.schema.TestManagedSchemaAPI_C01793FB2788D995-001
    [junit4] 2> NOTE: test params are: codec=Asserting(Lucene60): {_version_=PostingsFormat(name=LuceneVarGapFixedInterval), id=PostingsFormat(name=LuceneVarGapDocFreqInterval), myNewField=Lucene50(blocksize=128)}, docValues:{}, maxPointsInLeafNode=555, maxMBSortInHeap=6.212169517743856, sim=ClassicSimilarity, locale=ko-KR, timezone=Australia/Hobart
    [junit4] 2> NOTE: Mac OS X 10.11.4 x86_64/Oracle Corporation 1.8.0_72 (64-bit)/cpus=3,threads=1,free=213839552,total=527958016
    [junit4] 2> NOTE: All tests run in this JVM: [CloudMLTQParserTest, UniqFieldsUpdateProcessorFactoryTest, ExitableDirectoryReaderTest, SolrIndexSplitterTest, SolrCmdDistributorTest, TestOmitPositions, TestCollationField, ExplicitHLLTest, DateMathParserTest, TestRequestForwarding, DistributedFacetPivotSmallAdvancedTest, DirectSolrConnectionTest, SecurityConfHandlerTest, CachingDirectoryFactoryTest, TestTrieFacet, IgnoreCommitOptimizeUpdateProcessorFactoryTest, TestSolrConfigHandler, TestReRankQParserPlugin, TestJsonFacets, IndexSchemaRuntimeFieldTest, TestRealTimeGet, DistributedIntervalFacetingTest, DistributedQueryComponentOptimizationTest, TestSha256AuthenticationProvider, TestDistributedMissingSort, BlockJoinFacetRandomTest, TestRTGBase, TestRestoreCore, QueryResultKeyTest, TestExactSharedStatsCache, TestMiniSolrCloudCluster, LeaderInitiatedRecoveryOnShardRestartTest, HdfsNNFailoverTest, SearchHandlerTest, TestGraphTermsQParserPlugin, ShardSplitTest, HdfsSyncSliceTest, SpellCheckComponentTest, TestFastWriter, TestQueryUtils, TestSSLRandomization, TestSchemaManager, TestFuzzyAnalyzedSuggestions, TestUninvertingReader, TestSolrQueryResponse, TestIndexingPerformance, TestConfigSetsAPI, HighlighterConfigTest, CloneFieldUpdateProcessorFactoryTest, FullSolrCloudDistribCmdsTest, TestSolr4Spatial, SuggesterTSTTest, SSLMigrationTest, TestBlendedInfixSuggestions, ForceLeaderTest, TestSolrQueryParserDefaultOperatorResource, TermVectorComponentTest, TestStandardQParsers, DebugComponentTest, TestLRUStatsCache, ConvertedLegacyTest, TestSolrQueryParser, TestTrie, TestQueryTypes, TermVectorComponentDistributedTest, TestTestInjection, TestLMJelinekMercerSimilarityFactory, CoreAdminHandlerTest, TestUseDocValuesAsStored2, TestConfigSetImmutable, BlockCacheTest, TestBinaryResponseWriter, TestFiltering, TestRecovery, ZkNodePropsTest, SuggestComponentContextFilterQueryTest, RAMDirectoryFactoryTest, BaseCdcrDistributedZkTest, TestBlobHandler, HdfsChaosMonkeySafeLeaderTest, SparseHLLTest, LeaderElectionIntegrationTest, NotRequiredUniqueKeyTest, CopyFieldTest, TestFreeTextSuggestions, SynonymTokenizerTest, TestDefaultSearchFieldResource, SolrPluginUtilsTest, TestRangeQuery, TestRebalanceLeaders, CacheHeaderTest, EchoParamsTest, TestReload, ZkStateWriterTest, NumericFieldsTest, ShardRoutingCustomTest, TestQuerySenderListener, NoCacheHeaderTest, CSVRequestHandlerTest, TestSolrConfigHandlerCloud, DistanceFunctionTest, RequestHandlersTest, TestDefaultStatsCache, SuggesterTest, TestInitQParser, DistributedFacetPivotLargeTest, HLLSerializationTest, BasicFunctionalityTest, ChaosMonkeySafeLeaderTest, CollectionReloadTest, TestJoin, TestConfigSets, TestManagedSynonymFilterFactory, TestCSVResponseWriter, BasicZkTest, TestSubQueryTransformerCrossCore, BasicDistributedZk2Test, TestIndexSearcher, HdfsLockFactoryTest, TestPerFieldSimilarityWithDefaultOverride, OpenExchangeRatesOrgProviderTest, BigEndianAscendingWordSerializerTest, HdfsWriteToMultipleCollectionsTest, DeleteReplicaTest, TestChildDocTransformer, TestAtomicUpdateErrorCases, TestFieldCacheWithThreads, TestDistribDocBasedVersion, BinaryUpdateRequestHandlerTest, DistanceUnitsTest, TestComplexPhraseQParserPlugin, CreateCollectionCleanupTest, TestZkChroot, TestWriterPerf, StatsComponentTest, AutoCommitTest, SuggesterWFSTTest, RemoteQueryErrorTest, TestCloudPivotFacet, HdfsRecoveryZkTest, DistributedFacetPivotWhiteBoxTest, OutputWriterTest, TestGeoJSONResponseWriter, AnalyticsQueryTest, TestCharFilters, TestSolrCoreProperties, CollectionsAPIDistributedZkTest, TestReloadDeadlock, AnalysisErrorHandlingTest, DistributedMLTComponentTest, OpenCloseCoreStressTest, OverseerTest, TestRandomFaceting, LeaderElectionTest, TestRandomDVFaceting, ZkCLITest, ZkControllerTest, TestCoreContainer, QueryElevationComponentTest, BadIndexSchemaTest, TestSort, DirectUpdateHandlerTest, TestBadConfig, HighlighterTest, SoftAutoCommitTest, TestCoreDiscovery, SignatureUpdateProcessorFactoryTest, DocValuesTest, IndexBasedSpellCheckerTest, LukeRequestHandlerTest, TestReversedWildcardFilterFactory, XmlUpdateRequestHandlerTest, PathHierarchyTokenizerFactoryTest, FieldAnalysisRequestHandlerTest, RegexBoostProcessorTest, ReturnFieldsTest, QueryParsingTest, TestPartialUpdateDeduplication, AlternateDirectoryTest, ResponseLogComponentTest, TestStressRecovery, TestTolerantSearch, ConnectionReuseTest, AsyncCallRequestStatusResponseTest, AsyncMigrateRouteKeyTest, CollectionStateFormat2Test, CollectionsAPIAsyncDistributedZkTest, CollectionsAPISolrJTest, DeleteInactiveReplicaTest, DeleteLastCustomShardedReplicaTest, DeleteShardTest, DistribJoinFromCollectionTest, LeaderFailoverAfterPartitionTest, MultiThreadedOCPTest, OutOfBoxZkACLAndCredentialsProvidersTest, OverseerRolesTest, ReplicationFactorTest, RestartWhileUpdatingTest, RollingRestartTest, TestAuthenticationFramework, TestLockTree, TestMiniSolrCloudClusterSSL, TestRandomRequestDistribution, TestRequestStatusCollectionAPI, TestStressCloudBlindAtomicUpdates, TestTolerantUpdateProcessorCloud, RuleEngineTest, BlobRepositoryCloudTest, TestInfoStreamLogging, TestNRTOpen, TestSolrXml, TestReplicationHandlerBackup, TestSolrConfigHandlerConcurrent, DistributedFacetPivotSmallTest, FacetPivotSmallTest, TestDistributedStatsComponentCardinality, TestCloudManagedSchema, TestCollationFieldDocValues, TestManagedSchema, TestManagedSchemaAPI]
    [junit4] Completed [554/613 (1!)] on J1 in 14.71s, 1 test, 1 error <<< FAILURES!

[...truncated 209 lines...]
BUILD FAILED
/Users/jenkins/workspace/Lucene-Solr-6.x-MacOSX/build.xml:740: The following error occurred while executing this line:
/Users/jenkins/workspace/Lucene-Solr-6.x-MacOSX/build.xml:684: The following error occurred while executing this line:
/Users/jenkins/workspace/Lucene-Solr-6.x-MacOSX/build.xml:59: The following error occurred while executing this line:
/Users/jenkins/workspace/Lucene-Solr-6.x-MacOSX/solr/build.xml:233: The following error occurred while executing this line:
/Users/jenkins/workspace/Lucene-Solr-6.x-MacOSX/solr/common-build.xml:531: The following error occurred while executing this line:
/Users/jenkins/workspace/Lucene-Solr-6.x-MacOSX/lucene/common-build.xml:1427: The following error occurred while executing this line:
/Users/jenkins/workspace/Lucene-Solr-6.x-MacOSX/lucene/common-build.xml:984: There were test failures: 613 suites (10 ignored), 2567 tests, 1 error, 121 ignored (71 assumptions) [seed: C01793FB2788D995]

Total time: 79 minutes 20 seconds
Build step 'Invoke Ant' marked build as failure
Archiving artifacts
[WARNINGS] Skipping publisher since build result is FAILURE
Recording test results
Email was triggered for: Failure - Any
Sending email for trigger: Failure - Any

Search Discussions

Related Discussions

Discussion Navigation
viewthread | post
Discussion Overview
groupdev @
categorieslucene
postedJun 8, '16 at 6:39p
activeJun 8, '16 at 6:39p
posts1
users1
websitelucene.apache.org

1 user in discussion

Policeman Jenkins Server: 1 post

People

Translate

site design / logo © 2018 Grokbase