Grokbase Groups Lucene dev June 2016
FAQ
Build: http://jenkins.thetaphi.de/job/Lucene-Solr-6.x-Solaris/180/
Java: 64bit/jdk1.8.0 -XX:-UseCompressedOops -XX:+UseSerialGC

24 tests failed.
FAILED: org.apache.solr.cloud.OverseerStatusTest.test

Error Message:
No registered leader was found after waiting for 10000ms , collection: collection1 slice: shard1

Stack Trace:
org.apache.solr.common.SolrException: No registered leader was found after waiting for 10000ms , collection: collection1 slice: shard1
  at __randomizedtesting.SeedInfo.seed([AAFF994773ADCAE8:22ABA69DDD51A710]:0)
  at org.apache.solr.common.cloud.ZkStateReader.getLeaderRetry(ZkStateReader.java:718)
  at org.apache.solr.cloud.AbstractFullDistribZkTestBase.createJettys(AbstractFullDistribZkTestBase.java:427)
  at org.apache.solr.cloud.AbstractFullDistribZkTestBase.createServers(AbstractFullDistribZkTestBase.java:332)
  at org.apache.solr.BaseDistributedSearchTestCase$ShardsRepeatRule$ShardsFixedStatement.callStatement(BaseDistributedSearchTestCase.java:990)
  at org.apache.solr.BaseDistributedSearchTestCase$ShardsRepeatRule$ShardsStatement.evaluate(BaseDistributedSearchTestCase.java:967)
  at com.carrotsearch.randomizedtesting.rules.SystemPropertiesRestoreRule$1.evaluate(SystemPropertiesRestoreRule.java:57)
  at org.apache.lucene.util.TestRuleSetupTeardownChained$1.evaluate(TestRuleSetupTeardownChained.java:49)
  at org.apache.lucene.util.AbstractBeforeAfterRule$1.evaluate(AbstractBeforeAfterRule.java:45)
  at org.apache.lucene.util.TestRuleThreadAndTestName$1.evaluate(TestRuleThreadAndTestName.java:48)
  at org.apache.lucene.util.TestRuleIgnoreAfterMaxFailures$1.evaluate(TestRuleIgnoreAfterMaxFailures.java:64)
  at org.apache.lucene.util.TestRuleMarkFailure$1.evaluate(TestRuleMarkFailure.java:47)
  at com.carrotsearch.randomizedtesting.rules.StatementAdapter.evaluate(StatementAdapter.java:36)
  at com.carrotsearch.randomizedtesting.ThreadLeakControl$StatementRunner.run(ThreadLeakControl.java:367)
  at com.carrotsearch.randomizedtesting.ThreadLeakControl.forkTimeoutingTask(ThreadLeakControl.java:809)
  at com.carrotsearch.randomizedtesting.ThreadLeakControl$3.evaluate(ThreadLeakControl.java:460)
  at com.carrotsearch.randomizedtesting.RandomizedRunner.runSingleTest(RandomizedRunner.java:880)
  at com.carrotsearch.randomizedtesting.RandomizedRunner$5.evaluate(RandomizedRunner.java:781)
  at com.carrotsearch.randomizedtesting.RandomizedRunner$6.evaluate(RandomizedRunner.java:816)
  at com.carrotsearch.randomizedtesting.RandomizedRunner$7.evaluate(RandomizedRunner.java:827)
  at com.carrotsearch.randomizedtesting.rules.StatementAdapter.evaluate(StatementAdapter.java:36)
  at com.carrotsearch.randomizedtesting.rules.SystemPropertiesRestoreRule$1.evaluate(SystemPropertiesRestoreRule.java:57)
  at org.apache.lucene.util.AbstractBeforeAfterRule$1.evaluate(AbstractBeforeAfterRule.java:45)
  at com.carrotsearch.randomizedtesting.rules.StatementAdapter.evaluate(StatementAdapter.java:36)
  at org.apache.lucene.util.TestRuleStoreClassName$1.evaluate(TestRuleStoreClassName.java:41)
  at com.carrotsearch.randomizedtesting.rules.NoShadowingOrOverridesOnMethodsRule$1.evaluate(NoShadowingOrOverridesOnMethodsRule.java:40)
  at com.carrotsearch.randomizedtesting.rules.NoShadowingOrOverridesOnMethodsRule$1.evaluate(NoShadowingOrOverridesOnMethodsRule.java:40)
  at com.carrotsearch.randomizedtesting.rules.StatementAdapter.evaluate(StatementAdapter.java:36)
  at com.carrotsearch.randomizedtesting.rules.StatementAdapter.evaluate(StatementAdapter.java:36)
  at com.carrotsearch.randomizedtesting.rules.StatementAdapter.evaluate(StatementAdapter.java:36)
  at org.apache.lucene.util.TestRuleAssertionsRequired$1.evaluate(TestRuleAssertionsRequired.java:53)
  at org.apache.lucene.util.TestRuleMarkFailure$1.evaluate(TestRuleMarkFailure.java:47)
  at org.apache.lucene.util.TestRuleIgnoreAfterMaxFailures$1.evaluate(TestRuleIgnoreAfterMaxFailures.java:64)
  at org.apache.lucene.util.TestRuleIgnoreTestSuites$1.evaluate(TestRuleIgnoreTestSuites.java:54)
  at com.carrotsearch.randomizedtesting.rules.StatementAdapter.evaluate(StatementAdapter.java:36)
  at com.carrotsearch.randomizedtesting.ThreadLeakControl$StatementRunner.run(ThreadLeakControl.java:367)
  at java.lang.Thread.run(Thread.java:745)


FAILED: org.apache.solr.cloud.BasicDistributedZk2Test.test

Error Message:
Error from server at http://127.0.0.1:61802: Error CREATEing SolrCore 'onenodecollectioncore': Unable to create core [onenodecollectioncore] Caused by: Timed out getting coreNodeName for onenodecollectioncore

Stack Trace:
java.lang.AssertionError: Error from server at http://127.0.0.1:61802: Error CREATEing SolrCore 'onenodecollectioncore': Unable to create core [onenodecollectioncore] Caused by: Timed out getting coreNodeName for onenodecollectioncore
  at __randomizedtesting.SeedInfo.seed([AAFF994773ADCAE8:22ABA69DDD51A710]:0)
  at org.junit.Assert.fail(Assert.java:93)
  at org.apache.solr.cloud.BasicDistributedZk2Test.testNodeWithoutCollectionForwarding(BasicDistributedZk2Test.java:162)
  at org.apache.solr.cloud.BasicDistributedZk2Test.test(BasicDistributedZk2Test.java:71)
  at sun.reflect.NativeMethodAccessorImpl.invoke0(Native Method)
  at sun.reflect.NativeMethodAccessorImpl.invoke(NativeMethodAccessorImpl.java:62)
  at sun.reflect.DelegatingMethodAccessorImpl.invoke(DelegatingMethodAccessorImpl.java:43)
  at java.lang.reflect.Method.invoke(Method.java:498)
  at com.carrotsearch.randomizedtesting.RandomizedRunner.invoke(RandomizedRunner.java:1764)
  at com.carrotsearch.randomizedtesting.RandomizedRunner$8.evaluate(RandomizedRunner.java:871)
  at com.carrotsearch.randomizedtesting.RandomizedRunner$9.evaluate(RandomizedRunner.java:907)
  at com.carrotsearch.randomizedtesting.RandomizedRunner$10.evaluate(RandomizedRunner.java:921)
  at org.apache.solr.BaseDistributedSearchTestCase$ShardsRepeatRule$ShardsFixedStatement.callStatement(BaseDistributedSearchTestCase.java:992)
  at org.apache.solr.BaseDistributedSearchTestCase$ShardsRepeatRule$ShardsStatement.evaluate(BaseDistributedSearchTestCase.java:967)
  at com.carrotsearch.randomizedtesting.rules.SystemPropertiesRestoreRule$1.evaluate(SystemPropertiesRestoreRule.java:57)
  at org.apache.lucene.util.TestRuleSetupTeardownChained$1.evaluate(TestRuleSetupTeardownChained.java:49)
  at org.apache.lucene.util.AbstractBeforeAfterRule$1.evaluate(AbstractBeforeAfterRule.java:45)
  at org.apache.lucene.util.TestRuleThreadAndTestName$1.evaluate(TestRuleThreadAndTestName.java:48)
  at org.apache.lucene.util.TestRuleIgnoreAfterMaxFailures$1.evaluate(TestRuleIgnoreAfterMaxFailures.java:64)
  at org.apache.lucene.util.TestRuleMarkFailure$1.evaluate(TestRuleMarkFailure.java:47)
  at com.carrotsearch.randomizedtesting.rules.StatementAdapter.evaluate(StatementAdapter.java:36)
  at com.carrotsearch.randomizedtesting.ThreadLeakControl$StatementRunner.run(ThreadLeakControl.java:367)
  at com.carrotsearch.randomizedtesting.ThreadLeakControl.forkTimeoutingTask(ThreadLeakControl.java:809)
  at com.carrotsearch.randomizedtesting.ThreadLeakControl$3.evaluate(ThreadLeakControl.java:460)
  at com.carrotsearch.randomizedtesting.RandomizedRunner.runSingleTest(RandomizedRunner.java:880)
  at com.carrotsearch.randomizedtesting.RandomizedRunner$5.evaluate(RandomizedRunner.java:781)
  at com.carrotsearch.randomizedtesting.RandomizedRunner$6.evaluate(RandomizedRunner.java:816)
  at com.carrotsearch.randomizedtesting.RandomizedRunner$7.evaluate(RandomizedRunner.java:827)
  at com.carrotsearch.randomizedtesting.rules.StatementAdapter.evaluate(StatementAdapter.java:36)
  at com.carrotsearch.randomizedtesting.rules.SystemPropertiesRestoreRule$1.evaluate(SystemPropertiesRestoreRule.java:57)
  at org.apache.lucene.util.AbstractBeforeAfterRule$1.evaluate(AbstractBeforeAfterRule.java:45)
  at com.carrotsearch.randomizedtesting.rules.StatementAdapter.evaluate(StatementAdapter.java:36)
  at org.apache.lucene.util.TestRuleStoreClassName$1.evaluate(TestRuleStoreClassName.java:41)
  at com.carrotsearch.randomizedtesting.rules.NoShadowingOrOverridesOnMethodsRule$1.evaluate(NoShadowingOrOverridesOnMethodsRule.java:40)
  at com.carrotsearch.randomizedtesting.rules.NoShadowingOrOverridesOnMethodsRule$1.evaluate(NoShadowingOrOverridesOnMethodsRule.java:40)
  at com.carrotsearch.randomizedtesting.rules.StatementAdapter.evaluate(StatementAdapter.java:36)
  at com.carrotsearch.randomizedtesting.rules.StatementAdapter.evaluate(StatementAdapter.java:36)
  at com.carrotsearch.randomizedtesting.rules.StatementAdapter.evaluate(StatementAdapter.java:36)
  at org.apache.lucene.util.TestRuleAssertionsRequired$1.evaluate(TestRuleAssertionsRequired.java:53)
  at org.apache.lucene.util.TestRuleMarkFailure$1.evaluate(TestRuleMarkFailure.java:47)
  at org.apache.lucene.util.TestRuleIgnoreAfterMaxFailures$1.evaluate(TestRuleIgnoreAfterMaxFailures.java:64)
  at org.apache.lucene.util.TestRuleIgnoreTestSuites$1.evaluate(TestRuleIgnoreTestSuites.java:54)
  at com.carrotsearch.randomizedtesting.rules.StatementAdapter.evaluate(StatementAdapter.java:36)
  at com.carrotsearch.randomizedtesting.ThreadLeakControl$StatementRunner.run(ThreadLeakControl.java:367)
  at java.lang.Thread.run(Thread.java:745)


FAILED: org.apache.solr.cloud.BasicDistributedZkTest.test

Error Message:
Error from server at http://127.0.0.1:37377/collection1: Expected mime type application/octet-stream but got text/html. <html> <head> <meta http-equiv="Content-Type" content="text/html;charset=ISO-8859-1"/> <title>Error 500 </title> </head> <body> <h2>HTTP ERROR: 500</h2> <p>Problem accessing /collection1/update. Reason: <pre> {metadata={error-class=org.apache.solr.common.SolrException,root-error-class=org.apache.solr.common.SolrException},msg=SolrCore &apos;collection1&apos; is not available due to init failure: Timed out getting coreNodeName for collection1,trace=org.apache.solr.common.SolrException: SolrCore &apos;collection1&apos; is not available due to init failure: Timed out getting coreNodeName for collection1 at org.apache.solr.core.CoreContainer.getCore(CoreContainer.java:1080) at org.apache.solr.servlet.HttpSolrCall.init(HttpSolrCall.java:256) at org.apache.solr.servlet.HttpSolrCall.call(HttpSolrCall.java:418) at org.apache.solr.servlet.SolrDispatchFilter.doFilter(SolrDispatchFilter.java:257) at org.apache.solr.servlet.SolrDispatchFilter.doFilter(SolrDispatchFilter.java:208) at org.eclipse.jetty.servlet.ServletHandler$CachedChain.doFilter(ServletHandler.java:1676) at org.apache.solr.client.solrj.embedded.JettySolrRunner$DebugFilter.doFilter(JettySolrRunner.java:109) at org.eclipse.jetty.servlet.ServletHandler$CachedChain.doFilter(ServletHandler.java:1676) at org.eclipse.jetty.servlet.ServletHandler.doHandle(ServletHandler.java:581) at org.eclipse.jetty.server.session.SessionHandler.doHandle(SessionHandler.java:224) at org.eclipse.jetty.server.handler.ContextHandler.doHandle(ContextHandler.java:1160) at org.eclipse.jetty.servlet.ServletHandler.doScope(ServletHandler.java:511) at org.eclipse.jetty.server.session.SessionHandler.doScope(SessionHandler.java:185) at org.eclipse.jetty.server.handler.ContextHandler.doScope(ContextHandler.java:1092) at org.eclipse.jetty.server.handler.ScopedHandler.handle(ScopedHandler.java:141) at org.eclipse.jetty.server.handler.gzip.GzipHandler.handle(GzipHandler.java:399) at org.eclipse.jetty.server.handler.HandlerWrapper.handle(HandlerWrapper.java:134) at org.eclipse.jetty.server.Server.handle(Server.java:518) at org.eclipse.jetty.server.HttpChannel.handle(HttpChannel.java:308) at org.eclipse.jetty.server.HttpConnection.onFillable(HttpConnection.java:244) at org.eclipse.jetty.io.AbstractConnection$ReadCallback.succeeded(AbstractConnection.java:273) at org.eclipse.jetty.io.FillInterest.fillable(FillInterest.java:95) at org.eclipse.jetty.io.SelectChannelEndPoint$2.run(SelectChannelEndPoint.java:93) at org.eclipse.jetty.util.thread.strategy.ExecuteProduceConsume.produceAndRun(ExecuteProduceConsume.java:246) at org.eclipse.jetty.util.thread.strategy.ExecuteProduceConsume.run(ExecuteProduceConsume.java:156) at org.eclipse.jetty.util.thread.QueuedThreadPool.runJob(QueuedThreadPool.java:654) at org.eclipse.jetty.util.thread.QueuedThreadPool$3.run(QueuedThreadPool.java:572) at java.lang.Thread.run(Thread.java:745) Caused by: org.apache.solr.common.SolrException: Timed out getting coreNodeName for collection1 at org.apache.solr.cloud.ZkController.waitForCoreNodeName(ZkController.java:1387) at org.apache.solr.cloud.ZkController.doGetShardIdAndNodeNameProcess(ZkController.java:1365) at org.apache.solr.cloud.ZkController.preRegister(ZkController.java:1456) at org.apache.solr.core.CoreContainer.create(CoreContainer.java:809) at org.apache.solr.core.CoreContainer.lambda$load$0(CoreContainer.java:468) at java.util.concurrent.FutureTask.run(FutureTask.java:266) at org.apache.solr.common.util.ExecutorUtil$MDCAwareThreadPoolExecutor.lambda$execute$0(ExecutorUtil.java:229) at java.util.concurrent.ThreadPoolExecutor.runWorker(ThreadPoolExecutor.java:1142) at java.util.concurrent.ThreadPoolExecutor$Worker.run(ThreadPoolExecutor.java:617) ... 1 more ,code=500}</pre></p> <hr /><a href="http://eclipse.org/jetty">Powered by Jetty:// 9.3.8.v20160314</a><hr/> </body> </html>

Stack Trace:
org.apache.solr.client.solrj.impl.HttpSolrClient$RemoteSolrException: Error from server at http://127.0.0.1:37377/collection1: Expected mime type application/octet-stream but got text/html. <html>
<head>
<meta http-equiv="Content-Type" content="text/html;charset=ISO-8859-1"/>
<title>Error 500 </title>
</head>
<body>
<h2>HTTP ERROR: 500</h2>
<p>Problem accessing /collection1/update. Reason:
<pre> {metadata={error-class=org.apache.solr.common.SolrException,root-error-class=org.apache.solr.common.SolrException},msg=SolrCore &apos;collection1&apos; is not available due to init failure: Timed out getting coreNodeName for collection1,trace=org.apache.solr.common.SolrException: SolrCore &apos;collection1&apos; is not available due to init failure: Timed out getting coreNodeName for collection1
  at org.apache.solr.core.CoreContainer.getCore(CoreContainer.java:1080)
  at org.apache.solr.servlet.HttpSolrCall.init(HttpSolrCall.java:256)
  at org.apache.solr.servlet.HttpSolrCall.call(HttpSolrCall.java:418)
  at org.apache.solr.servlet.SolrDispatchFilter.doFilter(SolrDispatchFilter.java:257)
  at org.apache.solr.servlet.SolrDispatchFilter.doFilter(SolrDispatchFilter.java:208)
  at org.eclipse.jetty.servlet.ServletHandler$CachedChain.doFilter(ServletHandler.java:1676)
  at org.apache.solr.client.solrj.embedded.JettySolrRunner$DebugFilter.doFilter(JettySolrRunner.java:109)
  at org.eclipse.jetty.servlet.ServletHandler$CachedChain.doFilter(ServletHandler.java:1676)
  at org.eclipse.jetty.servlet.ServletHandler.doHandle(ServletHandler.java:581)
  at org.eclipse.jetty.server.session.SessionHandler.doHandle(SessionHandler.java:224)
  at org.eclipse.jetty.server.handler.ContextHandler.doHandle(ContextHandler.java:1160)
  at org.eclipse.jetty.servlet.ServletHandler.doScope(ServletHandler.java:511)
  at org.eclipse.jetty.server.session.SessionHandler.doScope(SessionHandler.java:185)
  at org.eclipse.jetty.server.handler.ContextHandler.doScope(ContextHandler.java:1092)
  at org.eclipse.jetty.server.handler.ScopedHandler.handle(ScopedHandler.java:141)
  at org.eclipse.jetty.server.handler.gzip.GzipHandler.handle(GzipHandler.java:399)
  at org.eclipse.jetty.server.handler.HandlerWrapper.handle(HandlerWrapper.java:134)
  at org.eclipse.jetty.server.Server.handle(Server.java:518)
  at org.eclipse.jetty.server.HttpChannel.handle(HttpChannel.java:308)
  at org.eclipse.jetty.server.HttpConnection.onFillable(HttpConnection.java:244)
  at org.eclipse.jetty.io.AbstractConnection$ReadCallback.succeeded(AbstractConnection.java:273)
  at org.eclipse.jetty.io.FillInterest.fillable(FillInterest.java:95)
  at org.eclipse.jetty.io.SelectChannelEndPoint$2.run(SelectChannelEndPoint.java:93)
  at org.eclipse.jetty.util.thread.strategy.ExecuteProduceConsume.produceAndRun(ExecuteProduceConsume.java:246)
  at org.eclipse.jetty.util.thread.strategy.ExecuteProduceConsume.run(ExecuteProduceConsume.java:156)
  at org.eclipse.jetty.util.thread.QueuedThreadPool.runJob(QueuedThreadPool.java:654)
  at org.eclipse.jetty.util.thread.QueuedThreadPool$3.run(QueuedThreadPool.java:572)
  at java.lang.Thread.run(Thread.java:745)
Caused by: org.apache.solr.common.SolrException: Timed out getting coreNodeName for collection1
  at org.apache.solr.cloud.ZkController.waitForCoreNodeName(ZkController.java:1387)
  at org.apache.solr.cloud.ZkController.doGetShardIdAndNodeNameProcess(ZkController.java:1365)
  at org.apache.solr.cloud.ZkController.preRegister(ZkController.java:1456)
  at org.apache.solr.core.CoreContainer.create(CoreContainer.java:809)
  at org.apache.solr.core.CoreContainer.lambda$load$0(CoreContainer.java:468)
  at java.util.concurrent.FutureTask.run(FutureTask.java:266)
  at org.apache.solr.common.util.ExecutorUtil$MDCAwareThreadPoolExecutor.lambda$execute$0(ExecutorUtil.java:229)
  at java.util.concurrent.ThreadPoolExecutor.runWorker(ThreadPoolExecutor.java:1142)
  at java.util.concurrent.ThreadPoolExecutor$Worker.run(ThreadPoolExecutor.java:617)
  ... 1 more
,code=500}</pre></p>
<hr /><a href="http://eclipse.org/jetty">Powered by Jetty:// 9.3.8.v20160314</a><hr/>
</body>
[AAFF994773ADCAE8:22ABA69DDD51A710]:0)
  at org.apache.solr.client.solrj.impl.HttpSolrClient.executeMethod(HttpSolrClient.java:558)
  at org.apache.solr.client.solrj.impl.HttpSolrClient.request(HttpSolrClient.java:259)
  at org.apache.solr.client.solrj.impl.HttpSolrClient.request(HttpSolrClient.java:248)
  at org.apache.solr.client.solrj.SolrRequest.process(SolrRequest.java:149)
  at org.apache.solr.client.solrj.SolrClient.deleteByQuery(SolrClient.java:895)
  at org.apache.solr.client.solrj.SolrClient.deleteByQuery(SolrClient.java:858)
  at org.apache.solr.client.solrj.SolrClient.deleteByQuery(SolrClient.java:873)
  at org.apache.solr.cloud.AbstractFullDistribZkTestBase.del(AbstractFullDistribZkTestBase.java:835)
  at org.apache.solr.cloud.BasicDistributedZkTest.test(BasicDistributedZkTest.java:152)
  at sun.reflect.NativeMethodAccessorImpl.invoke0(Native Method)
  at sun.reflect.NativeMethodAccessorImpl.invoke(NativeMethodAccessorImpl.java:62)
  at sun.reflect.DelegatingMethodAccessorImpl.invoke(DelegatingMethodAccessorImpl.java:43)
  at java.lang.reflect.Method.invoke(Method.java:498)
  at com.carrotsearch.randomizedtesting.RandomizedRunner.invoke(RandomizedRunner.java:1764)
  at com.carrotsearch.randomizedtesting.RandomizedRunner$8.evaluate(RandomizedRunner.java:871)
  at com.carrotsearch.randomizedtesting.RandomizedRunner$9.evaluate(RandomizedRunner.java:907)
  at com.carrotsearch.randomizedtesting.RandomizedRunner$10.evaluate(RandomizedRunner.java:921)
  at org.apache.solr.BaseDistributedSearchTestCase$ShardsRepeatRule$ShardsFixedStatement.callStatement(BaseDistributedSearchTestCase.java:992)
  at org.apache.solr.BaseDistributedSearchTestCase$ShardsRepeatRule$ShardsStatement.evaluate(BaseDistributedSearchTestCase.java:967)
  at com.carrotsearch.randomizedtesting.rules.SystemPropertiesRestoreRule$1.evaluate(SystemPropertiesRestoreRule.java:57)
  at org.apache.lucene.util.TestRuleSetupTeardownChained$1.evaluate(TestRuleSetupTeardownChained.java:49)
  at org.apache.lucene.util.AbstractBeforeAfterRule$1.evaluate(AbstractBeforeAfterRule.java:45)
  at org.apache.lucene.util.TestRuleThreadAndTestName$1.evaluate(TestRuleThreadAndTestName.java:48)
  at org.apache.lucene.util.TestRuleIgnoreAfterMaxFailures$1.evaluate(TestRuleIgnoreAfterMaxFailures.java:64)
  at org.apache.lucene.util.TestRuleMarkFailure$1.evaluate(TestRuleMarkFailure.java:47)
  at com.carrotsearch.randomizedtesting.rules.StatementAdapter.evaluate(StatementAdapter.java:36)
  at com.carrotsearch.randomizedtesting.ThreadLeakControl$StatementRunner.run(ThreadLeakControl.java:367)
  at com.carrotsearch.randomizedtesting.ThreadLeakControl.forkTimeoutingTask(ThreadLeakControl.java:809)
  at com.carrotsearch.randomizedtesting.ThreadLeakControl$3.evaluate(ThreadLeakControl.java:460)
  at com.carrotsearch.randomizedtesting.RandomizedRunner.runSingleTest(RandomizedRunner.java:880)
  at com.carrotsearch.randomizedtesting.RandomizedRunner$5.evaluate(RandomizedRunner.java:781)
  at com.carrotsearch.randomizedtesting.RandomizedRunner$6.evaluate(RandomizedRunner.java:816)
  at com.carrotsearch.randomizedtesting.RandomizedRunner$7.evaluate(RandomizedRunner.java:827)
  at com.carrotsearch.randomizedtesting.rules.StatementAdapter.evaluate(StatementAdapter.java:36)
  at com.carrotsearch.randomizedtesting.rules.SystemPropertiesRestoreRule$1.evaluate(SystemPropertiesRestoreRule.java:57)
  at org.apache.lucene.util.AbstractBeforeAfterRule$1.evaluate(AbstractBeforeAfterRule.java:45)
  at com.carrotsearch.randomizedtesting.rules.StatementAdapter.evaluate(StatementAdapter.java:36)
  at org.apache.lucene.util.TestRuleStoreClassName$1.evaluate(TestRuleStoreClassName.java:41)
  at com.carrotsearch.randomizedtesting.rules.NoShadowingOrOverridesOnMethodsRule$1.evaluate(NoShadowingOrOverridesOnMethodsRule.java:40)
  at com.carrotsearch.randomizedtesting.rules.NoShadowingOrOverridesOnMethodsRule$1.evaluate(NoShadowingOrOverridesOnMethodsRule.java:40)
  at com.carrotsearch.randomizedtesting.rules.StatementAdapter.evaluate(StatementAdapter.java:36)
  at com.carrotsearch.randomizedtesting.rules.StatementAdapter.evaluate(StatementAdapter.java:36)
  at com.carrotsearch.randomizedtesting.rules.StatementAdapter.evaluate(StatementAdapter.java:36)
  at org.apache.lucene.util.TestRuleAssertionsRequired$1.evaluate(TestRuleAssertionsRequired.java:53)
  at org.apache.lucene.util.TestRuleMarkFailure$1.evaluate(TestRuleMarkFailure.java:47)
  at org.apache.lucene.util.TestRuleIgnoreAfterMaxFailures$1.evaluate(TestRuleIgnoreAfterMaxFailures.java:64)
  at org.apache.lucene.util.TestRuleIgnoreTestSuites$1.evaluate(TestRuleIgnoreTestSuites.java:54)
  at com.carrotsearch.randomizedtesting.rules.StatementAdapter.evaluate(StatementAdapter.java:36)
  at com.carrotsearch.randomizedtesting.ThreadLeakControl$StatementRunner.run(ThreadLeakControl.java:367)
  at java.lang.Thread.run(Thread.java:745)


FAILED: org.apache.solr.cloud.ChaosMonkeyNothingIsSafeTest.test

Error Message:
Error from server at http://127.0.0.1:63254/collection1: Expected mime type application/octet-stream but got text/html. <html> <head> <meta http-equiv="Content-Type" content="text/html;charset=ISO-8859-1"/> <title>Error 500 </title> </head> <body> <h2>HTTP ERROR: 500</h2> <p>Problem accessing /collection1/update. Reason: <pre> {metadata={error-class=org.apache.solr.common.SolrException,root-error-class=org.apache.solr.common.SolrException},msg=SolrCore &apos;collection1&apos; is not available due to init failure: Timed out getting coreNodeName for collection1,trace=org.apache.solr.common.SolrException: SolrCore &apos;collection1&apos; is not available due to init failure: Timed out getting coreNodeName for collection1 at org.apache.solr.core.CoreContainer.getCore(CoreContainer.java:1080) at org.apache.solr.servlet.HttpSolrCall.init(HttpSolrCall.java:256) at org.apache.solr.servlet.HttpSolrCall.call(HttpSolrCall.java:418) at org.apache.solr.servlet.SolrDispatchFilter.doFilter(SolrDispatchFilter.java:257) at org.apache.solr.servlet.SolrDispatchFilter.doFilter(SolrDispatchFilter.java:208) at org.eclipse.jetty.servlet.ServletHandler$CachedChain.doFilter(ServletHandler.java:1676) at org.apache.solr.client.solrj.embedded.JettySolrRunner$DebugFilter.doFilter(JettySolrRunner.java:109) at org.eclipse.jetty.servlet.ServletHandler$CachedChain.doFilter(ServletHandler.java:1676) at org.eclipse.jetty.servlet.ServletHandler.doHandle(ServletHandler.java:581) at org.eclipse.jetty.server.session.SessionHandler.doHandle(SessionHandler.java:224) at org.eclipse.jetty.server.handler.ContextHandler.doHandle(ContextHandler.java:1160) at org.eclipse.jetty.servlet.ServletHandler.doScope(ServletHandler.java:511) at org.eclipse.jetty.server.session.SessionHandler.doScope(SessionHandler.java:185) at org.eclipse.jetty.server.handler.ContextHandler.doScope(ContextHandler.java:1092) at org.eclipse.jetty.server.handler.ScopedHandler.handle(ScopedHandler.java:141) at org.eclipse.jetty.server.handler.gzip.GzipHandler.handle(GzipHandler.java:399) at org.eclipse.jetty.server.handler.HandlerWrapper.handle(HandlerWrapper.java:134) at org.eclipse.jetty.server.Server.handle(Server.java:518) at org.eclipse.jetty.server.HttpChannel.handle(HttpChannel.java:308) at org.eclipse.jetty.server.HttpConnection.onFillable(HttpConnection.java:244) at org.eclipse.jetty.io.AbstractConnection$ReadCallback.succeeded(AbstractConnection.java:273) at org.eclipse.jetty.io.FillInterest.fillable(FillInterest.java:95) at org.eclipse.jetty.io.SelectChannelEndPoint$2.run(SelectChannelEndPoint.java:93) at org.eclipse.jetty.util.thread.strategy.ExecuteProduceConsume.produceAndRun(ExecuteProduceConsume.java:246) at org.eclipse.jetty.util.thread.strategy.ExecuteProduceConsume.run(ExecuteProduceConsume.java:156) at org.eclipse.jetty.util.thread.QueuedThreadPool.runJob(QueuedThreadPool.java:654) at org.eclipse.jetty.util.thread.QueuedThreadPool$3.run(QueuedThreadPool.java:572) at java.lang.Thread.run(Thread.java:745) Caused by: org.apache.solr.common.SolrException: Timed out getting coreNodeName for collection1 at org.apache.solr.cloud.ZkController.waitForCoreNodeName(ZkController.java:1387) at org.apache.solr.cloud.ZkController.doGetShardIdAndNodeNameProcess(ZkController.java:1365) at org.apache.solr.cloud.ZkController.preRegister(ZkController.java:1456) at org.apache.solr.core.CoreContainer.create(CoreContainer.java:809) at org.apache.solr.core.CoreContainer.lambda$load$0(CoreContainer.java:468) at java.util.concurrent.FutureTask.run(FutureTask.java:266) at org.apache.solr.common.util.ExecutorUtil$MDCAwareThreadPoolExecutor.lambda$execute$0(ExecutorUtil.java:229) at java.util.concurrent.ThreadPoolExecutor.runWorker(ThreadPoolExecutor.java:1142) at java.util.concurrent.ThreadPoolExecutor$Worker.run(ThreadPoolExecutor.java:617) ... 1 more ,code=500}</pre></p> <hr /><a href="http://eclipse.org/jetty">Powered by Jetty:// 9.3.8.v20160314</a><hr/> </body> </html>

Stack Trace:
org.apache.solr.client.solrj.impl.HttpSolrClient$RemoteSolrException: Error from server at http://127.0.0.1:63254/collection1: Expected mime type application/octet-stream but got text/html. <html>
<head>
<meta http-equiv="Content-Type" content="text/html;charset=ISO-8859-1"/>
<title>Error 500 </title>
</head>
<body>
<h2>HTTP ERROR: 500</h2>
<p>Problem accessing /collection1/update. Reason:
<pre> {metadata={error-class=org.apache.solr.common.SolrException,root-error-class=org.apache.solr.common.SolrException},msg=SolrCore &apos;collection1&apos; is not available due to init failure: Timed out getting coreNodeName for collection1,trace=org.apache.solr.common.SolrException: SolrCore &apos;collection1&apos; is not available due to init failure: Timed out getting coreNodeName for collection1
  at org.apache.solr.core.CoreContainer.getCore(CoreContainer.java:1080)
  at org.apache.solr.servlet.HttpSolrCall.init(HttpSolrCall.java:256)
  at org.apache.solr.servlet.HttpSolrCall.call(HttpSolrCall.java:418)
  at org.apache.solr.servlet.SolrDispatchFilter.doFilter(SolrDispatchFilter.java:257)
  at org.apache.solr.servlet.SolrDispatchFilter.doFilter(SolrDispatchFilter.java:208)
  at org.eclipse.jetty.servlet.ServletHandler$CachedChain.doFilter(ServletHandler.java:1676)
  at org.apache.solr.client.solrj.embedded.JettySolrRunner$DebugFilter.doFilter(JettySolrRunner.java:109)
  at org.eclipse.jetty.servlet.ServletHandler$CachedChain.doFilter(ServletHandler.java:1676)
  at org.eclipse.jetty.servlet.ServletHandler.doHandle(ServletHandler.java:581)
  at org.eclipse.jetty.server.session.SessionHandler.doHandle(SessionHandler.java:224)
  at org.eclipse.jetty.server.handler.ContextHandler.doHandle(ContextHandler.java:1160)
  at org.eclipse.jetty.servlet.ServletHandler.doScope(ServletHandler.java:511)
  at org.eclipse.jetty.server.session.SessionHandler.doScope(SessionHandler.java:185)
  at org.eclipse.jetty.server.handler.ContextHandler.doScope(ContextHandler.java:1092)
  at org.eclipse.jetty.server.handler.ScopedHandler.handle(ScopedHandler.java:141)
  at org.eclipse.jetty.server.handler.gzip.GzipHandler.handle(GzipHandler.java:399)
  at org.eclipse.jetty.server.handler.HandlerWrapper.handle(HandlerWrapper.java:134)
  at org.eclipse.jetty.server.Server.handle(Server.java:518)
  at org.eclipse.jetty.server.HttpChannel.handle(HttpChannel.java:308)
  at org.eclipse.jetty.server.HttpConnection.onFillable(HttpConnection.java:244)
  at org.eclipse.jetty.io.AbstractConnection$ReadCallback.succeeded(AbstractConnection.java:273)
  at org.eclipse.jetty.io.FillInterest.fillable(FillInterest.java:95)
  at org.eclipse.jetty.io.SelectChannelEndPoint$2.run(SelectChannelEndPoint.java:93)
  at org.eclipse.jetty.util.thread.strategy.ExecuteProduceConsume.produceAndRun(ExecuteProduceConsume.java:246)
  at org.eclipse.jetty.util.thread.strategy.ExecuteProduceConsume.run(ExecuteProduceConsume.java:156)
  at org.eclipse.jetty.util.thread.QueuedThreadPool.runJob(QueuedThreadPool.java:654)
  at org.eclipse.jetty.util.thread.QueuedThreadPool$3.run(QueuedThreadPool.java:572)
  at java.lang.Thread.run(Thread.java:745)
Caused by: org.apache.solr.common.SolrException: Timed out getting coreNodeName for collection1
  at org.apache.solr.cloud.ZkController.waitForCoreNodeName(ZkController.java:1387)
  at org.apache.solr.cloud.ZkController.doGetShardIdAndNodeNameProcess(ZkController.java:1365)
  at org.apache.solr.cloud.ZkController.preRegister(ZkController.java:1456)
  at org.apache.solr.core.CoreContainer.create(CoreContainer.java:809)
  at org.apache.solr.core.CoreContainer.lambda$load$0(CoreContainer.java:468)
  at java.util.concurrent.FutureTask.run(FutureTask.java:266)
  at org.apache.solr.common.util.ExecutorUtil$MDCAwareThreadPoolExecutor.lambda$execute$0(ExecutorUtil.java:229)
  at java.util.concurrent.ThreadPoolExecutor.runWorker(ThreadPoolExecutor.java:1142)
  at java.util.concurrent.ThreadPoolExecutor$Worker.run(ThreadPoolExecutor.java:617)
  ... 1 more
,code=500}</pre></p>
<hr /><a href="http://eclipse.org/jetty">Powered by Jetty:// 9.3.8.v20160314</a><hr/>
</body>
[AAFF994773ADCAE8:22ABA69DDD51A710]:0)
  at org.apache.solr.client.solrj.impl.HttpSolrClient.executeMethod(HttpSolrClient.java:558)
  at org.apache.solr.client.solrj.impl.HttpSolrClient.request(HttpSolrClient.java:259)
  at org.apache.solr.client.solrj.impl.HttpSolrClient.request(HttpSolrClient.java:248)
  at org.apache.solr.client.solrj.SolrRequest.process(SolrRequest.java:149)
  at org.apache.solr.client.solrj.SolrClient.deleteByQuery(SolrClient.java:895)
  at org.apache.solr.client.solrj.SolrClient.deleteByQuery(SolrClient.java:858)
  at org.apache.solr.client.solrj.SolrClient.deleteByQuery(SolrClient.java:873)
  at org.apache.solr.cloud.AbstractFullDistribZkTestBase.del(AbstractFullDistribZkTestBase.java:835)
  at org.apache.solr.cloud.ChaosMonkeyNothingIsSafeTest.test(ChaosMonkeyNothingIsSafeTest.java:128)
  at sun.reflect.NativeMethodAccessorImpl.invoke0(Native Method)
  at sun.reflect.NativeMethodAccessorImpl.invoke(NativeMethodAccessorImpl.java:62)
  at sun.reflect.DelegatingMethodAccessorImpl.invoke(DelegatingMethodAccessorImpl.java:43)
  at java.lang.reflect.Method.invoke(Method.java:498)
  at com.carrotsearch.randomizedtesting.RandomizedRunner.invoke(RandomizedRunner.java:1764)
  at com.carrotsearch.randomizedtesting.RandomizedRunner$8.evaluate(RandomizedRunner.java:871)
  at com.carrotsearch.randomizedtesting.RandomizedRunner$9.evaluate(RandomizedRunner.java:907)
  at com.carrotsearch.randomizedtesting.RandomizedRunner$10.evaluate(RandomizedRunner.java:921)
  at org.apache.solr.BaseDistributedSearchTestCase$ShardsRepeatRule$ShardsFixedStatement.callStatement(BaseDistributedSearchTestCase.java:992)
  at org.apache.solr.BaseDistributedSearchTestCase$ShardsRepeatRule$ShardsStatement.evaluate(BaseDistributedSearchTestCase.java:967)
  at com.carrotsearch.randomizedtesting.rules.SystemPropertiesRestoreRule$1.evaluate(SystemPropertiesRestoreRule.java:57)
  at org.apache.lucene.util.TestRuleSetupTeardownChained$1.evaluate(TestRuleSetupTeardownChained.java:49)
  at org.apache.lucene.util.AbstractBeforeAfterRule$1.evaluate(AbstractBeforeAfterRule.java:45)
  at org.apache.lucene.util.TestRuleThreadAndTestName$1.evaluate(TestRuleThreadAndTestName.java:48)
  at org.apache.lucene.util.TestRuleIgnoreAfterMaxFailures$1.evaluate(TestRuleIgnoreAfterMaxFailures.java:64)
  at org.apache.lucene.util.TestRuleMarkFailure$1.evaluate(TestRuleMarkFailure.java:47)
  at com.carrotsearch.randomizedtesting.rules.StatementAdapter.evaluate(StatementAdapter.java:36)
  at com.carrotsearch.randomizedtesting.ThreadLeakControl$StatementRunner.run(ThreadLeakControl.java:367)
  at com.carrotsearch.randomizedtesting.ThreadLeakControl.forkTimeoutingTask(ThreadLeakControl.java:809)
  at com.carrotsearch.randomizedtesting.ThreadLeakControl$3.evaluate(ThreadLeakControl.java:460)
  at com.carrotsearch.randomizedtesting.RandomizedRunner.runSingleTest(RandomizedRunner.java:880)
  at com.carrotsearch.randomizedtesting.RandomizedRunner$5.evaluate(RandomizedRunner.java:781)
  at com.carrotsearch.randomizedtesting.RandomizedRunner$6.evaluate(RandomizedRunner.java:816)
  at com.carrotsearch.randomizedtesting.RandomizedRunner$7.evaluate(RandomizedRunner.java:827)
  at com.carrotsearch.randomizedtesting.rules.StatementAdapter.evaluate(StatementAdapter.java:36)
  at com.carrotsearch.randomizedtesting.rules.SystemPropertiesRestoreRule$1.evaluate(SystemPropertiesRestoreRule.java:57)
  at org.apache.lucene.util.AbstractBeforeAfterRule$1.evaluate(AbstractBeforeAfterRule.java:45)
  at com.carrotsearch.randomizedtesting.rules.StatementAdapter.evaluate(StatementAdapter.java:36)
  at org.apache.lucene.util.TestRuleStoreClassName$1.evaluate(TestRuleStoreClassName.java:41)
  at com.carrotsearch.randomizedtesting.rules.NoShadowingOrOverridesOnMethodsRule$1.evaluate(NoShadowingOrOverridesOnMethodsRule.java:40)
  at com.carrotsearch.randomizedtesting.rules.NoShadowingOrOverridesOnMethodsRule$1.evaluate(NoShadowingOrOverridesOnMethodsRule.java:40)
  at com.carrotsearch.randomizedtesting.rules.StatementAdapter.evaluate(StatementAdapter.java:36)
  at com.carrotsearch.randomizedtesting.rules.StatementAdapter.evaluate(StatementAdapter.java:36)
  at com.carrotsearch.randomizedtesting.rules.StatementAdapter.evaluate(StatementAdapter.java:36)
  at org.apache.lucene.util.TestRuleAssertionsRequired$1.evaluate(TestRuleAssertionsRequired.java:53)
  at org.apache.lucene.util.TestRuleMarkFailure$1.evaluate(TestRuleMarkFailure.java:47)
  at org.apache.lucene.util.TestRuleIgnoreAfterMaxFailures$1.evaluate(TestRuleIgnoreAfterMaxFailures.java:64)
  at org.apache.lucene.util.TestRuleIgnoreTestSuites$1.evaluate(TestRuleIgnoreTestSuites.java:54)
  at com.carrotsearch.randomizedtesting.rules.StatementAdapter.evaluate(StatementAdapter.java:36)
  at com.carrotsearch.randomizedtesting.ThreadLeakControl$StatementRunner.run(ThreadLeakControl.java:367)
  at java.lang.Thread.run(Thread.java:745)


FAILED: org.apache.solr.cloud.ChaosMonkeySafeLeaderTest.test

Error Message:
Error from server at http://127.0.0.1:40971/b_/v/collection1: Expected mime type application/octet-stream but got text/html. <html> <head> <meta http-equiv="Content-Type" content="text/html;charset=ISO-8859-1"/> <title>Error 500 </title> </head> <body> <h2>HTTP ERROR: 500</h2> <p>Problem accessing /b_/v/collection1/update. Reason: <pre> {metadata={error-class=org.apache.solr.common.SolrException,root-error-class=org.apache.solr.common.SolrException},msg=SolrCore &apos;collection1&apos; is not available due to init failure: Timed out getting coreNodeName for collection1,trace=org.apache.solr.common.SolrException: SolrCore &apos;collection1&apos; is not available due to init failure: Timed out getting coreNodeName for collection1 at org.apache.solr.core.CoreContainer.getCore(CoreContainer.java:1080) at org.apache.solr.servlet.HttpSolrCall.init(HttpSolrCall.java:256) at org.apache.solr.servlet.HttpSolrCall.call(HttpSolrCall.java:418) at org.apache.solr.servlet.SolrDispatchFilter.doFilter(SolrDispatchFilter.java:257) at org.apache.solr.servlet.SolrDispatchFilter.doFilter(SolrDispatchFilter.java:208) at org.eclipse.jetty.servlet.ServletHandler$CachedChain.doFilter(ServletHandler.java:1676) at org.apache.solr.client.solrj.embedded.JettySolrRunner$DebugFilter.doFilter(JettySolrRunner.java:109) at org.eclipse.jetty.servlet.ServletHandler$CachedChain.doFilter(ServletHandler.java:1676) at org.eclipse.jetty.servlet.ServletHandler.doHandle(ServletHandler.java:581) at org.eclipse.jetty.server.session.SessionHandler.doHandle(SessionHandler.java:224) at org.eclipse.jetty.server.handler.ContextHandler.doHandle(ContextHandler.java:1160) at org.eclipse.jetty.servlet.ServletHandler.doScope(ServletHandler.java:511) at org.eclipse.jetty.server.session.SessionHandler.doScope(SessionHandler.java:185) at org.eclipse.jetty.server.handler.ContextHandler.doScope(ContextHandler.java:1092) at org.eclipse.jetty.server.handler.ScopedHandler.handle(ScopedHandler.java:141) at org.eclipse.jetty.server.handler.gzip.GzipHandler.handle(GzipHandler.java:399) at org.eclipse.jetty.server.handler.HandlerWrapper.handle(HandlerWrapper.java:134) at org.eclipse.jetty.server.Server.handle(Server.java:518) at org.eclipse.jetty.server.HttpChannel.handle(HttpChannel.java:308) at org.eclipse.jetty.server.HttpConnection.onFillable(HttpConnection.java:244) at org.eclipse.jetty.io.AbstractConnection$ReadCallback.succeeded(AbstractConnection.java:273) at org.eclipse.jetty.io.FillInterest.fillable(FillInterest.java:95) at org.eclipse.jetty.io.SelectChannelEndPoint$2.run(SelectChannelEndPoint.java:93) at org.eclipse.jetty.util.thread.strategy.ExecuteProduceConsume.produceAndRun(ExecuteProduceConsume.java:246) at org.eclipse.jetty.util.thread.strategy.ExecuteProduceConsume.run(ExecuteProduceConsume.java:156) at org.eclipse.jetty.util.thread.QueuedThreadPool.runJob(QueuedThreadPool.java:654) at org.eclipse.jetty.util.thread.QueuedThreadPool$3.run(QueuedThreadPool.java:572) at java.lang.Thread.run(Thread.java:745) Caused by: org.apache.solr.common.SolrException: Timed out getting coreNodeName for collection1 at org.apache.solr.cloud.ZkController.waitForCoreNodeName(ZkController.java:1387) at org.apache.solr.cloud.ZkController.doGetShardIdAndNodeNameProcess(ZkController.java:1365) at org.apache.solr.cloud.ZkController.preRegister(ZkController.java:1456) at org.apache.solr.core.CoreContainer.create(CoreContainer.java:809) at org.apache.solr.core.CoreContainer.lambda$load$0(CoreContainer.java:468) at java.util.concurrent.FutureTask.run(FutureTask.java:266) at org.apache.solr.common.util.ExecutorUtil$MDCAwareThreadPoolExecutor.lambda$execute$0(ExecutorUtil.java:229) at java.util.concurrent.ThreadPoolExecutor.runWorker(ThreadPoolExecutor.java:1142) at java.util.concurrent.ThreadPoolExecutor$Worker.run(ThreadPoolExecutor.java:617) ... 1 more ,code=500}</pre></p> <hr /><a href="http://eclipse.org/jetty">Powered by Jetty:// 9.3.8.v20160314</a><hr/> </body> </html>

Stack Trace:
org.apache.solr.client.solrj.impl.HttpSolrClient$RemoteSolrException: Error from server at http://127.0.0.1:40971/b_/v/collection1: Expected mime type application/octet-stream but got text/html. <html>
<head>
<meta http-equiv="Content-Type" content="text/html;charset=ISO-8859-1"/>
<title>Error 500 </title>
</head>
<body>
<h2>HTTP ERROR: 500</h2>
<p>Problem accessing /b_/v/collection1/update. Reason:
<pre> {metadata={error-class=org.apache.solr.common.SolrException,root-error-class=org.apache.solr.common.SolrException},msg=SolrCore &apos;collection1&apos; is not available due to init failure: Timed out getting coreNodeName for collection1,trace=org.apache.solr.common.SolrException: SolrCore &apos;collection1&apos; is not available due to init failure: Timed out getting coreNodeName for collection1
  at org.apache.solr.core.CoreContainer.getCore(CoreContainer.java:1080)
  at org.apache.solr.servlet.HttpSolrCall.init(HttpSolrCall.java:256)
  at org.apache.solr.servlet.HttpSolrCall.call(HttpSolrCall.java:418)
  at org.apache.solr.servlet.SolrDispatchFilter.doFilter(SolrDispatchFilter.java:257)
  at org.apache.solr.servlet.SolrDispatchFilter.doFilter(SolrDispatchFilter.java:208)
  at org.eclipse.jetty.servlet.ServletHandler$CachedChain.doFilter(ServletHandler.java:1676)
  at org.apache.solr.client.solrj.embedded.JettySolrRunner$DebugFilter.doFilter(JettySolrRunner.java:109)
  at org.eclipse.jetty.servlet.ServletHandler$CachedChain.doFilter(ServletHandler.java:1676)
  at org.eclipse.jetty.servlet.ServletHandler.doHandle(ServletHandler.java:581)
  at org.eclipse.jetty.server.session.SessionHandler.doHandle(SessionHandler.java:224)
  at org.eclipse.jetty.server.handler.ContextHandler.doHandle(ContextHandler.java:1160)
  at org.eclipse.jetty.servlet.ServletHandler.doScope(ServletHandler.java:511)
  at org.eclipse.jetty.server.session.SessionHandler.doScope(SessionHandler.java:185)
  at org.eclipse.jetty.server.handler.ContextHandler.doScope(ContextHandler.java:1092)
  at org.eclipse.jetty.server.handler.ScopedHandler.handle(ScopedHandler.java:141)
  at org.eclipse.jetty.server.handler.gzip.GzipHandler.handle(GzipHandler.java:399)
  at org.eclipse.jetty.server.handler.HandlerWrapper.handle(HandlerWrapper.java:134)
  at org.eclipse.jetty.server.Server.handle(Server.java:518)
  at org.eclipse.jetty.server.HttpChannel.handle(HttpChannel.java:308)
  at org.eclipse.jetty.server.HttpConnection.onFillable(HttpConnection.java:244)
  at org.eclipse.jetty.io.AbstractConnection$ReadCallback.succeeded(AbstractConnection.java:273)
  at org.eclipse.jetty.io.FillInterest.fillable(FillInterest.java:95)
  at org.eclipse.jetty.io.SelectChannelEndPoint$2.run(SelectChannelEndPoint.java:93)
  at org.eclipse.jetty.util.thread.strategy.ExecuteProduceConsume.produceAndRun(ExecuteProduceConsume.java:246)
  at org.eclipse.jetty.util.thread.strategy.ExecuteProduceConsume.run(ExecuteProduceConsume.java:156)
  at org.eclipse.jetty.util.thread.QueuedThreadPool.runJob(QueuedThreadPool.java:654)
  at org.eclipse.jetty.util.thread.QueuedThreadPool$3.run(QueuedThreadPool.java:572)
  at java.lang.Thread.run(Thread.java:745)
Caused by: org.apache.solr.common.SolrException: Timed out getting coreNodeName for collection1
  at org.apache.solr.cloud.ZkController.waitForCoreNodeName(ZkController.java:1387)
  at org.apache.solr.cloud.ZkController.doGetShardIdAndNodeNameProcess(ZkController.java:1365)
  at org.apache.solr.cloud.ZkController.preRegister(ZkController.java:1456)
  at org.apache.solr.core.CoreContainer.create(CoreContainer.java:809)
  at org.apache.solr.core.CoreContainer.lambda$load$0(CoreContainer.java:468)
  at java.util.concurrent.FutureTask.run(FutureTask.java:266)
  at org.apache.solr.common.util.ExecutorUtil$MDCAwareThreadPoolExecutor.lambda$execute$0(ExecutorUtil.java:229)
  at java.util.concurrent.ThreadPoolExecutor.runWorker(ThreadPoolExecutor.java:1142)
  at java.util.concurrent.ThreadPoolExecutor$Worker.run(ThreadPoolExecutor.java:617)
  ... 1 more
,code=500}</pre></p>
<hr /><a href="http://eclipse.org/jetty">Powered by Jetty:// 9.3.8.v20160314</a><hr/>
</body>
[AAFF994773ADCAE8:22ABA69DDD51A710]:0)
  at org.apache.solr.client.solrj.impl.HttpSolrClient.executeMethod(HttpSolrClient.java:558)
  at org.apache.solr.client.solrj.impl.HttpSolrClient.request(HttpSolrClient.java:259)
  at org.apache.solr.client.solrj.impl.HttpSolrClient.request(HttpSolrClient.java:248)
  at org.apache.solr.client.solrj.SolrRequest.process(SolrRequest.java:149)
  at org.apache.solr.client.solrj.SolrClient.deleteByQuery(SolrClient.java:895)
  at org.apache.solr.client.solrj.SolrClient.deleteByQuery(SolrClient.java:858)
  at org.apache.solr.client.solrj.SolrClient.deleteByQuery(SolrClient.java:873)
  at org.apache.solr.cloud.AbstractFullDistribZkTestBase.del(AbstractFullDistribZkTestBase.java:835)
  at org.apache.solr.cloud.ChaosMonkeySafeLeaderTest.tryDelete(ChaosMonkeySafeLeaderTest.java:190)
  at org.apache.solr.cloud.ChaosMonkeySafeLeaderTest.test(ChaosMonkeySafeLeaderTest.java:92)
  at sun.reflect.NativeMethodAccessorImpl.invoke0(Native Method)
  at sun.reflect.NativeMethodAccessorImpl.invoke(NativeMethodAccessorImpl.java:62)
  at sun.reflect.DelegatingMethodAccessorImpl.invoke(DelegatingMethodAccessorImpl.java:43)
  at java.lang.reflect.Method.invoke(Method.java:498)
  at com.carrotsearch.randomizedtesting.RandomizedRunner.invoke(RandomizedRunner.java:1764)
  at com.carrotsearch.randomizedtesting.RandomizedRunner$8.evaluate(RandomizedRunner.java:871)
  at com.carrotsearch.randomizedtesting.RandomizedRunner$9.evaluate(RandomizedRunner.java:907)
  at com.carrotsearch.randomizedtesting.RandomizedRunner$10.evaluate(RandomizedRunner.java:921)
  at org.apache.solr.BaseDistributedSearchTestCase$ShardsRepeatRule$ShardsFixedStatement.callStatement(BaseDistributedSearchTestCase.java:992)
  at org.apache.solr.BaseDistributedSearchTestCase$ShardsRepeatRule$ShardsStatement.evaluate(BaseDistributedSearchTestCase.java:967)
  at com.carrotsearch.randomizedtesting.rules.SystemPropertiesRestoreRule$1.evaluate(SystemPropertiesRestoreRule.java:57)
  at org.apache.lucene.util.TestRuleSetupTeardownChained$1.evaluate(TestRuleSetupTeardownChained.java:49)
  at org.apache.lucene.util.AbstractBeforeAfterRule$1.evaluate(AbstractBeforeAfterRule.java:45)
  at org.apache.lucene.util.TestRuleThreadAndTestName$1.evaluate(TestRuleThreadAndTestName.java:48)
  at org.apache.lucene.util.TestRuleIgnoreAfterMaxFailures$1.evaluate(TestRuleIgnoreAfterMaxFailures.java:64)
  at org.apache.lucene.util.TestRuleMarkFailure$1.evaluate(TestRuleMarkFailure.java:47)
  at com.carrotsearch.randomizedtesting.rules.StatementAdapter.evaluate(StatementAdapter.java:36)
  at com.carrotsearch.randomizedtesting.ThreadLeakControl$StatementRunner.run(ThreadLeakControl.java:367)
  at com.carrotsearch.randomizedtesting.ThreadLeakControl.forkTimeoutingTask(ThreadLeakControl.java:809)
  at com.carrotsearch.randomizedtesting.ThreadLeakControl$3.evaluate(ThreadLeakControl.java:460)
  at com.carrotsearch.randomizedtesting.RandomizedRunner.runSingleTest(RandomizedRunner.java:880)
  at com.carrotsearch.randomizedtesting.RandomizedRunner$5.evaluate(RandomizedRunner.java:781)
  at com.carrotsearch.randomizedtesting.RandomizedRunner$6.evaluate(RandomizedRunner.java:816)
  at com.carrotsearch.randomizedtesting.RandomizedRunner$7.evaluate(RandomizedRunner.java:827)
  at com.carrotsearch.randomizedtesting.rules.StatementAdapter.evaluate(StatementAdapter.java:36)
  at com.carrotsearch.randomizedtesting.rules.SystemPropertiesRestoreRule$1.evaluate(SystemPropertiesRestoreRule.java:57)
  at org.apache.lucene.util.AbstractBeforeAfterRule$1.evaluate(AbstractBeforeAfterRule.java:45)
  at com.carrotsearch.randomizedtesting.rules.StatementAdapter.evaluate(StatementAdapter.java:36)
  at org.apache.lucene.util.TestRuleStoreClassName$1.evaluate(TestRuleStoreClassName.java:41)
  at com.carrotsearch.randomizedtesting.rules.NoShadowingOrOverridesOnMethodsRule$1.evaluate(NoShadowingOrOverridesOnMethodsRule.java:40)
  at com.carrotsearch.randomizedtesting.rules.NoShadowingOrOverridesOnMethodsRule$1.evaluate(NoShadowingOrOverridesOnMethodsRule.java:40)
  at com.carrotsearch.randomizedtesting.rules.StatementAdapter.evaluate(StatementAdapter.java:36)
  at com.carrotsearch.randomizedtesting.rules.StatementAdapter.evaluate(StatementAdapter.java:36)
  at com.carrotsearch.randomizedtesting.rules.StatementAdapter.evaluate(StatementAdapter.java:36)
  at org.apache.lucene.util.TestRuleAssertionsRequired$1.evaluate(TestRuleAssertionsRequired.java:53)
  at org.apache.lucene.util.TestRuleMarkFailure$1.evaluate(TestRuleMarkFailure.java:47)
  at org.apache.lucene.util.TestRuleIgnoreAfterMaxFailures$1.evaluate(TestRuleIgnoreAfterMaxFailures.java:64)
  at org.apache.lucene.util.TestRuleIgnoreTestSuites$1.evaluate(TestRuleIgnoreTestSuites.java:54)
  at com.carrotsearch.randomizedtesting.rules.StatementAdapter.evaluate(StatementAdapter.java:36)
  at com.carrotsearch.randomizedtesting.ThreadLeakControl$StatementRunner.run(ThreadLeakControl.java:367)
  at java.lang.Thread.run(Thread.java:745)


FAILED: org.apache.solr.cloud.CollectionTooManyReplicasTest.testAddTooManyReplicas

Error Message:
No registered leader was found after waiting for 10000ms , collection: collection1 slice: shard1

Stack Trace:
org.apache.solr.common.SolrException: No registered leader was found after waiting for 10000ms , collection: collection1 slice: shard1
  at __randomizedtesting.SeedInfo.seed([AAFF994773ADCAE8:27ADED9F3D4BF559]:0)
  at org.apache.solr.common.cloud.ZkStateReader.getLeaderRetry(ZkStateReader.java:718)
  at org.apache.solr.cloud.AbstractFullDistribZkTestBase.createJettys(AbstractFullDistribZkTestBase.java:427)
  at org.apache.solr.cloud.AbstractFullDistribZkTestBase.createServers(AbstractFullDistribZkTestBase.java:332)
  at org.apache.solr.BaseDistributedSearchTestCase$ShardsRepeatRule$ShardsFixedStatement.callStatement(BaseDistributedSearchTestCase.java:990)
  at org.apache.solr.BaseDistributedSearchTestCase$ShardsRepeatRule$ShardsStatement.evaluate(BaseDistributedSearchTestCase.java:967)
  at com.carrotsearch.randomizedtesting.rules.SystemPropertiesRestoreRule$1.evaluate(SystemPropertiesRestoreRule.java:57)
  at org.apache.lucene.util.TestRuleSetupTeardownChained$1.evaluate(TestRuleSetupTeardownChained.java:49)
  at org.apache.lucene.util.AbstractBeforeAfterRule$1.evaluate(AbstractBeforeAfterRule.java:45)
  at org.apache.lucene.util.TestRuleThreadAndTestName$1.evaluate(TestRuleThreadAndTestName.java:48)
  at org.apache.lucene.util.TestRuleIgnoreAfterMaxFailures$1.evaluate(TestRuleIgnoreAfterMaxFailures.java:64)
  at org.apache.lucene.util.TestRuleMarkFailure$1.evaluate(TestRuleMarkFailure.java:47)
  at com.carrotsearch.randomizedtesting.rules.StatementAdapter.evaluate(StatementAdapter.java:36)
  at com.carrotsearch.randomizedtesting.ThreadLeakControl$StatementRunner.run(ThreadLeakControl.java:367)
  at com.carrotsearch.randomizedtesting.ThreadLeakControl.forkTimeoutingTask(ThreadLeakControl.java:809)
  at com.carrotsearch.randomizedtesting.ThreadLeakControl$3.evaluate(ThreadLeakControl.java:460)
  at com.carrotsearch.randomizedtesting.RandomizedRunner.runSingleTest(RandomizedRunner.java:880)
  at com.carrotsearch.randomizedtesting.RandomizedRunner$5.evaluate(RandomizedRunner.java:781)
  at com.carrotsearch.randomizedtesting.RandomizedRunner$6.evaluate(RandomizedRunner.java:816)
  at com.carrotsearch.randomizedtesting.RandomizedRunner$7.evaluate(RandomizedRunner.java:827)
  at com.carrotsearch.randomizedtesting.rules.StatementAdapter.evaluate(StatementAdapter.java:36)
  at com.carrotsearch.randomizedtesting.rules.SystemPropertiesRestoreRule$1.evaluate(SystemPropertiesRestoreRule.java:57)
  at org.apache.lucene.util.AbstractBeforeAfterRule$1.evaluate(AbstractBeforeAfterRule.java:45)
  at com.carrotsearch.randomizedtesting.rules.StatementAdapter.evaluate(StatementAdapter.java:36)
  at org.apache.lucene.util.TestRuleStoreClassName$1.evaluate(TestRuleStoreClassName.java:41)
  at com.carrotsearch.randomizedtesting.rules.NoShadowingOrOverridesOnMethodsRule$1.evaluate(NoShadowingOrOverridesOnMethodsRule.java:40)
  at com.carrotsearch.randomizedtesting.rules.NoShadowingOrOverridesOnMethodsRule$1.evaluate(NoShadowingOrOverridesOnMethodsRule.java:40)
  at com.carrotsearch.randomizedtesting.rules.StatementAdapter.evaluate(StatementAdapter.java:36)
  at com.carrotsearch.randomizedtesting.rules.StatementAdapter.evaluate(StatementAdapter.java:36)
  at com.carrotsearch.randomizedtesting.rules.StatementAdapter.evaluate(StatementAdapter.java:36)
  at org.apache.lucene.util.TestRuleAssertionsRequired$1.evaluate(TestRuleAssertionsRequired.java:53)
  at org.apache.lucene.util.TestRuleMarkFailure$1.evaluate(TestRuleMarkFailure.java:47)
  at org.apache.lucene.util.TestRuleIgnoreAfterMaxFailures$1.evaluate(TestRuleIgnoreAfterMaxFailures.java:64)
  at org.apache.lucene.util.TestRuleIgnoreTestSuites$1.evaluate(TestRuleIgnoreTestSuites.java:54)
  at com.carrotsearch.randomizedtesting.rules.StatementAdapter.evaluate(StatementAdapter.java:36)
  at com.carrotsearch.randomizedtesting.ThreadLeakControl$StatementRunner.run(ThreadLeakControl.java:367)
  at java.lang.Thread.run(Thread.java:745)


FAILED: org.apache.solr.cloud.CollectionsAPIDistributedZkTest.test

Error Message:
Timeout occured while waiting response from server at: http://127.0.0.1:63794/jk_pjt/a

Stack Trace:
org.apache.solr.client.solrj.SolrServerException: Timeout occured while waiting response from server at: http://127.0.0.1:63794/jk_pjt/a
  at __randomizedtesting.SeedInfo.seed([AAFF994773ADCAE8:22ABA69DDD51A710]:0)
  at org.apache.solr.client.solrj.impl.HttpSolrClient.executeMethod(HttpSolrClient.java:601)
  at org.apache.solr.client.solrj.impl.HttpSolrClient.request(HttpSolrClient.java:259)
  at org.apache.solr.client.solrj.impl.HttpSolrClient.request(HttpSolrClient.java:248)
  at org.apache.solr.client.solrj.SolrClient.request(SolrClient.java:1219)
  at org.apache.solr.cloud.CollectionsAPIDistributedZkTest.makeRequest(CollectionsAPIDistributedZkTest.java:399)
  at org.apache.solr.cloud.CollectionsAPIDistributedZkTest.testNoConfigSetExist(CollectionsAPIDistributedZkTest.java:601)
  at org.apache.solr.cloud.CollectionsAPIDistributedZkTest.test(CollectionsAPIDistributedZkTest.java:176)
  at sun.reflect.NativeMethodAccessorImpl.invoke0(Native Method)
  at sun.reflect.NativeMethodAccessorImpl.invoke(NativeMethodAccessorImpl.java:62)
  at sun.reflect.DelegatingMethodAccessorImpl.invoke(DelegatingMethodAccessorImpl.java:43)
  at java.lang.reflect.Method.invoke(Method.java:498)
  at com.carrotsearch.randomizedtesting.RandomizedRunner.invoke(RandomizedRunner.java:1764)
  at com.carrotsearch.randomizedtesting.RandomizedRunner$8.evaluate(RandomizedRunner.java:871)
  at com.carrotsearch.randomizedtesting.RandomizedRunner$9.evaluate(RandomizedRunner.java:907)
  at com.carrotsearch.randomizedtesting.RandomizedRunner$10.evaluate(RandomizedRunner.java:921)
  at org.apache.solr.BaseDistributedSearchTestCase$ShardsRepeatRule$ShardsFixedStatement.callStatement(BaseDistributedSearchTestCase.java:992)
  at org.apache.solr.BaseDistributedSearchTestCase$ShardsRepeatRule$ShardsStatement.evaluate(BaseDistributedSearchTestCase.java:967)
  at com.carrotsearch.randomizedtesting.rules.SystemPropertiesRestoreRule$1.evaluate(SystemPropertiesRestoreRule.java:57)
  at org.apache.lucene.util.TestRuleSetupTeardownChained$1.evaluate(TestRuleSetupTeardownChained.java:49)
  at org.apache.lucene.util.AbstractBeforeAfterRule$1.evaluate(AbstractBeforeAfterRule.java:45)
  at org.apache.lucene.util.TestRuleThreadAndTestName$1.evaluate(TestRuleThreadAndTestName.java:48)
  at org.apache.lucene.util.TestRuleIgnoreAfterMaxFailures$1.evaluate(TestRuleIgnoreAfterMaxFailures.java:64)
  at org.apache.lucene.util.TestRuleMarkFailure$1.evaluate(TestRuleMarkFailure.java:47)
  at com.carrotsearch.randomizedtesting.rules.StatementAdapter.evaluate(StatementAdapter.java:36)
  at com.carrotsearch.randomizedtesting.ThreadLeakControl$StatementRunner.run(ThreadLeakControl.java:367)
  at com.carrotsearch.randomizedtesting.ThreadLeakControl.forkTimeoutingTask(ThreadLeakControl.java:809)
  at com.carrotsearch.randomizedtesting.ThreadLeakControl$3.evaluate(ThreadLeakControl.java:460)
  at com.carrotsearch.randomizedtesting.RandomizedRunner.runSingleTest(RandomizedRunner.java:880)
  at com.carrotsearch.randomizedtesting.RandomizedRunner$5.evaluate(RandomizedRunner.java:781)
  at com.carrotsearch.randomizedtesting.RandomizedRunner$6.evaluate(RandomizedRunner.java:816)
  at com.carrotsearch.randomizedtesting.RandomizedRunner$7.evaluate(RandomizedRunner.java:827)
  at com.carrotsearch.randomizedtesting.rules.StatementAdapter.evaluate(StatementAdapter.java:36)
  at com.carrotsearch.randomizedtesting.rules.SystemPropertiesRestoreRule$1.evaluate(SystemPropertiesRestoreRule.java:57)
  at org.apache.lucene.util.AbstractBeforeAfterRule$1.evaluate(AbstractBeforeAfterRule.java:45)
  at com.carrotsearch.randomizedtesting.rules.StatementAdapter.evaluate(StatementAdapter.java:36)
  at org.apache.lucene.util.TestRuleStoreClassName$1.evaluate(TestRuleStoreClassName.java:41)
  at com.carrotsearch.randomizedtesting.rules.NoShadowingOrOverridesOnMethodsRule$1.evaluate(NoShadowingOrOverridesOnMethodsRule.java:40)
  at com.carrotsearch.randomizedtesting.rules.NoShadowingOrOverridesOnMethodsRule$1.evaluate(NoShadowingOrOverridesOnMethodsRule.java:40)
  at com.carrotsearch.randomizedtesting.rules.StatementAdapter.evaluate(StatementAdapter.java:36)
  at com.carrotsearch.randomizedtesting.rules.StatementAdapter.evaluate(StatementAdapter.java:36)
  at com.carrotsearch.randomizedtesting.rules.StatementAdapter.evaluate(StatementAdapter.java:36)
  at org.apache.lucene.util.TestRuleAssertionsRequired$1.evaluate(TestRuleAssertionsRequired.java:53)
  at org.apache.lucene.util.TestRuleMarkFailure$1.evaluate(TestRuleMarkFailure.java:47)
  at org.apache.lucene.util.TestRuleIgnoreAfterMaxFailures$1.evaluate(TestRuleIgnoreAfterMaxFailures.java:64)
  at org.apache.lucene.util.TestRuleIgnoreTestSuites$1.evaluate(TestRuleIgnoreTestSuites.java:54)
  at com.carrotsearch.randomizedtesting.rules.StatementAdapter.evaluate(StatementAdapter.java:36)
  at com.carrotsearch.randomizedtesting.ThreadLeakControl$StatementRunner.run(ThreadLeakControl.java:367)
  at java.lang.Thread.run(Thread.java:745)
Caused by: java.net.SocketTimeoutException: Read timed out
  at java.net.SocketInputStream.socketRead0(Native Method)
  at java.net.SocketInputStream.socketRead(SocketInputStream.java:116)
  at java.net.SocketInputStream.read(SocketInputStream.java:170)
  at java.net.SocketInputStream.read(SocketInputStream.java:141)
  at org.apache.http.impl.io.AbstractSessionInputBuffer.fillBuffer(AbstractSessionInputBuffer.java:160)
  at org.apache.http.impl.io.SocketInputBuffer.fillBuffer(SocketInputBuffer.java:84)
  at org.apache.http.impl.io.AbstractSessionInputBuffer.readLine(AbstractSessionInputBuffer.java:273)
  at org.apache.http.impl.conn.DefaultHttpResponseParser.parseHead(DefaultHttpResponseParser.java:140)
  at org.apache.http.impl.conn.DefaultHttpResponseParser.parseHead(DefaultHttpResponseParser.java:57)
  at org.apache.http.impl.io.AbstractMessageParser.parse(AbstractMessageParser.java:261)
  at org.apache.http.impl.AbstractHttpClientConnection.receiveResponseHeader(AbstractHttpClientConnection.java:283)
  at org.apache.http.impl.conn.DefaultClientConnection.receiveResponseHeader(DefaultClientConnection.java:251)
  at org.apache.http.impl.conn.ManagedClientConnectionImpl.receiveResponseHeader(ManagedClientConnectionImpl.java:197)
  at org.apache.http.protocol.HttpRequestExecutor.doReceiveResponse(HttpRequestExecutor.java:272)
  at org.apache.http.protocol.HttpRequestExecutor.execute(HttpRequestExecutor.java:124)
  at org.apache.http.impl.client.DefaultRequestDirector.tryExecute(DefaultRequestDirector.java:685)
  at org.apache.http.impl.client.DefaultRequestDirector.execute(DefaultRequestDirector.java:487)
  at org.apache.http.impl.client.AbstractHttpClient.doExecute(AbstractHttpClient.java:882)
  at org.apache.http.impl.client.CloseableHttpClient.execute(CloseableHttpClient.java:82)
  at org.apache.http.impl.client.CloseableHttpClient.execute(CloseableHttpClient.java:107)
  at org.apache.http.impl.client.CloseableHttpClient.execute(CloseableHttpClient.java:55)
  at org.apache.solr.client.solrj.impl.HttpSolrClient.executeMethod(HttpSolrClient.java:495)
  ... 47 more


FAILED: org.apache.solr.cloud.DistribCursorPagingTest.test

Error Message:
Error from server at http://127.0.0.1:36516/collection1: Expected mime type application/octet-stream but got text/html. <html> <head> <meta http-equiv="Content-Type" content="text/html;charset=ISO-8859-1"/> <title>Error 500 </title> </head> <body> <h2>HTTP ERROR: 500</h2> <p>Problem accessing /collection1/update. Reason: <pre> {metadata={error-class=org.apache.solr.common.SolrException,root-error-class=org.apache.solr.common.SolrException},msg=SolrCore &apos;collection1&apos; is not available due to init failure: Timed out getting coreNodeName for collection1,trace=org.apache.solr.common.SolrException: SolrCore &apos;collection1&apos; is not available due to init failure: Timed out getting coreNodeName for collection1 at org.apache.solr.core.CoreContainer.getCore(CoreContainer.java:1080) at org.apache.solr.servlet.HttpSolrCall.init(HttpSolrCall.java:256) at org.apache.solr.servlet.HttpSolrCall.call(HttpSolrCall.java:418) at org.apache.solr.servlet.SolrDispatchFilter.doFilter(SolrDispatchFilter.java:257) at org.apache.solr.servlet.SolrDispatchFilter.doFilter(SolrDispatchFilter.java:208) at org.eclipse.jetty.servlet.ServletHandler$CachedChain.doFilter(ServletHandler.java:1676) at org.apache.solr.client.solrj.embedded.JettySolrRunner$DebugFilter.doFilter(JettySolrRunner.java:109) at org.eclipse.jetty.servlet.ServletHandler$CachedChain.doFilter(ServletHandler.java:1676) at org.eclipse.jetty.servlet.ServletHandler.doHandle(ServletHandler.java:581) at org.eclipse.jetty.server.session.SessionHandler.doHandle(SessionHandler.java:224) at org.eclipse.jetty.server.handler.ContextHandler.doHandle(ContextHandler.java:1160) at org.eclipse.jetty.servlet.ServletHandler.doScope(ServletHandler.java:511) at org.eclipse.jetty.server.session.SessionHandler.doScope(SessionHandler.java:185) at org.eclipse.jetty.server.handler.ContextHandler.doScope(ContextHandler.java:1092) at org.eclipse.jetty.server.handler.ScopedHandler.handle(ScopedHandler.java:141) at org.eclipse.jetty.server.handler.gzip.GzipHandler.handle(GzipHandler.java:399) at org.eclipse.jetty.server.handler.HandlerWrapper.handle(HandlerWrapper.java:134) at org.eclipse.jetty.server.Server.handle(Server.java:518) at org.eclipse.jetty.server.HttpChannel.handle(HttpChannel.java:308) at org.eclipse.jetty.server.HttpConnection.onFillable(HttpConnection.java:244) at org.eclipse.jetty.io.AbstractConnection$ReadCallback.succeeded(AbstractConnection.java:273) at org.eclipse.jetty.io.FillInterest.fillable(FillInterest.java:95) at org.eclipse.jetty.io.SelectChannelEndPoint$2.run(SelectChannelEndPoint.java:93) at org.eclipse.jetty.util.thread.strategy.ExecuteProduceConsume.produceAndRun(ExecuteProduceConsume.java:246) at org.eclipse.jetty.util.thread.strategy.ExecuteProduceConsume.run(ExecuteProduceConsume.java:156) at org.eclipse.jetty.util.thread.QueuedThreadPool.runJob(QueuedThreadPool.java:654) at org.eclipse.jetty.util.thread.QueuedThreadPool$3.run(QueuedThreadPool.java:572) at java.lang.Thread.run(Thread.java:745) Caused by: org.apache.solr.common.SolrException: Timed out getting coreNodeName for collection1 at org.apache.solr.cloud.ZkController.waitForCoreNodeName(ZkController.java:1387) at org.apache.solr.cloud.ZkController.doGetShardIdAndNodeNameProcess(ZkController.java:1365) at org.apache.solr.cloud.ZkController.preRegister(ZkController.java:1456) at org.apache.solr.core.CoreContainer.create(CoreContainer.java:809) at org.apache.solr.core.CoreContainer.lambda$load$0(CoreContainer.java:468) at java.util.concurrent.FutureTask.run(FutureTask.java:266) at org.apache.solr.common.util.ExecutorUtil$MDCAwareThreadPoolExecutor.lambda$execute$0(ExecutorUtil.java:229) at java.util.concurrent.ThreadPoolExecutor.runWorker(ThreadPoolExecutor.java:1142) at java.util.concurrent.ThreadPoolExecutor$Worker.run(ThreadPoolExecutor.java:617) ... 1 more ,code=500}</pre></p> <hr /><a href="http://eclipse.org/jetty">Powered by Jetty:// 9.3.8.v20160314</a><hr/> </body> </html>

Stack Trace:
org.apache.solr.client.solrj.impl.HttpSolrClient$RemoteSolrException: Error from server at http://127.0.0.1:36516/collection1: Expected mime type application/octet-stream but got text/html. <html>
<head>
<meta http-equiv="Content-Type" content="text/html;charset=ISO-8859-1"/>
<title>Error 500 </title>
</head>
<body>
<h2>HTTP ERROR: 500</h2>
<p>Problem accessing /collection1/update. Reason:
<pre> {metadata={error-class=org.apache.solr.common.SolrException,root-error-class=org.apache.solr.common.SolrException},msg=SolrCore &apos;collection1&apos; is not available due to init failure: Timed out getting coreNodeName for collection1,trace=org.apache.solr.common.SolrException: SolrCore &apos;collection1&apos; is not available due to init failure: Timed out getting coreNodeName for collection1
  at org.apache.solr.core.CoreContainer.getCore(CoreContainer.java:1080)
  at org.apache.solr.servlet.HttpSolrCall.init(HttpSolrCall.java:256)
  at org.apache.solr.servlet.HttpSolrCall.call(HttpSolrCall.java:418)
  at org.apache.solr.servlet.SolrDispatchFilter.doFilter(SolrDispatchFilter.java:257)
  at org.apache.solr.servlet.SolrDispatchFilter.doFilter(SolrDispatchFilter.java:208)
  at org.eclipse.jetty.servlet.ServletHandler$CachedChain.doFilter(ServletHandler.java:1676)
  at org.apache.solr.client.solrj.embedded.JettySolrRunner$DebugFilter.doFilter(JettySolrRunner.java:109)
  at org.eclipse.jetty.servlet.ServletHandler$CachedChain.doFilter(ServletHandler.java:1676)
  at org.eclipse.jetty.servlet.ServletHandler.doHandle(ServletHandler.java:581)
  at org.eclipse.jetty.server.session.SessionHandler.doHandle(SessionHandler.java:224)
  at org.eclipse.jetty.server.handler.ContextHandler.doHandle(ContextHandler.java:1160)
  at org.eclipse.jetty.servlet.ServletHandler.doScope(ServletHandler.java:511)
  at org.eclipse.jetty.server.session.SessionHandler.doScope(SessionHandler.java:185)
  at org.eclipse.jetty.server.handler.ContextHandler.doScope(ContextHandler.java:1092)
  at org.eclipse.jetty.server.handler.ScopedHandler.handle(ScopedHandler.java:141)
  at org.eclipse.jetty.server.handler.gzip.GzipHandler.handle(GzipHandler.java:399)
  at org.eclipse.jetty.server.handler.HandlerWrapper.handle(HandlerWrapper.java:134)
  at org.eclipse.jetty.server.Server.handle(Server.java:518)
  at org.eclipse.jetty.server.HttpChannel.handle(HttpChannel.java:308)
  at org.eclipse.jetty.server.HttpConnection.onFillable(HttpConnection.java:244)
  at org.eclipse.jetty.io.AbstractConnection$ReadCallback.succeeded(AbstractConnection.java:273)
  at org.eclipse.jetty.io.FillInterest.fillable(FillInterest.java:95)
  at org.eclipse.jetty.io.SelectChannelEndPoint$2.run(SelectChannelEndPoint.java:93)
  at org.eclipse.jetty.util.thread.strategy.ExecuteProduceConsume.produceAndRun(ExecuteProduceConsume.java:246)
  at org.eclipse.jetty.util.thread.strategy.ExecuteProduceConsume.run(ExecuteProduceConsume.java:156)
  at org.eclipse.jetty.util.thread.QueuedThreadPool.runJob(QueuedThreadPool.java:654)
  at org.eclipse.jetty.util.thread.QueuedThreadPool$3.run(QueuedThreadPool.java:572)
  at java.lang.Thread.run(Thread.java:745)
Caused by: org.apache.solr.common.SolrException: Timed out getting coreNodeName for collection1
  at org.apache.solr.cloud.ZkController.waitForCoreNodeName(ZkController.java:1387)
  at org.apache.solr.cloud.ZkController.doGetShardIdAndNodeNameProcess(ZkController.java:1365)
  at org.apache.solr.cloud.ZkController.preRegister(ZkController.java:1456)
  at org.apache.solr.core.CoreContainer.create(CoreContainer.java:809)
  at org.apache.solr.core.CoreContainer.lambda$load$0(CoreContainer.java:468)
  at java.util.concurrent.FutureTask.run(FutureTask.java:266)
  at org.apache.solr.common.util.ExecutorUtil$MDCAwareThreadPoolExecutor.lambda$execute$0(ExecutorUtil.java:229)
  at java.util.concurrent.ThreadPoolExecutor.runWorker(ThreadPoolExecutor.java:1142)
  at java.util.concurrent.ThreadPoolExecutor$Worker.run(ThreadPoolExecutor.java:617)
  ... 1 more
,code=500}</pre></p>
<hr /><a href="http://eclipse.org/jetty">Powered by Jetty:// 9.3.8.v20160314</a><hr/>
</body>
[AAFF994773ADCAE8:22ABA69DDD51A710]:0)
  at org.apache.solr.client.solrj.impl.HttpSolrClient.executeMethod(HttpSolrClient.java:558)
  at org.apache.solr.client.solrj.impl.HttpSolrClient.request(HttpSolrClient.java:259)
  at org.apache.solr.client.solrj.impl.HttpSolrClient.request(HttpSolrClient.java:248)
  at org.apache.solr.client.solrj.SolrRequest.process(SolrRequest.java:149)
  at org.apache.solr.client.solrj.SolrRequest.process(SolrRequest.java:166)
  at org.apache.solr.cloud.AbstractFullDistribZkTestBase.indexDoc(AbstractFullDistribZkTestBase.java:775)
  at org.apache.solr.cloud.DistribCursorPagingTest.doBadInputTest(DistribCursorPagingTest.java:111)
  at org.apache.solr.cloud.DistribCursorPagingTest.test(DistribCursorPagingTest.java:88)
  at sun.reflect.NativeMethodAccessorImpl.invoke0(Native Method)
  at sun.reflect.NativeMethodAccessorImpl.invoke(NativeMethodAccessorImpl.java:62)
  at sun.reflect.DelegatingMethodAccessorImpl.invoke(DelegatingMethodAccessorImpl.java:43)
  at java.lang.reflect.Method.invoke(Method.java:498)
  at com.carrotsearch.randomizedtesting.RandomizedRunner.invoke(RandomizedRunner.java:1764)
  at com.carrotsearch.randomizedtesting.RandomizedRunner$8.evaluate(RandomizedRunner.java:871)
  at com.carrotsearch.randomizedtesting.RandomizedRunner$9.evaluate(RandomizedRunner.java:907)
  at com.carrotsearch.randomizedtesting.RandomizedRunner$10.evaluate(RandomizedRunner.java:921)
  at org.apache.solr.BaseDistributedSearchTestCase$ShardsRepeatRule$ShardsFixedStatement.callStatement(BaseDistributedSearchTestCase.java:992)
  at org.apache.solr.BaseDistributedSearchTestCase$ShardsRepeatRule$ShardsStatement.evaluate(BaseDistributedSearchTestCase.java:967)
  at com.carrotsearch.randomizedtesting.rules.SystemPropertiesRestoreRule$1.evaluate(SystemPropertiesRestoreRule.java:57)
  at org.apache.lucene.util.TestRuleSetupTeardownChained$1.evaluate(TestRuleSetupTeardownChained.java:49)
  at org.apache.lucene.util.AbstractBeforeAfterRule$1.evaluate(AbstractBeforeAfterRule.java:45)
  at org.apache.lucene.util.TestRuleThreadAndTestName$1.evaluate(TestRuleThreadAndTestName.java:48)
  at org.apache.lucene.util.TestRuleIgnoreAfterMaxFailures$1.evaluate(TestRuleIgnoreAfterMaxFailures.java:64)
  at org.apache.lucene.util.TestRuleMarkFailure$1.evaluate(TestRuleMarkFailure.java:47)
  at com.carrotsearch.randomizedtesting.rules.StatementAdapter.evaluate(StatementAdapter.java:36)
  at com.carrotsearch.randomizedtesting.ThreadLeakControl$StatementRunner.run(ThreadLeakControl.java:367)
  at com.carrotsearch.randomizedtesting.ThreadLeakControl.forkTimeoutingTask(ThreadLeakControl.java:809)
  at com.carrotsearch.randomizedtesting.ThreadLeakControl$3.evaluate(ThreadLeakControl.java:460)
  at com.carrotsearch.randomizedtesting.RandomizedRunner.runSingleTest(RandomizedRunner.java:880)
  at com.carrotsearch.randomizedtesting.RandomizedRunner$5.evaluate(RandomizedRunner.java:781)
  at com.carrotsearch.randomizedtesting.RandomizedRunner$6.evaluate(RandomizedRunner.java:816)
  at com.carrotsearch.randomizedtesting.RandomizedRunner$7.evaluate(RandomizedRunner.java:827)
  at com.carrotsearch.randomizedtesting.rules.StatementAdapter.evaluate(StatementAdapter.java:36)
  at com.carrotsearch.randomizedtesting.rules.SystemPropertiesRestoreRule$1.evaluate(SystemPropertiesRestoreRule.java:57)
  at org.apache.lucene.util.AbstractBeforeAfterRule$1.evaluate(AbstractBeforeAfterRule.java:45)
  at com.carrotsearch.randomizedtesting.rules.StatementAdapter.evaluate(StatementAdapter.java:36)
  at org.apache.lucene.util.TestRuleStoreClassName$1.evaluate(TestRuleStoreClassName.java:41)
  at com.carrotsearch.randomizedtesting.rules.NoShadowingOrOverridesOnMethodsRule$1.evaluate(NoShadowingOrOverridesOnMethodsRule.java:40)
  at com.carrotsearch.randomizedtesting.rules.NoShadowingOrOverridesOnMethodsRule$1.evaluate(NoShadowingOrOverridesOnMethodsRule.java:40)
  at com.carrotsearch.randomizedtesting.rules.StatementAdapter.evaluate(StatementAdapter.java:36)
  at com.carrotsearch.randomizedtesting.rules.StatementAdapter.evaluate(StatementAdapter.java:36)
  at com.carrotsearch.randomizedtesting.rules.StatementAdapter.evaluate(StatementAdapter.java:36)
  at org.apache.lucene.util.TestRuleAssertionsRequired$1.evaluate(TestRuleAssertionsRequired.java:53)
  at org.apache.lucene.util.TestRuleMarkFailure$1.evaluate(TestRuleMarkFailure.java:47)
  at org.apache.lucene.util.TestRuleIgnoreAfterMaxFailures$1.evaluate(TestRuleIgnoreAfterMaxFailures.java:64)
  at org.apache.lucene.util.TestRuleIgnoreTestSuites$1.evaluate(TestRuleIgnoreTestSuites.java:54)
  at com.carrotsearch.randomizedtesting.rules.StatementAdapter.evaluate(StatementAdapter.java:36)
  at com.carrotsearch.randomizedtesting.ThreadLeakControl$StatementRunner.run(ThreadLeakControl.java:367)
  at java.lang.Thread.run(Thread.java:745)


FAILED: org.apache.solr.cloud.FullSolrCloudDistribCmdsTest.test

Error Message:
Error from server at http://127.0.0.1:61047/collection1: Expected mime type application/octet-stream but got text/html. <html> <head> <meta http-equiv="Content-Type" content="text/html;charset=ISO-8859-1"/> <title>Error 500 </title> </head> <body> <h2>HTTP ERROR: 500</h2> <p>Problem accessing /collection1/update. Reason: <pre> {metadata={error-class=org.apache.solr.common.SolrException,root-error-class=org.apache.solr.common.SolrException},msg=SolrCore &apos;collection1&apos; is not available due to init failure: Timed out getting coreNodeName for collection1,trace=org.apache.solr.common.SolrException: SolrCore &apos;collection1&apos; is not available due to init failure: Timed out getting coreNodeName for collection1 at org.apache.solr.core.CoreContainer.getCore(CoreContainer.java:1080) at org.apache.solr.servlet.HttpSolrCall.init(HttpSolrCall.java:256) at org.apache.solr.servlet.HttpSolrCall.call(HttpSolrCall.java:418) at org.apache.solr.servlet.SolrDispatchFilter.doFilter(SolrDispatchFilter.java:257) at org.apache.solr.servlet.SolrDispatchFilter.doFilter(SolrDispatchFilter.java:208) at org.eclipse.jetty.servlet.ServletHandler$CachedChain.doFilter(ServletHandler.java:1676) at org.apache.solr.client.solrj.embedded.JettySolrRunner$DebugFilter.doFilter(JettySolrRunner.java:109) at org.eclipse.jetty.servlet.ServletHandler$CachedChain.doFilter(ServletHandler.java:1676) at org.eclipse.jetty.servlet.ServletHandler.doHandle(ServletHandler.java:581) at org.eclipse.jetty.server.session.SessionHandler.doHandle(SessionHandler.java:224) at org.eclipse.jetty.server.handler.ContextHandler.doHandle(ContextHandler.java:1160) at org.eclipse.jetty.servlet.ServletHandler.doScope(ServletHandler.java:511) at org.eclipse.jetty.server.session.SessionHandler.doScope(SessionHandler.java:185) at org.eclipse.jetty.server.handler.ContextHandler.doScope(ContextHandler.java:1092) at org.eclipse.jetty.server.handler.ScopedHandler.handle(ScopedHandler.java:141) at org.eclipse.jetty.server.handler.gzip.GzipHandler.handle(GzipHandler.java:399) at org.eclipse.jetty.server.handler.HandlerWrapper.handle(HandlerWrapper.java:134) at org.eclipse.jetty.server.Server.handle(Server.java:518) at org.eclipse.jetty.server.HttpChannel.handle(HttpChannel.java:308) at org.eclipse.jetty.server.HttpConnection.onFillable(HttpConnection.java:244) at org.eclipse.jetty.io.AbstractConnection$ReadCallback.succeeded(AbstractConnection.java:273) at org.eclipse.jetty.io.FillInterest.fillable(FillInterest.java:95) at org.eclipse.jetty.io.SelectChannelEndPoint$2.run(SelectChannelEndPoint.java:93) at org.eclipse.jetty.util.thread.strategy.ExecuteProduceConsume.produceAndRun(ExecuteProduceConsume.java:246) at org.eclipse.jetty.util.thread.strategy.ExecuteProduceConsume.run(ExecuteProduceConsume.java:156) at org.eclipse.jetty.util.thread.QueuedThreadPool.runJob(QueuedThreadPool.java:654) at org.eclipse.jetty.util.thread.QueuedThreadPool$3.run(QueuedThreadPool.java:572) at java.lang.Thread.run(Thread.java:745) Caused by: org.apache.solr.common.SolrException: Timed out getting coreNodeName for collection1 at org.apache.solr.cloud.ZkController.waitForCoreNodeName(ZkController.java:1387) at org.apache.solr.cloud.ZkController.doGetShardIdAndNodeNameProcess(ZkController.java:1365) at org.apache.solr.cloud.ZkController.preRegister(ZkController.java:1456) at org.apache.solr.core.CoreContainer.create(CoreContainer.java:809) at org.apache.solr.core.CoreContainer.lambda$load$0(CoreContainer.java:468) at java.util.concurrent.FutureTask.run(FutureTask.java:266) at org.apache.solr.common.util.ExecutorUtil$MDCAwareThreadPoolExecutor.lambda$execute$0(ExecutorUtil.java:229) at java.util.concurrent.ThreadPoolExecutor.runWorker(ThreadPoolExecutor.java:1142) at java.util.concurrent.ThreadPoolExecutor$Worker.run(ThreadPoolExecutor.java:617) ... 1 more ,code=500}</pre></p> <hr /><a href="http://eclipse.org/jetty">Powered by Jetty:// 9.3.8.v20160314</a><hr/> </body> </html>

Stack Trace:
org.apache.solr.client.solrj.impl.HttpSolrClient$RemoteSolrException: Error from server at http://127.0.0.1:61047/collection1: Expected mime type application/octet-stream but got text/html. <html>
<head>
<meta http-equiv="Content-Type" content="text/html;charset=ISO-8859-1"/>
<title>Error 500 </title>
</head>
<body>
<h2>HTTP ERROR: 500</h2>
<p>Problem accessing /collection1/update. Reason:
<pre> {metadata={error-class=org.apache.solr.common.SolrException,root-error-class=org.apache.solr.common.SolrException},msg=SolrCore &apos;collection1&apos; is not available due to init failure: Timed out getting coreNodeName for collection1,trace=org.apache.solr.common.SolrException: SolrCore &apos;collection1&apos; is not available due to init failure: Timed out getting coreNodeName for collection1
  at org.apache.solr.core.CoreContainer.getCore(CoreContainer.java:1080)
  at org.apache.solr.servlet.HttpSolrCall.init(HttpSolrCall.java:256)
  at org.apache.solr.servlet.HttpSolrCall.call(HttpSolrCall.java:418)
  at org.apache.solr.servlet.SolrDispatchFilter.doFilter(SolrDispatchFilter.java:257)
  at org.apache.solr.servlet.SolrDispatchFilter.doFilter(SolrDispatchFilter.java:208)
  at org.eclipse.jetty.servlet.ServletHandler$CachedChain.doFilter(ServletHandler.java:1676)
  at org.apache.solr.client.solrj.embedded.JettySolrRunner$DebugFilter.doFilter(JettySolrRunner.java:109)
  at org.eclipse.jetty.servlet.ServletHandler$CachedChain.doFilter(ServletHandler.java:1676)
  at org.eclipse.jetty.servlet.ServletHandler.doHandle(ServletHandler.java:581)
  at org.eclipse.jetty.server.session.SessionHandler.doHandle(SessionHandler.java:224)
  at org.eclipse.jetty.server.handler.ContextHandler.doHandle(ContextHandler.java:1160)
  at org.eclipse.jetty.servlet.ServletHandler.doScope(ServletHandler.java:511)
  at org.eclipse.jetty.server.session.SessionHandler.doScope(SessionHandler.java:185)
  at org.eclipse.jetty.server.handler.ContextHandler.doScope(ContextHandler.java:1092)
  at org.eclipse.jetty.server.handler.ScopedHandler.handle(ScopedHandler.java:141)
  at org.eclipse.jetty.server.handler.gzip.GzipHandler.handle(GzipHandler.java:399)
  at org.eclipse.jetty.server.handler.HandlerWrapper.handle(HandlerWrapper.java:134)
  at org.eclipse.jetty.server.Server.handle(Server.java:518)
  at org.eclipse.jetty.server.HttpChannel.handle(HttpChannel.java:308)
  at org.eclipse.jetty.server.HttpConnection.onFillable(HttpConnection.java:244)
  at org.eclipse.jetty.io.AbstractConnection$ReadCallback.succeeded(AbstractConnection.java:273)
  at org.eclipse.jetty.io.FillInterest.fillable(FillInterest.java:95)
  at org.eclipse.jetty.io.SelectChannelEndPoint$2.run(SelectChannelEndPoint.java:93)
  at org.eclipse.jetty.util.thread.strategy.ExecuteProduceConsume.produceAndRun(ExecuteProduceConsume.java:246)
  at org.eclipse.jetty.util.thread.strategy.ExecuteProduceConsume.run(ExecuteProduceConsume.java:156)
  at org.eclipse.jetty.util.thread.QueuedThreadPool.runJob(QueuedThreadPool.java:654)
  at org.eclipse.jetty.util.thread.QueuedThreadPool$3.run(QueuedThreadPool.java:572)
  at java.lang.Thread.run(Thread.java:745)
Caused by: org.apache.solr.common.SolrException: Timed out getting coreNodeName for collection1
  at org.apache.solr.cloud.ZkController.waitForCoreNodeName(ZkController.java:1387)
  at org.apache.solr.cloud.ZkController.doGetShardIdAndNodeNameProcess(ZkController.java:1365)
  at org.apache.solr.cloud.ZkController.preRegister(ZkController.java:1456)
  at org.apache.solr.core.CoreContainer.create(CoreContainer.java:809)
  at org.apache.solr.core.CoreContainer.lambda$load$0(CoreContainer.java:468)
  at java.util.concurrent.FutureTask.run(FutureTask.java:266)
  at org.apache.solr.common.util.ExecutorUtil$MDCAwareThreadPoolExecutor.lambda$execute$0(ExecutorUtil.java:229)
  at java.util.concurrent.ThreadPoolExecutor.runWorker(ThreadPoolExecutor.java:1142)
  at java.util.concurrent.ThreadPoolExecutor$Worker.run(ThreadPoolExecutor.java:617)
  ... 1 more
,code=500}</pre></p>
<hr /><a href="http://eclipse.org/jetty">Powered by Jetty:// 9.3.8.v20160314</a><hr/>
</body>
[AAFF994773ADCAE8:22ABA69DDD51A710]:0)
  at org.apache.solr.client.solrj.impl.HttpSolrClient.executeMethod(HttpSolrClient.java:558)
  at org.apache.solr.client.solrj.impl.HttpSolrClient.request(HttpSolrClient.java:259)
  at org.apache.solr.client.solrj.impl.HttpSolrClient.request(HttpSolrClient.java:248)
  at org.apache.solr.client.solrj.SolrRequest.process(SolrRequest.java:149)
  at org.apache.solr.client.solrj.SolrRequest.process(SolrRequest.java:166)
  at org.apache.solr.cloud.AbstractFullDistribZkTestBase.indexDoc(AbstractFullDistribZkTestBase.java:775)
  at org.apache.solr.BaseDistributedSearchTestCase.indexr(BaseDistributedSearchTestCase.java:472)
  at org.apache.solr.cloud.FullSolrCloudDistribCmdsTest.addUpdateDelete(FullSolrCloudDistribCmdsTest.java:472)
  at org.apache.solr.cloud.FullSolrCloudDistribCmdsTest.test(FullSolrCloudDistribCmdsTest.java:81)
  at sun.reflect.NativeMethodAccessorImpl.invoke0(Native Method)
  at sun.reflect.NativeMethodAccessorImpl.invoke(NativeMethodAccessorImpl.java:62)
  at sun.reflect.DelegatingMethodAccessorImpl.invoke(DelegatingMethodAccessorImpl.java:43)
  at java.lang.reflect.Method.invoke(Method.java:498)
  at com.carrotsearch.randomizedtesting.RandomizedRunner.invoke(RandomizedRunner.java:1764)
  at com.carrotsearch.randomizedtesting.RandomizedRunner$8.evaluate(RandomizedRunner.java:871)
  at com.carrotsearch.randomizedtesting.RandomizedRunner$9.evaluate(RandomizedRunner.java:907)
  at com.carrotsearch.randomizedtesting.RandomizedRunner$10.evaluate(RandomizedRunner.java:921)
  at org.apache.solr.BaseDistributedSearchTestCase$ShardsRepeatRule$ShardsFixedStatement.callStatement(BaseDistributedSearchTestCase.java:992)
  at org.apache.solr.BaseDistributedSearchTestCase$ShardsRepeatRule$ShardsStatement.evaluate(BaseDistributedSearchTestCase.java:967)
  at com.carrotsearch.randomizedtesting.rules.SystemPropertiesRestoreRule$1.evaluate(SystemPropertiesRestoreRule.java:57)
  at org.apache.lucene.util.TestRuleSetupTeardownChained$1.evaluate(TestRuleSetupTeardownChained.java:49)
  at org.apache.lucene.util.AbstractBeforeAfterRule$1.evaluate(AbstractBeforeAfterRule.java:45)
  at org.apache.lucene.util.TestRuleThreadAndTestName$1.evaluate(TestRuleThreadAndTestName.java:48)
  at org.apache.lucene.util.TestRuleIgnoreAfterMaxFailures$1.evaluate(TestRuleIgnoreAfterMaxFailures.java:64)
  at org.apache.lucene.util.TestRuleMarkFailure$1.evaluate(TestRuleMarkFailure.java:47)
  at com.carrotsearch.randomizedtesting.rules.StatementAdapter.evaluate(StatementAdapter.java:36)
  at com.carrotsearch.randomizedtesting.ThreadLeakControl$StatementRunner.run(ThreadLeakControl.java:367)
  at com.carrotsearch.randomizedtesting.ThreadLeakControl.forkTimeoutingTask(ThreadLeakControl.java:809)
  at com.carrotsearch.randomizedtesting.ThreadLeakControl$3.evaluate(ThreadLeakControl.java:460)
  at com.carrotsearch.randomizedtesting.RandomizedRunner.runSingleTest(RandomizedRunner.java:880)
  at com.carrotsearch.randomizedtesting.RandomizedRunner$5.evaluate(RandomizedRunner.java:781)
  at com.carrotsearch.randomizedtesting.RandomizedRunner$6.evaluate(RandomizedRunner.java:816)
  at com.carrotsearch.randomizedtesting.RandomizedRunner$7.evaluate(RandomizedRunner.java:827)
  at com.carrotsearch.randomizedtesting.rules.StatementAdapter.evaluate(StatementAdapter.java:36)
  at com.carrotsearch.randomizedtesting.rules.SystemPropertiesRestoreRule$1.evaluate(SystemPropertiesRestoreRule.java:57)
  at org.apache.lucene.util.AbstractBeforeAfterRule$1.evaluate(AbstractBeforeAfterRule.java:45)
  at com.carrotsearch.randomizedtesting.rules.StatementAdapter.evaluate(StatementAdapter.java:36)
  at org.apache.lucene.util.TestRuleStoreClassName$1.evaluate(TestRuleStoreClassName.java:41)
  at com.carrotsearch.randomizedtesting.rules.NoShadowingOrOverridesOnMethodsRule$1.evaluate(NoShadowingOrOverridesOnMethodsRule.java:40)
  at com.carrotsearch.randomizedtesting.rules.NoShadowingOrOverridesOnMethodsRule$1.evaluate(NoShadowingOrOverridesOnMethodsRule.java:40)
  at com.carrotsearch.randomizedtesting.rules.StatementAdapter.evaluate(StatementAdapter.java:36)
  at com.carrotsearch.randomizedtesting.rules.StatementAdapter.evaluate(StatementAdapter.java:36)
  at com.carrotsearch.randomizedtesting.rules.StatementAdapter.evaluate(StatementAdapter.java:36)
  at org.apache.lucene.util.TestRuleAssertionsRequired$1.evaluate(TestRuleAssertionsRequired.java:53)
  at org.apache.lucene.util.TestRuleMarkFailure$1.evaluate(TestRuleMarkFailure.java:47)
  at org.apache.lucene.util.TestRuleIgnoreAfterMaxFailures$1.evaluate(TestRuleIgnoreAfterMaxFailures.java:64)
  at org.apache.lucene.util.TestRuleIgnoreTestSuites$1.evaluate(TestRuleIgnoreTestSuites.java:54)
  at com.carrotsearch.randomizedtesting.rules.StatementAdapter.evaluate(StatementAdapter.java:36)
  at com.carrotsearch.randomizedtesting.ThreadLeakControl$StatementRunner.run(ThreadLeakControl.java:367)
  at java.lang.Thread.run(Thread.java:745)


FAILED: org.apache.solr.cloud.LeaderElectionIntegrationTest.testSimpleSliceLeaderElection

Error Message:
Could not start container:7000. Reason:class org.apache.solr.common.SolrException Error CREATEing SolrCore 'collection1_shard1': Unable to create core [collection1_shard1] Caused by: Timed out getting coreNodeName for collection1_shard1

Stack Trace:
java.lang.AssertionError: Could not start container:7000. Reason:class org.apache.solr.common.SolrException Error CREATEing SolrCore 'collection1_shard1': Unable to create core [collection1_shard1] Caused by: Timed out getting coreNodeName for collection1_shard1
  at __randomizedtesting.SeedInfo.seed([AAFF994773ADCAE8:F4CB540930D2560F]:0)
  at org.junit.Assert.fail(Assert.java:93)
  at org.apache.solr.cloud.LeaderElectionIntegrationTest.setUp(LeaderElectionIntegrationTest.java:102)
  at sun.reflect.GeneratedMethodAccessor50.invoke(Unknown Source)
  at sun.reflect.DelegatingMethodAccessorImpl.invoke(DelegatingMethodAccessorImpl.java:43)
  at java.lang.reflect.Method.invoke(Method.java:498)
  at com.carrotsearch.randomizedtesting.RandomizedRunner.invoke(RandomizedRunner.java:1764)
  at com.carrotsearch.randomizedtesting.RandomizedRunner$9.evaluate(RandomizedRunner.java:905)
  at com.carrotsearch.randomizedtesting.RandomizedRunner$10.evaluate(RandomizedRunner.java:921)
  at com.carrotsearch.randomizedtesting.rules.SystemPropertiesRestoreRule$1.evaluate(SystemPropertiesRestoreRule.java:57)
  at org.apache.lucene.util.TestRuleSetupTeardownChained$1.evaluate(TestRuleSetupTeardownChained.java:49)
  at org.apache.lucene.util.AbstractBeforeAfterRule$1.evaluate(AbstractBeforeAfterRule.java:45)
  at org.apache.lucene.util.TestRuleThreadAndTestName$1.evaluate(TestRuleThreadAndTestName.java:48)
  at org.apache.lucene.util.TestRuleIgnoreAfterMaxFailures$1.evaluate(TestRuleIgnoreAfterMaxFailures.java:64)
  at org.apache.lucene.util.TestRuleMarkFailure$1.evaluate(TestRuleMarkFailure.java:47)
  at com.carrotsearch.randomizedtesting.rules.StatementAdapter.evaluate(StatementAdapter.java:36)
  at com.carrotsearch.randomizedtesting.ThreadLeakControl$StatementRunner.run(ThreadLeakControl.java:367)
  at com.carrotsearch.randomizedtesting.ThreadLeakControl.forkTimeoutingTask(ThreadLeakControl.java:809)
  at com.carrotsearch.randomizedtesting.ThreadLeakControl$3.evaluate(ThreadLeakControl.java:460)
  at com.carrotsearch.randomizedtesting.RandomizedRunner.runSingleTest(RandomizedRunner.java:880)
  at com.carrotsearch.randomizedtesting.RandomizedRunner$5.evaluate(RandomizedRunner.java:781)
  at com.carrotsearch.randomizedtesting.RandomizedRunner$6.evaluate(RandomizedRunner.java:816)
  at com.carrotsearch.randomizedtesting.RandomizedRunner$7.evaluate(RandomizedRunner.java:827)
  at com.carrotsearch.randomizedtesting.rules.StatementAdapter.evaluate(StatementAdapter.java:36)
  at com.carrotsearch.randomizedtesting.rules.SystemPropertiesRestoreRule$1.evaluate(SystemPropertiesRestoreRule.java:57)
  at org.apache.lucene.util.AbstractBeforeAfterRule$1.evaluate(AbstractBeforeAfterRule.java:45)
  at com.carrotsearch.randomizedtesting.rules.StatementAdapter.evaluate(StatementAdapter.java:36)
  at org.apache.lucene.util.TestRuleStoreClassName$1.evaluate(TestRuleStoreClassName.java:41)
  at com.carrotsearch.randomizedtesting.rules.NoShadowingOrOverridesOnMethodsRule$1.evaluate(NoShadowingOrOverridesOnMethodsRule.java:40)
  at com.carrotsearch.randomizedtesting.rules.NoShadowingOrOverridesOnMethodsRule$1.evaluate(NoShadowingOrOverridesOnMethodsRule.java:40)
  at com.carrotsearch.randomizedtesting.rules.StatementAdapter.evaluate(StatementAdapter.java:36)
  at com.carrotsearch.randomizedtesting.rules.StatementAdapter.evaluate(StatementAdapter.java:36)
  at com.carrotsearch.randomizedtesting.rules.StatementAdapter.evaluate(StatementAdapter.java:36)
  at org.apache.lucene.util.TestRuleAssertionsRequired$1.evaluate(TestRuleAssertionsRequired.java:53)
  at org.apache.lucene.util.TestRuleMarkFailure$1.evaluate(TestRuleMarkFailure.java:47)
  at org.apache.lucene.util.TestRuleIgnoreAfterMaxFailures$1.evaluate(TestRuleIgnoreAfterMaxFailures.java:64)
  at org.apache.lucene.util.TestRuleIgnoreTestSuites$1.evaluate(TestRuleIgno

[...truncated too long message...]

.eclipse.jetty.server.handler.ContextHandler.doHandle(ContextHandler.java:1160)
    [junit4] > at org.eclipse.jetty.servlet.ServletHandler.doScope(ServletHandler.java:511)
    [junit4] > at org.eclipse.jetty.server.session.SessionHandler.doScope(SessionHandler.java:185)
    [junit4] > at org.eclipse.jetty.server.handler.ContextHandler.doScope(ContextHandler.java:1092)
    [junit4] > at org.eclipse.jetty.server.handler.ScopedHandler.handle(ScopedHandler.java:141)
    [junit4] > at org.eclipse.jetty.server.handler.gzip.GzipHandler.handle(GzipHandler.java:399)
    [junit4] > at org.eclipse.jetty.server.handler.HandlerWrapper.handle(HandlerWrapper.java:134)
    [junit4] > at org.eclipse.jetty.server.Server.handle(Server.java:518)
    [junit4] > at org.eclipse.jetty.server.HttpChannel.handle(HttpChannel.java:308)
    [junit4] > at org.eclipse.jetty.server.HttpConnection.onFillable(HttpConnection.java:244)
    [junit4] > at org.eclipse.jetty.io.AbstractConnection$ReadCallback.succeeded(AbstractConnection.java:273)
    [junit4] > at org.eclipse.jetty.io.FillInterest.fillable(FillInterest.java:95)
    [junit4] > at org.eclipse.jetty.io.SelectChannelEndPoint$2.run(SelectChannelEndPoint.java:93)
    [junit4] > at org.eclipse.jetty.util.thread.strategy.ExecuteProduceConsume.produceAndRun(ExecuteProduceConsume.java:246)
    [junit4] > at org.eclipse.jetty.util.thread.strategy.ExecuteProduceConsume.run(ExecuteProduceConsume.java:156)
    [junit4] > at org.eclipse.jetty.util.thread.QueuedThreadPool.runJob(QueuedThreadPool.java:654)
    [junit4] > at org.eclipse.jetty.util.thread.QueuedThreadPool$3.run(QueuedThreadPool.java:572)
    [junit4] > at java.lang.Thread.run(Thread.java:745)
    [junit4] > Caused by: org.apache.solr.common.SolrException: Timed out getting coreNodeName for collection1
    [junit4] > at org.apache.solr.cloud.ZkController.waitForCoreNodeName(ZkController.java:1387)
    [junit4] > at org.apache.solr.cloud.ZkController.doGetShardIdAndNodeNameProcess(ZkController.java:1365)
    [junit4] > at org.apache.solr.cloud.ZkController.preRegister(ZkController.java:1456)
    [junit4] > at org.apache.solr.core.CoreContainer.create(CoreContainer.java:809)
    [junit4] > at org.apache.solr.core.CoreContainer.lambda$load$0(CoreContainer.java:468)
    [junit4] > at java.util.concurrent.FutureTask.run(FutureTask.java:266)
    [junit4] > at org.apache.solr.common.util.ExecutorUtil$MDCAwareThreadPoolExecutor.lambda$execute$0(ExecutorUtil.java:229)
    [junit4] > at java.util.concurrent.ThreadPoolExecutor.runWorker(ThreadPoolExecutor.java:1142)
    [junit4] > at java.util.concurrent.ThreadPoolExecutor$Worker.run(ThreadPoolExecutor.java:617)
    [junit4] > ... 1 more
    [junit4] > ,code=500}</pre></p>
    [junit4] > <hr /><a href="http://eclipse.org/jetty">Powered by Jetty:// 9.3.8.v20160314</a><hr/>
    [junit4] > </body>
    [junit4] > </html>
    [junit4] > at __randomizedtesting.SeedInfo.seed([AAFF994773ADCAE8:22ABA69DDD51A710]:0)
    [junit4] > at org.apache.solr.client.solrj.impl.HttpSolrClient.executeMethod(HttpSolrClient.java:558)
    [junit4] > at org.apache.solr.client.solrj.impl.HttpSolrClient.request(HttpSolrClient.java:259)
    [junit4] > at org.apache.solr.client.solrj.impl.HttpSolrClient.request(HttpSolrClient.java:248)
    [junit4] > at org.apache.solr.client.solrj.SolrRequest.process(SolrRequest.java:149)
    [junit4] > at org.apache.solr.client.solrj.SolrClient.deleteByQuery(SolrClient.java:895)
    [junit4] > at org.apache.solr.client.solrj.SolrClient.deleteByQuery(SolrClient.java:858)
    [junit4] > at org.apache.solr.client.solrj.SolrClient.deleteByQuery(SolrClient.java:873)
    [junit4] > at org.apache.solr.cloud.AbstractFullDistribZkTestBase.del(AbstractFullDistribZkTestBase.java:835)
    [junit4] > at org.apache.solr.cloud.BasicDistributedZkTest.test(BasicDistributedZkTest.java:152)
    [junit4] > at org.apache.solr.BaseDistributedSearchTestCase$ShardsRepeatRule$ShardsFixedStatement.callStatement(BaseDistributedSearchTestCase.java:992)
    [junit4] > at org.apache.solr.BaseDistributedSearchTestCase$ShardsRepeatRule$ShardsStatement.evaluate(BaseDistributedSearchTestCase.java:967)
    [junit4] > at java.lang.Thread.run(Thread.java:745)
    [junit4] 2> 16368153 INFO (SUITE-BasicDistributedZkTest-seed#[AAFF994773ADCAE8]-worker) [ ] o.a.s.SolrTestCaseJ4 ###deleteCore
    [junit4] 2> NOTE: leaving temporary files on disk at: /export/home/jenkins/workspace/Lucene-Solr-6.x-Solaris/solr/build/solr-core/test/J0/temp/solr.cloud.BasicDistributedZkTest_AAFF994773ADCAE8-001
    [junit4] 2> Jun 06, 2016 2:02:31 AM com.carrotsearch.randomizedtesting.ThreadLeakControl checkThreadLeaks
    [junit4] 2> WARNING: Will linger awaiting termination of 1 leaked thread(s).
    [junit4] 2> NOTE: test params are: codec=Asserting(Lucene60): {}, docValues:{}, maxPointsInLeafNode=1491, maxMBSortInHeap=7.370068998132778, sim=ClassicSimilarity, locale=no-NO, timezone=Etc/GMT+2
    [junit4] 2> NOTE: SunOS 5.11 amd64/Oracle Corporation 1.8.0_92 (64-bit)/cpus=3,threads=1,free=97044632,total=467030016
    [junit4] 2> NOTE: All tests run in this JVM: [CdcrReplicationDistributedZkTest, TestSolrConfigHandlerConcurrent, TestAnalyzeInfixSuggestions, PrimUtilsTest, TestSchemaNameResource, TestFaceting, TestLFUCache, PingRequestHandlerTest, TestGraphMLResponseWriter, TestDownShardTolerantSearch, CurrencyFieldXmlFileTest, TestObjectReleaseTracker, TestHighFrequencyDictionaryFactory, TestGroupingSearch, HdfsThreadLeakTest, TestIntervalFaceting, ChaosMonkeyNothingIsSafeTest, TestFilteredDocIdSet, SuggesterFSTTest, TestCloudBackupRestore, TestPartialUpdateDeduplication, FastVectorHighlighterTest, SpatialHeatmapFacetsTest, TestWordDelimiterFilterFactory, ConcurrentDeleteAndCreateCollectionTest, CdcrUpdateLogTest, TestRemoteStreaming, AlternateDirectoryTest, OverseerStatusTest, TestMiniSolrCloudClusterBase, ScriptEngineTest, ZkStateReaderTest, TestDistributedSearch, URLClassifyProcessorTest, JsonLoaderTest, SimpleMLTQParserTest, TestManagedSchemaAPI, MigrateRouteKeyTest, TestDFRSimilarityFactory, HdfsRestartWhileUpdatingTest, AddBlockUpdateTest, TestDocSet, SyncSliceTest, TestConfigReload, TestRuleBasedAuthorizationPlugin, TestDocBasedVersionConstraints, SliceStateTest, TestHdfsUpdateLog, TestNumericTerms64, TestCollationFieldDocValues, HighlighterTest, UUIDUpdateProcessorFallbackTest, TestSolrFieldCacheMBean, BadComponentTest, TestCollapseQParserPlugin, UUIDFieldTest, SOLR749Test, DeleteShardTest, DistributedFacetPivotLongTailTest, LeaderInitiatedRecoveryOnCommitTest, MoreLikeThisHandlerTest, BasicAuthIntegrationTest, TestElisionMultitermQuery, TestExtendedDismaxParser, SaslZkACLProviderTest, TestLMDirichletSimilarityFactory, AssignTest, ResponseHeaderTest, TestFieldTypeCollectionResource, TestHighlightDedupGrouping, TestJmxIntegration, TestXIncludeConfig, TestQuerySenderNoQuery, HdfsDirectoryFactoryTest, TestNoOpRegenerator, HdfsCollectionsAPIDistributedZkTest, TestFastLRUCache, TestDocTermOrds, DocumentBuilderTest, TestJsonRequest, TestAnalyzedSuggestions, DistribCursorPagingTest, SolrCoreTest, TestMergePolicyConfig, ReplicationFactorTest, CdcrRequestHandlerTest, BlockDirectoryTest, TestManagedStopFilterFactory, TestSubQueryTransformerDistrib, DistributedExpandComponentTest, SimpleFacetsTest, SharedFSAutoReplicaFailoverTest, TestRecoveryHdfs, StressHdfsTest, EnumFieldTest, TestCustomSort, TestLRUCache, TriLevelCompositeIdRoutingTest, UnloadDistributedZkTest, RulesTest, TestUseDocValuesAsStored, QueryElevationComponentTest, TermsComponentTest, BitVectorTest, BadCopyFieldTest, HdfsUnloadDistributedZkTest, SolrIndexConfigTest, ParsingFieldUpdateProcessorsTest, ShardRoutingTest, TimeZoneUtilsTest, RequiredFieldsTest, TestTrackingShardHandlerFactory, CoreAdminRequestStatusTest, SegmentsInfoRequestHandlerTest, TestReqParamsAPI, DirectoryFactoryTest, SampleTest, AddSchemaFieldsUpdateProcessorFactoryTest, TestSearchPerf, TestReplicaProperties, DocExpirationUpdateProcessorFactoryTest, DistribJoinFromCollectionTest, DistributedSuggestComponentTest, TestMiniSolrCloudClusterSSL, SchemaVersionSpecificBehaviorTest, TestStressLiveNodes, WrapperMergePolicyFactoryTest, TestRandomRequestDistribution, TestSolrQueryParserResource, HardAutoCommitTest, ClusterStateTest, TestReplicationHandler, SimpleCollectionCreateDeleteTest, BlockJoinFacetSimpleTest, MBeansHandlerTest, TestSerializedLuceneMatchVersion, BasicDistributedZkTest]
    [junit4] Completed [605/613 (21!)] on J0 in 616.75s, 1 test, 1 error <<< FAILURES!

[...truncated 53 lines...]
BUILD FAILED
/export/home/jenkins/workspace/Lucene-Solr-6.x-Solaris/build.xml:740: The following error occurred while executing this line:
/export/home/jenkins/workspace/Lucene-Solr-6.x-Solaris/build.xml:684: The following error occurred while executing this line:
/export/home/jenkins/workspace/Lucene-Solr-6.x-Solaris/build.xml:59: The following error occurred while executing this line:
/export/home/jenkins/workspace/Lucene-Solr-6.x-Solaris/solr/build.xml:233: The following error occurred while executing this line:
/export/home/jenkins/workspace/Lucene-Solr-6.x-Solaris/solr/common-build.xml:531: The following error occurred while executing this line:
/export/home/jenkins/workspace/Lucene-Solr-6.x-Solaris/lucene/common-build.xml:1427: The following error occurred while executing this line:
/export/home/jenkins/workspace/Lucene-Solr-6.x-Solaris/lucene/common-build.xml:984: There were test failures: 613 suites (10 ignored), 2567 tests, 2 suite-level errors, 19 errors, 3 failures, 1241 ignored (66 assumptions) [seed: AAFF994773ADCAE8]

Total time: 302 minutes 3 seconds
Build step 'Invoke Ant' marked build as failure
Archiving artifacts
[WARNINGS] Skipping publisher since build result is FAILURE
Recording test results
Email was triggered for: Failure - Any
Sending email for trigger: Failure - Any

Search Discussions

  • Policeman Jenkins Server at Jun 6, 2016 at 9:13 pm
    Build: http://jenkins.thetaphi.de/job/Lucene-Solr-6.x-Solaris/181/
    Java: 64bit/jdk1.8.0 -XX:-UseCompressedOops -XX:+UseParallelGC

    20 tests failed.
    FAILED: org.apache.solr.handler.TestReqParamsAPI.test

    Error Message:
    Could not get expected value 'first' for path 'response/params/x/_appends_/add' full output: { "responseHeader":{ "status":0, "QTime":0}, "response":{ "znodeVersion":3, "params":{ "x":{ "a":"A val", "b":"B val", "":{"v":0}}, "y":{ "p":"P val", "q":"Q val", "":{"v":2}}}}}, from server: http://127.0.0.1:61530/uw_gxj/dc/collection1

    Stack Trace:
    java.lang.AssertionError: Could not get expected value 'first' for path 'response/params/x/_appends_/add' full output: {
       "responseHeader":{
         "status":0,
         "QTime":0},
       "response":{
         "znodeVersion":3,
         "params":{
           "x":{
             "a":"A val",
             "b":"B val",
             "":{"v":0}},
           "y":{
             "p":"P val",
             "q":"Q val",
             "":{"v":2}}}}}, from server: http://127.0.0.1:61530/uw_gxj/dc/collection1
      at __randomizedtesting.SeedInfo.seed([E23C5815F355BF8A:6A6867CF5DA9D272]:0)
      at org.junit.Assert.fail(Assert.java:93)
      at org.junit.Assert.assertTrue(Assert.java:43)
      at org.apache.solr.core.TestSolrConfigHandler.testForResponseElement(TestSolrConfigHandler.java:457)
      at org.apache.solr.handler.TestReqParamsAPI.testReqParams(TestReqParamsAPI.java:231)
      at org.apache.solr.handler.TestReqParamsAPI.test(TestReqParamsAPI.java:62)
      at sun.reflect.NativeMethodAccessorImpl.invoke0(Native Method)
      at sun.reflect.NativeMethodAccessorImpl.invoke(NativeMethodAccessorImpl.java:62)
      at sun.reflect.DelegatingMethodAccessorImpl.invoke(DelegatingMethodAccessorImpl.java:43)
      at java.lang.reflect.Method.invoke(Method.java:498)
      at com.carrotsearch.randomizedtesting.RandomizedRunner.invoke(RandomizedRunner.java:1764)
      at com.carrotsearch.randomizedtesting.RandomizedRunner$8.evaluate(RandomizedRunner.java:871)
      at com.carrotsearch.randomizedtesting.RandomizedRunner$9.evaluate(RandomizedRunner.java:907)
      at com.carrotsearch.randomizedtesting.RandomizedRunner$10.evaluate(RandomizedRunner.java:921)
      at org.apache.solr.BaseDistributedSearchTestCase$ShardsRepeatRule$ShardsFixedStatement.callStatement(BaseDistributedSearchTestCase.java:992)
      at org.apache.solr.BaseDistributedSearchTestCase$ShardsRepeatRule$ShardsStatement.evaluate(BaseDistributedSearchTestCase.java:967)
      at com.carrotsearch.randomizedtesting.rules.SystemPropertiesRestoreRule$1.evaluate(SystemPropertiesRestoreRule.java:57)
      at org.apache.lucene.util.TestRuleSetupTeardownChained$1.evaluate(TestRuleSetupTeardownChained.java:49)
      at org.apache.lucene.util.AbstractBeforeAfterRule$1.evaluate(AbstractBeforeAfterRule.java:45)
      at org.apache.lucene.util.TestRuleThreadAndTestName$1.evaluate(TestRuleThreadAndTestName.java:48)
      at org.apache.lucene.util.TestRuleIgnoreAfterMaxFailures$1.evaluate(TestRuleIgnoreAfterMaxFailures.java:64)
      at org.apache.lucene.util.TestRuleMarkFailure$1.evaluate(TestRuleMarkFailure.java:47)
      at com.carrotsearch.randomizedtesting.rules.StatementAdapter.evaluate(StatementAdapter.java:36)
      at com.carrotsearch.randomizedtesting.ThreadLeakControl$StatementRunner.run(ThreadLeakControl.java:367)
      at com.carrotsearch.randomizedtesting.ThreadLeakControl.forkTimeoutingTask(ThreadLeakControl.java:809)
      at com.carrotsearch.randomizedtesting.ThreadLeakControl$3.evaluate(ThreadLeakControl.java:460)
      at com.carrotsearch.randomizedtesting.RandomizedRunner.runSingleTest(RandomizedRunner.java:880)
      at com.carrotsearch.randomizedtesting.RandomizedRunner$5.evaluate(RandomizedRunner.java:781)
      at com.carrotsearch.randomizedtesting.RandomizedRunner$6.evaluate(RandomizedRunner.java:816)
      at com.carrotsearch.randomizedtesting.RandomizedRunner$7.evaluate(RandomizedRunner.java:827)
      at com.carrotsearch.randomizedtesting.rules.StatementAdapter.evaluate(StatementAdapter.java:36)
      at com.carrotsearch.randomizedtesting.rules.SystemPropertiesRestoreRule$1.evaluate(SystemPropertiesRestoreRule.java:57)
      at org.apache.lucene.util.AbstractBeforeAfterRule$1.evaluate(AbstractBeforeAfterRule.java:45)
      at com.carrotsearch.randomizedtesting.rules.StatementAdapter.evaluate(StatementAdapter.java:36)
      at org.apache.lucene.util.TestRuleStoreClassName$1.evaluate(TestRuleStoreClassName.java:41)
      at com.carrotsearch.randomizedtesting.rules.NoShadowingOrOverridesOnMethodsRule$1.evaluate(NoShadowingOrOverridesOnMethodsRule.java:40)
      at com.carrotsearch.randomizedtesting.rules.NoShadowingOrOverridesOnMethodsRule$1.evaluate(NoShadowingOrOverridesOnMethodsRule.java:40)
      at com.carrotsearch.randomizedtesting.rules.StatementAdapter.evaluate(StatementAdapter.java:36)
      at com.carrotsearch.randomizedtesting.rules.StatementAdapter.evaluate(StatementAdapter.java:36)
      at com.carrotsearch.randomizedtesting.rules.StatementAdapter.evaluate(StatementAdapter.java:36)
      at org.apache.lucene.util.TestRuleAssertionsRequired$1.evaluate(TestRuleAssertionsRequired.java:53)
      at org.apache.lucene.util.TestRuleMarkFailure$1.evaluate(TestRuleMarkFailure.java:47)
      at org.apache.lucene.util.TestRuleIgnoreAfterMaxFailures$1.evaluate(TestRuleIgnoreAfterMaxFailures.java:64)
      at org.apache.lucene.util.TestRuleIgnoreTestSuites$1.evaluate(TestRuleIgnoreTestSuites.java:54)
      at com.carrotsearch.randomizedtesting.rules.StatementAdapter.evaluate(StatementAdapter.java:36)
      at com.carrotsearch.randomizedtesting.ThreadLeakControl$StatementRunner.run(ThreadLeakControl.java:367)
      at java.lang.Thread.run(Thread.java:745)


    FAILED: org.apache.solr.schema.TestCloudManagedSchema.test

    Error Message:
    Schema resource name differs from expected name expected:<[managed-schema]> but was:<[schema.xml]>

    Stack Trace:
    org.junit.ComparisonFailure: Schema resource name differs from expected name expected:<[managed-schema]> but was:[E23C5815F355BF8A:6A6867CF5DA9D272]:0)
      at org.junit.Assert.assertEquals(Assert.java:125)
      at org.apache.solr.schema.TestCloudManagedSchema.test(TestCloudManagedSchema.java:68)
      at sun.reflect.NativeMethodAccessorImpl.invoke0(Native Method)
      at sun.reflect.NativeMethodAccessorImpl.invoke(NativeMethodAccessorImpl.java:62)
      at sun.reflect.DelegatingMethodAccessorImpl.invoke(DelegatingMethodAccessorImpl.java:43)
      at java.lang.reflect.Method.invoke(Method.java:498)
      at com.carrotsearch.randomizedtesting.RandomizedRunner.invoke(RandomizedRunner.java:1764)
      at com.carrotsearch.randomizedtesting.RandomizedRunner$8.evaluate(RandomizedRunner.java:871)
      at com.carrotsearch.randomizedtesting.RandomizedRunner$9.evaluate(RandomizedRunner.java:907)
      at com.carrotsearch.randomizedtesting.RandomizedRunner$10.evaluate(RandomizedRunner.java:921)
      at org.apache.solr.BaseDistributedSearchTestCase$ShardsRepeatRule$ShardsFixedStatement.callStatement(BaseDistributedSearchTestCase.java:992)
      at org.apache.solr.BaseDistributedSearchTestCase$ShardsRepeatRule$ShardsStatement.evaluate(BaseDistributedSearchTestCase.java:967)
      at com.carrotsearch.randomizedtesting.rules.SystemPropertiesRestoreRule$1.evaluate(SystemPropertiesRestoreRule.java:57)
      at org.apache.lucene.util.TestRuleSetupTeardownChained$1.evaluate(TestRuleSetupTeardownChained.java:49)
      at org.apache.lucene.util.AbstractBeforeAfterRule$1.evaluate(AbstractBeforeAfterRule.java:45)
      at org.apache.lucene.util.TestRuleThreadAndTestName$1.evaluate(TestRuleThreadAndTestName.java:48)
      at org.apache.lucene.util.TestRuleIgnoreAfterMaxFailures$1.evaluate(TestRuleIgnoreAfterMaxFailures.java:64)
      at org.apache.lucene.util.TestRuleMarkFailure$1.evaluate(TestRuleMarkFailure.java:47)
      at com.carrotsearch.randomizedtesting.rules.StatementAdapter.evaluate(StatementAdapter.java:36)
      at com.carrotsearch.randomizedtesting.ThreadLeakControl$StatementRunner.run(ThreadLeakControl.java:367)
      at com.carrotsearch.randomizedtesting.ThreadLeakControl.forkTimeoutingTask(ThreadLeakControl.java:809)
      at com.carrotsearch.randomizedtesting.ThreadLeakControl$3.evaluate(ThreadLeakControl.java:460)
      at com.carrotsearch.randomizedtesting.RandomizedRunner.runSingleTest(RandomizedRunner.java:880)
      at com.carrotsearch.randomizedtesting.RandomizedRunner$5.evaluate(RandomizedRunner.java:781)
      at com.carrotsearch.randomizedtesting.RandomizedRunner$6.evaluate(RandomizedRunner.java:816)
      at com.carrotsearch.randomizedtesting.RandomizedRunner$7.evaluate(RandomizedRunner.java:827)
      at com.carrotsearch.randomizedtesting.rules.StatementAdapter.evaluate(StatementAdapter.java:36)
      at com.carrotsearch.randomizedtesting.rules.SystemPropertiesRestoreRule$1.evaluate(SystemPropertiesRestoreRule.java:57)
      at org.apache.lucene.util.AbstractBeforeAfterRule$1.evaluate(AbstractBeforeAfterRule.java:45)
      at com.carrotsearch.randomizedtesting.rules.StatementAdapter.evaluate(StatementAdapter.java:36)
      at org.apache.lucene.util.TestRuleStoreClassName$1.evaluate(TestRuleStoreClassName.java:41)
      at com.carrotsearch.randomizedtesting.rules.NoShadowingOrOverridesOnMethodsRule$1.evaluate(NoShadowingOrOverridesOnMethodsRule.java:40)
      at com.carrotsearch.randomizedtesting.rules.NoShadowingOrOverridesOnMethodsRule$1.evaluate(NoShadowingOrOverridesOnMethodsRule.java:40)
      at com.carrotsearch.randomizedtesting.rules.StatementAdapter.evaluate(StatementAdapter.java:36)
      at com.carrotsearch.randomizedtesting.rules.StatementAdapter.evaluate(StatementAdapter.java:36)
      at com.carrotsearch.randomizedtesting.rules.StatementAdapter.evaluate(StatementAdapter.java:36)
      at org.apache.lucene.util.TestRuleAssertionsRequired$1.evaluate(TestRuleAssertionsRequired.java:53)
      at org.apache.lucene.util.TestRuleMarkFailure$1.evaluate(TestRuleMarkFailure.java:47)
      at org.apache.lucene.util.TestRuleIgnoreAfterMaxFailures$1.evaluate(TestRuleIgnoreAfterMaxFailures.java:64)
      at org.apache.lucene.util.TestRuleIgnoreTestSuites$1.evaluate(TestRuleIgnoreTestSuites.java:54)
      at com.carrotsearch.randomizedtesting.rules.StatementAdapter.evaluate(StatementAdapter.java:36)
      at com.carrotsearch.randomizedtesting.ThreadLeakControl$StatementRunner.run(ThreadLeakControl.java:367)
      at java.lang.Thread.run(Thread.java:745)


    FAILED: org.apache.solr.cloud.OverseerStatusTest.test

    Error Message:
    No registered leader was found after waiting for 10000ms , collection: collection1 slice: shard1

    Stack Trace:
    org.apache.solr.common.SolrException: No registered leader was found after waiting for 10000ms , collection: collection1 slice: shard1
      at __randomizedtesting.SeedInfo.seed([E23C5815F355BF8A:6A6867CF5DA9D272]:0)
      at org.apache.solr.common.cloud.ZkStateReader.getLeaderRetry(ZkStateReader.java:718)
      at org.apache.solr.cloud.AbstractFullDistribZkTestBase.createJettys(AbstractFullDistribZkTestBase.java:427)
      at org.apache.solr.cloud.AbstractFullDistribZkTestBase.createServers(AbstractFullDistribZkTestBase.java:332)
      at org.apache.solr.BaseDistributedSearchTestCase$ShardsRepeatRule$ShardsFixedStatement.callStatement(BaseDistributedSearchTestCase.java:990)
      at org.apache.solr.BaseDistributedSearchTestCase$ShardsRepeatRule$ShardsStatement.evaluate(BaseDistributedSearchTestCase.java:967)
      at com.carrotsearch.randomizedtesting.rules.SystemPropertiesRestoreRule$1.evaluate(SystemPropertiesRestoreRule.java:57)
      at org.apache.lucene.util.TestRuleSetupTeardownChained$1.evaluate(TestRuleSetupTeardownChained.java:49)
      at org.apache.lucene.util.AbstractBeforeAfterRule$1.evaluate(AbstractBeforeAfterRule.java:45)
      at org.apache.lucene.util.TestRuleThreadAndTestName$1.evaluate(TestRuleThreadAndTestName.java:48)
      at org.apache.lucene.util.TestRuleIgnoreAfterMaxFailures$1.evaluate(TestRuleIgnoreAfterMaxFailures.java:64)
      at org.apache.lucene.util.TestRuleMarkFailure$1.evaluate(TestRuleMarkFailure.java:47)
      at com.carrotsearch.randomizedtesting.rules.StatementAdapter.evaluate(StatementAdapter.java:36)
      at com.carrotsearch.randomizedtesting.ThreadLeakControl$StatementRunner.run(ThreadLeakControl.java:367)
      at com.carrotsearch.randomizedtesting.ThreadLeakControl.forkTimeoutingTask(ThreadLeakControl.java:809)
      at com.carrotsearch.randomizedtesting.ThreadLeakControl$3.evaluate(ThreadLeakControl.java:460)
      at com.carrotsearch.randomizedtesting.RandomizedRunner.runSingleTest(RandomizedRunner.java:880)
      at com.carrotsearch.randomizedtesting.RandomizedRunner$5.evaluate(RandomizedRunner.java:781)
      at com.carrotsearch.randomizedtesting.RandomizedRunner$6.evaluate(RandomizedRunner.java:816)
      at com.carrotsearch.randomizedtesting.RandomizedRunner$7.evaluate(RandomizedRunner.java:827)
      at com.carrotsearch.randomizedtesting.rules.StatementAdapter.evaluate(StatementAdapter.java:36)
      at com.carrotsearch.randomizedtesting.rules.SystemPropertiesRestoreRule$1.evaluate(SystemPropertiesRestoreRule.java:57)
      at org.apache.lucene.util.AbstractBeforeAfterRule$1.evaluate(AbstractBeforeAfterRule.java:45)
      at com.carrotsearch.randomizedtesting.rules.StatementAdapter.evaluate(StatementAdapter.java:36)
      at org.apache.lucene.util.TestRuleStoreClassName$1.evaluate(TestRuleStoreClassName.java:41)
      at com.carrotsearch.randomizedtesting.rules.NoShadowingOrOverridesOnMethodsRule$1.evaluate(NoShadowingOrOverridesOnMethodsRule.java:40)
      at com.carrotsearch.randomizedtesting.rules.NoShadowingOrOverridesOnMethodsRule$1.evaluate(NoShadowingOrOverridesOnMethodsRule.java:40)
      at com.carrotsearch.randomizedtesting.rules.StatementAdapter.evaluate(StatementAdapter.java:36)
      at com.carrotsearch.randomizedtesting.rules.StatementAdapter.evaluate(StatementAdapter.java:36)
      at com.carrotsearch.randomizedtesting.rules.StatementAdapter.evaluate(StatementAdapter.java:36)
      at org.apache.lucene.util.TestRuleAssertionsRequired$1.evaluate(TestRuleAssertionsRequired.java:53)
      at org.apache.lucene.util.TestRuleMarkFailure$1.evaluate(TestRuleMarkFailure.java:47)
      at org.apache.lucene.util.TestRuleIgnoreAfterMaxFailures$1.evaluate(TestRuleIgnoreAfterMaxFailures.java:64)
      at org.apache.lucene.util.TestRuleIgnoreTestSuites$1.evaluate(TestRuleIgnoreTestSuites.java:54)
      at com.carrotsearch.randomizedtesting.rules.StatementAdapter.evaluate(StatementAdapter.java:36)
      at com.carrotsearch.randomizedtesting.ThreadLeakControl$StatementRunner.run(ThreadLeakControl.java:367)
      at java.lang.Thread.run(Thread.java:745)


    FAILED: org.apache.solr.cloud.AsyncMigrateRouteKeyTest.test

    Error Message:
    Error from server at http://127.0.0.1:65377/fvy/q/collection1: Expected mime type application/octet-stream but got text/html. <html> <head> <meta http-equiv="Content-Type" content="text/html;charset=ISO-8859-1"/> <title>Error 500 </title> </head> <body> <h2>HTTP ERROR: 500</h2> <p>Problem accessing /fvy/q/collection1/update. Reason: <pre> {metadata={error-class=org.apache.solr.common.SolrException,root-error-class=org.apache.solr.common.SolrException},msg=SolrCore &apos;collection1&apos; is not available due to init failure: Timed out getting coreNodeName for collection1,trace=org.apache.solr.common.SolrException: SolrCore &apos;collection1&apos; is not available due to init failure: Timed out getting coreNodeName for collection1 at org.apache.solr.core.CoreContainer.getCore(CoreContainer.java:1080) at org.apache.solr.servlet.HttpSolrCall.init(HttpSolrCall.java:256) at org.apache.solr.servlet.HttpSolrCall.call(HttpSolrCall.java:418) at org.apache.solr.servlet.SolrDispatchFilter.doFilter(SolrDispatchFilter.java:257) at org.apache.solr.servlet.SolrDispatchFilter.doFilter(SolrDispatchFilter.java:208) at org.eclipse.jetty.servlet.ServletHandler$CachedChain.doFilter(ServletHandler.java:1676) at org.apache.solr.client.solrj.embedded.JettySolrRunner$DebugFilter.doFilter(JettySolrRunner.java:109) at org.eclipse.jetty.servlet.ServletHandler$CachedChain.doFilter(ServletHandler.java:1676) at org.eclipse.jetty.servlet.ServletHandler.doHandle(ServletHandler.java:581) at org.eclipse.jetty.server.session.SessionHandler.doHandle(SessionHandler.java:224) at org.eclipse.jetty.server.handler.ContextHandler.doHandle(ContextHandler.java:1160) at org.eclipse.jetty.servlet.ServletHandler.doScope(ServletHandler.java:511) at org.eclipse.jetty.server.session.SessionHandler.doScope(SessionHandler.java:185) at org.eclipse.jetty.server.handler.ContextHandler.doScope(ContextHandler.java:1092) at org.eclipse.jetty.server.handler.ScopedHandler.handle(ScopedHandler.java:141) at org.eclipse.jetty.server.handler.gzip.GzipHandler.handle(GzipHandler.java:399) at org.eclipse.jetty.server.handler.HandlerWrapper.handle(HandlerWrapper.java:134) at org.eclipse.jetty.server.Server.handle(Server.java:518) at org.eclipse.jetty.server.HttpChannel.handle(HttpChannel.java:308) at org.eclipse.jetty.server.HttpConnection.onFillable(HttpConnection.java:244) at org.eclipse.jetty.io.AbstractConnection$ReadCallback.succeeded(AbstractConnection.java:273) at org.eclipse.jetty.io.FillInterest.fillable(FillInterest.java:95) at org.eclipse.jetty.io.SelectChannelEndPoint$2.run(SelectChannelEndPoint.java:93) at org.eclipse.jetty.util.thread.strategy.ExecuteProduceConsume.produceAndRun(ExecuteProduceConsume.java:246) at org.eclipse.jetty.util.thread.strategy.ExecuteProduceConsume.run(ExecuteProduceConsume.java:156) at org.eclipse.jetty.util.thread.QueuedThreadPool.runJob(QueuedThreadPool.java:654) at org.eclipse.jetty.util.thread.QueuedThreadPool$3.run(QueuedThreadPool.java:572) at java.lang.Thread.run(Thread.java:745) Caused by: org.apache.solr.common.SolrException: Timed out getting coreNodeName for collection1 at org.apache.solr.cloud.ZkController.waitForCoreNodeName(ZkController.java:1387) at org.apache.solr.cloud.ZkController.doGetShardIdAndNodeNameProcess(ZkController.java:1365) at org.apache.solr.cloud.ZkController.preRegister(ZkController.java:1456) at org.apache.solr.core.CoreContainer.create(CoreContainer.java:809) at org.apache.solr.core.CoreContainer.lambda$load$0(CoreContainer.java:468) at java.util.concurrent.FutureTask.run(FutureTask.java:266) at org.apache.solr.common.util.ExecutorUtil$MDCAwareThreadPoolExecutor.lambda$execute$0(ExecutorUtil.java:229) at java.util.concurrent.ThreadPoolExecutor.runWorker(ThreadPoolExecutor.java:1142) at java.util.concurrent.ThreadPoolExecutor$Worker.run(ThreadPoolExecutor.java:617) ... 1 more ,code=500}</pre></p> <hr /><a href="http://eclipse.org/jetty">Powered by Jetty:// 9.3.8.v20160314</a><hr/> </body> </html>

    Stack Trace:
    org.apache.solr.client.solrj.impl.HttpSolrClient$RemoteSolrException: Error from server at http://127.0.0.1:65377/fvy/q/collection1: Expected mime type application/octet-stream but got text/html. <html>
    <head>
    <meta http-equiv="Content-Type" content="text/html;charset=ISO-8859-1"/>
    <title>Error 500 </title>
    </head>
    <body>
    <h2>HTTP ERROR: 500</h2>
    <p>Problem accessing /fvy/q/collection1/update. Reason:
    <pre> {metadata={error-class=org.apache.solr.common.SolrException,root-error-class=org.apache.solr.common.SolrException},msg=SolrCore &apos;collection1&apos; is not available due to init failure: Timed out getting coreNodeName for collection1,trace=org.apache.solr.common.SolrException: SolrCore &apos;collection1&apos; is not available due to init failure: Timed out getting coreNodeName for collection1
      at org.apache.solr.core.CoreContainer.getCore(CoreContainer.java:1080)
      at org.apache.solr.servlet.HttpSolrCall.init(HttpSolrCall.java:256)
      at org.apache.solr.servlet.HttpSolrCall.call(HttpSolrCall.java:418)
      at org.apache.solr.servlet.SolrDispatchFilter.doFilter(SolrDispatchFilter.java:257)
      at org.apache.solr.servlet.SolrDispatchFilter.doFilter(SolrDispatchFilter.java:208)
      at org.eclipse.jetty.servlet.ServletHandler$CachedChain.doFilter(ServletHandler.java:1676)
      at org.apache.solr.client.solrj.embedded.JettySolrRunner$DebugFilter.doFilter(JettySolrRunner.java:109)
      at org.eclipse.jetty.servlet.ServletHandler$CachedChain.doFilter(ServletHandler.java:1676)
      at org.eclipse.jetty.servlet.ServletHandler.doHandle(ServletHandler.java:581)
      at org.eclipse.jetty.server.session.SessionHandler.doHandle(SessionHandler.java:224)
      at org.eclipse.jetty.server.handler.ContextHandler.doHandle(ContextHandler.java:1160)
      at org.eclipse.jetty.servlet.ServletHandler.doScope(ServletHandler.java:511)
      at org.eclipse.jetty.server.session.SessionHandler.doScope(SessionHandler.java:185)
      at org.eclipse.jetty.server.handler.ContextHandler.doScope(ContextHandler.java:1092)
      at org.eclipse.jetty.server.handler.ScopedHandler.handle(ScopedHandler.java:141)
      at org.eclipse.jetty.server.handler.gzip.GzipHandler.handle(GzipHandler.java:399)
      at org.eclipse.jetty.server.handler.HandlerWrapper.handle(HandlerWrapper.java:134)
      at org.eclipse.jetty.server.Server.handle(Server.java:518)
      at org.eclipse.jetty.server.HttpChannel.handle(HttpChannel.java:308)
      at org.eclipse.jetty.server.HttpConnection.onFillable(HttpConnection.java:244)
      at org.eclipse.jetty.io.AbstractConnection$ReadCallback.succeeded(AbstractConnection.java:273)
      at org.eclipse.jetty.io.FillInterest.fillable(FillInterest.java:95)
      at org.eclipse.jetty.io.SelectChannelEndPoint$2.run(SelectChannelEndPoint.java:93)
      at org.eclipse.jetty.util.thread.strategy.ExecuteProduceConsume.produceAndRun(ExecuteProduceConsume.java:246)
      at org.eclipse.jetty.util.thread.strategy.ExecuteProduceConsume.run(ExecuteProduceConsume.java:156)
      at org.eclipse.jetty.util.thread.QueuedThreadPool.runJob(QueuedThreadPool.java:654)
      at org.eclipse.jetty.util.thread.QueuedThreadPool$3.run(QueuedThreadPool.java:572)
      at java.lang.Thread.run(Thread.java:745)
    Caused by: org.apache.solr.common.SolrException: Timed out getting coreNodeName for collection1
      at org.apache.solr.cloud.ZkController.waitForCoreNodeName(ZkController.java:1387)
      at org.apache.solr.cloud.ZkController.doGetShardIdAndNodeNameProcess(ZkController.java:1365)
      at org.apache.solr.cloud.ZkController.preRegister(ZkController.java:1456)
      at org.apache.solr.core.CoreContainer.create(CoreContainer.java:809)
      at org.apache.solr.core.CoreContainer.lambda$load$0(CoreContainer.java:468)
      at java.util.concurrent.FutureTask.run(FutureTask.java:266)
      at org.apache.solr.common.util.ExecutorUtil$MDCAwareThreadPoolExecutor.lambda$execute$0(ExecutorUtil.java:229)
      at java.util.concurrent.ThreadPoolExecutor.runWorker(ThreadPoolExecutor.java:1142)
      at java.util.concurrent.ThreadPoolExecutor$Worker.run(ThreadPoolExecutor.java:617)
      ... 1 more
    ,code=500}</pre></p>
    <hr /><a href="http://eclipse.org/jetty">Powered by Jetty:// 9.3.8.v20160314</a><hr/>
    </body>
    [E23C5815F355BF8A:6A6867CF5DA9D272]:0)
      at org.apache.solr.client.solrj.impl.HttpSolrClient.executeMethod(HttpSolrClient.java:558)
      at org.apache.solr.client.solrj.impl.HttpSolrClient.request(HttpSolrClient.java:259)
      at org.apache.solr.client.solrj.impl.HttpSolrClient.request(HttpSolrClient.java:248)
      at org.apache.solr.client.solrj.SolrRequest.process(SolrRequest.java:149)
      at org.apache.solr.client.solrj.SolrClient.deleteByQuery(SolrClient.java:895)
      at org.apache.solr.client.solrj.SolrClient.deleteByQuery(SolrClient.java:858)
      at org.apache.solr.client.solrj.SolrClient.deleteByQuery(SolrClient.java:873)
      at org.apache.solr.cloud.AbstractFullDistribZkTestBase.del(AbstractFullDistribZkTestBase.java:835)
      at org.apache.solr.cloud.MigrateRouteKeyTest.multipleShardMigrateTest(MigrateRouteKeyTest.java:135)
      at org.apache.solr.cloud.AsyncMigrateRouteKeyTest.test(AsyncMigrateRouteKeyTest.java:44)
      at sun.reflect.NativeMethodAccessorImpl.invoke0(Native Method)
      at sun.reflect.NativeMethodAccessorImpl.invoke(NativeMethodAccessorImpl.java:62)
      at sun.reflect.DelegatingMethodAccessorImpl.invoke(DelegatingMethodAccessorImpl.java:43)
      at java.lang.reflect.Method.invoke(Method.java:498)
      at com.carrotsearch.randomizedtesting.RandomizedRunner.invoke(RandomizedRunner.java:1764)
      at com.carrotsearch.randomizedtesting.RandomizedRunner$8.evaluate(RandomizedRunner.java:871)
      at com.carrotsearch.randomizedtesting.RandomizedRunner$9.evaluate(RandomizedRunner.java:907)
      at com.carrotsearch.randomizedtesting.RandomizedRunner$10.evaluate(RandomizedRunner.java:921)
      at org.apache.solr.BaseDistributedSearchTestCase$ShardsRepeatRule$ShardsFixedStatement.callStatement(BaseDistributedSearchTestCase.java:992)
      at org.apache.solr.BaseDistributedSearchTestCase$ShardsRepeatRule$ShardsStatement.evaluate(BaseDistributedSearchTestCase.java:967)
      at com.carrotsearch.randomizedtesting.rules.SystemPropertiesRestoreRule$1.evaluate(SystemPropertiesRestoreRule.java:57)
      at org.apache.lucene.util.TestRuleSetupTeardownChained$1.evaluate(TestRuleSetupTeardownChained.java:49)
      at org.apache.lucene.util.AbstractBeforeAfterRule$1.evaluate(AbstractBeforeAfterRule.java:45)
      at org.apache.lucene.util.TestRuleThreadAndTestName$1.evaluate(TestRuleThreadAndTestName.java:48)
      at org.apache.lucene.util.TestRuleIgnoreAfterMaxFailures$1.evaluate(TestRuleIgnoreAfterMaxFailures.java:64)
      at org.apache.lucene.util.TestRuleMarkFailure$1.evaluate(TestRuleMarkFailure.java:47)
      at com.carrotsearch.randomizedtesting.rules.StatementAdapter.evaluate(StatementAdapter.java:36)
      at com.carrotsearch.randomizedtesting.ThreadLeakControl$StatementRunner.run(ThreadLeakControl.java:367)
      at com.carrotsearch.randomizedtesting.ThreadLeakControl.forkTimeoutingTask(ThreadLeakControl.java:809)
      at com.carrotsearch.randomizedtesting.ThreadLeakControl$3.evaluate(ThreadLeakControl.java:460)
      at com.carrotsearch.randomizedtesting.RandomizedRunner.runSingleTest(RandomizedRunner.java:880)
      at com.carrotsearch.randomizedtesting.RandomizedRunner$5.evaluate(RandomizedRunner.java:781)
      at com.carrotsearch.randomizedtesting.RandomizedRunner$6.evaluate(RandomizedRunner.java:816)
      at com.carrotsearch.randomizedtesting.RandomizedRunner$7.evaluate(RandomizedRunner.java:827)
      at com.carrotsearch.randomizedtesting.rules.StatementAdapter.evaluate(StatementAdapter.java:36)
      at com.carrotsearch.randomizedtesting.rules.SystemPropertiesRestoreRule$1.evaluate(SystemPropertiesRestoreRule.java:57)
      at org.apache.lucene.util.AbstractBeforeAfterRule$1.evaluate(AbstractBeforeAfterRule.java:45)
      at com.carrotsearch.randomizedtesting.rules.StatementAdapter.evaluate(StatementAdapter.java:36)
      at org.apache.lucene.util.TestRuleStoreClassName$1.evaluate(TestRuleStoreClassName.java:41)
      at com.carrotsearch.randomizedtesting.rules.NoShadowingOrOverridesOnMethodsRule$1.evaluate(NoShadowingOrOverridesOnMethodsRule.java:40)
      at com.carrotsearch.randomizedtesting.rules.NoShadowingOrOverridesOnMethodsRule$1.evaluate(NoShadowingOrOverridesOnMethodsRule.java:40)
      at com.carrotsearch.randomizedtesting.rules.StatementAdapter.evaluate(StatementAdapter.java:36)
      at com.carrotsearch.randomizedtesting.rules.StatementAdapter.evaluate(StatementAdapter.java:36)
      at com.carrotsearch.randomizedtesting.rules.StatementAdapter.evaluate(StatementAdapter.java:36)
      at org.apache.lucene.util.TestRuleAssertionsRequired$1.evaluate(TestRuleAssertionsRequired.java:53)
      at org.apache.lucene.util.TestRuleMarkFailure$1.evaluate(TestRuleMarkFailure.java:47)
      at org.apache.lucene.util.TestRuleIgnoreAfterMaxFailures$1.evaluate(TestRuleIgnoreAfterMaxFailures.java:64)
      at org.apache.lucene.util.TestRuleIgnoreTestSuites$1.evaluate(TestRuleIgnoreTestSuites.java:54)
      at com.carrotsearch.randomizedtesting.rules.StatementAdapter.evaluate(StatementAdapter.java:36)
      at com.carrotsearch.randomizedtesting.ThreadLeakControl$StatementRunner.run(ThreadLeakControl.java:367)
      at java.lang.Thread.run(Thread.java:745)


    FAILED: org.apache.solr.cloud.BasicDistributedZkTest.test

    Error Message:
    Error from server at http://127.0.0.1:62582/u_oak/x/collection1: Expected mime type application/octet-stream but got text/html. <html> <head> <meta http-equiv="Content-Type" content="text/html;charset=ISO-8859-1"/> <title>Error 500 </title> </head> <body> <h2>HTTP ERROR: 500</h2> <p>Problem accessing /u_oak/x/collection1/update. Reason: <pre> {metadata={error-class=org.apache.solr.common.SolrException,root-error-class=org.apache.solr.common.SolrException},msg=SolrCore &apos;collection1&apos; is not available due to init failure: Timed out getting coreNodeName for collection1,trace=org.apache.solr.common.SolrException: SolrCore &apos;collection1&apos; is not available due to init failure: Timed out getting coreNodeName for collection1 at org.apache.solr.core.CoreContainer.getCore(CoreContainer.java:1080) at org.apache.solr.servlet.HttpSolrCall.init(HttpSolrCall.java:256) at org.apache.solr.servlet.HttpSolrCall.call(HttpSolrCall.java:418) at org.apache.solr.servlet.SolrDispatchFilter.doFilter(SolrDispatchFilter.java:257) at org.apache.solr.servlet.SolrDispatchFilter.doFilter(SolrDispatchFilter.java:208) at org.eclipse.jetty.servlet.ServletHandler$CachedChain.doFilter(ServletHandler.java:1676) at org.apache.solr.client.solrj.embedded.JettySolrRunner$DebugFilter.doFilter(JettySolrRunner.java:109) at org.eclipse.jetty.servlet.ServletHandler$CachedChain.doFilter(ServletHandler.java:1676) at org.eclipse.jetty.servlet.ServletHandler.doHandle(ServletHandler.java:581) at org.eclipse.jetty.server.session.SessionHandler.doHandle(SessionHandler.java:224) at org.eclipse.jetty.server.handler.ContextHandler.doHandle(ContextHandler.java:1160) at org.eclipse.jetty.servlet.ServletHandler.doScope(ServletHandler.java:511) at org.eclipse.jetty.server.session.SessionHandler.doScope(SessionHandler.java:185) at org.eclipse.jetty.server.handler.ContextHandler.doScope(ContextHandler.java:1092) at org.eclipse.jetty.server.handler.ScopedHandler.handle(ScopedHandler.java:141) at org.eclipse.jetty.server.handler.gzip.GzipHandler.handle(GzipHandler.java:399) at org.eclipse.jetty.server.handler.HandlerWrapper.handle(HandlerWrapper.java:134) at org.eclipse.jetty.server.Server.handle(Server.java:518) at org.eclipse.jetty.server.HttpChannel.handle(HttpChannel.java:308) at org.eclipse.jetty.server.HttpConnection.onFillable(HttpConnection.java:244) at org.eclipse.jetty.io.AbstractConnection$ReadCallback.succeeded(AbstractConnection.java:273) at org.eclipse.jetty.io.FillInterest.fillable(FillInterest.java:95) at org.eclipse.jetty.io.SelectChannelEndPoint$2.run(SelectChannelEndPoint.java:93) at org.eclipse.jetty.util.thread.strategy.ExecuteProduceConsume.produceAndRun(ExecuteProduceConsume.java:246) at org.eclipse.jetty.util.thread.strategy.ExecuteProduceConsume.run(ExecuteProduceConsume.java:156) at org.eclipse.jetty.util.thread.QueuedThreadPool.runJob(QueuedThreadPool.java:654) at org.eclipse.jetty.util.thread.QueuedThreadPool$3.run(QueuedThreadPool.java:572) at java.lang.Thread.run(Thread.java:745) Caused by: org.apache.solr.common.SolrException: Timed out getting coreNodeName for collection1 at org.apache.solr.cloud.ZkController.waitForCoreNodeName(ZkController.java:1387) at org.apache.solr.cloud.ZkController.doGetShardIdAndNodeNameProcess(ZkController.java:1365) at org.apache.solr.cloud.ZkController.preRegister(ZkController.java:1456) at org.apache.solr.core.CoreContainer.create(CoreContainer.java:809) at org.apache.solr.core.CoreContainer.lambda$load$0(CoreContainer.java:468) at java.util.concurrent.FutureTask.run(FutureTask.java:266) at org.apache.solr.common.util.ExecutorUtil$MDCAwareThreadPoolExecutor.lambda$execute$0(ExecutorUtil.java:229) at java.util.concurrent.ThreadPoolExecutor.runWorker(ThreadPoolExecutor.java:1142) at java.util.concurrent.ThreadPoolExecutor$Worker.run(ThreadPoolExecutor.java:617) ... 1 more ,code=500}</pre></p> <hr /><a href="http://eclipse.org/jetty">Powered by Jetty:// 9.3.8.v20160314</a><hr/> </body> </html>

    Stack Trace:
    org.apache.solr.client.solrj.impl.HttpSolrClient$RemoteSolrException: Error from server at http://127.0.0.1:62582/u_oak/x/collection1: Expected mime type application/octet-stream but got text/html. <html>
    <head>
    <meta http-equiv="Content-Type" content="text/html;charset=ISO-8859-1"/>
    <title>Error 500 </title>
    </head>
    <body>
    <h2>HTTP ERROR: 500</h2>
    <p>Problem accessing /u_oak/x/collection1/update. Reason:
    <pre> {metadata={error-class=org.apache.solr.common.SolrException,root-error-class=org.apache.solr.common.SolrException},msg=SolrCore &apos;collection1&apos; is not available due to init failure: Timed out getting coreNodeName for collection1,trace=org.apache.solr.common.SolrException: SolrCore &apos;collection1&apos; is not available due to init failure: Timed out getting coreNodeName for collection1
      at org.apache.solr.core.CoreContainer.getCore(CoreContainer.java:1080)
      at org.apache.solr.servlet.HttpSolrCall.init(HttpSolrCall.java:256)
      at org.apache.solr.servlet.HttpSolrCall.call(HttpSolrCall.java:418)
      at org.apache.solr.servlet.SolrDispatchFilter.doFilter(SolrDispatchFilter.java:257)
      at org.apache.solr.servlet.SolrDispatchFilter.doFilter(SolrDispatchFilter.java:208)
      at org.eclipse.jetty.servlet.ServletHandler$CachedChain.doFilter(ServletHandler.java:1676)
      at org.apache.solr.client.solrj.embedded.JettySolrRunner$DebugFilter.doFilter(JettySolrRunner.java:109)
      at org.eclipse.jetty.servlet.ServletHandler$CachedChain.doFilter(ServletHandler.java:1676)
      at org.eclipse.jetty.servlet.ServletHandler.doHandle(ServletHandler.java:581)
      at org.eclipse.jetty.server.session.SessionHandler.doHandle(SessionHandler.java:224)
      at org.eclipse.jetty.server.handler.ContextHandler.doHandle(ContextHandler.java:1160)
      at org.eclipse.jetty.servlet.ServletHandler.doScope(ServletHandler.java:511)
      at org.eclipse.jetty.server.session.SessionHandler.doScope(SessionHandler.java:185)
      at org.eclipse.jetty.server.handler.ContextHandler.doScope(ContextHandler.java:1092)
      at org.eclipse.jetty.server.handler.ScopedHandler.handle(ScopedHandler.java:141)
      at org.eclipse.jetty.server.handler.gzip.GzipHandler.handle(GzipHandler.java:399)
      at org.eclipse.jetty.server.handler.HandlerWrapper.handle(HandlerWrapper.java:134)
      at org.eclipse.jetty.server.Server.handle(Server.java:518)
      at org.eclipse.jetty.server.HttpChannel.handle(HttpChannel.java:308)
      at org.eclipse.jetty.server.HttpConnection.onFillable(HttpConnection.java:244)
      at org.eclipse.jetty.io.AbstractConnection$ReadCallback.succeeded(AbstractConnection.java:273)
      at org.eclipse.jetty.io.FillInterest.fillable(FillInterest.java:95)
      at org.eclipse.jetty.io.SelectChannelEndPoint$2.run(SelectChannelEndPoint.java:93)
      at org.eclipse.jetty.util.thread.strategy.ExecuteProduceConsume.produceAndRun(ExecuteProduceConsume.java:246)
      at org.eclipse.jetty.util.thread.strategy.ExecuteProduceConsume.run(ExecuteProduceConsume.java:156)
      at org.eclipse.jetty.util.thread.QueuedThreadPool.runJob(QueuedThreadPool.java:654)
      at org.eclipse.jetty.util.thread.QueuedThreadPool$3.run(QueuedThreadPool.java:572)
      at java.lang.Thread.run(Thread.java:745)
    Caused by: org.apache.solr.common.SolrException: Timed out getting coreNodeName for collection1
      at org.apache.solr.cloud.ZkController.waitForCoreNodeName(ZkController.java:1387)
      at org.apache.solr.cloud.ZkController.doGetShardIdAndNodeNameProcess(ZkController.java:1365)
      at org.apache.solr.cloud.ZkController.preRegister(ZkController.java:1456)
      at org.apache.solr.core.CoreContainer.create(CoreContainer.java:809)
      at org.apache.solr.core.CoreContainer.lambda$load$0(CoreContainer.java:468)
      at java.util.concurrent.FutureTask.run(FutureTask.java:266)
      at org.apache.solr.common.util.ExecutorUtil$MDCAwareThreadPoolExecutor.lambda$execute$0(ExecutorUtil.java:229)
      at java.util.concurrent.ThreadPoolExecutor.runWorker(ThreadPoolExecutor.java:1142)
      at java.util.concurrent.ThreadPoolExecutor$Worker.run(ThreadPoolExecutor.java:617)
      ... 1 more
    ,code=500}</pre></p>
    <hr /><a href="http://eclipse.org/jetty">Powered by Jetty:// 9.3.8.v20160314</a><hr/>
    </body>
    [E23C5815F355BF8A:6A6867CF5DA9D272]:0)
      at org.apache.solr.client.solrj.impl.HttpSolrClient.executeMethod(HttpSolrClient.java:558)
      at org.apache.solr.client.solrj.impl.HttpSolrClient.request(HttpSolrClient.java:259)
      at org.apache.solr.client.solrj.impl.HttpSolrClient.request(HttpSolrClient.java:248)
      at org.apache.solr.client.solrj.SolrRequest.process(SolrRequest.java:149)
      at org.apache.solr.client.solrj.SolrClient.deleteByQuery(SolrClient.java:895)
      at org.apache.solr.client.solrj.SolrClient.deleteByQuery(SolrClient.java:858)
      at org.apache.solr.client.solrj.SolrClient.deleteByQuery(SolrClient.java:873)
      at org.apache.solr.cloud.AbstractFullDistribZkTestBase.del(AbstractFullDistribZkTestBase.java:835)
      at org.apache.solr.cloud.BasicDistributedZkTest.test(BasicDistributedZkTest.java:152)
      at sun.reflect.NativeMethodAccessorImpl.invoke0(Native Method)
      at sun.reflect.NativeMethodAccessorImpl.invoke(NativeMethodAccessorImpl.java:62)
      at sun.reflect.DelegatingMethodAccessorImpl.invoke(DelegatingMethodAccessorImpl.java:43)
      at java.lang.reflect.Method.invoke(Method.java:498)
      at com.carrotsearch.randomizedtesting.RandomizedRunner.invoke(RandomizedRunner.java:1764)
      at com.carrotsearch.randomizedtesting.RandomizedRunner$8.evaluate(RandomizedRunner.java:871)
      at com.carrotsearch.randomizedtesting.RandomizedRunner$9.evaluate(RandomizedRunner.java:907)
      at com.carrotsearch.randomizedtesting.RandomizedRunner$10.evaluate(RandomizedRunner.java:921)
      at org.apache.solr.BaseDistributedSearchTestCase$ShardsRepeatRule$ShardsFixedStatement.callStatement(BaseDistributedSearchTestCase.java:992)
      at org.apache.solr.BaseDistributedSearchTestCase$ShardsRepeatRule$ShardsStatement.evaluate(BaseDistributedSearchTestCase.java:967)
      at com.carrotsearch.randomizedtesting.rules.SystemPropertiesRestoreRule$1.evaluate(SystemPropertiesRestoreRule.java:57)
      at org.apache.lucene.util.TestRuleSetupTeardownChained$1.evaluate(TestRuleSetupTeardownChained.java:49)
      at org.apache.lucene.util.AbstractBeforeAfterRule$1.evaluate(AbstractBeforeAfterRule.java:45)
      at org.apache.lucene.util.TestRuleThreadAndTestName$1.evaluate(TestRuleThreadAndTestName.java:48)
      at org.apache.lucene.util.TestRuleIgnoreAfterMaxFailures$1.evaluate(TestRuleIgnoreAfterMaxFailures.java:64)
      at org.apache.lucene.util.TestRuleMarkFailure$1.evaluate(TestRuleMarkFailure.java:47)
      at com.carrotsearch.randomizedtesting.rules.StatementAdapter.evaluate(StatementAdapter.java:36)
      at com.carrotsearch.randomizedtesting.ThreadLeakControl$StatementRunner.run(ThreadLeakControl.java:367)
      at com.carrotsearch.randomizedtesting.ThreadLeakControl.forkTimeoutingTask(ThreadLeakControl.java:809)
      at com.carrotsearch.randomizedtesting.ThreadLeakControl$3.evaluate(ThreadLeakControl.java:460)
      at com.carrotsearch.randomizedtesting.RandomizedRunner.runSingleTest(RandomizedRunner.java:880)
      at com.carrotsearch.randomizedtesting.RandomizedRunner$5.evaluate(RandomizedRunner.java:781)
      at com.carrotsearch.randomizedtesting.RandomizedRunner$6.evaluate(RandomizedRunner.java:816)
      at com.carrotsearch.randomizedtesting.RandomizedRunner$7.evaluate(RandomizedRunner.java:827)
      at com.carrotsearch.randomizedtesting.rules.StatementAdapter.evaluate(StatementAdapter.java:36)
      at com.carrotsearch.randomizedtesting.rules.SystemPropertiesRestoreRule$1.evaluate(SystemPropertiesRestoreRule.java:57)
      at org.apache.lucene.util.AbstractBeforeAfterRule$1.evaluate(AbstractBeforeAfterRule.java:45)
      at com.carrotsearch.randomizedtesting.rules.StatementAdapter.evaluate(StatementAdapter.java:36)
      at org.apache.lucene.util.TestRuleStoreClassName$1.evaluate(TestRuleStoreClassName.java:41)
      at com.carrotsearch.randomizedtesting.rules.NoShadowingOrOverridesOnMethodsRule$1.evaluate(NoShadowingOrOverridesOnMethodsRule.java:40)
      at com.carrotsearch.randomizedtesting.rules.NoShadowingOrOverridesOnMethodsRule$1.evaluate(NoShadowingOrOverridesOnMethodsRule.java:40)
      at com.carrotsearch.randomizedtesting.rules.StatementAdapter.evaluate(StatementAdapter.java:36)
      at com.carrotsearch.randomizedtesting.rules.StatementAdapter.evaluate(StatementAdapter.java:36)
      at com.carrotsearch.randomizedtesting.rules.StatementAdapter.evaluate(StatementAdapter.java:36)
      at org.apache.lucene.util.TestRuleAssertionsRequired$1.evaluate(TestRuleAssertionsRequired.java:53)
      at org.apache.lucene.util.TestRuleMarkFailure$1.evaluate(TestRuleMarkFailure.java:47)
      at org.apache.lucene.util.TestRuleIgnoreAfterMaxFailures$1.evaluate(TestRuleIgnoreAfterMaxFailures.java:64)
      at org.apache.lucene.util.TestRuleIgnoreTestSuites$1.evaluate(TestRuleIgnoreTestSuites.java:54)
      at com.carrotsearch.randomizedtesting.rules.StatementAdapter.evaluate(StatementAdapter.java:36)
      at com.carrotsearch.randomizedtesting.ThreadLeakControl$StatementRunner.run(ThreadLeakControl.java:367)
      at java.lang.Thread.run(Thread.java:745)


    FAILED: org.apache.solr.cloud.ChaosMonkeySafeLeaderTest.test

    Error Message:
    Error from server at http://127.0.0.1:46009/neu/collection1: Expected mime type application/octet-stream but got text/html. <html> <head> <meta http-equiv="Content-Type" content="text/html;charset=ISO-8859-1"/> <title>Error 500 </title> </head> <body> <h2>HTTP ERROR: 500</h2> <p>Problem accessing /neu/collection1/update. Reason: <pre> {metadata={error-class=org.apache.solr.common.SolrException,root-error-class=org.apache.solr.common.SolrException},msg=SolrCore &apos;collection1&apos; is not available due to init failure: Timed out getting coreNodeName for collection1,trace=org.apache.solr.common.SolrException: SolrCore &apos;collection1&apos; is not available due to init failure: Timed out getting coreNodeName for collection1 at org.apache.solr.core.CoreContainer.getCore(CoreContainer.java:1080) at org.apache.solr.servlet.HttpSolrCall.init(HttpSolrCall.java:256) at org.apache.solr.servlet.HttpSolrCall.call(HttpSolrCall.java:418) at org.apache.solr.servlet.SolrDispatchFilter.doFilter(SolrDispatchFilter.java:257) at org.apache.solr.servlet.SolrDispatchFilter.doFilter(SolrDispatchFilter.java:208) at org.eclipse.jetty.servlet.ServletHandler$CachedChain.doFilter(ServletHandler.java:1676) at org.apache.solr.client.solrj.embedded.JettySolrRunner$DebugFilter.doFilter(JettySolrRunner.java:109) at org.eclipse.jetty.servlet.ServletHandler$CachedChain.doFilter(ServletHandler.java:1676) at org.eclipse.jetty.servlet.ServletHandler.doHandle(ServletHandler.java:581) at org.eclipse.jetty.server.session.SessionHandler.doHandle(SessionHandler.java:224) at org.eclipse.jetty.server.handler.ContextHandler.doHandle(ContextHandler.java:1160) at org.eclipse.jetty.servlet.ServletHandler.doScope(ServletHandler.java:511) at org.eclipse.jetty.server.session.SessionHandler.doScope(SessionHandler.java:185) at org.eclipse.jetty.server.handler.ContextHandler.doScope(ContextHandler.java:1092) at org.eclipse.jetty.server.handler.ScopedHandler.handle(ScopedHandler.java:141) at org.eclipse.jetty.server.handler.gzip.GzipHandler.handle(GzipHandler.java:399) at org.eclipse.jetty.server.handler.HandlerWrapper.handle(HandlerWrapper.java:134) at org.eclipse.jetty.server.Server.handle(Server.java:518) at org.eclipse.jetty.server.HttpChannel.handle(HttpChannel.java:308) at org.eclipse.jetty.server.HttpConnection.onFillable(HttpConnection.java:244) at org.eclipse.jetty.io.AbstractConnection$ReadCallback.succeeded(AbstractConnection.java:273) at org.eclipse.jetty.io.FillInterest.fillable(FillInterest.java:95) at org.eclipse.jetty.io.SelectChannelEndPoint$2.run(SelectChannelEndPoint.java:93) at org.eclipse.jetty.util.thread.strategy.ExecuteProduceConsume.produceAndRun(ExecuteProduceConsume.java:246) at org.eclipse.jetty.util.thread.strategy.ExecuteProduceConsume.run(ExecuteProduceConsume.java:156) at org.eclipse.jetty.util.thread.QueuedThreadPool.runJob(QueuedThreadPool.java:654) at org.eclipse.jetty.util.thread.QueuedThreadPool$3.run(QueuedThreadPool.java:572) at java.lang.Thread.run(Thread.java:745) Caused by: org.apache.solr.common.SolrException: Timed out getting coreNodeName for collection1 at org.apache.solr.cloud.ZkController.waitForCoreNodeName(ZkController.java:1387) at org.apache.solr.cloud.ZkController.doGetShardIdAndNodeNameProcess(ZkController.java:1365) at org.apache.solr.cloud.ZkController.preRegister(ZkController.java:1456) at org.apache.solr.core.CoreContainer.create(CoreContainer.java:809) at org.apache.solr.core.CoreContainer.lambda$load$0(CoreContainer.java:468) at java.util.concurrent.FutureTask.run(FutureTask.java:266) at org.apache.solr.common.util.ExecutorUtil$MDCAwareThreadPoolExecutor.lambda$execute$0(ExecutorUtil.java:229) at java.util.concurrent.ThreadPoolExecutor.runWorker(ThreadPoolExecutor.java:1142) at java.util.concurrent.ThreadPoolExecutor$Worker.run(ThreadPoolExecutor.java:617) ... 1 more ,code=500}</pre></p> <hr /><a href="http://eclipse.org/jetty">Powered by Jetty:// 9.3.8.v20160314</a><hr/> </body> </html>

    Stack Trace:
    org.apache.solr.client.solrj.impl.HttpSolrClient$RemoteSolrException: Error from server at http://127.0.0.1:46009/neu/collection1: Expected mime type application/octet-stream but got text/html. <html>
    <head>
    <meta http-equiv="Content-Type" content="text/html;charset=ISO-8859-1"/>
    <title>Error 500 </title>
    </head>
    <body>
    <h2>HTTP ERROR: 500</h2>
    <p>Problem accessing /neu/collection1/update. Reason:
    <pre> {metadata={error-class=org.apache.solr.common.SolrException,root-error-class=org.apache.solr.common.SolrException},msg=SolrCore &apos;collection1&apos; is not available due to init failure: Timed out getting coreNodeName for collection1,trace=org.apache.solr.common.SolrException: SolrCore &apos;collection1&apos; is not available due to init failure: Timed out getting coreNodeName for collection1
      at org.apache.solr.core.CoreContainer.getCore(CoreContainer.java:1080)
      at org.apache.solr.servlet.HttpSolrCall.init(HttpSolrCall.java:256)
      at org.apache.solr.servlet.HttpSolrCall.call(HttpSolrCall.java:418)
      at org.apache.solr.servlet.SolrDispatchFilter.doFilter(SolrDispatchFilter.java:257)
      at org.apache.solr.servlet.SolrDispatchFilter.doFilter(SolrDispatchFilter.java:208)
      at org.eclipse.jetty.servlet.ServletHandler$CachedChain.doFilter(ServletHandler.java:1676)
      at org.apache.solr.client.solrj.embedded.JettySolrRunner$DebugFilter.doFilter(JettySolrRunner.java:109)
      at org.eclipse.jetty.servlet.ServletHandler$CachedChain.doFilter(ServletHandler.java:1676)
      at org.eclipse.jetty.servlet.ServletHandler.doHandle(ServletHandler.java:581)
      at org.eclipse.jetty.server.session.SessionHandler.doHandle(SessionHandler.java:224)
      at org.eclipse.jetty.server.handler.ContextHandler.doHandle(ContextHandler.java:1160)
      at org.eclipse.jetty.servlet.ServletHandler.doScope(ServletHandler.java:511)
      at org.eclipse.jetty.server.session.SessionHandler.doScope(SessionHandler.java:185)
      at org.eclipse.jetty.server.handler.ContextHandler.doScope(ContextHandler.java:1092)
      at org.eclipse.jetty.server.handler.ScopedHandler.handle(ScopedHandler.java:141)
      at org.eclipse.jetty.server.handler.gzip.GzipHandler.handle(GzipHandler.java:399)
      at org.eclipse.jetty.server.handler.HandlerWrapper.handle(HandlerWrapper.java:134)
      at org.eclipse.jetty.server.Server.handle(Server.java:518)
      at org.eclipse.jetty.server.HttpChannel.handle(HttpChannel.java:308)
      at org.eclipse.jetty.server.HttpConnection.onFillable(HttpConnection.java:244)
      at org.eclipse.jetty.io.AbstractConnection$ReadCallback.succeeded(AbstractConnection.java:273)
      at org.eclipse.jetty.io.FillInterest.fillable(FillInterest.java:95)
      at org.eclipse.jetty.io.SelectChannelEndPoint$2.run(SelectChannelEndPoint.java:93)
      at org.eclipse.jetty.util.thread.strategy.ExecuteProduceConsume.produceAndRun(ExecuteProduceConsume.java:246)
      at org.eclipse.jetty.util.thread.strategy.ExecuteProduceConsume.run(ExecuteProduceConsume.java:156)
      at org.eclipse.jetty.util.thread.QueuedThreadPool.runJob(QueuedThreadPool.java:654)
      at org.eclipse.jetty.util.thread.QueuedThreadPool$3.run(QueuedThreadPool.java:572)
      at java.lang.Thread.run(Thread.java:745)
    Caused by: org.apache.solr.common.SolrException: Timed out getting coreNodeName for collection1
      at org.apache.solr.cloud.ZkController.waitForCoreNodeName(ZkController.java:1387)
      at org.apache.solr.cloud.ZkController.doGetShardIdAndNodeNameProcess(ZkController.java:1365)
      at org.apache.solr.cloud.ZkController.preRegister(ZkController.java:1456)
      at org.apache.solr.core.CoreContainer.create(CoreContainer.java:809)
      at org.apache.solr.core.CoreContainer.lambda$load$0(CoreContainer.java:468)
      at java.util.concurrent.FutureTask.run(FutureTask.java:266)
      at org.apache.solr.common.util.ExecutorUtil$MDCAwareThreadPoolExecutor.lambda$execute$0(ExecutorUtil.java:229)
      at java.util.concurrent.ThreadPoolExecutor.runWorker(ThreadPoolExecutor.java:1142)
      at java.util.concurrent.ThreadPoolExecutor$Worker.run(ThreadPoolExecutor.java:617)
      ... 1 more
    ,code=500}</pre></p>
    <hr /><a href="http://eclipse.org/jetty">Powered by Jetty:// 9.3.8.v20160314</a><hr/>
    </body>
    [E23C5815F355BF8A:6A6867CF5DA9D272]:0)
      at org.apache.solr.client.solrj.impl.HttpSolrClient.executeMethod(HttpSolrClient.java:558)
      at org.apache.solr.client.solrj.impl.HttpSolrClient.request(HttpSolrClient.java:259)
      at org.apache.solr.client.solrj.impl.HttpSolrClient.request(HttpSolrClient.java:248)
      at org.apache.solr.client.solrj.SolrRequest.process(SolrRequest.java:149)
      at org.apache.solr.client.solrj.SolrClient.deleteByQuery(SolrClient.java:895)
      at org.apache.solr.client.solrj.SolrClient.deleteByQuery(SolrClient.java:858)
      at org.apache.solr.client.solrj.SolrClient.deleteByQuery(SolrClient.java:873)
      at org.apache.solr.cloud.AbstractFullDistribZkTestBase.del(AbstractFullDistribZkTestBase.java:835)
      at org.apache.solr.cloud.ChaosMonkeySafeLeaderTest.tryDelete(ChaosMonkeySafeLeaderTest.java:190)
      at org.apache.solr.cloud.ChaosMonkeySafeLeaderTest.test(ChaosMonkeySafeLeaderTest.java:92)
      at sun.reflect.NativeMethodAccessorImpl.invoke0(Native Method)
      at sun.reflect.NativeMethodAccessorImpl.invoke(NativeMethodAccessorImpl.java:62)
      at sun.reflect.DelegatingMethodAccessorImpl.invoke(DelegatingMethodAccessorImpl.java:43)
      at java.lang.reflect.Method.invoke(Method.java:498)
      at com.carrotsearch.randomizedtesting.RandomizedRunner.invoke(RandomizedRunner.java:1764)
      at com.carrotsearch.randomizedtesting.RandomizedRunner$8.evaluate(RandomizedRunner.java:871)
      at com.carrotsearch.randomizedtesting.RandomizedRunner$9.evaluate(RandomizedRunner.java:907)
      at com.carrotsearch.randomizedtesting.RandomizedRunner$10.evaluate(RandomizedRunner.java:921)
      at org.apache.solr.BaseDistributedSearchTestCase$ShardsRepeatRule$ShardsFixedStatement.callStatement(BaseDistributedSearchTestCase.java:992)
      at org.apache.solr.BaseDistributedSearchTestCase$ShardsRepeatRule$ShardsStatement.evaluate(BaseDistributedSearchTestCase.java:967)
      at com.carrotsearch.randomizedtesting.rules.SystemPropertiesRestoreRule$1.evaluate(SystemPropertiesRestoreRule.java:57)
      at org.apache.lucene.util.TestRuleSetupTeardownChained$1.evaluate(TestRuleSetupTeardownChained.java:49)
      at org.apache.lucene.util.AbstractBeforeAfterRule$1.evaluate(AbstractBeforeAfterRule.java:45)
      at org.apache.lucene.util.TestRuleThreadAndTestName$1.evaluate(TestRuleThreadAndTestName.java:48)
      at org.apache.lucene.util.TestRuleIgnoreAfterMaxFailures$1.evaluate(TestRuleIgnoreAfterMaxFailures.java:64)
      at org.apache.lucene.util.TestRuleMarkFailure$1.evaluate(TestRuleMarkFailure.java:47)
      at com.carrotsearch.randomizedtesting.rules.StatementAdapter.evaluate(StatementAdapter.java:36)
      at com.carrotsearch.randomizedtesting.ThreadLeakControl$StatementRunner.run(ThreadLeakControl.java:367)
      at com.carrotsearch.randomizedtesting.ThreadLeakControl.forkTimeoutingTask(ThreadLeakControl.java:809)
      at com.carrotsearch.randomizedtesting.ThreadLeakControl$3.evaluate(ThreadLeakControl.java:460)
      at com.carrotsearch.randomizedtesting.RandomizedRunner.runSingleTest(RandomizedRunner.java:880)
      at com.carrotsearch.randomizedtesting.RandomizedRunner$5.evaluate(RandomizedRunner.java:781)
      at com.carrotsearch.randomizedtesting.RandomizedRunner$6.evaluate(RandomizedRunner.java:816)
      at com.carrotsearch.randomizedtesting.RandomizedRunner$7.evaluate(RandomizedRunner.java:827)
      at com.carrotsearch.randomizedtesting.rules.StatementAdapter.evaluate(StatementAdapter.java:36)
      at com.carrotsearch.randomizedtesting.rules.SystemPropertiesRestoreRule$1.evaluate(SystemPropertiesRestoreRule.java:57)
      at org.apache.lucene.util.AbstractBeforeAfterRule$1.evaluate(AbstractBeforeAfterRule.java:45)
      at com.carrotsearch.randomizedtesting.rules.StatementAdapter.evaluate(StatementAdapter.java:36)
      at org.apache.lucene.util.TestRuleStoreClassName$1.evaluate(TestRuleStoreClassName.java:41)
      at com.carrotsearch.randomizedtesting.rules.NoShadowingOrOverridesOnMethodsRule$1.evaluate(NoShadowingOrOverridesOnMethodsRule.java:40)
      at com.carrotsearch.randomizedtesting.rules.NoShadowingOrOverridesOnMethodsRule$1.evaluate(NoShadowingOrOverridesOnMethodsRule.java:40)
      at com.carrotsearch.randomizedtesting.rules.StatementAdapter.evaluate(StatementAdapter.java:36)
      at com.carrotsearch.randomizedtesting.rules.StatementAdapter.evaluate(StatementAdapter.java:36)
      at com.carrotsearch.randomizedtesting.rules.StatementAdapter.evaluate(StatementAdapter.java:36)
      at org.apache.lucene.util.TestRuleAssertionsRequired$1.evaluate(TestRuleAssertionsRequired.java:53)
      at org.apache.lucene.util.TestRuleMarkFailure$1.evaluate(TestRuleMarkFailure.java:47)
      at org.apache.lucene.util.TestRuleIgnoreAfterMaxFailures$1.evaluate(TestRuleIgnoreAfterMaxFailures.java:64)
      at org.apache.lucene.util.TestRuleIgnoreTestSuites$1.evaluate(TestRuleIgnoreTestSuites.java:54)
      at com.carrotsearch.randomizedtesting.rules.StatementAdapter.evaluate(StatementAdapter.java:36)
      at com.carrotsearch.randomizedtesting.ThreadLeakControl$StatementRunner.run(ThreadLeakControl.java:367)
      at java.lang.Thread.run(Thread.java:745)


    FAILED: org.apache.solr.cloud.ClusterStateUpdateTest.testCoreRegistration

    Error Message:
    Error CREATEing SolrCore 'testcore': Unable to create core [testcore] Caused by: Timed out getting shard id for core: testcore

    Stack Trace:
    org.apache.solr.common.SolrException: Error CREATEing SolrCore 'testcore': Unable to create core [testcore] Caused by: Timed out getting shard id for core: testcore
      at __randomizedtesting.SeedInfo.seed([E23C5815F355BF8A:5CB73EBA8A2FB1BF]:0)
      at org.apache.solr.core.CoreContainer.create(CoreContainer.java:785)
      at org.apache.solr.core.CoreContainer.create(CoreContainer.java:718)
      at org.apache.solr.cloud.ClusterStateUpdateTest.testCoreRegistration(ClusterStateUpdateTest.java:158)
      at sun.reflect.NativeMethodAccessorImpl.invoke0(Native Method)
      at sun.reflect.NativeMethodAccessorImpl.invoke(NativeMethodAccessorImpl.java:62)
      at sun.reflect.DelegatingMethodAccessorImpl.invoke(DelegatingMethodAccessorImpl.java:43)
      at java.lang.reflect.Method.invoke(Method.java:498)
      at com.carrotsearch.randomizedtesting.RandomizedRunner.invoke(RandomizedRunner.java:1764)
      at com.carrotsearch.randomizedtesting.RandomizedRunner$8.evaluate(RandomizedRunner.java:871)
      at com.carrotsearch.randomizedtesting.RandomizedRunner$9.evaluate(RandomizedRunner.java:907)
      at com.carrotsearch.randomizedtesting.RandomizedRunner$10.evaluate(RandomizedRunner.java:921)
      at com.carrotsearch.randomizedtesting.rules.SystemPropertiesRestoreRule$1.evaluate(SystemPropertiesRestoreRule.java:57)
      at org.apache.lucene.util.TestRuleSetupTeardownChained$1.evaluate(TestRuleSetupTeardownChained.java:49)
      at org.apache.lucene.util.AbstractBeforeAfterRule$1.evaluate(AbstractBeforeAfterRule.java:45)
      at org.apache.lucene.util.TestRuleThreadAndTestName$1.evaluate(TestRuleThreadAndTestName.java:48)
      at org.apache.lucene.util.TestRuleIgnoreAfterMaxFailures$1.evaluate(TestRuleIgnoreAfterMaxFailures.java:64)
      at org.apache.lucene.util.TestRuleMarkFailure$1.evaluate(TestRuleMarkFailure.java:47)
      at com.carrotsearch.randomizedtesting.rules.StatementAdapter.evaluate(StatementAdapter.java:36)
      at com.carrotsearch.randomizedtesting.ThreadLeakControl$StatementRunner.run(ThreadLeakControl.java:367)
      at com.carrotsearch.randomizedtesting.ThreadLeakControl.forkTimeoutingTask(ThreadLeakControl.java:809)
      at com.carrotsearch.randomizedtesting.ThreadLeakControl$3.evaluate(ThreadLeakControl.java:460)
      at com.carrotsearch.randomizedtesting.RandomizedRunner.runSingleTest(RandomizedRunner.java:880)
      at com.carrotsearch.randomizedtesting.RandomizedRunner$5.evaluate(RandomizedRunner.java:781)
      at com.carrotsearch.randomizedtesting.RandomizedRunner$6.evaluate(RandomizedRunner.java:816)
      at com.carrotsearch.randomizedtesting.RandomizedRunner$7.evaluate(RandomizedRunner.java:827)
      at com.carrotsearch.randomizedtesting.rules.StatementAdapter.evaluate(StatementAdapter.java:36)
      at com.carrotsearch.randomizedtesting.rules.SystemPropertiesRestoreRule$1.evaluate(SystemPropertiesRestoreRule.java:57)
      at org.apache.lucene.util.AbstractBeforeAfterRule$1.evaluate(AbstractBeforeAfterRule.java:45)
      at com.carrotsearch.randomizedtesting.rules.StatementAdapter.evaluate(StatementAdapter.java:36)
      at org.apache.lucene.util.TestRuleStoreClassName$1.evaluate(TestRuleStoreClassName.java:41)
      at com.carrotsearch.randomizedtesting.rules.NoShadowingOrOverridesOnMethodsRule$1.evaluate(NoShadowingOrOverridesOnMethodsRule.java:40)
      at com.carrotsearch.randomizedtesting.rules.NoShadowingOrOverridesOnMethodsRule$1.evaluate(NoShadowingOrOverridesOnMethodsRule.java:40)
      at com.carrotsearch.randomizedtesting.rules.StatementAdapter.evaluate(StatementAdapter.java:36)
      at com.carrotsearch.randomizedtesting.rules.StatementAdapter.evaluate(StatementAdapter.java:36)
      at com.carrotsearch.randomizedtesting.rules.StatementAdapter.evaluate(StatementAdapter.java:36)
      at org.apache.lucene.util.TestRuleAssertionsRequired$1.evaluate(TestRuleAssertionsRequired.java:53)
      at org.apache.lucene.util.TestRuleMarkFailure$1.evaluate(TestRuleMarkFailure.java:47)
      at org.apache.lucene.util.TestRuleIgnoreAfterMaxFailures$1.evaluate(TestRuleIgnoreAfterMaxFailures.java:64)
      at org.apache.lucene.util.TestRuleIgnoreTestSuites$1.evaluate(TestRuleIgnoreTestSuites.java:54)
      at com.carrotsearch.randomizedtesting.rules.StatementAdapter.evaluate(StatementAdapter.java:36)
      at com.carrotsearch.randomizedtesting.ThreadLeakControl$StatementRunner.run(ThreadLeakControl.java:367)
      at java.lang.Thread.run(Thread.java:745)
    Caused by: org.apache.solr.common.SolrException: Unable to create core [testcore]
      at org.apache.solr.core.CoreContainer.create(CoreContainer.java:828)
      at org.apache.solr.core.CoreContainer.create(CoreContainer.java:751)
      ... 41 more
    Caused by: org.apache.solr.common.SolrException: Timed out getting shard id for core: testcore
      at org.apache.solr.cloud.ZkController.waitForShardId(ZkController.java:1407)
      at org.apache.solr.cloud.ZkController.doGetShardIdAndNodeNameProcess(ZkController.java:1362)
      at org.apache.solr.cloud.ZkController.preRegister(ZkController.java:1456)
      at org.apache.solr.core.CoreContainer.create(CoreContainer.java:809)
      ... 42 more


    FAILED: org.apache.solr.cloud.DistribCursorPagingTest.test

    Error Message:
    Error from server at http://127.0.0.1:63357/e_iuo/kw/collection1: Expected mime type application/octet-stream but got text/html. <html> <head> <meta http-equiv="Content-Type" content="text/html;charset=ISO-8859-1"/> <title>Error 500 </title> </head> <body> <h2>HTTP ERROR: 500</h2> <p>Problem accessing /e_iuo/kw/collection1/update. Reason: <pre> {metadata={error-class=org.apache.solr.common.SolrException,root-error-class=org.apache.solr.common.SolrException},msg=SolrCore &apos;collection1&apos; is not available due to init failure: Timed out getting coreNodeName for collection1,trace=org.apache.solr.common.SolrException: SolrCore &apos;collection1&apos; is not available due to init failure: Timed out getting coreNodeName for collection1 at org.apache.solr.core.CoreContainer.getCore(CoreContainer.java:1080) at org.apache.solr.servlet.HttpSolrCall.init(HttpSolrCall.java:256) at org.apache.solr.servlet.HttpSolrCall.call(HttpSolrCall.java:418) at org.apache.solr.servlet.SolrDispatchFilter.doFilter(SolrDispatchFilter.java:257) at org.apache.solr.servlet.SolrDispatchFilter.doFilter(SolrDispatchFilter.java:208) at org.eclipse.jetty.servlet.ServletHandler$CachedChain.doFilter(ServletHandler.java:1676) at org.apache.solr.client.solrj.embedded.JettySolrRunner$DebugFilter.doFilter(JettySolrRunner.java:109) at org.eclipse.jetty.servlet.ServletHandler$CachedChain.doFilter(ServletHandler.java:1676) at org.eclipse.jetty.servlet.ServletHandler.doHandle(ServletHandler.java:581) at org.eclipse.jetty.server.session.SessionHandler.doHandle(SessionHandler.java:224) at org.eclipse.jetty.server.handler.ContextHandler.doHandle(ContextHandler.java:1160) at org.eclipse.jetty.servlet.ServletHandler.doScope(ServletHandler.java:511) at org.eclipse.jetty.server.session.SessionHandler.doScope(SessionHandler.java:185) at org.eclipse.jetty.server.handler.ContextHandler.doScope(ContextHandler.java:1092) at org.eclipse.jetty.server.handler.ScopedHandler.handle(ScopedHandler.java:141) at org.eclipse.jetty.server.handler.gzip.GzipHandler.handle(GzipHandler.java:399) at org.eclipse.jetty.server.handler.HandlerWrapper.handle(HandlerWrapper.java:134) at org.eclipse.jetty.server.Server.handle(Server.java:518) at org.eclipse.jetty.server.HttpChannel.handle(HttpChannel.java:308) at org.eclipse.jetty.server.HttpConnection.onFillable(HttpConnection.java:244) at org.eclipse.jetty.io.AbstractConnection$ReadCallback.succeeded(AbstractConnection.java:273) at org.eclipse.jetty.io.FillInterest.fillable(FillInterest.java:95) at org.eclipse.jetty.io.SelectChannelEndPoint$2.run(SelectChannelEndPoint.java:93) at org.eclipse.jetty.util.thread.strategy.ExecuteProduceConsume.produceAndRun(ExecuteProduceConsume.java:246) at org.eclipse.jetty.util.thread.strategy.ExecuteProduceConsume.run(ExecuteProduceConsume.java:156) at org.eclipse.jetty.util.thread.QueuedThreadPool.runJob(QueuedThreadPool.java:654) at org.eclipse.jetty.util.thread.QueuedThreadPool$3.run(QueuedThreadPool.java:572) at java.lang.Thread.run(Thread.java:745) Caused by: org.apache.solr.common.SolrException: Timed out getting coreNodeName for collection1 at org.apache.solr.cloud.ZkController.waitForCoreNodeName(ZkController.java:1387) at org.apache.solr.cloud.ZkController.doGetShardIdAndNodeNameProcess(ZkController.java:1365) at org.apache.solr.cloud.ZkController.preRegister(ZkController.java:1456) at org.apache.solr.core.CoreContainer.create(CoreContainer.java:809) at org.apache.solr.core.CoreContainer.lambda$load$0(CoreContainer.java:468) at java.util.concurrent.FutureTask.run(FutureTask.java:266) at org.apache.solr.common.util.ExecutorUtil$MDCAwareThreadPoolExecutor.lambda$execute$0(ExecutorUtil.java:229) at java.util.concurrent.ThreadPoolExecutor.runWorker(ThreadPoolExecutor.java:1142) at java.util.concurrent.ThreadPoolExecutor$Worker.run(ThreadPoolExecutor.java:617) ... 1 more ,code=500}</pre></p> <hr /><a href="http://eclipse.org/jetty">Powered by Jetty:// 9.3.8.v20160314</a><hr/> </body> </html>

    Stack Trace:
    org.apache.solr.client.solrj.impl.HttpSolrClient$RemoteSolrException: Error from server at http://127.0.0.1:63357/e_iuo/kw/collection1: Expected mime type application/octet-stream but got text/html. <html>
    <head>
    <meta http-equiv="Content-Type" content="text/html;charset=ISO-8859-1"/>
    <title>Error 500 </title>
    </head>
    <body>
    <h2>HTTP ERROR: 500</h2>
    <p>Problem accessing /e_iuo/kw/collection1/update. Reason:
    <pre> {metadata={error-class=org.apache.solr.common.SolrException,root-error-class=org.apache.solr.common.SolrException},msg=SolrCore &apos;collection1&apos; is not available due to init failure: Timed out getting coreNodeName for collection1,trace=org.apache.solr.common.SolrException: SolrCore &apos;collection1&apos; is not available due to init failure: Timed out getting coreNodeName for collection1
      at org.apache.solr.core.CoreContainer.getCore(CoreContainer.java:1080)
      at org.apache.solr.servlet.HttpSolrCall.init(HttpSolrCall.java:256)
      at org.apache.solr.servlet.HttpSolrCall.call(HttpSolrCall.java:418)
      at org.apache.solr.servlet.SolrDispatchFilter.doFilter(SolrDispatchFilter.java:257)
      at org.apache.solr.servlet.SolrDispatchFilter.doFilter(SolrDispatchFilter.java:208)
      at org.eclipse.jetty.servlet.ServletHandler$CachedChain.doFilter(ServletHandler.java:1676)
      at org.apache.solr.client.solrj.embedded.JettySolrRunner$DebugFilter.doFilter(JettySolrRunner.java:109)
      at org.eclipse.jetty.servlet.ServletHandler$CachedChain.doFilter(ServletHandler.java:1676)
      at org.eclipse.jetty.servlet.ServletHandler.doHandle(ServletHandler.java:581)
      at org.eclipse.jetty.server.session.SessionHandler.doHandle(SessionHandler.java:224)
      at org.eclipse.jetty.server.handler.ContextHandler.doHandle(ContextHandler.java:1160)
      at org.eclipse.jetty.servlet.ServletHandler.doScope(ServletHandler.java:511)
      at org.eclipse.jetty.server.session.SessionHandler.doScope(SessionHandler.java:185)
      at org.eclipse.jetty.server.handler.ContextHandler.doScope(ContextHandler.java:1092)
      at org.eclipse.jetty.server.handler.ScopedHandler.handle(ScopedHandler.java:141)
      at org.eclipse.jetty.server.handler.gzip.GzipHandler.handle(GzipHandler.java:399)
      at org.eclipse.jetty.server.handler.HandlerWrapper.handle(HandlerWrapper.java:134)
      at org.eclipse.jetty.server.Server.handle(Server.java:518)
      at org.eclipse.jetty.server.HttpChannel.handle(HttpChannel.java:308)
      at org.eclipse.jetty.server.HttpConnection.onFillable(HttpConnection.java:244)
      at org.eclipse.jetty.io.AbstractConnection$ReadCallback.succeeded(AbstractConnection.java:273)
      at org.eclipse.jetty.io.FillInterest.fillable(FillInterest.java:95)
      at org.eclipse.jetty.io.SelectChannelEndPoint$2.run(SelectChannelEndPoint.java:93)
      at org.eclipse.jetty.util.thread.strategy.ExecuteProduceConsume.produceAndRun(ExecuteProduceConsume.java:246)
      at org.eclipse.jetty.util.thread.strategy.ExecuteProduceConsume.run(ExecuteProduceConsume.java:156)
      at org.eclipse.jetty.util.thread.QueuedThreadPool.runJob(QueuedThreadPool.java:654)
      at org.eclipse.jetty.util.thread.QueuedThreadPool$3.run(QueuedThreadPool.java:572)
      at java.lang.Thread.run(Thread.java:745)
    Caused by: org.apache.solr.common.SolrException: Timed out getting coreNodeName for collection1
      at org.apache.solr.cloud.ZkController.waitForCoreNodeName(ZkController.java:1387)
      at org.apache.solr.cloud.ZkController.doGetShardIdAndNodeNameProcess(ZkController.java:1365)
      at org.apache.solr.cloud.ZkController.preRegister(ZkController.java:1456)
      at org.apache.solr.core.CoreContainer.create(CoreContainer.java:809)
      at org.apache.solr.core.CoreContainer.lambda$load$0(CoreContainer.java:468)
      at java.util.concurrent.FutureTask.run(FutureTask.java:266)
      at org.apache.solr.common.util.ExecutorUtil$MDCAwareThreadPoolExecutor.lambda$execute$0(ExecutorUtil.java:229)
      at java.util.concurrent.ThreadPoolExecutor.runWorker(ThreadPoolExecutor.java:1142)
      at java.util.concurrent.ThreadPoolExecutor$Worker.run(ThreadPoolExecutor.java:617)
      ... 1 more
    ,code=500}</pre></p>
    <hr /><a href="http://eclipse.org/jetty">Powered by Jetty:// 9.3.8.v20160314</a><hr/>
    </body>
    [E23C5815F355BF8A:6A6867CF5DA9D272]:0)
      at org.apache.solr.client.solrj.impl.HttpSolrClient.executeMethod(HttpSolrClient.java:558)
      at org.apache.solr.client.solrj.impl.HttpSolrClient.request(HttpSolrClient.java:259)
      at org.apache.solr.client.solrj.impl.HttpSolrClient.request(HttpSolrClient.java:248)
      at org.apache.solr.client.solrj.SolrRequest.process(SolrRequest.java:149)
      at org.apache.solr.client.solrj.SolrRequest.process(SolrRequest.java:166)
      at org.apache.solr.cloud.AbstractFullDistribZkTestBase.indexDoc(AbstractFullDistribZkTestBase.java:775)
      at org.apache.solr.cloud.DistribCursorPagingTest.doBadInputTest(DistribCursorPagingTest.java:111)
      at org.apache.solr.cloud.DistribCursorPagingTest.test(DistribCursorPagingTest.java:88)
      at sun.reflect.NativeMethodAccessorImpl.invoke0(Native Method)
      at sun.reflect.NativeMethodAccessorImpl.invoke(NativeMethodAccessorImpl.java:62)
      at sun.reflect.DelegatingMethodAccessorImpl.invoke(DelegatingMethodAccessorImpl.java:43)
      at java.lang.reflect.Method.invoke(Method.java:498)
      at com.carrotsearch.randomizedtesting.RandomizedRunner.invoke(RandomizedRunner.java:1764)
      at com.carrotsearch.randomizedtesting.RandomizedRunner$8.evaluate(RandomizedRunner.java:871)
      at com.carrotsearch.randomizedtesting.RandomizedRunner$9.evaluate(RandomizedRunner.java:907)
      at com.carrotsearch.randomizedtesting.RandomizedRunner$10.evaluate(RandomizedRunner.java:921)
      at org.apache.solr.BaseDistributedSearchTestCase$ShardsRepeatRule$ShardsFixedStatement.callStatement(BaseDistributedSearchTestCase.java:992)
      at org.apache.solr.BaseDistributedSearchTestCase$ShardsRepeatRule$ShardsStatement.evaluate(BaseDistributedSearchTestCase.java:967)
      at com.carrotsearch.randomizedtesting.rules.SystemPropertiesRestoreRule$1.evaluate(SystemPropertiesRestoreRule.java:57)
      at org.apache.lucene.util.TestRuleSetupTeardownChained$1.evaluate(TestRuleSetupTeardownChained.java:49)
      at org.apache.lucene.util.AbstractBeforeAfterRule$1.evaluate(AbstractBeforeAfterRule.java:45)
      at org.apache.lucene.util.TestRuleThreadAndTestName$1.evaluate(TestRuleThreadAndTestName.java:48)
      at org.apache.lucene.util.TestRuleIgnoreAfterMaxFailures$1.evaluate(TestRuleIgnoreAfterMaxFailures.java:64)
      at org.apache.lucene.util.TestRuleMarkFailure$1.evaluate(TestRuleMarkFailure.java:47)
      at com.carrotsearch.randomizedtesting.rules.StatementAdapter.evaluate(StatementAdapter.java:36)
      at com.carrotsearch.randomizedtesting.ThreadLeakControl$StatementRunner.run(ThreadLeakControl.java:367)
      at com.carrotsearch.randomizedtesting.ThreadLeakControl.forkTimeoutingTask(ThreadLeakControl.java:809)
      at com.carrotsearch.randomizedtesting.ThreadLeakControl$3.evaluate(ThreadLeakControl.java:460)
      at com.carrotsearch.randomizedtesting.RandomizedRunner.runSingleTest(RandomizedRunner.java:880)
      at com.carrotsearch.randomizedtesting.RandomizedRunner$5.evaluate(RandomizedRunner.java:781)
      at com.carrotsearch.randomizedtesting.RandomizedRunner$6.evaluate(RandomizedRunner.java:816)
      at com.carrotsearch.randomizedtesting.RandomizedRunner$7.evaluate(RandomizedRunner.java:827)
      at com.carrotsearch.randomizedtesting.rules.StatementAdapter.evaluate(StatementAdapter.java:36)
      at com.carrotsearch.randomizedtesting.rules.SystemPropertiesRestoreRule$1.evaluate(SystemPropertiesRestoreRule.java:57)
      at org.apache.lucene.util.AbstractBeforeAfterRule$1.evaluate(AbstractBeforeAfterRule.java:45)
      at com.carrotsearch.randomizedtesting.rules.StatementAdapter.evaluate(StatementAdapter.java:36)
      at org.apache.lucene.util.TestRuleStoreClassName$1.evaluate(TestRuleStoreClassName.java:41)
      at com.carrotsearch.randomizedtesting.rules.NoShadowingOrOverridesOnMethodsRule$1.evaluate(NoShadowingOrOverridesOnMethodsRule.java:40)
      at com.carrotsearch.randomizedtesting.rules.NoShadowingOrOverridesOnMethodsRule$1.evaluate(NoShadowingOrOverridesOnMethodsRule.java:40)
      at com.carrotsearch.randomizedtesting.rules.StatementAdapter.evaluate(StatementAdapter.java:36)
      at com.carrotsearch.randomizedtesting.rules.StatementAdapter.evaluate(StatementAdapter.java:36)
      at com.carrotsearch.randomizedtesting.rules.StatementAdapter.evaluate(StatementAdapter.java:36)
      at org.apache.lucene.util.TestRuleAssertionsRequired$1.evaluate(TestRuleAssertionsRequired.java:53)
      at org.apache.lucene.util.TestRuleMarkFailure$1.evaluate(TestRuleMarkFailure.java:47)
      at org.apache.lucene.util.TestRuleIgnoreAfterMaxFailures$1.evaluate(TestRuleIgnoreAfterMaxFailures.java:64)
      at org.apache.lucene.util.TestRuleIgnoreTestSuites$1.evaluate(TestRuleIgnoreTestSuites.java:54)
      at com.carrotsearch.randomizedtesting.rules.StatementAdapter.evaluate(StatementAdapter.java:36)
      at com.carrotsearch.randomizedtesting.ThreadLeakControl$StatementRunner.run(ThreadLeakControl.java:367)
      at java.lang.Thread.run(Thread.java:745)


    FAILED: org.apache.solr.cloud.FullSolrCloudDistribCmdsTest.test

    Error Message:
    Error from server at http://127.0.0.1:39167/collection1: Expected mime type application/octet-stream but got text/html. <html> <head> <meta http-equiv="Content-Type" content="text/html;charset=ISO-8859-1"/> <title>Error 500 </title> </head> <body> <h2>HTTP ERROR: 500</h2> <p>Problem accessing /collection1/update. Reason: <pre> {metadata={error-class=org.apache.solr.common.SolrException,root-error-class=org.apache.solr.common.SolrException},msg=SolrCore &apos;collection1&apos; is not available due to init failure: Timed out getting coreNodeName for collection1,trace=org.apache.solr.common.SolrException: SolrCore &apos;collection1&apos; is not available due to init failure: Timed out getting coreNodeName for collection1 at org.apache.solr.core.CoreContainer.getCore(CoreContainer.java:1080) at org.apache.solr.servlet.HttpSolrCall.init(HttpSolrCall.java:256) at org.apache.solr.servlet.HttpSolrCall.call(HttpSolrCall.java:418) at org.apache.solr.servlet.SolrDispatchFilter.doFilter(SolrDispatchFilter.java:257) at org.apache.solr.servlet.SolrDispatchFilter.doFilter(SolrDispatchFilter.java:208) at org.eclipse.jetty.servlet.ServletHandler$CachedChain.doFilter(ServletHandler.java:1676) at org.apache.solr.client.solrj.embedded.JettySolrRunner$DebugFilter.doFilter(JettySolrRunner.java:109) at org.eclipse.jetty.servlet.ServletHandler$CachedChain.doFilter(ServletHandler.java:1676) at org.eclipse.jetty.servlet.ServletHandler.doHandle(ServletHandler.java:581) at org.eclipse.jetty.server.session.SessionHandler.doHandle(SessionHandler.java:224) at org.eclipse.jetty.server.handler.ContextHandler.doHandle(ContextHandler.java:1160) at org.eclipse.jetty.servlet.ServletHandler.doScope(ServletHandler.java:511) at org.eclipse.jetty.server.session.SessionHandler.doScope(SessionHandler.java:185) at org.eclipse.jetty.server.handler.ContextHandler.doScope(ContextHandler.java:1092) at org.eclipse.jetty.server.handler.ScopedHandler.handle(ScopedHandler.java:141) at org.eclipse.jetty.server.handler.gzip.GzipHandler.handle(GzipHandler.java:399) at org.eclipse.jetty.server.handler.HandlerWrapper.handle(HandlerWrapper.java:134) at org.eclipse.jetty.server.Server.handle(Server.java:518) at org.eclipse.jetty.server.HttpChannel.handle(HttpChannel.java:308) at org.eclipse.jetty.server.HttpConnection.onFillable(HttpConnection.java:244) at org.eclipse.jetty.io.AbstractConnection$ReadCallback.succeeded(AbstractConnection.java:273) at org.eclipse.jetty.io.FillInterest.fillable(FillInterest.java:95) at org.eclipse.jetty.io.SelectChannelEndPoint$2.run(SelectChannelEndPoint.java:93) at org.eclipse.jetty.util.thread.strategy.ExecuteProduceConsume.produceAndRun(ExecuteProduceConsume.java:246) at org.eclipse.jetty.util.thread.strategy.ExecuteProduceConsume.run(ExecuteProduceConsume.java:156) at org.eclipse.jetty.util.thread.QueuedThreadPool.runJob(QueuedThreadPool.java:654) at org.eclipse.jetty.util.thread.QueuedThreadPool$3.run(QueuedThreadPool.java:572) at java.lang.Thread.run(Thread.java:745) Caused by: org.apache.solr.common.SolrException: Timed out getting coreNodeName for collection1 at org.apache.solr.cloud.ZkController.waitForCoreNodeName(ZkController.java:1387) at org.apache.solr.cloud.ZkController.doGetShardIdAndNodeNameProcess(ZkController.java:1365) at org.apache.solr.cloud.ZkController.preRegister(ZkController.java:1456) at org.apache.solr.core.CoreContainer.create(CoreContainer.java:809) at org.apache.solr.core.CoreContainer.lambda$load$0(CoreContainer.java:468) at java.util.concurrent.FutureTask.run(FutureTask.java:266) at org.apache.solr.common.util.ExecutorUtil$MDCAwareThreadPoolExecutor.lambda$execute$0(ExecutorUtil.java:229) at java.util.concurrent.ThreadPoolExecutor.runWorker(ThreadPoolExecutor.java:1142) at java.util.concurrent.ThreadPoolExecutor$Worker.run(ThreadPoolExecutor.java:617) ... 1 more ,code=500}</pre></p> <hr /><a href="http://eclipse.org/jetty">Powered by Jetty:// 9.3.8.v20160314</a><hr/> </body> </html>

    Stack Trace:
    org.apache.solr.client.solrj.impl.HttpSolrClient$RemoteSolrException: Error from server at http://127.0.0.1:39167/collection1: Expected mime type application/octet-stream but got text/html. <html>
    <head>
    <meta http-equiv="Content-Type" content="text/html;charset=ISO-8859-1"/>
    <title>Error 500 </title>
    </head>
    <body>
    <h2>HTTP ERROR: 500</h2>
    <p>Problem accessing /collection1/update. Reason:
    <pre> {metadata={error-class=org.apache.solr.common.SolrException,root-error-class=org.apache.solr.common.SolrException},msg=SolrCore &apos;collection1&apos; is not available due to init failure: Timed out getting coreNodeName for collection1,trace=org.apache.solr.common.SolrException: SolrCore &apos;collection1&apos; is not available due to init failure: Timed out getting coreNodeName for collection1
      at org.apache.solr.core.CoreContainer.getCore(CoreContainer.java:1080)
      at org.apache.solr.servlet.HttpSolrCall.init(HttpSolrCall.java:256)
      at org.apache.solr.servlet.HttpSolrCall.call(HttpSolrCall.java:418)
      at org.apache.solr.servlet.SolrDispatchFilter.doFilter(SolrDispatchFilter.java:257)
      at org.apache.solr.servlet.SolrDispatchFilter.doFilter(SolrDispatchFilter.java:208)
      at org.eclipse.jetty.servlet.ServletHandler$CachedChain.doFilter(ServletHandler.java:1676)
      at org.apache.solr.client.solrj.embedded.JettySolrRunner$DebugFilter.doFilter(JettySolrRunner.java:109)
      at org.eclipse.jetty.servlet.ServletHandler$CachedChain.doFilter(ServletHandler.java:1676)
      at org.eclipse.jetty.servlet.ServletHandler.doHandle(ServletHandler.java:581)
      at org.eclipse.jetty.server.session.SessionHandler.doHandle(SessionHandler.java:224)
      at org.eclipse.jetty.server.handler.ContextHandler.doHandle(ContextHandler.java:1160)
      at org.eclipse.jetty.servlet.ServletHandler.doScope(ServletHandler.java:511)
      at org.eclipse.jetty.server.session.SessionHandler.doScope(SessionHandler.java:185)
      at org.eclipse.jetty.server.handler.ContextHandler.doScope(ContextHandler.java:1092)
      at org.eclipse.jetty.server.handler.ScopedHandler.handle(ScopedHandler.java:141)
      at org.eclipse.jetty.server.handler.gzip.GzipHandler.handle(GzipHandler.java:399)
      at org.eclipse.jetty.server.handler.HandlerWrapper.handle(HandlerWrapper.java:134)
      at org.eclipse.jetty.server.Server.handle(Server.java:518)
      at org.eclipse.jetty.server.HttpChannel.handle(HttpChannel.java:308)
      at org.eclipse.jetty.server.HttpConnection.onFillable(HttpConnection.java:244)
      at org.eclipse.jetty.io.AbstractConnection$ReadCallback.succeeded(AbstractConnection.java:273)
      at org.eclipse.jetty.io.FillInterest.fillable(FillInterest.java:95)
      at org.eclipse.jetty.io.SelectChannelEndPoint$2.run(SelectChannelEndPoint.java:93)
      at org.eclipse.jetty.util.thread.strategy.ExecuteProduceConsume.produceAndRun(ExecuteProduceConsume.java:246)
      at org.eclipse.jetty.util.thread.strategy.ExecuteProduceConsume.run(ExecuteProduceConsume.java:156)
      at org.eclipse.jetty.util.thread.QueuedThreadPool.runJob(QueuedThreadPool.java:654)
      at org.eclipse.jetty.util.thread.QueuedThreadPool$3.run(QueuedThreadPool.java:572)
      at java.lang.Thread.run(Thread.java:745)
    Caused by: org.apache.solr.common.SolrException: Timed out getting coreNodeName for collection1
      at org.apache.solr.cloud.ZkController.waitForCoreNodeName(ZkController.java:1387)
      at org.apache.solr.cloud.ZkController.doGetShardIdAndNodeNameProcess(ZkController.java:1365)
      at org.apache.solr.cloud.ZkController.preRegister(ZkController.java:1456)
      at org.apache.solr.core.CoreContainer.create(CoreContainer.java:809)
      at org.apache.solr.core.CoreContainer.lambda$load$0(CoreContainer.java:468)
      at java.util.concurrent.FutureTask.run(FutureTask.java:266)
      at org.apache.solr.common.util.ExecutorUtil$MDCAwareThreadPoolExecutor.lambda$execute$0(ExecutorUtil.java:229)
      at java.util.concurrent.ThreadPoolExecutor.runWorker(ThreadPoolExecutor.java:1142)
      at java.util.concurrent.ThreadPoolExecutor$Worker.run(ThreadPoolExecutor.java:617)
      ... 1 more
    ,code=500}</pre></p>
    <hr /><a href="http://eclipse.org/jetty">Powered by Jetty:// 9.3.8.v20160314</a><hr/>
    </body>
    [E23C5815F355BF8A:6A6867CF5DA9D272]:0)
      at org.apache.solr.client.solrj.impl.HttpSolrClient.executeMethod(HttpSolrClient.java:558)
      at org.apache.solr.client.solrj.impl.HttpSolrClient.request(HttpSolrClient.java:259)
      at org.apache.solr.client.solrj.impl.HttpSolrClient.request(HttpSolrClient.java:248)
      at org.apache.solr.client.solrj.SolrRequest.process(SolrRequest.java:149)
      at org.apache.solr.client.solrj.SolrRequest.process(SolrRequest.java:166)
      at org.apache.solr.cloud.AbstractFullDistribZkTestBase.indexDoc(AbstractFullDistribZkTestBase.java:775)
      at org.apache.solr.BaseDistributedSearchTestCase.indexr(BaseDistributedSearchTestCase.java:472)
      at org.apache.solr.cloud.FullSolrCloudDistribCmdsTest.addUpdateDelete(FullSolrCloudDistribCmdsTest.java:472)
      at org.apache.solr.cloud.FullSolrCloudDistribCmdsTest.test(FullSolrCloudDistribCmdsTest.java:81)
      at sun.reflect.NativeMethodAccessorImpl.invoke0(Native Method)
      at sun.reflect.NativeMethodAccessorImpl.invoke(NativeMethodAccessorImpl.java:62)
      at sun.reflect.DelegatingMethodAccessorImpl.invoke(DelegatingMethodAccessorImpl.java:43)
      at java.lang.reflect.Method.invoke(Method.java:498)
      at com.carrotsearch.randomizedtesting.RandomizedRunner.invoke(RandomizedRunner.java:1764)
      at com.carrotsearch.randomizedtesting.RandomizedRunner$8.evaluate(RandomizedRunner.java:871)
      at com.carrotsearch.randomizedtesting.RandomizedRunner$9.evaluate(RandomizedRunner.java:907)
      at com.carrotsearch.randomizedtesting.RandomizedRunner$10.evaluate(RandomizedRunner.java:921)
      at org.apache.solr.BaseDistributedSearchTestCase$ShardsRepeatRule$ShardsFixedStatement.callStatement(BaseDistributedSearchTestCase.java:992)
      at org.apache.solr.BaseDistributedSearchTestCase$ShardsRepeatRule$ShardsStatement.evaluate(BaseDistributedSearchTestCase.java:967)
      at com.carrotsearch.randomizedtesting.rules.SystemPropertiesRestoreRule$1.evaluate(SystemPropertiesRestoreRule.java:57)
      at org.apache.lucene.util.TestRuleSetupTeardownChained$1.evaluate(TestRuleSetupTeardownChained.java:49)
      at org.apache.lucene.util.AbstractBeforeAfterRule$1.evaluate(AbstractBeforeAfterRule.java:45)
      at org.apache.lucene.util.TestRuleThreadAndTestName$1.evaluate(TestRuleThreadAndTestName.java:48)
      at org.apache.lucene.util.TestRuleIgnoreAfterMaxFailures$1.evaluate(TestRuleIgnoreAfterMaxFailures.java:64)
      at org.apache.lucene.util.TestRuleMarkFailure$1.evaluate(TestRuleMarkFailure.java:47)
      at com.carrotsearch.randomizedtesting.rules.StatementAdapter.evaluate(StatementAdapter.java:36)
      at com.carrotsearch.randomizedtesting.ThreadLeakControl$StatementRunner.run(ThreadLeakControl.java:367)
      at com.carrotsearch.randomizedtesting.ThreadLeakControl.forkTimeoutingTask(ThreadLeakControl.java:809)
      at com.carrotsearch.randomizedtesting.ThreadLeakControl$3.evaluate(ThreadLeakControl.java:460)
      at com.carrotsearch.randomizedtesting.RandomizedRunner.runSingleTest(RandomizedRunner.java:880)
      at com.carrotsearch.randomizedtesting.RandomizedRunner$5.evaluate(RandomizedRunner.java:781)
      at com.carrotsearch.randomizedtesting.RandomizedRunner$6.evaluate(RandomizedRunner.java:816)
      at com.carrotsearch.randomizedtesting.RandomizedRunner$7.evaluate(RandomizedRunner.java:827)
      at com.carrotsearch.randomizedtesting.rules.StatementAdapter.evaluate(StatementAdapter.java:36)
      at com.carrotsearch.randomizedtesting.rules.SystemPropertiesRestoreRule$1.evaluate(SystemPropertiesRestoreRule.java:57)
      at org.apache.lucene.util.AbstractBeforeAfterRule$1.evaluate(AbstractBeforeAfterRule.java:45)
      at com.carrotsearch.randomizedtesting.rules.StatementAdapter.evaluate(StatementAdapter.java:36)
      at org.apache.lucene.util.TestRuleStoreClassName$1.evaluate(TestRuleStoreClassName.java:41)
      at com.carrotsearch.randomizedtesting.rules.NoShadowingOrOverridesOnMethodsRule$1.evaluate(NoShadowingOrOverridesOnMethodsRule.java:40)
      at com.carrotsearch.randomizedtesting.rules.NoShadowingOrOverridesOnMethodsRule$1.evaluate(NoShadowingOrOverridesOnMethodsRule.java:40)
      at com.carrotsearch.randomizedtesting.rules.StatementAdapter.evaluate(StatementAdapter.java:36)
      at com.carrotsearch.randomizedtesting.rules.StatementAdapter.evaluate(StatementAdapter.java:36)
      at com.carrotsearch.randomizedtesting.rules.StatementAdapter.evaluate(StatementAdapter.java:36)
      at org.apache.lucene.util.TestRuleAssertionsRequired$1.evaluate(TestRuleAssertionsRequired.java:53)
      at org.apache.lucene.util.TestRuleMarkFailure$1.evaluate(TestRuleMarkFailure.java:47)
      at org.apache.lucene.util.TestRuleIgnoreAfterMaxFailures$1.evaluate(TestRuleIgnoreAfterMaxFailures.java:64)
      at org.apache.lucene.util.TestRuleIgnoreTestSuites$1.evaluate(TestRuleIgnoreTestSuites.java:54)
      at com.carrotsearch.randomizedtesting.rules.StatementAdapter.evaluate(StatementAdapter.java:36)
      at com.carrotsearch.randomizedtesting.ThreadLeakControl$StatementRunner.run(ThreadLeakControl.java:367)
      at java.lang.Thread.run(Thread.java:745)


    FAILED: org.apache.solr.cloud.LeaderElectionIntegrationTest.testLeaderElectionAfterClientTimeout

    Error Message:
    Could not start container:7000. Reason:class org.apache.solr.common.SolrException Error CREATEing SolrCore 'collection1_shard1': Unable to create core [collection1_shard1] Caused by: Timed out getting coreNodeName for collection1_shard1

    Stack Trace:
    java.lang.AssertionError: Could not start container:7000. Reason:class org.apache.solr.common.SolrException Error CREATEing SolrCore 'collection1_shard1': Unable to create core [collection1_shard1] Caused by: Timed out getting coreNodeName for collection1_shard1
      at __randomizedtesting.SeedInfo.seed([E23C5815F355BF8A:4B0BFDB6D4703761]:0)
      at org.junit.Assert.fail(Assert.java:93)
      at org.apache.solr.cloud.LeaderElectionIntegrationTest.setUp(LeaderElectionIntegrationTest.java:102)
      at sun.reflect.GeneratedMethodAccessor74.invoke(Unknown Source)
      at sun.reflect.DelegatingMethodAccessorImpl.invoke(DelegatingMethodAccessorImpl.java:43)
      at java.lang.reflect.Method.invoke(Method.java:498)
      at com.carrotsearch.randomizedtesting.RandomizedRunner.invoke(RandomizedRunner.java:1764)
      at com.carrotsearch.randomizedtesting.RandomizedRunner$9.evaluate(RandomizedRunner.java:905)
      at com.carrotsearch.randomizedtesting.RandomizedRunner$10.evaluate(RandomizedRunner.java:921)
      at com.carrotsearch.randomizedtesting.rules.SystemPropertiesRestoreRule$1.evaluate(SystemPropertiesRestoreRule.java:57)
      at org.apache.lucene.util.TestRuleSetupTeardownChained$1.evaluate(TestRuleSetupTeardownChained.java:49)
      at org.apache.lucene.util.AbstractBeforeAfterRule$1.evaluate(AbstractBeforeAfterRule.java:45)
      at org.apache.lucene.util.TestRuleThreadAndTestName$1.evaluate(TestRuleThreadAndTestName.java:48)
      at org.apache.lucene.util.TestRuleIgnoreAfterMaxFailures$1.evaluate(TestRuleIgnoreAfterMaxFailures.java:64)
      at org.apache.lucene.util.TestRuleMarkFailure$1.evaluate(TestRuleMarkFailure.java:47)
      at com.carrotsearch.randomizedtesting.rules.StatementAdapter.evaluate(StatementAdapter.java:36)
      at com.carrotsearch.randomizedtesting.ThreadLeakControl$StatementRunner.run(ThreadLeakControl.java:367)
      at com.carrotsearch.randomizedtesting.ThreadLeakControl.forkTimeoutingTask(ThreadLeakControl.java:809)
      at com.carrotsearch.randomizedtesting.ThreadLeakControl$3.evaluate(ThreadLeakControl.java:460)
      at com.carrotsearch.randomizedtesting.RandomizedRunner.runSingleTest(RandomizedRunner.java:880)
      at com.carrotsearch.randomizedtesting.RandomizedRunner$5.evaluate(RandomizedRunner.java:781)
      at com.carrotsearch.randomizedtesting.RandomizedRunner$6.evaluate(RandomizedRunner.java:816)
      at com.carrotsearch.randomizedtesting.RandomizedRunner$7.evaluate(RandomizedRunner.java:827)
      at com.carrotsearch.randomizedtesting.rules.StatementAdapter.evaluate(StatementAdapter.java:36)
      at com.carrotsearch.randomizedtesting.rules.SystemPropertiesRestoreRule$1.evaluate(SystemPropertiesRestoreRule.java:57)
      at org.apache.lucene.util.AbstractBeforeAfterRule$1.evaluate(AbstractBeforeAfterRule.java:45)
      at com.carrotsearch.randomizedtesting.rules.StatementAdapter.evaluate(StatementAdapter.java:36)
      at org.apache.lucene.util.TestRuleStoreClassName$1.evaluate(TestRuleStoreClassName.java:41)
      at com.carrotsearch.randomizedtesting.rules.NoShadowingOrOverridesOnMethodsRule$1.evaluate(NoShadowingOrOverridesOnMethodsRule.java:40)
      at com.carrotsearch.randomizedtesting.rules.NoShadowingOrOverridesOnMethodsRule$1.evaluate(NoShadowingOrOverridesOnMethodsRule.java:40)
      at com.carrotsearch.randomizedtesting.rules.StatementAdapter.evaluate(StatementAdapter.java:36)
      at com.carrotsearch.randomizedtesting.rules.StatementAdapter.evaluate(StatementAdapter.java:36)
      at com.carrotsearch.randomizedtesting.rules.StatementAdapter.evaluate(StatementAdapter.java:36)
      at org.apache.lucene.util.TestRuleAssertionsRequired$1.evaluate(TestRuleAssertionsRequired.java:53)
      at org.apache.lucene.util.TestRuleMarkFailure$1.evaluate(TestRuleMarkFailure.java:47)
      at org.apache.lucene.util.TestRuleIgnoreAfterMaxFailures$1.evaluate(TestRuleIgnoreAfterMaxFailures.java:64)
      at org.apache.lucene.util.TestRuleIgnoreTestSuites$1.evaluate(TestRuleIgnoreTestSuites.java:54)
      at com.carrotsearch.randomizedtesting.rules.StatementAdapter.evaluate(StatementAdapter.java:36)
      at com.carrotsearch.randomizedtesting.ThreadLeakControl$StatementRunner.run(ThreadLeakControl.java:367)
      at java.lang.Thread.run(Thread.java:745)


    FAILED: org.apache.solr.cloud.LeaderElectionIntegrationTest.testSimpleSliceLeaderElection

    Error Message:
    Could not start container:7000. Reason:class org.apache.solr.common.SolrException Error CREATEing SolrCore 'collection1_shard1': Unable to create core [collection1_shard1] Caused by: Timed out getting coreNodeName for collection1_shard1

    Stack Trace:
    java.lang.AssertionError: Could not start container:7000. Reason:class org.apache.solr.common.SolrException Error CREATEing SolrCore 'collection1_shard1': Unable to create core [collection1_shard1] Caused by: Timed out getting coreNodeName for collection1_shard1


    [...truncated too long message...]

    .z.ClientCnxn Error while calling watcher
        [junit4] 2> java.util.concurrent.RejectedExecutionException: Task org.apache.solr.common.util.ExecutorUtil$MDCAwareThreadPoolExecutor$$Lambda$8/798301276@72b5ee2b rejected from org.apache.solr.common.util.ExecutorUtil$MDCAwareThreadPoolExecutor@a48a8f0[Terminated, pool size = 0, active threads = 0, queued tasks = 0, completed tasks = 31]
        [junit4] 2> at java.util.concurrent.ThreadPoolExecutor$AbortPolicy.rejectedExecution(ThreadPoolExecutor.java:2047)
        [junit4] 2> at java.util.concurrent.ThreadPoolExecutor.reject(ThreadPoolExecutor.java:823)
        [junit4] 2> at java.util.concurrent.ThreadPoolExecutor.execute(ThreadPoolExecutor.java:1369)
        [junit4] 2> at org.apache.solr.common.util.ExecutorUtil$MDCAwareThreadPoolExecutor.execute(ExecutorUtil.java:214)
        [junit4] 2> at java.util.concurrent.AbstractExecutorService.submit(AbstractExecutorService.java:112)
        [junit4] 2> at org.apache.solr.common.cloud.SolrZkClient$3.process(SolrZkClient.java:266)
        [junit4] 2> at org.apache.zookeeper.ClientCnxn$EventThread.processEvent(ClientCnxn.java:522)
        [junit4] 2> at org.apache.zookeeper.ClientCnxn$EventThread.run(ClientCnxn.java:498)
        [junit4] 2> 14556665 INFO (TEST-TestReqParamsAPI.test-seed#[E23C5815F355BF8A]) [ ] o.e.j.s.ServerConnector Stopped ServerConnector@3f26daaa{HTTP/1.1,[http/1.1]}{127.0.0.1:0}
        [junit4] 2> 14556665 INFO (TEST-TestReqParamsAPI.test-seed#[E23C5815F355BF8A]) [ ] o.e.j.s.h.ContextHandler Stopped o.e.j.s.ServletContextHandler@516d7c9a{/uw_gxj/dc,null,UNAVAILABLE}
        [junit4] 2> 14556669 INFO (TEST-TestReqParamsAPI.test-seed#[E23C5815F355BF8A]) [ ] o.a.s.c.ZkTestServer connecting to 127.0.0.1:52526 52526
        [junit4] 2> 14556782 INFO (Thread-7665) [ ] o.a.s.c.ZkTestServer connecting to 127.0.0.1:52526 52526
        [junit4] 2> 14556783 WARN (Thread-7665) [ ] o.a.s.c.ZkTestServer Watch limit violations:
        [junit4] 2> Maximum concurrent create/delete watches above limit:
        [junit4] 2>
        [junit4] 2> 32 /solr/configs/conf1
        [junit4] 2> 6 /solr/aliases.json
        [junit4] 2> 6 /solr/clusterprops.json
        [junit4] 2> 5 /solr/security.json
        [junit4] 2> 4 /solr/collections/collection1/state.json
        [junit4] 2>
        [junit4] 2> Maximum concurrent data watches above limit:
        [junit4] 2>
        [junit4] 2> 6 /solr/clusterstate.json
        [junit4] 2>
        [junit4] 2> Maximum concurrent children watches above limit:
        [junit4] 2>
        [junit4] 2> 6 /solr/live_nodes
        [junit4] 2> 6 /solr/collections
        [junit4] 2> 3 /solr/overseer/queue
        [junit4] 2> 3 /solr/overseer/collection-queue-work
        [junit4] 2> 2 /solr/overseer/queue-work
        [junit4] 2>
        [junit4] 2> NOTE: reproduce with: ant test -Dtestcase=TestReqParamsAPI -Dtests.method=test -Dtests.seed=E23C5815F355BF8A -Dtests.slow=true -Dtests.locale=es-BO -Dtests.timezone=America/Puerto_Rico -Dtests.asserts=true -Dtests.file.encoding=UTF-8
        [junit4] FAILURE 619s J0 | TestReqParamsAPI.test <<<
        [junit4] > Throwable #1: java.lang.AssertionError: Could not get expected value 'first' for path 'response/params/x/_appends_/add' full output: {
        [junit4] > "responseHeader":{
        [junit4] > "status":0,
        [junit4] > "QTime":0},
        [junit4] > "response":{
        [junit4] > "znodeVersion":3,
        [junit4] > "params":{
        [junit4] > "x":{
        [junit4] > "a":"A val",
        [junit4] > "b":"B val",
        [junit4] > "":{"v":0}},
        [junit4] > "y":{
        [junit4] > "p":"P val",
        [junit4] > "q":"Q val",
        [junit4] > "":{"v":2}}}}}, from server: http://127.0.0.1:61530/uw_gxj/dc/collection1
        [junit4] > at __randomizedtesting.SeedInfo.seed([E23C5815F355BF8A:6A6867CF5DA9D272]:0)
        [junit4] > at org.apache.solr.core.TestSolrConfigHandler.testForResponseElement(TestSolrConfigHandler.java:457)
        [junit4] > at org.apache.solr.handler.TestReqParamsAPI.testReqParams(TestReqParamsAPI.java:231)
        [junit4] > at org.apache.solr.handler.TestReqParamsAPI.test(TestReqParamsAPI.java:62)
        [junit4] > at org.apache.solr.BaseDistributedSearchTestCase$ShardsRepeatRule$ShardsFixedStatement.callStatement(BaseDistributedSearchTestCase.java:992)
        [junit4] > at org.apache.solr.BaseDistributedSearchTestCase$ShardsRepeatRule$ShardsStatement.evaluate(BaseDistributedSearchTestCase.java:967)
        [junit4] > at java.lang.Thread.run(Thread.java:745)
        [junit4] 2> 14556785 INFO (SUITE-TestReqParamsAPI-seed#[E23C5815F355BF8A]-worker) [ ] o.a.s.SolrTestCaseJ4 ###deleteCore
        [junit4] 2> NOTE: leaving temporary files on disk at: /export/home/jenkins/workspace/Lucene-Solr-6.x-Solaris/solr/build/solr-core/test/J0/temp/solr.handler.TestReqParamsAPI_E23C5815F355BF8A-001
        [junit4] 2> Jun 06, 2016 9:11:49 PM com.carrotsearch.randomizedtesting.ThreadLeakControl checkThreadLeaks
        [junit4] 2> WARNING: Will linger awaiting termination of 1 leaked thread(s).
        [junit4] 2> NOTE: test params are: codec=Asserting(Lucene60): {}, docValues:{}, maxPointsInLeafNode=1883, maxMBSortInHeap=5.491911595889764, sim=RandomSimilarity(queryNorm=true,coord=crazy): {}, locale=es-BO, timezone=America/Puerto_Rico
        [junit4] 2> NOTE: SunOS 5.11 amd64/Oracle Corporation 1.8.0_92 (64-bit)/cpus=3,threads=1,free=323112464,total=478150656
        [junit4] 2> NOTE: All tests run in this JVM: [HdfsBasicDistributedZk2Test, SolrIndexConfigTest, JSONWriterTest, TestUpdate, LeaderInitiatedRecoveryOnCommitTest, TestRequestStatusCollectionAPI, TestCustomSort, TestLegacyFieldCache, TestStressLucene, SegmentsInfoRequestHandlerTest, TestLazyCores, IndexSchemaTest, TestEmbeddedSolrServerConstructors, DeleteLastCustomShardedReplicaTest, TestCollectionAPI, TestRecoveryHdfs, RequiredFieldsTest, TestCollationFieldDocValues, TestLuceneMatchVersion, TestPerFieldSimilarityClassic, ClusterStateTest, TestSortingResponseWriter, PeerSyncTest, CdcrUpdateLogTest, StandardRequestHandlerTest, TestFieldTypeCollectionResource, TestFieldCacheReopen, TestHashQParserPlugin, TestAnalyzedSuggestions, TestConfigSetsAPIExclusivity, DirectSolrSpellCheckerTest, ResponseHeaderTest, TestFilteredDocIdSet, TestBulkSchemaAPI, HdfsThreadLeakTest, TestDynamicLoading, DistributedFacetPivotSmallTest, TestTolerantSearch, OutOfBoxZkACLAndCredentialsProvidersTest, TestUseDocValuesAsStored, TestXmlQParser, TestSort, DistribCursorPagingTest, InfoHandlerTest, SpatialFilterTest, ZkStateReaderTest, DirectUpdateHandlerTest, CursorMarkTest, QueryEqualityTest, CustomCollectionTest, TestCloudInspectUtil, TestHdfsUpdateLog, TestExtendedDismaxParser, UUIDFieldTest, AddBlockUpdateTest, ClusterStateUpdateTest, TestLFUCache, URLClassifyProcessorTest, TestShortCircuitedRequests, SharedFSAutoReplicaFailoverTest, BasicDistributedZkTest, SoftAutoCommitTest, DirectoryFactoryTest, TestExpandComponent, BlockJoinFacetSimpleTest, AssignTest, FastVectorHighlighterTest, DOMUtilTest, DistributedQueryElevationComponentTest, ActionThrottleTest, TestDownShardTolerantSearch, DistributedVersionInfoTest, TestRemoteStreaming, TestTolerantUpdateProcessorRandomCloud, TimeZoneUtilsTest, TestReplicaProperties, DistributedSuggestComponentTest, PreAnalyzedFieldTest, ZkControllerTest, DeleteShardTest, CloudExitableDirectoryReaderTest, SimpleMLTQParserTest, JsonLoaderTest, ScriptEngineTest, TestCoreContainer, SpatialHeatmapFacetsTest, SliceStateTest, TestFaceting, HLLUtilTest, MBeansHandlerTest, ShardRoutingTest, TestArbitraryIndexDir, TestCollapseQParserPlugin, SampleTest, TestAnalyzeInfixSuggestions, TestJmxMonitoredMap, HdfsUnloadDistributedZkTest, TestNumericTerms64, CollectionStateFormat2Test, TestShardHandlerFactory, TestCryptoKeys, TestLockTree, SaslZkACLProviderTest, TestDocumentBuilder, TestDistributedSearch, TestCursorMarkWithoutUniqueKey, TestIntervalFaceting, TestConfigOverlay, TestSchemaNameResource, StressHdfsTest, OverseerStatusTest, TestLMDirichletSimilarityFactory, SimplePostToolTest, TestDocSet, TestDocBasedVersionConstraints, TestSolrConfigHandlerConcurrent, TestDFISimilarityFactory, PolyFieldTest, TestPartialUpdateDeduplication, HdfsDirectoryTest, TestSolrDeletionPolicy1, UnloadDistributedZkTest, TestSolrFieldCacheMBean, AsyncMigrateRouteKeyTest, DistributedExpandComponentTest, HdfsCollectionsAPIDistributedZkTest, TestNoOpRegenerator, BadCopyFieldTest, HighlighterTest, ExternalFileFieldSortTest, HttpPartitionTest, TestCSVLoader, TestFieldCacheSort, TestInfoStreamLogging, TestReqParamsAPI]
        [junit4] Completed [599/613 (17!)] on J0 in 620.29s, 1 test, 1 failure <<< FAILURES!

    [...truncated 62 lines...]
    BUILD FAILED
    /export/home/jenkins/workspace/Lucene-Solr-6.x-Solaris/build.xml:740: The following error occurred while executing this line:
    /export/home/jenkins/workspace/Lucene-Solr-6.x-Solaris/build.xml:684: The following error occurred while executing this line:
    /export/home/jenkins/workspace/Lucene-Solr-6.x-Solaris/build.xml:59: The following error occurred while executing this line:
    /export/home/jenkins/workspace/Lucene-Solr-6.x-Solaris/solr/build.xml:233: The following error occurred while executing this line:
    /export/home/jenkins/workspace/Lucene-Solr-6.x-Solaris/solr/common-build.xml:531: The following error occurred while executing this line:
    /export/home/jenkins/workspace/Lucene-Solr-6.x-Solaris/lucene/common-build.xml:1427: The following error occurred while executing this line:
    /export/home/jenkins/workspace/Lucene-Solr-6.x-Solaris/lucene/common-build.xml:984: There were test failures: 613 suites (10 ignored), 2567 tests, 2 suite-level errors, 14 errors, 4 failures, 1216 ignored (61 assumptions) [seed: E23C5815F355BF8A]

    Total time: 261 minutes 17 seconds
    Build step 'Invoke Ant' marked build as failure
    Archiving artifacts
    [WARNINGS] Skipping publisher since build result is FAILURE
    Recording test results
    Email was triggered for: Failure - Any
    Sending email for trigger: Failure - Any
  • Policeman Jenkins Server at Jun 7, 2016 at 6:49 am
    Build: http://jenkins.thetaphi.de/job/Lucene-Solr-6.x-Solaris/182/
    Java: 64bit/jdk1.8.0 -XX:-UseCompressedOops -XX:+UseParallelGC

    1 tests failed.
    FAILED: org.apache.lucene.spatial.geopoint.search.TestLegacyGeoPointQuery.testAllLatEqual

    Error Message:
    Java heap space

    Stack Trace:
    java.lang.OutOfMemoryError: Java heap space
      at __randomizedtesting.SeedInfo.seed([EDD67565DF51E0D6:504323EBD69CC2DB]:0)
      at java.util.LinkedList.toArray(LinkedList.java:1050)
      at java.util.List.sort(List.java:477)
      at java.util.Collections.sort(Collections.java:141)
      at org.apache.lucene.spatial.geopoint.search.GeoPointNumericTermsEnum.(GeoPointTermsEnum.java:52)
      at org.apache.lucene.spatial.geopoint.search.GeoPointMultiTermQuery.getTermsEnum(GeoPointMultiTermQuery.java:84)
      at org.apache.lucene.spatial.geopoint.search.GeoPointTermQueryConstantScoreWrapper$1.scorer(GeoPointTermQueryConstantScoreWrapper.java:88)
      at org.apache.lucene.search.Weight.bulkScorer(Weight.java:135)
      at org.apache.lucene.search.LRUQueryCache$CachingWrapperWeight.bulkScorer(LRUQueryCache.java:769)
      at org.apache.lucene.search.AssertingWeight.bulkScorer(AssertingWeight.java:68)
      at org.apache.lucene.search.AssertingWeight.bulkScorer(AssertingWeight.java:68)
      at org.apache.lucene.search.IndexSearcher.search(IndexSearcher.java:666)
      at org.apache.lucene.search.AssertingIndexSearcher.search(AssertingIndexSearcher.java:91)
      at org.apache.lucene.search.IndexSearcher.search(IndexSearcher.java:473)
      at org.apache.lucene.geo.BaseGeoPointTestCase.verifyRandomDistances(BaseGeoPointTestCase.java:953)
      at org.apache.lucene.geo.BaseGeoPointTestCase.verify(BaseGeoPointTestCase.java:744)
      at org.apache.lucene.geo.BaseGeoPointTestCase.testAllLatEqual(BaseGeoPointTestCase.java:452)
      at sun.reflect.NativeMethodAccessorImpl.invoke0(Native Method)
      at sun.reflect.NativeMethodAccessorImpl.invoke(NativeMethodAccessorImpl.java:62)
      at sun.reflect.DelegatingMethodAccessorImpl.invoke(DelegatingMethodAccessorImpl.java:43)
      at java.lang.reflect.Method.invoke(Method.java:498)
      at com.carrotsearch.randomizedtesting.RandomizedRunner.invoke(RandomizedRunner.java:1764)
      at com.carrotsearch.randomizedtesting.RandomizedRunner$8.evaluate(RandomizedRunner.java:871)
      at com.carrotsearch.randomizedtesting.RandomizedRunner$9.evaluate(RandomizedRunner.java:907)
      at com.carrotsearch.randomizedtesting.RandomizedRunner$10.evaluate(RandomizedRunner.java:921)
      at org.apache.lucene.util.TestRuleSetupTeardownChained$1.evaluate(TestRuleSetupTeardownChained.java:49)
      at org.apache.lucene.util.AbstractBeforeAfterRule$1.evaluate(AbstractBeforeAfterRule.java:45)
      at org.apache.lucene.util.TestRuleThreadAndTestName$1.evaluate(TestRuleThreadAndTestName.java:48)
      at org.apache.lucene.util.TestRuleIgnoreAfterMaxFailures$1.evaluate(TestRuleIgnoreAfterMaxFailures.java:64)
      at org.apache.lucene.util.TestRuleMarkFailure$1.evaluate(TestRuleMarkFailure.java:47)
      at com.carrotsearch.randomizedtesting.rules.StatementAdapter.evaluate(StatementAdapter.java:36)
      at com.carrotsearch.randomizedtesting.ThreadLeakControl$StatementRunner.run(ThreadLeakControl.java:367)




    Build Log:
    [...truncated 8707 lines...]
        [junit4] Suite: org.apache.lucene.spatial.geopoint.search.TestLegacyGeoPointQuery
        [junit4] IGNOR/A 0.02s J1 | TestLegacyGeoPointQuery.testRandomBig
        [junit4] > Assumption #1: 'nightly' test group is disabled (@Nightly())
        [junit4] IGNOR/A 0.00s J1 | TestLegacyGeoPointQuery.testRandomDistanceHuge
        [junit4] > Assumption #1: legacy encoding is too slow/hangs on this test
        [junit4] 2> NOTE: reproduce with: ant test -Dtestcase=TestLegacyGeoPointQuery -Dtests.method=testAllLatEqual -Dtests.seed=EDD67565DF51E0D6 -Dtests.slow=true -Dtests.locale=de-AT -Dtests.timezone=America/Argentina/Ushuaia -Dtests.asserts=true -Dtests.file.encoding=ISO-8859-1
        [junit4] ERROR 24.7s J1 | TestLegacyGeoPointQuery.testAllLatEqual <<<
        [junit4] > Throwable #1: java.lang.OutOfMemoryError: Java heap space
        [junit4] > at __randomizedtesting.SeedInfo.seed([EDD67565DF51E0D6:504323EBD69CC2DB]:0)
        [junit4] > at java.util.LinkedList.toArray(LinkedList.java:1050)
        [junit4] > at java.util.List.sort(List.java:477)
        [junit4] > at java.util.Collections.sort(Collections.java:141)
        [junit4] > at org.apache.lucene.spatial.geopoint.search.GeoPointNumericTermsEnum.<init>(GeoPointNumericTermsEnum.java:53)
        [junit4] > at org.apache.lucene.spatial.geopoint.search.GeoPointTermsEnum.newInstance(GeoPointTermsEnum.java:52)
        [junit4] > at org.apache.lucene.spatial.geopoint.search.GeoPointMultiTermQuery.getTermsEnum(GeoPointMultiTermQuery.java:84)
        [junit4] > at org.apache.lucene.spatial.geopoint.search.GeoPointTermQueryConstantScoreWrapper$1.scorer(GeoPointTermQueryConstantScoreWrapper.java:88)
        [junit4] > at org.apache.lucene.search.Weight.bulkScorer(Weight.java:135)
        [junit4] > at org.apache.lucene.search.LRUQueryCache$CachingWrapperWeight.bulkScorer(LRUQueryCache.java:769)
        [junit4] > at org.apache.lucene.search.AssertingWeight.bulkScorer(AssertingWeight.java:68)
        [junit4] > at org.apache.lucene.search.AssertingWeight.bulkScorer(AssertingWeight.java:68)
        [junit4] > at org.apache.lucene.search.IndexSearcher.search(IndexSearcher.java:666)
        [junit4] > at org.apache.lucene.search.AssertingIndexSearcher.search(AssertingIndexSearcher.java:91)
        [junit4] > at org.apache.lucene.search.IndexSearcher.search(IndexSearcher.java:473)
        [junit4] > at org.apache.lucene.geo.BaseGeoPointTestCase.verifyRandomDistances(BaseGeoPointTestCase.java:953)
        [junit4] > at org.apache.lucene.geo.BaseGeoPointTestCase.verify(BaseGeoPointTestCase.java:744)
        [junit4] > at org.apache.lucene.geo.BaseGeoPointTestCase.testAllLatEqual(BaseGeoPointTestCase.java:452)
        [junit4] IGNOR/A 0.00s J1 | TestLegacyGeoPointQuery.testSamePointManyTimes
        [junit4] > Assumption #1: legacy encoding goes OOM on this test
        [junit4] IGNOR/A 0.00s J1 | TestLegacyGeoPointQuery.testRandomDistance
        [junit4] > Assumption #1: legacy encoding is too slow/hangs on this test
        [junit4] 2> NOTE: test params are: codec=Lucene60, sim=ClassicSimilarity, locale=de-AT, timezone=America/Argentina/Ushuaia
        [junit4] 2> NOTE: SunOS 5.11 amd64/Oracle Corporation 1.8.0_92 (64-bit)/cpus=3,threads=1,free=218003368,total=287309824
        [junit4] 2> NOTE: All tests run in this JVM: [TestLegacyGeoPointQuery]
        [junit4] Completed [4/4 (1!)] on J1 in 41.57s, 40 tests, 1 error, 4 skipped <<< FAILURES!

    [...truncated 1 lines...]
        [junit4] JVM J1: stdout was not empty, see: /export/home/jenkins/workspace/Lucene-Solr-6.x-Solaris/lucene/build/spatial/test/temp/junit4-J1-20160607_064759_730.sysout
        [junit4] >>> JVM J1 emitted unexpected output (verbatim) ----
        [junit4] java.lang.OutOfMemoryError: Java heap space
        [junit4] Dumping heap to /export/home/jenkins/workspace/Lucene-Solr-6.x-Solaris/heapdumps/java_pid6451.hprof ...
        [junit4] Heap dump file created [466706011 bytes in 13.444 secs]
        [junit4] <<< JVM J1: EOF ----

    [...truncated 9 lines...]
    BUILD FAILED
    /export/home/jenkins/workspace/Lucene-Solr-6.x-Solaris/build.xml:740: The following error occurred while executing this line:
    /export/home/jenkins/workspace/Lucene-Solr-6.x-Solaris/build.xml:684: The following error occurred while executing this line:
    /export/home/jenkins/workspace/Lucene-Solr-6.x-Solaris/build.xml:59: The following error occurred while executing this line:
    /export/home/jenkins/workspace/Lucene-Solr-6.x-Solaris/lucene/build.xml:476: The following error occurred while executing this line:
    /export/home/jenkins/workspace/Lucene-Solr-6.x-Solaris/lucene/common-build.xml:2161: The following error occurred while executing this line:
    /export/home/jenkins/workspace/Lucene-Solr-6.x-Solaris/lucene/module-build.xml:58: The following error occurred while executing this line:
    /export/home/jenkins/workspace/Lucene-Solr-6.x-Solaris/lucene/common-build.xml:1427: The following error occurred while executing this line:
    /export/home/jenkins/workspace/Lucene-Solr-6.x-Solaris/lucene/common-build.xml:984: There were test failures: 4 suites, 82 tests, 1 error, 6 ignored (6 assumptions) [seed: EDD67565DF51E0D6]

    Total time: 20 minutes 0 seconds
    Build step 'Invoke Ant' marked build as failure
    Archiving artifacts
    [WARNINGS] Skipping publisher since build result is FAILURE
    Recording test results
    Email was triggered for: Failure - Any
    Sending email for trigger: Failure - Any

Related Discussions

Discussion Navigation
viewthread | post
Discussion Overview
groupdev @
categorieslucene
postedJun 6, '16 at 2:14a
activeJun 7, '16 at 6:49a
posts3
users1
websitelucene.apache.org

1 user in discussion

Policeman Jenkins Server: 3 posts

People

Translate

site design / logo © 2021 Grokbase