Grokbase Groups Lucene dev May 2016
FAQ
Build: http://jenkins.thetaphi.de/job/Lucene-Solr-6.x-Linux/655/
Java: 32bit/jdk-9-ea+116 -client -XX:+UseParallelGC

1 tests failed.
FAILED: org.apache.solr.cloud.TestCryptoKeys.test

Error Message:
Could not find collection:.system

Stack Trace:
java.lang.AssertionError: Could not find collection:.system
  at __randomizedtesting.SeedInfo.seed([1104211D32EE6CEA:99501EC79C120112]:0)
  at org.junit.Assert.fail(Assert.java:93)
  at org.junit.Assert.assertTrue(Assert.java:43)
  at org.junit.Assert.assertNotNull(Assert.java:526)
  at org.apache.solr.cloud.AbstractDistribZkTestBase.waitForRecoveriesToFinish(AbstractDistribZkTestBase.java:154)
  at org.apache.solr.cloud.AbstractDistribZkTestBase.waitForRecoveriesToFinish(AbstractDistribZkTestBase.java:139)
  at org.apache.solr.cloud.AbstractDistribZkTestBase.waitForRecoveriesToFinish(AbstractDistribZkTestBase.java:134)
  at org.apache.solr.cloud.AbstractFullDistribZkTestBase.waitForRecoveriesToFinish(AbstractFullDistribZkTestBase.java:852)
  at org.apache.solr.cloud.TestCryptoKeys.test(TestCryptoKeys.java:118)
  at jdk.internal.reflect.NativeMethodAccessorImpl.invoke0(java.base@9-ea/Native Method)
  at jdk.internal.reflect.NativeMethodAccessorImpl.invoke(java.base@9-ea/NativeMethodAccessorImpl.java:62)
  at jdk.internal.reflect.DelegatingMethodAccessorImpl.invoke(java.base@9-ea/DelegatingMethodAccessorImpl.java:43)
  at java.lang.reflect.Method.invoke(java.base@9-ea/Method.java:531)
  at com.carrotsearch.randomizedtesting.RandomizedRunner.invoke(RandomizedRunner.java:1764)
  at com.carrotsearch.randomizedtesting.RandomizedRunner$8.evaluate(RandomizedRunner.java:871)
  at com.carrotsearch.randomizedtesting.RandomizedRunner$9.evaluate(RandomizedRunner.java:907)
  at com.carrotsearch.randomizedtesting.RandomizedRunner$10.evaluate(RandomizedRunner.java:921)
  at org.apache.solr.BaseDistributedSearchTestCase$ShardsRepeatRule$ShardsFixedStatement.callStatement(BaseDistributedSearchTestCase.java:992)
  at org.apache.solr.BaseDistributedSearchTestCase$ShardsRepeatRule$ShardsStatement.evaluate(BaseDistributedSearchTestCase.java:967)
  at com.carrotsearch.randomizedtesting.rules.SystemPropertiesRestoreRule$1.evaluate(SystemPropertiesRestoreRule.java:57)
  at org.apache.lucene.util.TestRuleSetupTeardownChained$1.evaluate(TestRuleSetupTeardownChained.java:49)
  at org.apache.lucene.util.AbstractBeforeAfterRule$1.evaluate(AbstractBeforeAfterRule.java:45)
  at org.apache.lucene.util.TestRuleThreadAndTestName$1.evaluate(TestRuleThreadAndTestName.java:48)
  at org.apache.lucene.util.TestRuleIgnoreAfterMaxFailures$1.evaluate(TestRuleIgnoreAfterMaxFailures.java:64)
  at org.apache.lucene.util.TestRuleMarkFailure$1.evaluate(TestRuleMarkFailure.java:47)
  at com.carrotsearch.randomizedtesting.rules.StatementAdapter.evaluate(StatementAdapter.java:36)
  at com.carrotsearch.randomizedtesting.ThreadLeakControl$StatementRunner.run(ThreadLeakControl.java:367)
  at com.carrotsearch.randomizedtesting.ThreadLeakControl.forkTimeoutingTask(ThreadLeakControl.java:809)
  at com.carrotsearch.randomizedtesting.ThreadLeakControl$3.evaluate(ThreadLeakControl.java:460)
  at com.carrotsearch.randomizedtesting.RandomizedRunner.runSingleTest(RandomizedRunner.java:880)
  at com.carrotsearch.randomizedtesting.RandomizedRunner$5.evaluate(RandomizedRunner.java:781)
  at com.carrotsearch.randomizedtesting.RandomizedRunner$6.evaluate(RandomizedRunner.java:816)
  at com.carrotsearch.randomizedtesting.RandomizedRunner$7.evaluate(RandomizedRunner.java:827)
  at com.carrotsearch.randomizedtesting.rules.StatementAdapter.evaluate(StatementAdapter.java:36)
  at com.carrotsearch.randomizedtesting.rules.SystemPropertiesRestoreRule$1.evaluate(SystemPropertiesRestoreRule.java:57)
  at org.apache.lucene.util.AbstractBeforeAfterRule$1.evaluate(AbstractBeforeAfterRule.java:45)
  at com.carrotsearch.randomizedtesting.rules.StatementAdapter.evaluate(StatementAdapter.java:36)
  at org.apache.lucene.util.TestRuleStoreClassName$1.evaluate(TestRuleStoreClassName.java:41)
  at com.carrotsearch.randomizedtesting.rules.NoShadowingOrOverridesOnMethodsRule$1.evaluate(NoShadowingOrOverridesOnMethodsRule.java:40)
  at com.carrotsearch.randomizedtesting.rules.NoShadowingOrOverridesOnMethodsRule$1.evaluate(NoShadowingOrOverridesOnMethodsRule.java:40)
  at com.carrotsearch.randomizedtesting.rules.StatementAdapter.evaluate(StatementAdapter.java:36)
  at com.carrotsearch.randomizedtesting.rules.StatementAdapter.evaluate(StatementAdapter.java:36)
  at com.carrotsearch.randomizedtesting.rules.StatementAdapter.evaluate(StatementAdapter.java:36)
  at org.apache.lucene.util.TestRuleAssertionsRequired$1.evaluate(TestRuleAssertionsRequired.java:53)
  at org.apache.lucene.util.TestRuleMarkFailure$1.evaluate(TestRuleMarkFailure.java:47)
  at org.apache.lucene.util.TestRuleIgnoreAfterMaxFailures$1.evaluate(TestRuleIgnoreAfterMaxFailures.java:64)
  at org.apache.lucene.util.TestRuleIgnoreTestSuites$1.evaluate(TestRuleIgnoreTestSuites.java:54)
  at com.carrotsearch.randomizedtesting.rules.StatementAdapter.evaluate(StatementAdapter.java:36)
  at com.carrotsearch.randomizedtesting.ThreadLeakControl$StatementRunner.run(ThreadLeakControl.java:367)
  at java.lang.Thread.run(java.base@9-ea/Thread.java:804)




Build Log:
[...truncated 10903 lines...]
    [junit4] Suite: org.apache.solr.cloud.TestCryptoKeys
    [junit4] 2> Creating dataDir: /home/jenkins/workspace/Lucene-Solr-6.x-Linux/solr/build/solr-core/test/J2/temp/solr.cloud.TestCryptoKeys_1104211D32EE6CEA-001/init-core-data-001
    [junit4] 2> 467743 INFO (SUITE-TestCryptoKeys-seed#[1104211D32EE6CEA]-worker) [ ] o.a.s.SolrTestCaseJ4 Randomized ssl (false) and clientAuth (false)
    [junit4] 2> 467744 INFO (SUITE-TestCryptoKeys-seed#[1104211D32EE6CEA]-worker) [ ] o.a.s.BaseDistributedSearchTestCase Setting hostContext system property: /_/
    [junit4] 2> 467746 INFO (TEST-TestCryptoKeys.test-seed#[1104211D32EE6CEA]) [ ] o.a.s.c.ZkTestServer STARTING ZK TEST SERVER
    [junit4] 2> 467747 INFO (Thread-1023) [ ] o.a.s.c.ZkTestServer client port:0.0.0.0/0.0.0.0:0
    [junit4] 2> 467747 INFO (Thread-1023) [ ] o.a.s.c.ZkTestServer Starting server
    [junit4] 2> 467846 INFO (TEST-TestCryptoKeys.test-seed#[1104211D32EE6CEA]) [ ] o.a.s.c.ZkTestServer start zk server on port:33646
    [junit4] 2> 467846 INFO (TEST-TestCryptoKeys.test-seed#[1104211D32EE6CEA]) [ ] o.a.s.c.c.SolrZkClient Using default ZkCredentialsProvider
    [junit4] 2> 467847 INFO (TEST-TestCryptoKeys.test-seed#[1104211D32EE6CEA]) [ ] o.a.s.c.c.ConnectionManager Waiting for client to connect to ZooKeeper
    [junit4] 2> 467848 INFO (zkCallback-534-thread-1) [ ] o.a.s.c.c.ConnectionManager Watcher org.apache.solr.common.cloud.ConnectionManager@97e4f3 name:ZooKeeperConnection Watcher:127.0.0.1:33646 got event WatchedEvent state:SyncConnected type:None path:null path:null type:None
    [junit4] 2> 467848 INFO (TEST-TestCryptoKeys.test-seed#[1104211D32EE6CEA]) [ ] o.a.s.c.c.ConnectionManager Client is connected to ZooKeeper
    [junit4] 2> 467848 INFO (TEST-TestCryptoKeys.test-seed#[1104211D32EE6CEA]) [ ] o.a.s.c.c.SolrZkClient Using default ZkACLProvider
    [junit4] 2> 467848 INFO (TEST-TestCryptoKeys.test-seed#[1104211D32EE6CEA]) [ ] o.a.s.c.c.SolrZkClient makePath: /solr
    [junit4] 2> 467849 INFO (TEST-TestCryptoKeys.test-seed#[1104211D32EE6CEA]) [ ] o.a.s.c.c.SolrZkClient Using default ZkCredentialsProvider
    [junit4] 2> 467850 INFO (TEST-TestCryptoKeys.test-seed#[1104211D32EE6CEA]) [ ] o.a.s.c.c.ConnectionManager Waiting for client to connect to ZooKeeper
    [junit4] 2> 467850 INFO (zkCallback-535-thread-1) [ ] o.a.s.c.c.ConnectionManager Watcher org.apache.solr.common.cloud.ConnectionManager@2c39fd name:ZooKeeperConnection Watcher:127.0.0.1:33646/solr got event WatchedEvent state:SyncConnected type:None path:null path:null type:None
    [junit4] 2> 467850 INFO (TEST-TestCryptoKeys.test-seed#[1104211D32EE6CEA]) [ ] o.a.s.c.c.ConnectionManager Client is connected to ZooKeeper
    [junit4] 2> 467851 INFO (TEST-TestCryptoKeys.test-seed#[1104211D32EE6CEA]) [ ] o.a.s.c.c.SolrZkClient Using default ZkACLProvider
    [junit4] 2> 467851 INFO (TEST-TestCryptoKeys.test-seed#[1104211D32EE6CEA]) [ ] o.a.s.c.c.SolrZkClient makePath: /collections/collection1
    [junit4] 2> 467851 INFO (TEST-TestCryptoKeys.test-seed#[1104211D32EE6CEA]) [ ] o.a.s.c.c.SolrZkClient makePath: /collections/collection1/shards
    [junit4] 2> 467852 INFO (TEST-TestCryptoKeys.test-seed#[1104211D32EE6CEA]) [ ] o.a.s.c.c.SolrZkClient makePath: /collections/control_collection
    [junit4] 2> 467852 INFO (TEST-TestCryptoKeys.test-seed#[1104211D32EE6CEA]) [ ] o.a.s.c.c.SolrZkClient makePath: /collections/control_collection/shards
    [junit4] 2> 467853 INFO (TEST-TestCryptoKeys.test-seed#[1104211D32EE6CEA]) [ ] o.a.s.c.AbstractZkTestCase put /home/jenkins/workspace/Lucene-Solr-6.x-Linux/solr/core/src/test-files/solr/collection1/conf/solrconfig-tlog.xml to /configs/conf1/solrconfig.xml
    [junit4] 2> 467853 INFO (TEST-TestCryptoKeys.test-seed#[1104211D32EE6CEA]) [ ] o.a.s.c.c.SolrZkClient makePath: /configs/conf1/solrconfig.xml
    [junit4] 2> 467854 INFO (TEST-TestCryptoKeys.test-seed#[1104211D32EE6CEA]) [ ] o.a.s.c.AbstractZkTestCase put /home/jenkins/workspace/Lucene-Solr-6.x-Linux/solr/core/src/test-files/solr/collection1/conf/schema.xml to /configs/conf1/schema.xml
    [junit4] 2> 467854 INFO (TEST-TestCryptoKeys.test-seed#[1104211D32EE6CEA]) [ ] o.a.s.c.c.SolrZkClient makePath: /configs/conf1/schema.xml
    [junit4] 2> 467856 INFO (TEST-TestCryptoKeys.test-seed#[1104211D32EE6CEA]) [ ] o.a.s.c.AbstractZkTestCase put /home/jenkins/workspace/Lucene-Solr-6.x-Linux/solr/core/src/test-files/solr/collection1/conf/solrconfig.snippet.randomindexconfig.xml to /configs/conf1/solrconfig.snippet.randomindexconfig.xml
    [junit4] 2> 467856 INFO (TEST-TestCryptoKeys.test-seed#[1104211D32EE6CEA]) [ ] o.a.s.c.c.SolrZkClient makePath: /configs/conf1/solrconfig.snippet.randomindexconfig.xml
    [junit4] 2> 467856 INFO (TEST-TestCryptoKeys.test-seed#[1104211D32EE6CEA]) [ ] o.a.s.c.AbstractZkTestCase put /home/jenkins/workspace/Lucene-Solr-6.x-Linux/solr/core/src/test-files/solr/collection1/conf/stopwords.txt to /configs/conf1/stopwords.txt
    [junit4] 2> 467857 INFO (TEST-TestCryptoKeys.test-seed#[1104211D32EE6CEA]) [ ] o.a.s.c.c.SolrZkClient makePath: /configs/conf1/stopwords.txt
    [junit4] 2> 467857 INFO (TEST-TestCryptoKeys.test-seed#[1104211D32EE6CEA]) [ ] o.a.s.c.AbstractZkTestCase put /home/jenkins/workspace/Lucene-Solr-6.x-Linux/solr/core/src/test-files/solr/collection1/conf/protwords.txt to /configs/conf1/protwords.txt
    [junit4] 2> 467857 INFO (TEST-TestCryptoKeys.test-seed#[1104211D32EE6CEA]) [ ] o.a.s.c.c.SolrZkClient makePath: /configs/conf1/protwords.txt
    [junit4] 2> 467858 INFO (TEST-TestCryptoKeys.test-seed#[1104211D32EE6CEA]) [ ] o.a.s.c.AbstractZkTestCase put /home/jenkins/workspace/Lucene-Solr-6.x-Linux/solr/core/src/test-files/solr/collection1/conf/currency.xml to /configs/conf1/currency.xml
    [junit4] 2> 467858 INFO (TEST-TestCryptoKeys.test-seed#[1104211D32EE6CEA]) [ ] o.a.s.c.c.SolrZkClient makePath: /configs/conf1/currency.xml
    [junit4] 2> 467859 INFO (TEST-TestCryptoKeys.test-seed#[1104211D32EE6CEA]) [ ] o.a.s.c.AbstractZkTestCase put /home/jenkins/workspace/Lucene-Solr-6.x-Linux/solr/core/src/test-files/solr/collection1/conf/enumsConfig.xml to /configs/conf1/enumsConfig.xml
    [junit4] 2> 467859 INFO (TEST-TestCryptoKeys.test-seed#[1104211D32EE6CEA]) [ ] o.a.s.c.c.SolrZkClient makePath: /configs/conf1/enumsConfig.xml
    [junit4] 2> 467859 INFO (TEST-TestCryptoKeys.test-seed#[1104211D32EE6CEA]) [ ] o.a.s.c.AbstractZkTestCase put /home/jenkins/workspace/Lucene-Solr-6.x-Linux/solr/core/src/test-files/solr/collection1/conf/open-exchange-rates.json to /configs/conf1/open-exchange-rates.json
    [junit4] 2> 467859 INFO (TEST-TestCryptoKeys.test-seed#[1104211D32EE6CEA]) [ ] o.a.s.c.c.SolrZkClient makePath: /configs/conf1/open-exchange-rates.json
    [junit4] 2> 467860 INFO (TEST-TestCryptoKeys.test-seed#[1104211D32EE6CEA]) [ ] o.a.s.c.AbstractZkTestCase put /home/jenkins/workspace/Lucene-Solr-6.x-Linux/solr/core/src/test-files/solr/collection1/conf/mapping-ISOLatin1Accent.txt to /configs/conf1/mapping-ISOLatin1Accent.txt
    [junit4] 2> 467860 INFO (TEST-TestCryptoKeys.test-seed#[1104211D32EE6CEA]) [ ] o.a.s.c.c.SolrZkClient makePath: /configs/conf1/mapping-ISOLatin1Accent.txt
    [junit4] 2> 467860 INFO (TEST-TestCryptoKeys.test-seed#[1104211D32EE6CEA]) [ ] o.a.s.c.AbstractZkTestCase put /home/jenkins/workspace/Lucene-Solr-6.x-Linux/solr/core/src/test-files/solr/collection1/conf/old_synonyms.txt to /configs/conf1/old_synonyms.txt
    [junit4] 2> 467861 INFO (TEST-TestCryptoKeys.test-seed#[1104211D32EE6CEA]) [ ] o.a.s.c.c.SolrZkClient makePath: /configs/conf1/old_synonyms.txt
    [junit4] 2> 467861 INFO (TEST-TestCryptoKeys.test-seed#[1104211D32EE6CEA]) [ ] o.a.s.c.AbstractZkTestCase put /home/jenkins/workspace/Lucene-Solr-6.x-Linux/solr/core/src/test-files/solr/collection1/conf/synonyms.txt to /configs/conf1/synonyms.txt
    [junit4] 2> 467861 INFO (TEST-TestCryptoKeys.test-seed#[1104211D32EE6CEA]) [ ] o.a.s.c.c.SolrZkClient makePath: /configs/conf1/synonyms.txt
    [junit4] 2> 467923 INFO (TEST-TestCryptoKeys.test-seed#[1104211D32EE6CEA]) [ ] o.a.s.SolrTestCaseJ4 Writing core.properties file to /home/jenkins/workspace/Lucene-Solr-6.x-Linux/solr/build/solr-core/test/J2/temp/solr.cloud.TestCryptoKeys_1104211D32EE6CEA-001/control-001/cores/collection1
    [junit4] 2> 467924 INFO (TEST-TestCryptoKeys.test-seed#[1104211D32EE6CEA]) [ ] o.e.j.s.Server jetty-9.3.8.v20160314
    [junit4] 2> 467925 INFO (TEST-TestCryptoKeys.test-seed#[1104211D32EE6CEA]) [ ] o.e.j.s.h.ContextHandler Started o.e.j.s.ServletContextHandler@118eb5e{/_,null,AVAILABLE}
    [junit4] 2> 467926 INFO (TEST-TestCryptoKeys.test-seed#[1104211D32EE6CEA]) [ ] o.e.j.s.ServerConnector Started ServerConnector@fb654d{HTTP/1.1,[http/1.1]}{127.0.0.1:44989}
    [junit4] 2> 467926 INFO (TEST-TestCryptoKeys.test-seed#[1104211D32EE6CEA]) [ ] o.e.j.s.Server Started @469870ms
    [junit4] 2> 467926 INFO (TEST-TestCryptoKeys.test-seed#[1104211D32EE6CEA]) [ ] o.a.s.c.s.e.JettySolrRunner Jetty properties: {solr.data.dir=/home/jenkins/workspace/Lucene-Solr-6.x-Linux/solr/build/solr-core/test/J2/temp/solr.cloud.TestCryptoKeys_1104211D32EE6CEA-001/tempDir-001/control/data, hostContext=/_, hostPort=44989, coreRootDirectory=/home/jenkins/workspace/Lucene-Solr-6.x-Linux/solr/build/solr-core/test/J2/../../../../../../../../../home/jenkins/workspace/Lucene-Solr-6.x-Linux/solr/build/solr-core/test/J2/temp/solr.cloud.TestCryptoKeys_1104211D32EE6CEA-001/control-001/cores}
    [junit4] 2> 467926 INFO (TEST-TestCryptoKeys.test-seed#[1104211D32EE6CEA]) [ ] o.a.s.s.SolrDispatchFilter SolrDispatchFilter.init(): jdk.internal.loader.ClassLoaders$AppClassLoader@a4a92b
    [junit4] 2> 467926 INFO (TEST-TestCryptoKeys.test-seed#[1104211D32EE6CEA]) [ ] o.a.s.c.SolrResourceLoader new SolrResourceLoader for directory: '/home/jenkins/workspace/Lucene-Solr-6.x-Linux/solr/build/solr-core/test/J2/temp/solr.cloud.TestCryptoKeys_1104211D32EE6CEA-001/control-001'
    [junit4] 2> 467927 INFO (TEST-TestCryptoKeys.test-seed#[1104211D32EE6CEA]) [ ] o.a.s.c.SolrResourceLoader JNDI not configured for solr (NoInitialContextEx)
    [junit4] 2> 467927 INFO (TEST-TestCryptoKeys.test-seed#[1104211D32EE6CEA]) [ ] o.a.s.c.SolrResourceLoader solr home defaulted to 'solr/' (could not find system property or JNDI)
    [junit4] 2> 467927 INFO (TEST-TestCryptoKeys.test-seed#[1104211D32EE6CEA]) [ ] o.a.s.c.c.SolrZkClient Using default ZkCredentialsProvider
    [junit4] 2> 467927 INFO (TEST-TestCryptoKeys.test-seed#[1104211D32EE6CEA]) [ ] o.a.s.c.c.ConnectionManager Waiting for client to connect to ZooKeeper
    [junit4] 2> 467928 INFO (zkCallback-536-thread-1) [ ] o.a.s.c.c.ConnectionManager Watcher org.apache.solr.common.cloud.ConnectionManager@763929 name:ZooKeeperConnection Watcher:127.0.0.1:33646/solr got event WatchedEvent state:SyncConnected type:None path:null path:null type:None
    [junit4] 2> 467928 INFO (TEST-TestCryptoKeys.test-seed#[1104211D32EE6CEA]) [ ] o.a.s.c.c.ConnectionManager Client is connected to ZooKeeper
    [junit4] 2> 467928 INFO (TEST-TestCryptoKeys.test-seed#[1104211D32EE6CEA]) [ ] o.a.s.c.c.SolrZkClient Using default ZkACLProvider
    [junit4] 2> 467929 INFO (TEST-TestCryptoKeys.test-seed#[1104211D32EE6CEA]) [ ] o.a.s.s.SolrDispatchFilter Loading solr.xml from SolrHome (not found in ZooKeeper)
    [junit4] 2> 467929 INFO (TEST-TestCryptoKeys.test-seed#[1104211D32EE6CEA]) [ ] o.a.s.c.SolrXmlConfig Loading container configuration from /home/jenkins/workspace/Lucene-Solr-6.x-Linux/solr/build/solr-core/test/J2/temp/solr.cloud.TestCryptoKeys_1104211D32EE6CEA-001/control-001/solr.xml
    [junit4] 2> 467933 INFO (TEST-TestCryptoKeys.test-seed#[1104211D32EE6CEA]) [ ] o.a.s.c.CorePropertiesLocator Config-defined core root directory: /home/jenkins/workspace/Lucene-Solr-6.x-Linux/solr/build/solr-core/test/J2/../../../../../../../../../home/jenkins/workspace/Lucene-Solr-6.x-Linux/solr/build/solr-core/test/J2/temp/solr.cloud.TestCryptoKeys_1104211D32EE6CEA-001/control-001/cores
    [junit4] 2> 467933 INFO (TEST-TestCryptoKeys.test-seed#[1104211D32EE6CEA]) [ ] o.a.s.c.CoreContainer New CoreContainer 4258078
    [junit4] 2> 467933 INFO (TEST-TestCryptoKeys.test-seed#[1104211D32EE6CEA]) [ ] o.a.s.c.CoreContainer Loading cores into CoreContainer [instanceDir=/home/jenkins/workspace/Lucene-Solr-6.x-Linux/solr/build/solr-core/test/J2/temp/solr.cloud.TestCryptoKeys_1104211D32EE6CEA-001/control-001]
    [junit4] 2> 467933 WARN (TEST-TestCryptoKeys.test-seed#[1104211D32EE6CEA]) [ ] o.a.s.c.CoreContainer Couldn't add files from /home/jenkins/workspace/Lucene-Solr-6.x-Linux/solr/build/solr-core/test/J2/temp/solr.cloud.TestCryptoKeys_1104211D32EE6CEA-001/control-001/lib to classpath: /home/jenkins/workspace/Lucene-Solr-6.x-Linux/solr/build/solr-core/test/J2/temp/solr.cloud.TestCryptoKeys_1104211D32EE6CEA-001/control-001/lib
    [junit4] 2> 467934 INFO (TEST-TestCryptoKeys.test-seed#[1104211D32EE6CEA]) [ ] o.a.s.h.c.HttpShardHandlerFactory created with socketTimeout : 90000,urlScheme : ,connTimeout : 15000,maxConnectionsPerHost : 20,maxConnections : 10000,corePoolSize : 0,maximumPoolSize : 2147483647,maxThreadIdleTime : 5,sizeOfQueue : -1,fairnessPolicy : false,useRetries : false,
    [junit4] 2> 467935 INFO (TEST-TestCryptoKeys.test-seed#[1104211D32EE6CEA]) [ ] o.a.s.u.UpdateShardHandler Creating UpdateShardHandler HTTP client with params: socketTimeout=340000&connTimeout=45000&retry=true
    [junit4] 2> 467936 INFO (TEST-TestCryptoKeys.test-seed#[1104211D32EE6CEA]) [ ] o.a.s.l.LogWatcher SLF4J impl is org.slf4j.impl.Log4jLoggerFactory
    [junit4] 2> 467936 INFO (TEST-TestCryptoKeys.test-seed#[1104211D32EE6CEA]) [ ] o.a.s.l.LogWatcher Registering Log Listener [Log4j (org.slf4j.impl.Log4jLoggerFactory)]
    [junit4] 2> 467936 INFO (TEST-TestCryptoKeys.test-seed#[1104211D32EE6CEA]) [ ] o.a.s.c.ZkContainer Zookeeper client=127.0.0.1:33646/solr
    [junit4] 2> 467936 INFO (TEST-TestCryptoKeys.test-seed#[1104211D32EE6CEA]) [ ] o.a.s.c.ZkController zkHost includes chroot
    [junit4] 2> 467936 INFO (TEST-TestCryptoKeys.test-seed#[1104211D32EE6CEA]) [ ] o.a.s.c.c.SolrZkClient Using default ZkCredentialsProvider
    [junit4] 2> 467936 INFO (TEST-TestCryptoKeys.test-seed#[1104211D32EE6CEA]) [ ] o.a.s.c.c.ConnectionManager Waiting for client to connect to ZooKeeper
    [junit4] 2> 467937 INFO (zkCallback-539-thread-1) [ ] o.a.s.c.c.ConnectionManager Watcher org.apache.solr.common.cloud.ConnectionManager@1175064 name:ZooKeeperConnection Watcher:127.0.0.1:33646 got event WatchedEvent state:SyncConnected type:None path:null path:null type:None
    [junit4] 2> 467937 INFO (TEST-TestCryptoKeys.test-seed#[1104211D32EE6CEA]) [ ] o.a.s.c.c.ConnectionManager Client is connected to ZooKeeper
    [junit4] 2> 467938 INFO (TEST-TestCryptoKeys.test-seed#[1104211D32EE6CEA]) [ ] o.a.s.c.c.SolrZkClient Using default ZkACLProvider
    [junit4] 2> 467938 INFO (TEST-TestCryptoKeys.test-seed#[1104211D32EE6CEA]) [ ] o.a.s.c.ZkController Added new OnReconnect listener org.apache.solr.cloud.ZkController$$Lambda$124/17595357@12f6c11
    [junit4] 2> 467939 INFO (TEST-TestCryptoKeys.test-seed#[1104211D32EE6CEA]) [ ] o.a.s.c.c.ConnectionManager Waiting for client to connect to ZooKeeper
    [junit4] 2> 467940 INFO (zkCallback-540-thread-1) [ ] o.a.s.c.c.ConnectionManager Watcher org.apache.solr.common.cloud.ConnectionManager@1c559b5 name:ZooKeeperConnection Watcher:127.0.0.1:33646/solr got event WatchedEvent state:SyncConnected type:None path:null path:null type:None
    [junit4] 2> 467940 INFO (TEST-TestCryptoKeys.test-seed#[1104211D32EE6CEA]) [ ] o.a.s.c.c.ConnectionManager Client is connected to ZooKeeper
    [junit4] 2> 467940 INFO (TEST-TestCryptoKeys.test-seed#[1104211D32EE6CEA]) [ ] o.a.s.c.c.SolrZkClient makePath: /overseer/queue
    [junit4] 2> 467941 INFO (TEST-TestCryptoKeys.test-seed#[1104211D32EE6CEA]) [ ] o.a.s.c.c.SolrZkClient makePath: /overseer/collection-queue-work
    [junit4] 2> 467942 INFO (TEST-TestCryptoKeys.test-seed#[1104211D32EE6CEA]) [ ] o.a.s.c.c.SolrZkClient makePath: /overseer/collection-map-running
    [junit4] 2> 467943 INFO (TEST-TestCryptoKeys.test-seed#[1104211D32EE6CEA]) [ ] o.a.s.c.c.SolrZkClient makePath: /overseer/collection-map-completed
    [junit4] 2> 467943 INFO (TEST-TestCryptoKeys.test-seed#[1104211D32EE6CEA]) [ ] o.a.s.c.c.SolrZkClient makePath: /overseer/collection-map-failure
    [junit4] 2> 467944 INFO (TEST-TestCryptoKeys.test-seed#[1104211D32EE6CEA]) [ ] o.a.s.c.c.SolrZkClient makePath: /live_nodes
    [junit4] 2> 467944 INFO (TEST-TestCryptoKeys.test-seed#[1104211D32EE6CEA]) [ ] o.a.s.c.c.SolrZkClient makePath: /aliases.json
    [junit4] 2> 467945 INFO (TEST-TestCryptoKeys.test-seed#[1104211D32EE6CEA]) [ ] o.a.s.c.c.SolrZkClient makePath: /clusterstate.json
    [junit4] 2> 467945 INFO (TEST-TestCryptoKeys.test-seed#[1104211D32EE6CEA]) [ ] o.a.s.c.c.SolrZkClient makePath: /security.json
    [junit4] 2> 467945 INFO (TEST-TestCryptoKeys.test-seed#[1104211D32EE6CEA]) [ ] o.a.s.c.c.ZkStateReader Updating cluster state from ZooKeeper...
    [junit4] 2> 467946 INFO (TEST-TestCryptoKeys.test-seed#[1104211D32EE6CEA]) [ ] o.a.s.c.c.ZkStateReader Loaded empty cluster properties
    [junit4] 2> 467946 INFO (TEST-TestCryptoKeys.test-seed#[1104211D32EE6CEA]) [ ] o.a.s.c.c.ZkStateReader Updated live nodes from ZooKeeper... (0) -> (0)
    [junit4] 2> 467947 INFO (TEST-TestCryptoKeys.test-seed#[1104211D32EE6CEA]) [ ] o.a.s.c.c.SolrZkClient makePath: /overseer_elect
    [junit4] 2> 467947 INFO (TEST-TestCryptoKeys.test-seed#[1104211D32EE6CEA]) [ ] o.a.s.c.c.SolrZkClient makePath: /overseer_elect/election
    [junit4] 2> 467948 INFO (TEST-TestCryptoKeys.test-seed#[1104211D32EE6CEA]) [ ] o.a.s.c.Overseer Overseer (id=null) closing
    [junit4] 2> 467948 INFO (TEST-TestCryptoKeys.test-seed#[1104211D32EE6CEA]) [ ] o.a.s.c.LeaderElector Joined leadership election with path: /overseer_elect/election/95897533968089092-127.0.0.1:44989__-n_0000000000
    [junit4] 2> 467948 INFO (TEST-TestCryptoKeys.test-seed#[1104211D32EE6CEA]) [ ] o.a.s.c.OverseerElectionContext I am going to be the leader 127.0.0.1:44989__
    [junit4] 2> 467948 INFO (TEST-TestCryptoKeys.test-seed#[1104211D32EE6CEA]) [ ] o.a.s.c.c.SolrZkClient makePath: /overseer_elect/leader
    [junit4] 2> 467949 INFO (TEST-TestCryptoKeys.test-seed#[1104211D32EE6CEA]) [ ] o.a.s.c.Overseer Overseer (id=95897533968089092-127.0.0.1:44989__-n_0000000000) starting
    [junit4] 2> 467949 INFO (TEST-TestCryptoKeys.test-seed#[1104211D32EE6CEA]) [ ] o.a.s.c.c.SolrZkClient makePath: /overseer/queue-work
    [junit4] 2> 467952 INFO (TEST-TestCryptoKeys.test-seed#[1104211D32EE6CEA]) [ ] o.a.s.c.OverseerAutoReplicaFailoverThread Starting OverseerAutoReplicaFailoverThread autoReplicaFailoverWorkLoopDelay=10000 autoReplicaFailoverWaitAfterExpiration=30000 autoReplicaFailoverBadNodeExpiration=60000
    [junit4] 2> 467952 INFO (OverseerCollectionConfigSetProcessor-95897533968089092-127.0.0.1:44989__-n_0000000000) [ ] o.a.s.c.OverseerTaskProcessor Process current queue of overseer operations
    [junit4] 2> 467953 INFO (OverseerStateUpdate-95897533968089092-127.0.0.1:44989__-n_0000000000) [ ] o.a.s.c.Overseer Starting to work on the main queue
    [junit4] 2> 467953 INFO (TEST-TestCryptoKeys.test-seed#[1104211D32EE6CEA]) [ ] o.a.s.c.ZkController Register node as live in ZooKeeper:/live_nodes/127.0.0.1:44989__
    [junit4] 2> 467953 INFO (TEST-TestCryptoKeys.test-seed#[1104211D32EE6CEA]) [ ] o.a.s.c.c.SolrZkClient makePath: /live_nodes/127.0.0.1:44989__
    [junit4] 2> 467954 INFO (OverseerStateUpdate-95897533968089092-127.0.0.1:44989__-n_0000000000) [ ] o.a.s.c.c.ZkStateReader Updated live nodes from ZooKeeper... (0) -> (0)
    [junit4] 2> 467954 INFO (zkCallback-540-thread-1) [ ] o.a.s.c.c.ZkStateReader A live node change: [WatchedEvent state:SyncConnected type:NodeChildrenChanged path:/live_nodes], has occurred - updating... (live nodes size: [0])
    [junit4] 2> 467954 INFO (zkCallback-540-thread-1) [ ] o.a.s.c.c.ZkStateReader Updated live nodes from ZooKeeper... (0) -> (1)
    [junit4] 2> 467970 INFO (TEST-TestCryptoKeys.test-seed#[1104211D32EE6CEA]) [ ] o.a.s.c.CoreContainer Security conf doesn't exist. Skipping setup for authorization module.
    [junit4] 2> 467970 INFO (TEST-TestCryptoKeys.test-seed#[1104211D32EE6CEA]) [ ] o.a.s.c.CoreContainer No authentication plugin used.
    [junit4] 2> 467970 INFO (TEST-TestCryptoKeys.test-seed#[1104211D32EE6CEA]) [ ] o.a.s.c.CorePropertiesLocator Looking for core definitions underneath /home/jenkins/workspace/Lucene-Solr-6.x-Linux/solr/build/solr-core/test/J2/../../../../../../../../../home/jenkins/workspace/Lucene-Solr-6.x-Linux/solr/build/solr-core/test/J2/temp/solr.cloud.TestCryptoKeys_1104211D32EE6CEA-001/control-001/cores
    [junit4] 2> 467971 INFO (TEST-TestCryptoKeys.test-seed#[1104211D32EE6CEA]) [ ] o.a.s.c.CoreDescriptor Created CoreDescriptor: {name=collection1, config=solrconfig.xml, transient=false, schema=schema.xml, loadOnStartup=true, configSetProperties=configsetprops.json, collection=control_collection, coreNodeName=, dataDir=data/, shard=}
    [junit4] 2> 467971 INFO (TEST-TestCryptoKeys.test-seed#[1104211D32EE6CEA]) [ ] o.a.s.c.CorePropertiesLocator Found core collection1 in /home/jenkins/workspace/Lucene-Solr-6.x-Linux/solr/build/solr-core/test/J2/../../../../../../../../../home/jenkins/workspace/Lucene-Solr-6.x-Linux/solr/build/solr-core/test/J2/temp/solr.cloud.TestCryptoKeys_1104211D32EE6CEA-001/control-001/cores/collection1
    [junit4] 2> 467971 INFO (TEST-TestCryptoKeys.test-seed#[1104211D32EE6CEA]) [ ] o.a.s.c.CorePropertiesLocator Found 1 core definitions
    [junit4] 2> 467972 INFO (coreLoadExecutor-1298-thread-1) [ ] o.a.s.c.ZkController publishing state=down
    [junit4] 2> 467972 INFO (coreLoadExecutor-1298-thread-1) [ ] o.a.s.c.ZkController numShards not found on descriptor - reading it from system property
    [junit4] 2> 467972 INFO (TEST-TestCryptoKeys.test-seed#[1104211D32EE6CEA]) [ ] o.a.s.s.SolrDispatchFilter user.dir=/home/jenkins/workspace/Lucene-Solr-6.x-Linux/solr/build/solr-core/test/J2
    [junit4] 2> 467972 INFO (TEST-TestCryptoKeys.test-seed#[1104211D32EE6CEA]) [ ] o.a.s.s.SolrDispatchFilter SolrDispatchFilter.init() done
    [junit4] 2> 467972 INFO (coreLoadExecutor-1298-thread-1) [ ] o.a.s.c.ZkController Collection control_collection not visible yet, but flagging it so a watch is registered when it becomes visible
    [junit4] 2> 467972 INFO (OverseerStateUpdate-95897533968089092-127.0.0.1:44989__-n_0000000000) [ ] o.a.s.c.Overseer processMessage: queueSize: 1, message = {
    [junit4] 2> "core":"collection1",
    [junit4] 2> "roles":null,
    [junit4] 2> "base_url":"http://127.0.0.1:44989/_",
    [junit4] 2> "node_name":"127.0.0.1:44989__",
    [junit4] 2> "numShards":"1",
    [junit4] 2> "state":"down",
    [junit4] 2> "shard":null,
    [junit4] 2> "collection":"control_collection",
    [junit4] 2> "operation":"state"} current state version: 0
    [junit4] 2> 467973 INFO (OverseerStateUpdate-95897533968089092-127.0.0.1:44989__-n_0000000000) [ ] o.a.s.c.o.ReplicaMutator Update state numShards=1 message={
    [junit4] 2> "core":"collection1",
    [junit4] 2> "roles":null,
    [junit4] 2> "base_url":"http://127.0.0.1:44989/_",
    [junit4] 2> "node_name":"127.0.0.1:44989__",
    [junit4] 2> "numShards":"1",
    [junit4] 2> "state":"down",
    [junit4] 2> "shard":null,
    [junit4] 2> "collection":"control_collection",
    [junit4] 2> "operation":"state"}
    [junit4] 2> 467973 INFO (coreLoadExecutor-1298-thread-1) [ ] o.a.s.c.c.ZkStateReader Deleting data for [control_collection]
    [junit4] 2> 467973 INFO (OverseerStateUpdate-95897533968089092-127.0.0.1:44989__-n_0000000000) [ ] o.a.s.c.o.ClusterStateMutator building a new cName: control_collection
    [junit4] 2> 467973 INFO (coreLoadExecutor-1298-thread-1) [ ] o.a.s.c.ZkController look for our core node name
    [junit4] 2> 467973 INFO (OverseerStateUpdate-95897533968089092-127.0.0.1:44989__-n_0000000000) [ ] o.a.s.c.o.ReplicaMutator Assigning new node to shard shard=shard1
    [junit4] 2> 467973 INFO (zkCallback-540-thread-1) [ ] o.a.s.c.c.ZkStateReader A cluster state change: [WatchedEvent state:SyncConnected type:NodeDataChanged path:/clusterstate.json], has occurred - updating... (live nodes size: [1])
    [junit4] 2> 468973 INFO (coreLoadExecutor-1298-thread-1) [ ] o.a.s.c.ZkController waiting to find shard id in clusterstate for collection1
    [junit4] 2> 468973 INFO (coreLoadExecutor-1298-thread-1) [ ] o.a.s.c.ZkController Check for collection zkNode:control_collection
    [junit4] 2> 468973 INFO (coreLoadExecutor-1298-thread-1) [ ] o.a.s.c.ZkController Collection zkNode exists
    [junit4] 2> 468974 INFO (coreLoadExecutor-1298-thread-1) [ ] o.a.s.c.c.ZkStateReader Load collection config from: [/collections/control_collection]
    [junit4] 2> 468974 INFO (coreLoadExecutor-1298-thread-1) [ ] o.a.s.c.c.ZkStateReader path=[/collections/control_collection] [configName]=[conf1] specified config exists in ZooKeeper
    [junit4] 2> 468974 INFO (coreLoadExecutor-1298-thread-1) [ ] o.a.s.c.SolrResourceLoader new SolrResourceLoader for directory: '/home/jenkins/workspace/Lucene-Solr-6.x-Linux/solr/build/solr-core/test/J2/temp/solr.cloud.TestCryptoKeys_1104211D32EE6CEA-001/control-001/cores/collection1'
    [junit4] 2> 468974 INFO (coreLoadExecutor-1298-thread-1) [ ] o.a.s.c.SolrResourceLoader JNDI not configured for solr (NoInitialContextEx)
    [junit4] 2> 468974 INFO (coreLoadExecutor-1298-thread-1) [ ] o.a.s.c.SolrResourceLoader solr home defaulted to 'solr/' (could not find system property or JNDI)
    [junit4] 2> 468975 INFO (coreLoadExecutor-1298-thread-1) [ ] o.a.s.c.Config loaded config solrconfig.xml with version 0
    [junit4] 2> 468978 INFO (coreLoadExecutor-1298-thread-1) [ ] o.a.s.c.SolrConfig current version of requestparams : -1
    [junit4] 2> 468981 INFO (coreLoadExecutor-1298-thread-1) [ ] o.a.s.c.SolrConfig Using Lucene MatchVersion: 6.1.0
    [junit4] 2> 468986 INFO (coreLoadExecutor-1298-thread-1) [ ] o.a.s.c.SolrConfig Loaded SolrConfig: solrconfig.xml
    [junit4] 2> 468994 INFO (coreLoadExecutor-1298-thread-1) [ ] o.a.s.s.IndexSchema [collection1] Schema name=test
    [junit4] 2> 469061 INFO (coreLoadExecutor-1298-thread-1) [ ] o.a.s.s.OpenExchangeRatesOrgProvider Initialized with rates=open-exchange-rates.json, refreshInterval=1440.
    [junit4] 2> 469065 INFO (coreLoadExecutor-1298-thread-1) [ ] o.a.s.s.IndexSchema default search field in schema is text
    [junit4] 2> 469066 INFO (coreLoadExecutor-1298-thread-1) [ ] o.a.s.s.IndexSchema unique key field: id
    [junit4] 2> 469070 INFO (coreLoadExecutor-1298-thread-1) [ ] o.a.s.s.FileExchangeRateProvider Reloading exchange rates from file currency.xml
    [junit4] 2> 469071 INFO (coreLoadExecutor-1298-thread-1) [ ] o.a.s.s.FileExchangeRateProvider Reloading exchange rates from file currency.xml
    [junit4] 2> 469072 INFO (coreLoadExecutor-1298-thread-1) [ ] o.a.s.s.OpenExchangeRatesOrgProvider Reloading exchange rates from open-exchange-rates.json
    [junit4] 2> 469072 INFO (coreLoadExecutor-1298-thread-1) [ ] o.a.s.s.OpenExchangeRatesOrgProvider Reloading exchange rates from open-exchange-rates.json
    [junit4] 2> 469073 INFO (coreLoadExecutor-1298-thread-1) [ ] o.a.s.c.ConfigSetProperties Did not find ConfigSet properties, assuming default properties: Can't find resource 'configsetprops.json' in classpath or '/configs/conf1', cwd=/home/jenkins/workspace/Lucene-Solr-6.x-Linux/solr/build/solr-core/test/J2
    [junit4] 2> 469073 INFO (coreLoadExecutor-1298-thread-1) [ ] o.a.s.c.CoreContainer Creating SolrCore 'collection1' using configuration from collection control_collection
    [junit4] 2> 469073 INFO (coreLoadExecutor-1298-thread-1) [ ] o.a.s.c.SolrCore org.apache.solr.core.MockDirectoryFactory
    [junit4] 2> 469073 INFO (coreLoadExecutor-1298-thread-1) [ ] o.a.s.c.SolrCore [[collection1] ] Opening new SolrCore at [/home/jenkins/workspace/Lucene-Solr-6.x-Linux/solr/build/solr-core/test/J2/temp/solr.cloud.TestCryptoKeys_1104211D32EE6CEA-001/control-001/cores/collection1], dataDir=[/home/jenkins/workspace/Lucene-Solr-6.x-Linux/solr/build/solr-core/test/J2/../../../../../../../../../home/jenkins/workspace/Lucene-Solr-6.x-Linux/solr/build/solr-core/test/J2/temp/solr.cloud.TestCryptoKeys_1104211D32EE6CEA-001/control-001/cores/collection1/data/]
    [junit4] 2> 469074 INFO (coreLoadExecutor-1298-thread-1) [ ] o.a.s.c.JmxMonitoredMap JMX monitoring is enabled. Adding Solr mbeans to JMX Server: com.sun.jmx.mbeanserver.JmxMBeanServer@194e622
    [junit4] 2> 469074 INFO (coreLoadExecutor-1298-thread-1) [ ] o.a.s.c.CachingDirectoryFactory return new directory for /home/jenkins/workspace/Lucene-Solr-6.x-Linux/solr/build/solr-core/test/J2/../../../../../../../../../home/jenkins/workspace/Lucene-Solr-6.x-Linux/solr/build/solr-core/test/J2/temp/solr.cloud.TestCryptoKeys_1104211D32EE6CEA-001/control-001/cores/collection1/data
    [junit4] 2> 469074 INFO (coreLoadExecutor-1298-thread-1) [ ] o.a.s.c.SolrCore New index directory detected: old=null new=/home/jenkins/workspace/Lucene-Solr-6.x-Linux/solr/build/solr-core/test/J2/../../../../../../../../../home/jenkins/workspace/Lucene-Solr-6.x-Linux/solr/build/solr-core/test/J2/temp/solr.cloud.TestCryptoKeys_1104211D32EE6CEA-001/control-001/cores/collection1/data/index/
    [junit4] 2> 469074 WARN (coreLoadExecutor-1298-thread-1) [ ] o.a.s.c.SolrCore [collection1] Solr index directory '/home/jenkins/workspace/Lucene-Solr-6.x-Linux/solr/build/solr-core/test/J2/../../../../../../../../../home/jenkins/workspace/Lucene-Solr-6.x-Linux/solr/build/solr-core/test/J2/temp/solr.cloud.TestCryptoKeys_1104211D32EE6CEA-001/control-001/cores/collection1/data/index' doesn't exist. Creating new index...
    [junit4] 2> 469075 INFO (coreLoadExecutor-1298-thread-1) [ ] o.a.s.c.CachingDirectoryFactory return new directory for /home/jenkins/workspace/Lucene-Solr-6.x-Linux/solr/build/solr-core/test/J2/../../../../../../../../../home/jenkins/workspace/Lucene-Solr-6.x-Linux/solr/build/solr-core/test/J2/temp/solr.cloud.TestCryptoKeys_1104211D32EE6CEA-001/control-001/cores/collection1/data/index
    [junit4] 2> 469075 INFO (coreLoadExecutor-1298-thread-1) [ ] o.a.s.u.RandomMergePolicy RandomMergePolicy wrapping class org.apache.lucene.index.LogDocMergePolicy: [LogDocMergePolicy: minMergeSize=1000, mergeFactor=10, maxMergeSize=9223372036854775807, maxMergeSizeForForcedMerge=9223372036854775807, calibrateSizeByDeletes=false, maxMergeDocs=2147483647, maxCFSSegmentSizeMB=8.796093022207999E12, noCFSRatio=0.0]
    [junit4] 2> 469075 INFO (coreLoadExecutor-1298-thread-1) [ ] o.a.s.c.SolrDeletionPolicy SolrDeletionPolicy.onCommit: commits: num=1
    [junit4] 2> commit{dir=MockDirectoryWrapper(RAMDirectory@153bf17 lockFactory=org.apache.lucene.store.SingleInstanceLockFactory@171fce5),segFN=segments_1,generation=1}
    [junit4] 2> 469075 INFO (coreLoadExecutor-1298-thread-1) [ ] o.a.s.c.SolrDeletionPolicy newest commit generation = 1
    [junit4] 2> 469076 INFO (OldIndexDirectoryCleanupThreadForCore-collection1) [ ] o.a.s.c.SolrCore Looking for old index directories to cleanup for core collection1 in /home/jenkins/workspace/Lucene-Solr-6.x-Linux/solr/build/solr-core/test/J2/../../../../../../../../../home/jenkins/workspace/Lucene-Solr-6.x-Linux/solr/build/solr-core/test/J2/temp/solr.cloud.TestCryptoKeys_1104211D32EE6CEA-001/control-001/cores/collection1/data/
    [junit4] 2> 469076 WARN (OldIndexDirectoryCleanupThreadForCore-collection1) [ ] o.a.s.c.DirectoryFactory /home/jenkins/workspace/Lucene-Solr-6.x-Linux/solr/build/solr-core/test/J2/../../../../../../../../../home/jenkins/workspace/Lucene-Solr-6.x-Linux/solr/build/solr-core/test/J2/temp/solr.cloud.TestCryptoKeys_1104211D32EE6CEA-001/control-001/cores/collection1/data/ does not point to a valid data directory; skipping clean-up of old index directories.
    [junit4] 2> 469078 INFO (coreLoadExecutor-1298-thread-1) [ ] o.a.s.u.p.UpdateRequestProcessorChain creating updateRequestProcessorChain "nodistrib"
    [junit4] 2> 469078 INFO (coreLoadExecutor-1298-thread-1) [ ] o.a.s.u.p.UpdateRequestProcessorChain creating updateRequestProcessorChain "dedupe"
    [junit4] 2> 469078 INFO (coreLoadExecutor-1298-thread-1) [ ] o.a.s.u.p.UpdateRequestProcessorChain inserting DistributedUpdateProcessorFactory into updateRequestProcessorChain "dedupe"
    [junit4] 2> 469078 INFO (coreLoadExecutor-1298-thread-1) [ ] o.a.s.u.p.UpdateRequestProcessorChain creating updateRequestProcessorChain "stored_sig"
    [junit4] 2> 469078 INFO (coreLoadExecutor-1298-thread-1) [ ] o.a.s.u.p.UpdateRequestProcessorChain inserting DistributedUpdateProcessorFactory into updateRequestProcessorChain "stored_sig"
    [junit4] 2> 469078 INFO (coreLoadExecutor-1298-thread-1) [ ] o.a.s.u.p.UpdateRequestProcessorChain creating updateRequestProcessorChain "distrib-dup-test-chain-explicit"
    [junit4] 2> 469078 INFO (coreLoadExecutor-1298-thread-1) [ ] o.a.s.u.p.UpdateRequestProcessorChain creating updateRequestProcessorChain "distrib-dup-test-chain-implicit"
    [junit4] 2> 469078 INFO (coreLoadExecutor-1298-thread-1) [ ] o.a.s.u.p.UpdateRequestProcessorChain inserting DistributedUpdateProcessorFactory into updateRequestProcessorChain "distrib-dup-test-chain-implicit"
    [junit4] 2> 469078 INFO (coreLoadExecutor-1298-thread-1) [ ] o.a.s.c.SolrCore no updateRequestProcessorChain defined as default, creating implicit default
    [junit4] 2> 469079 WARN (coreLoadExecutor-1298-thread-1) [ ] o.a.s.c.RequestHandlers INVALID paramSet a in requestHandler {type = requestHandler,name = /dump,class = DumpRequestHandler,args = {defaults={a=A,b=B}}}
    [junit4] 2> 469080 INFO (coreLoadExecutor-1298-thread-1) [ ] o.a.s.h.l.XMLLoader xsltCacheLifetimeSeconds=60
    [junit4] 2> 469081 INFO (coreLoadExecutor-1298-thread-1) [ ] o.a.s.h.l.XMLLoader xsltCacheLifetimeSeconds=60
    [junit4] 2> 469081 INFO (coreLoadExecutor-1298-thread-1) [ ] o.a.s.h.l.XMLLoader xsltCacheLifetimeSeconds=60
    [junit4] 2> 469082 INFO (coreLoadExecutor-1298-thread-1) [ ] o.a.s.h.l.XMLLoader xsltCacheLifetimeSeconds=60
    [junit4] 2> 469084 INFO (coreLoadExecutor-1298-thread-1) [ ] o.a.s.c.RequestHandlers Registered paths: /admin/mbeans,standard,/update/json/docs,/admin/luke,/export,/get,/admin/properties,/update/json,/admin/threads,/dump,/update/csv,/sql,/graph,/admin/segments,/admin/system,/replication,/config,/stream,/schema,/admin/plugins,/admin/logging,/admin/ping,/update,/admin/file
    [junit4] 2> 469084 INFO (coreLoadExecutor-1298-thread-1) [ ] o.a.s.c.SolrCore Using default statsCache cache: org.apache.solr.search.stats.LocalStatsCache
    [junit4] 2> 469084 INFO (coreLoadExecutor-1298-thread-1) [ ] o.a.s.u.UpdateHandler Using UpdateLog implementation: org.apache.solr.update.UpdateLog
    [junit4] 2> 469084 INFO (coreLoadExecutor-1298-thread-1) [ ] o.a.s.u.UpdateLog Initializing UpdateLog: dataDir= defaultSyncLevel=FLUSH numRecordsToKeep=100 maxNumLogsToKeep=10 numVersionBuckets=65536
    [junit4] 2> 469085 INFO (coreLoadExecutor-1298-thread-1) [ ] o.a.s.u.CommitTracker Hard AutoCommit: disabled
    [junit4] 2> 469085 INFO (coreLoadExecutor-1298-thread-1) [ ] o.a.s.u.CommitTracker Soft AutoCommit: disabled
    [junit4] 2> 469085 INFO (coreLoadExecutor-1298-thread-1) [ ] o.a.s.u.RandomMergePolicy RandomMergePolicy wrapping class org.apache.lucene.index.TieredMergePolicy: [TieredMergePolicy: maxMergeAtOnce=30, maxMergeAtOnceExplicit=31, maxMergedSegmentMB=72.3759765625, floorSegmentMB=2.1787109375, forceMergeDeletesPctAllowed=23.89870661722077, segmentsPerTier=45.0, maxCFSSegmentSizeMB=8.796093022207999E12, noCFSRatio=0.4642506595267081
    [junit4] 2> 469085 INFO (coreLoadExecutor-1298-thread-1) [ ] o.a.s.c.SolrDeletionPolicy SolrDeletionPolicy.onInit: commits: num=1
    [junit4] 2> commit{dir=MockDirectoryWrapper(RAMDirectory@153bf17 lockFactory=org.apache.lucene.store.SingleInstanceLockFactory@171fce5),segFN=segments_1,generation=1}
    [junit4] 2> 469085 INFO (coreLoadExecutor-1298-thread-1) [ ] o.a.s.c.SolrDeletionPolicy newest commit generation = 1
    [junit4] 2> 469085 INFO (coreLoadExecutor-1298-thread-1) [ ] o.a.s.s.SolrIndexSearcher Opening [Searcher@f19404[collection1] main]
    [junit4] 2> 469085 INFO (coreLoadExecutor-1298-thread-1) [ ] o.a.s.c.c.ZkStateReader Load collection config from: [/collections/control_collection]
    [junit4] 2> 469086 INFO (coreLoadExecutor-1298-thread-1) [ ] o.a.s.c.c.ZkStateReader path=[/collections/control_collection] [configName]=[conf1] specified config exists in ZooKeeper
    [junit4] 2> 469086 INFO (coreLoadExecutor-1298-thread-1) [ ] o.a.s.r.ManagedResourceStorage Setting up ZooKeeper-based storage for the RestManager with znodeBase: /configs/conf1
    [junit4] 2> 469086 INFO (coreLoadExecutor-1298-thread-1) [ ] o.a.s.r.ManagedResourceStorage Configured ZooKeeperStorageIO with znodeBase: /configs/conf1
    [junit4] 2> 469086 INFO (coreLoadExecutor-1298-thread-1) [ ] o.a.s.r.RestManager Initializing RestManager with initArgs: {}
    [junit4] 2> 469086 INFO (coreLoadExecutor-1298-thread-1) [ ] o.a.s.r.ManagedResourceStorage Reading _rest_managed.json using ZooKeeperStorageIO:path=/configs/conf1
    [junit4] 2> 469086 INFO (coreLoadExecutor-1298-thread-1) [ ] o.a.s.r.ManagedResourceStorage No data found for znode /configs/conf1/_rest_managed.json
    [junit4] 2> 469086 INFO (coreLoadExecutor-1298-thread-1) [ ] o.a.s.r.ManagedResourceStorage Loaded null at path _rest_managed.json using ZooKeeperStorageIO:path=/configs/conf1
    [junit4] 2> 469086 INFO (coreLoadExecutor-1298-thread-1) [ ] o.a.s.r.RestManager Initializing 0 registered ManagedResources
    [junit4] 2> 469086 INFO (coreLoadExecutor-1298-thread-1) [ ] o.a.s.h.ReplicationHandler Commits will be reserved for 10000
    [junit4] 2> 469087 INFO (searcherExecutor-1299-thread-1) [ ] o.a.s.c.SolrCore [collection1] Registered new searcher Searcher@f19404[collection1] main{ExitableDirectoryReader(UninvertingDirectoryReader())}
    [junit4] 2> 469087 INFO (coreLoadExecutor-1298-thread-1) [ ] o.a.s.u.UpdateLog Looking up max value of version field to seed version buckets
    [junit4] 2> 469087 INFO (coreLoadExecutor-1298-thread-1) [ ] o.a.s.u.VersionInfo Refreshing highest value of _version_ for 65536 version buckets from index
    [junit4] 2> 469087 INFO (coreLoadExecutor-1298-thread-1) [ ] o.a.s.u.VersionInfo No terms found for _version_, cannot seed version bucket highest value from index
    [junit4] 2> 469087 INFO (coreLoadExecutor-1298-thread-1) [ ] o.a.s.u.UpdateLog Could not find max version in index or recent updates, using new clock 1534360544893468672
    [junit4] 2> 469089 INFO (coreLoadExecutor-1298-thread-1) [ ] o.a.s.u.UpdateLog Took 1.0ms to seed version buckets with highest version 1534360544893468672
    [junit4] 2> 469089 INFO (coreLoadExecutor-1298-thread-1) [ ] o.a.s.c.ZkController watch zkdir /configs/conf1
    [junit4] 2> 469089 INFO (coreLoadExecutor-1298-thread-1) [ ] o.a.s.c.CoreContainer registering core: collection1
    [junit4] 2> 469089 INFO (coreZkRegister-1292-thread-1) [ ] o.a.s.c.ZkController Register replica - core:collection1 address:http://127.0.0.1:44989/_ collection:control_collection shard:shard1
    [junit4] 2> 469090 INFO (coreZkRegister-1292-thread-1) [ ] o.a.s.c.c.SolrZkClient makePath: /collections/control_collection/leader_elect/shard1/election
    [junit4] 2> 469092 INFO (coreZkRegister-1292-thread-1) [ ] o.a.s.c.LeaderElector Joined leadership election with path: /collections/control_collection/leader_elect/shard1/election/95897533968089092-core_node1-n_0000000000
    [junit4] 2> 469092 INFO (coreZkRegister-1292-thread-1) [ ] o.a.s.c.ShardLeaderElectionContext Running the leader process for shard=shard1 and weAreReplacement=false and leaderVoteWait=10000
    [junit4] 2> 469093 INFO (coreZkRegister-1292-thread-1) [ ] o.a.s.c.ShardLeaderElectionContext Enough replicas found to continue.
    [junit4] 2> 469093 INFO (coreZkRegister-1292-thread-1) [ ] o.a.s.c.ShardLeaderElectionContext I may be the new leader - try and sync
    [junit4] 2> 469093 INFO (coreZkRegister-1292-thread-1) [ ] o.a.s.c.SyncStrategy Sync replicas to http://127.0.0.1:44989/_/collection1/
    [junit4] 2> 469093 INFO (coreZkRegister-1292-thread-1) [ ] o.a.s.c.SyncStrategy Sync Success - now sync replicas to me
    [junit4] 2> 469093 INFO (coreZkRegister-1292-thread-1) [ ] o.a.s.c.SyncStrategy http://127.0.0.1:44989/_/collection1/ has no replicas
    [junit4] 2> 469093 INFO (OverseerStateUpdate-95897533968089092-127.0.0.1:44989__-n_0000000000) [ ] o.a.s.c.Overseer processMessage: queueSize: 1, message = {
    [junit4] 2> "operation":"leader",
    [junit4] 2> "shard":"shard1",
    [junit4] 2> "collection":"control_collection"} current state version: 1
    [junit4] 2> 469093 INFO (coreZkRegister-1292-thread-1) [ ] o.a.s.c.c.SolrZkClient makePath: /collections/control_collection/leaders/shard1
    [junit4] 2> 469094 INFO (coreZkRegister-1292-thread-1) [ ] o.a.s.c.ShardLeaderElectionContextBase Creating leader registration node /collections/control_collection/leaders/shard1/leader after winning as /collections/control_collection/leader_elect/shard1/election/95897533968089092-core_node1-n_0000000000
    [junit4] 2> 469095 INFO (coreZkRegister-1292-thread-1) [ ] o.a.s.c.ShardLeaderElectionContext I am the new leader: http://127.0.0.1:44989/_/collection1/ shard1
    [junit4] 2> 469095 INFO (OverseerStateUpdate-95897533968089092-127.0.0.1:44989__-n_0000000000) [ ] o.a.s.c.Overseer processMessage: queueSize: 1, message = {
    [junit4] 2> "operation":"leader",
    [junit4] 2> "shard":"shard1",
    [junit4] 2> "collection":"control_collection",
    [junit4] 2> "base_url":"http://127.0.0.1:44989/_",
    [junit4] 2> "core":"collection1",
    [junit4] 2> "state":"active"} current state version: 1
    [junit4] 2> 469196 INFO (zkCallback-540-thread-1) [ ] o.a.s.c.c.ZkStateReader A cluster state change: [WatchedEvent state:SyncConnected type:NodeDataChanged path:/clusterstate.json], has occurred - updating... (live nodes size: [1])
    [junit4] 2> 469246 INFO (coreZkRegister-1292-thread-1) [ ] o.a.s.c.ZkController We are http://127.0.0.1:44989/_/collection1/ and leader is http://127.0.0.1:44989/_/collection1/
    [junit4] 2> 469246 INFO (coreZkRegister-1292-thread-1) [ ] o.a.s.c.ZkController No LogReplay needed for core=collection1 baseURL=http://127.0.0.1:44989/_
    [junit4] 2> 469246 INFO (coreZkRegister-1292-thread-1) [ ] o.a.s.c.ZkController I am the leader, no recovery necessary
    [junit4] 2> 469246 INFO (coreZkRegister-1292-thread-1) [ ] o.a.s.c.ZkController publishing state=active
    [junit4] 2> 469246 INFO (coreZkRegister-1292-thread-1) [ ] o.a.s.c.ZkController numShards not found on descriptor - reading it from system property
    [junit4] 2> 469247 INFO (OverseerStateUpdate-95897533968089092-127.0.0.1:44989__-n_0000000000) [ ] o.a.s.c.Overseer processMessage: queueSize: 1, message = {
    [junit4] 2> "core":"collection1",
    [junit4] 2> "core_node_name":"core_node1",
    [junit4] 2> "roles":null,
    [junit4] 2> "base_url":"http://127.0.0.1:44989/_",
    [junit4] 2> "node_name":"127.0.0.1:44989__",
    [junit4] 2> "numShards":"1",
    [junit4] 2> "state":"active",
    [junit4] 2> "shard":"shard1",
    [junit4] 2> "collection":"control_collection",
    [junit4] 2> "operation":"state"} current state version: 2
    [junit4] 2> 469247 INFO (OverseerStateUpdate-95897533968089092-127.0.0.1:44989__-n_0000000000) [ ] o.a.s.c.o.ReplicaMutator Update state numShards=1 message={
    [junit4] 2> "core":"collection1",
    [junit4] 2> "core_node_name":"core_node1",
    [junit4] 2> "roles":null,
    [junit4] 2> "base_url":"http://127.0.0.1:44989/_",
    [junit4] 2> "node_name":"127.0.0.1:44989__",
    [junit4] 2> "numShards":"1",
    [junit4] 2> "state":"active",
    [junit4] 2> "shard":"shard1",
    [junit4] 2> "collection":"control_collection",
    [junit4] 2> "operation":"state"}
    [junit4] 2> 469348 INFO (zkCallback-540-thread-1) [ ] o.a.s.c.c.ZkStateReader A cluster state change: [WatchedEvent state:SyncConnected type:NodeDataChanged path:/clusterstate.json], has occurred - updating... (live nodes size: [1])
    [junit4] 2> 469473 INFO (TEST-TestCryptoKeys.test-seed#[1104211D32EE6CEA]) [ ] o.a.s.c.s.i.CloudSolrClient Final constructed zkHost string: 127.0.0.1:33646/solr
    [junit4] 2> 469473 INFO (TEST-TestCryptoKeys.test-seed#[1104211D32EE6CEA]) [ ] o.a.s.c.c.SolrZkClient Using default ZkCredentialsProvider
    [junit4] 2> 469474 INFO (TEST-TestCryptoKeys.test-seed#[1104211D32EE6CEA]) [ ] o.a.s.c.c.ConnectionManager Waiting for client to connect to ZooKeeper
    [junit4] 2> 469475 INFO (zkCallback-544-thread-1) [ ] o.a.s.c.c.ConnectionManager Watcher org.apache.solr.common.cloud.ConnectionManager@12eb878 name:ZooKeeperConnection Watcher:127.0.0.1:33646/solr got event WatchedEvent state:SyncConnected type:None path:null path:null type:None
    [junit4] 2> 469475 INFO (TEST-TestCryptoKeys.test-seed#[1104211D32EE6CEA]) [ ] o.a.s.c.c.ConnectionManager Client is connected to ZooKeeper
    [junit4] 2> 469475 INFO (TEST-TestCryptoKeys.test-seed#[1104211D32EE6CEA]) [ ] o.a.s.c.c.SolrZkClient Using default ZkACLProvider
    [junit4] 2> 469475 INFO (TEST-TestCryptoKeys.test-seed#[1104211D32EE6CEA]) [ ] o.a.s.c.c.ZkStateReader Updating cluster state from ZooKeeper...
    [junit4] 2> 469476 INFO (TEST-TestCryptoKeys.test-seed#[1104211D32EE6CEA]) [ ] o.a.s.c.c.ZkStateReader Loaded empty cluster properties
    [junit4] 2> 469476 INFO (TEST-TestCryptoKeys.test-seed#[1104211D32EE6CEA]) [ ] o.a.s.c.c.ZkStateReader Updated live nodes from ZooKeeper... (0) -> (1)
    [junit4] 2> 469477 INFO (TEST-TestCryptoKeys.test-seed#[1104211D32EE6CEA]) [ ] o.a.s.c.ChaosMonkey monkey: init - expire sessions:false cause connection loss:false
    [junit4] 2> 469477 INFO (TEST-TestCryptoKeys.test-seed#[1104211D32EE6CEA]) [ ] o.a.s.c.AbstractFullDistribZkTestBase Creating collection1 with stateFormat=2
    [junit4] 2> 469477 INFO (TEST-TestCryptoKeys.test-seed#[1104211D32EE6CEA]) [ ] o.a.s.c.c.SolrZkClient Using default ZkCredentialsProvider
    [junit4] 2> 469477 INFO (TEST-TestCryptoKeys.test-seed#[1104211D32EE6CEA]) [ ] o.a.s.c.c.ConnectionManager Waiting for client to connect to ZooKeeper
    [junit4] 2> 469478 INFO (zkCallback-545-thread-1) [ ] o.a.s.c.c.ConnectionManager Watcher org.apache.solr.common.cloud.ConnectionManager@2bf300 name:ZooKeeperConnection Watcher:127.0.0.1:33646/solr got event WatchedEvent state:SyncConnected type:None path:null path:null type:None
    [junit4] 2> 469478 INFO (TEST-TestCryptoKeys.test-seed#[1104211D32EE6CEA]) [ ] o.a.s.c.c.ConnectionManager Client is connected to ZooKeeper
    [junit4] 2> 469478 INFO (TEST-TestCryptoKeys.test-seed#[1104211D32EE6CEA]) [ ] o.a.s.c.c.SolrZkClient Using default ZkACLProvider
    [junit4] 2> 469479 INFO (OverseerStateUpdate-95897533968089092-127.0.0.1:44989__-n_0000000000) [ ] o.a.s.c.Overseer processMessage: queueSize: 1, message = {
    [junit4] 2> "operation":"create",
    [junit4] 2> "name":"collection1",
    [junit4] 2> "numShards":"1",
    [junit4] 2> "stateFormat":"2"} current state version: 3
    [junit4] 2> 469479 INFO (OverseerStateUpdate-95897533968089092-127.0.0.1:44989__-n_0000000000) [ ] o.a.s.c.o.ClusterStateMutator building a new cName: collection1
    [junit4] 2> 469542 INFO (TEST-TestCryptoKeys.test-seed#[1104211D32EE6CEA]) [ ] o.a.s.SolrTestCaseJ4 Writing core.properties file to /home/jenkins/workspace/Lucene-Solr-6.x-Linux/solr/build/solr-core/test/J2/temp/solr.cloud.TestCryptoKeys_1104211D32EE6CEA-001/shard-1-001/cores/collection1
    [junit4] 2> 469543 INFO (TEST-TestCryptoKeys.test-seed#[1104211D32EE6CEA]) [ ] o.a.s.c.AbstractFullDistribZkTestBase create jetty 1 in directory /home/jenkins/workspace/Lucene-Solr-6.x-Linux/solr/build/solr-core/test/J2/temp/solr.cloud.TestCryptoKeys_1104211D32EE6CEA-001/shard-1-001
    [junit4] 2> 469543 INFO (TEST-TestCryptoKeys.test-seed#[1104211D32EE6CEA]) [ ] o.e.j.s.Server jetty-9.3.8.v20160314
    [junit4] 2> 469544 INFO (TEST-TestCryptoKeys.test-seed#[1104211D32EE6CEA]) [ ] o.e.j.s.h.ContextHandler Started o.e.j.s.ServletContextHandler@1e06bd4{/_,null,AVAILABLE}
    [junit4] 2> 469545 INFO (TEST-TestCryptoKeys.test-seed#[1104211D32EE6CEA]) [ ] o.e.j.s.ServerConnector Started ServerConnector@123cd47{HTTP/1.1,[http/1.1]}{127.0.0.1:34501}
    [junit4] 2> 469545 INFO (TEST-TestCryptoKeys.test-seed#[1104211D32EE6CEA]) [ ] o.e.j.s.Server Started @471489ms
    [junit4] 2> 469545 INFO (TEST-TestCryptoKeys.test-seed#[1104211D32EE6CEA]) [ ] o.a.s.c.s.e.JettySolrRunner Jetty properties: {solr.data.dir=/home/jenkins/workspace/Lucene-Solr-6.x-Linux/solr/build/solr-core/test/J2/temp/solr.cloud.TestCryptoKeys_1104211D32EE6CEA-001/tempDir-001/jetty1, solrconfig=solrconfig.xml, hostContext=/_, hostPort=34501, coreRootDirectory=/home/jenkins/workspace/Lucene-Solr-6.x-Linux/solr/build/solr-core/test/J2/temp/solr.cloud.TestCryptoKeys_1104211D32EE6CEA-001/shard-1-001/cores}
    [junit4] 2> 469545 INFO (TEST-TestCryptoKeys.test-seed#[1104211D32EE6CEA]) [ ] o.a.s.s.SolrDispatchFilter SolrDispatchFilter.init(): jdk.internal.loader.ClassLoaders$AppClassLoader@a4a92b
    [junit4] 2> 469545 INFO (TEST-TestCryptoKeys.test-seed#[1104211D32EE6CEA]) [ ] o.a.s.c.SolrResourceLoader new SolrResourceLoader for directory: '/home/jenkins/workspace/Lucene-Solr-6.x-Linux/solr/build/solr-core/test/J2/temp/solr.cloud.TestCryptoKeys_1104211D32EE6CEA-001/shard-1-001'
    [junit4] 2> 469545 INFO (TEST-TestCryptoKeys.test-seed#[1104211D32EE6CEA]) [ ] o.a.s.c.SolrResourceLoader JNDI not configured for solr (NoInitialContextEx)
    [junit4] 2> 469545 INFO (TEST-TestCryptoKeys.test-seed#[1104211D32EE6CEA]) [ ] o.a.s.c.SolrResourceLoader solr home defaulted to 'solr/' (could not find system property or JNDI)
    [junit4] 2> 469545 INFO (TEST-TestCryptoKeys.test-seed#[1104211D32EE6CEA]) [ ] o.a.s.c.c.SolrZkClient Using default ZkCredentialsProvider
    [junit4] 2> 469546 INFO (TEST-TestCryptoKeys.test-seed#[1104211D32EE6CEA]) [ ] o.a.s.c.c.ConnectionManager Waiting for client to connect to ZooKeeper
    [junit4] 2> 469547 INFO (zkCallback-546-thread-1) [ ] o.a.s.c.c.ConnectionManager Watcher org.apache.solr.common.cloud.ConnectionManager@18730e6 name:ZooKeeperConnection Watcher:127.0.0.1:33646/solr got event WatchedEvent state:SyncConnected type:None path:null path:null type:None
    [junit4] 2> 469547 INFO (TEST-TestCryptoKeys.test-seed#[1104211D32EE6CEA]) [ ] o.a.s.c.c.ConnectionManager Client is connected to ZooKeeper
    [junit4] 2> 469548 INFO (TEST-TestCryptoKeys.test-seed#[1104211D32EE6CEA]) [ ] o.a.s.c.c.SolrZkClient Using default ZkACLProvider
    [junit4] 2> 469548 INFO (TEST-TestCryptoKeys.test-seed#[1104211D32EE6CEA]) [ ] o.a.s.s.SolrDispatchFilter Loading solr.xml from SolrHome (not found in ZooKeeper)
    [junit4] 2> 469548 INFO (TEST-TestCryptoKeys.test-seed#[1104211D32EE6CEA]) [ ] o.a.s.c.SolrXmlConfig Loading container configuration from /home/jenkins/workspace/Lucene-Solr-6.x-Linux/solr/build/solr-core/test/J2/temp/solr.cloud.TestCryptoKeys_1104211D32EE6CEA-001/shard-1-001/solr.xml
    [junit4] 2> 469551 INFO (TEST-TestCryptoKeys.test-seed#[1104211D32EE6CEA]) [ ] o.a.s.c.CorePropertiesLocator Config-defined core root directory: /home/jenkins/workspace/Lucene-Solr-6.x-Linux/solr/build/solr-core/test/J2/temp/solr.cloud.TestCryptoKeys_1104211D32EE6CEA-001/shard-1-001/cores
    [junit4] 2> 469551 INFO (TEST-TestCryptoKeys.test-seed#[1104211D32EE6CEA]) [ ] o.a.s.c.CoreContainer New CoreContainer 30927732
    [junit4] 2> 469551 INFO (TEST-TestCryptoKeys.test-seed#[1104211D32EE6CEA]) [ ] o.a.s.c.CoreContainer Loading cores into CoreContainer [instanceDir=/home/jenkins/workspace/Lucene-Solr-6.x-Linux/solr/build/solr-core/test/J2/temp/solr.cloud.TestCryptoKeys_1104211D32EE6CEA-001/shard-1-001]
    [junit4] 2> 469552 WARN (TEST-TestCryptoKeys.test-seed#[1104211D32EE6CEA]) [ ] o.a.s.c.CoreContainer Couldn't add files from /home/jenkins/workspace/Lucene-Solr-6.x-Linux/solr/build/solr-core/test/J2/temp/solr.cloud.TestCryptoKeys_1104211D32EE6CEA-001/shard-1-001/lib to classpath: /home/jenkins/workspace/Lucene-Solr-6.x-Linux/solr/build/solr-core/test/J2/temp/solr.cloud.TestCryptoKeys_1104211D32EE6CEA-001/shard-1-001/lib
    [junit4] 2> 469552 INFO (TEST-TestCryptoKeys.test-seed#[1104211D32EE6CEA]) [ ] o.a.s.h.c.HttpShardHandlerFactory created with socketTimeout : 90000,urlScheme : ,connTimeout : 15000,maxConnectionsPerHost : 20,maxConnections : 10000,corePoolSize : 0,maximumPoolSize : 2147483647,maxThreadIdleTime : 5,sizeOfQueue : -1,fairnessPolicy : false,useRetries : false,
    [junit4] 2> 469552 INFO (TEST-TestCryptoKeys.test-seed#[1104211D32EE6CEA]) [ ] o.a.s.u.UpdateShardHandler Creating UpdateShardHandler HTTP client with params: socketTimeout=340000&connTimeout=45000&retry=true
    [junit4] 2> 469553 INFO (TEST-TestCryptoKeys.test-seed#[1104211D32EE6CEA]) [ ] o.a.s.l.LogWatcher SLF4J impl is org.slf4j.impl.Log4jLoggerFactory
    [junit4] 2> 469553 INFO (TEST-TestCryptoKeys.test-seed#[1104211D32EE6CEA]) [ ] o.a.s.l.LogWatcher Registering Log Listener [Log4j (org.slf4j.impl.Log4jLoggerFactory)]
    [junit4] 2> 469553 INFO (TEST-TestCryptoKeys.test-seed#[1104211D32EE6CEA]) [ ] o.a.s.c.ZkContainer Zookeeper client=127.0.0.1:33646/solr
    [junit4] 2> 469553 INFO (TEST-TestCryptoKeys.test-seed#[1104211D32EE6CEA]) [ ] o.a.s.c.ZkController zkHost includes chroot
    [junit4] 2> 469553 INFO (TEST-TestCryptoKeys.test-seed#[1104211D32EE6CEA]) [ ] o.a.s.c.c.SolrZkClient Using default ZkCredentialsProvider
    [junit4] 2> 469553 INFO (TEST-TestCryptoKeys.test-seed#[1104211D32EE6CEA]) [ ] o.a.s.c.c.ConnectionManager Waiting for client to connect to ZooKeeper
    [junit4] 2> 469554 INFO (zkCallback-549-thread-1) [ ] o.a.s.c.c.ConnectionManager Watcher org.apache.solr.common.cloud.ConnectionManager@b2203c name:ZooKeeperConnection Watcher:127.0.0.1:33646 got event WatchedEvent state:SyncConnected type:None path:null path:null type:None
    [junit4] 2> 469555 INFO (TEST-TestCryptoKeys.test-seed#[1104211D32EE6CEA]) [ ] o.a.s.c.c.ConnectionManager Client is connected to ZooKeeper
    [junit4] 2> 469555 INFO (TEST-TestCryptoKeys.test-seed#[1104211D32EE6CEA]) [ ] o.a.s.c.c.SolrZkClient Using default ZkACLProvider
    [junit4] 2> 469556 INFO (TEST-TestCryptoKeys.test-seed#[1104211D32EE6CEA]) [ ] o.a.s.c.ZkController Added new OnReconnect listener org.apache.solr.cloud.ZkController$$Lambda$124/17595357@d72075
    [junit4] 2> 469556 INFO (TEST-TestCryptoKeys.test-seed#[1104211D32EE6CEA]) [ ] o.a.s.c.c.ConnectionManager Waiting for client to connect to ZooKeeper
    [junit4] 2> 469557 INFO (zkCallback-550-thread-1) [ ] o.a.s.c.c.ConnectionManager Watcher org.apache.solr.common.cloud.ConnectionManager@15f16b name:ZooKeeperConnection Watcher:127.0.0.1:33646/solr got event WatchedEvent state:SyncConnected type:None path:null path:null type:None
    [junit4] 2> 469557 INFO (TEST-TestCryptoKeys.test-seed#[1104211D32EE6CEA]) [ ] o.a.s.c.c.ConnectionManager Client is connected to ZooKeeper
    [junit4] 2> 469560 INFO (TEST-TestCryptoKeys.test-seed#[1104211D32EE6CEA]) [ ] o.a.s.c.c.ZkStateReader Updating cluster state from ZooKeeper...
    [junit4] 2> 469561 INFO (TEST-TestCryptoKeys.test-seed#[1104211D32EE6CEA]) [ ] o.a.s.c.c.ZkStateReader Loaded empty cluster properties
    [junit4] 2> 469561 INFO (TEST-TestCryptoKeys.test-seed#[1104211D32EE6CEA]) [ ] o.a.s.c.c.ZkStateReader Updated live nodes from ZooKeeper... (0) -> (1)
    [junit4] 2> 469562 INFO (TEST-TestCryptoKeys.test-seed#[1104211D32EE6CEA]) [ ] o.a.s.c.Overseer Overseer (id=null) closing
    [junit4] 2> 469562 INFO (TEST-TestCryptoKeys.test-seed#[1104211D32EE6CEA]) [ ] o.a.s.c.LeaderElector Joined leadership election with path: /overseer_elect/election/95897533968089097-127.0.0.1:34501__-n_0000000001
    [junit4] 2> 469562 INFO (TEST-TestCryptoKeys.test-seed#[1104211D32EE6CEA]) [ ] o.a.s.c.LeaderElector Watching path /overseer_elect/election/95897533968089092-127.0.0.1:44989__-n_0000000000 to know if I could be the leader
    [junit4] 2> 469563 INFO (TEST-TestCryptoKeys.test-seed#[1104211D32EE6CEA]) [ ] o.a.s.c.ZkController Publish node=127.0.0.1:34501__ as DOWN
    [junit4] 2> 469563 INFO (OverseerStateUpdate-95897533968089092-127.0.0.1:44989__-n_0000000000) [ ] o.a.s.c.Overseer processMessage: queueSize: 1, message = {
    [junit4] 2> "operation":"downnode",
    [junit4] 2> "node_name":"127.0.0.1:34501__"} current state version: 3
    [junit4] 2> 469564 INFO (OverseerStateUpdate-95897533968089092-127.0.0.1:44989__-n_0000000000) [ ] o.a.s.c.o.NodeMutator DownNode state invoked for node: 127.0.0.1:34501__
    [junit4] 2> 469564 INFO (OverseerStateUpdate-95897533968089092-127.0.0.1:44989__-n_0000000000) [ ] o.a.s.c.o.ZkStateWriter going to create_collection /collections/collection1/state.json
    [junit4] 2> 469565 INFO (zkCallback-540-thread-1) [ ] o.a.s.c.c.ZkStateReader A cluster state change: [WatchedEvent state:SyncConnected type:NodeDataChanged path:/clusterstate.json], has occurred - updating... (live nodes size: [1])
    [junit4] 2> 469565 INFO (zkCallback-550-thread-1) [ ] o.a.s.c.c.ZkStateReader A cluster state change: [WatchedEvent state:SyncConnected type:NodeDataChanged path:/clusterstate.json], has occurred - updating... (live nodes size: [1])
    [junit4] 2> 469565 INFO (zkCallback-544-thread-1) [ ] o.a.s.c.c.ZkStateReader A cluster state change: [WatchedEvent state:SyncConnected type:NodeDataChanged path:/clusterstate.json], has occurred - updating... (live nodes size: [1])
    [junit4] 2> 469667 INFO (OverseerStateUpdate-95897533968089092-127.0.0.1:44989__-n_0000000000) [ ] o.a.s.c.o.ZkStateWriter going to update_collection /collections/collection1/state.json version: 2147483647
    [junit4] 2> 469667 WARN (OverseerStateUpdate-95897533968089092-127.0.0.1:44989__-n_0000000000) [ ] o.a.s.c.Overseer Bad version writing to ZK using compare-and-set, will force refresh cluster state
    [junit4] 2> org.apache.zookeeper.KeeperException$BadVersionException: KeeperErrorCode = BadVersion for /collections/collection1/state.json
    [junit4] 2> at org.apache.zookeeper.KeeperException.create(KeeperException.java:115)
    [junit4] 2> at org.apache.zookeeper.KeeperException.create(KeeperException.java:51)
    [junit4] 2> at org.apache.zookeeper.ZooKeeper.setData(ZooKeeper.java:1270)
    [junit4] 2> at org.apache.solr.common.cloud.SolrZkClient$8.execute(SolrZkClient.java:365)
    [junit4] 2> at org.apache.solr.common.cloud.SolrZkClient$8.execute(SolrZkClient.java:362)
    [junit4] 2> at org.apache.solr.common.cloud.ZkCmdExecutor.retryOperation(ZkCmdExecutor.java:60)
    [junit4] 2> at org.apache.solr.common.cloud.SolrZkClient.setData(SolrZkClient.java:362)
    [junit4] 2> at org.apache.solr.cloud.overseer.ZkStateWriter.writePendingUpdates(ZkStateWriter.java:232)
    [junit4] 2> at org.apache.solr.cloud.Overseer$ClusterStateUpdater.run(Overseer.java:240)
    [junit4] 2> at java.lang.Thread.run(java.base@9-ea/Thread.java:804)
    [junit4] 2> 469668 INFO (OverseerStateUpdate-95897533968089092-127.0.0.1:44989__-n_0000000000) [ ] o.a.s.c.c.ZkStateReader Updated live nodes from ZooKeeper... (1) -> (1)
    [junit4] 2> 469669 INFO (OverseerStateUpdate-95897533968089092-127.0.0.1:44989__-n_0000000000) [ ] o.a.s.c.Overseer processMessage: workQueueSize: 1, message = {
    [junit4] 2> "operation":"downnode",
    [junit4] 2> "node_name":"127.0.0.1:34501__"}
    [junit4] 2> 469669 INFO (OverseerStateUpdate-95897533968089092-127.0.0.1:44989__-n_0000000000) [ ] o.a.s.c.o.NodeMutator DownNode state invoked for node: 127.0.0.1:34501__
    [junit4] 2> 469669 INFO (zkCallback-550-thread-1) [ ] o.a.s.c.c.ZkStateReader A cluster state change: [WatchedEvent state:SyncConnected type:NodeDataChanged path:/clusterstate.json], has occurred - updating... (live nodes size: [1])
    [junit4] 2> 469669 INFO (zkCallback-544-thread-1) [ ] o.a.s.c.c.ZkStateReader A cluster state change: [WatchedEvent state:SyncConnected type:NodeDataChanged path:/clusterstate.json], has occurred - updating... (live nodes size: [1])
    [junit4] 2> 469669 INFO (zkCallback-540-thread-1) [ ] o.a.s.c.c.ZkStateReader A cluster state change: [WatchedEvent state:SyncConnected type:NodeDataChanged path:/clusterstate.json], has occurred - updating... (live nodes size: [1])
    [junit4] 2> 469669 INFO (OverseerStateUpdate-95897533968089092-127.0.0.1:44989__-n_0000000000) [ ] o.a.s.c.o.ZkStateWriter going to update_collection /collections/collection1/state.json version: 0
    [junit4] 2> 470563 INFO (TEST-TestCryptoKeys.test-seed#[1104211D32EE6CEA]) [ ] o.a.s.c.ZkController Register node as live in ZooKeeper:/live_nodes/127.0.0.1:34501__
    [junit4] 2> 470564 INFO (TEST-TestCryptoKeys.test-seed#[1104211D32EE6CEA]) [ ] o.a.s.c.c.SolrZkClient makePath: /live_nodes/127.0.0.1:34501__
    [junit4] 2> 470564 INFO (zkCallback-540-thread-1) [ ] o.a.s.c.c.ZkStateReader A live node change: [WatchedEvent state:SyncConnected type:NodeChildrenChanged path:/live_nodes], has occurred - updating... (live nodes size: [1])
    [junit4] 2> 470564 INFO (zkCallback-544-thread-1) [ ] o.a.s.c.c.ZkStateReader A live node change: [WatchedEvent state:SyncConnected type:NodeChildrenChanged path:/live_nodes], has occurred - updating... (live nodes size: [1])
    [junit4] 2> 470564 INFO (zkCallback-550-thread-1) [ ] o.a.s.c.c.ZkStateReader A live node change: [WatchedEvent state:SyncConnected type:NodeChildrenChanged path:/live_nodes], has occurred - updating... (live nodes size: [1])
    [junit4] 2> 470565 INFO (zkCallback-540-thread-1) [ ] o.a.s.c.c.ZkStateReader Updated live nodes from ZooKeeper... (1) -> (2)
    [junit4] 2> 470565 INFO (zkCallback-544-thread-1) [ ] o.a.s.c.c.ZkStateReader Updated live nodes from ZooKeeper... (1) -> (2)
    [junit4] 2> 470565 INFO (zkCallback-550-thread-1) [ ] o.a.s.c.c.ZkStateReader Updated live nodes from ZooKeeper... (1) -> (2)
    [junit4] 2> 470590 INFO (TEST-TestCryptoKeys.test-seed#[1104211D32EE6CEA]) [ ] o.a.s.c.CoreContainer Security conf doesn't exist. Skipping setup for authorization module.
    [junit4] 2> 470590 INFO (TEST-TestCryptoKeys.test-seed#[1104211D32EE6CEA]) [ ] o.a.s.c.CoreContainer No authentication plugin used.
    [junit4] 2> 470590 INFO (TEST-TestCryptoKeys.test-seed#[1104211D32EE6CEA]) [ ] o.a.s.c.CorePropertiesLocator Looking for core definitions underneath /home/jenkins/workspace/Lucene-Solr-6.x-Linux/solr/build/solr-core/test/J2/temp/solr.cloud.TestCryptoKeys_1104211D32EE6CEA-001/shard-1-001/cores
    [junit4] 2> 470591 INFO (TEST-TestCryptoKeys.test-seed#[1104211D32EE6CEA]) [ ] o.a.s.c.CoreDescriptor Created CoreDescriptor: {name=collection1, config=solrconfig.xml, transient=false, schema=schema.xml, loadOnStartup=true, configSetProperties=configsetprops.json, collection=collection1, coreNodeName=, dataDir=data/, shard=}
    [junit4] 2> 470591 INFO (TEST-TestCryptoKeys.test-seed#[1104211D32EE6CEA]) [ ] o.a.s.c.CorePropertiesLocator Found core collection1 in /home/jenkins/workspace/Lucene-Solr-6.x-Linux/solr/build/solr-core/test/J2/temp/solr.cloud.TestCryptoKeys_1104211D32EE6CEA-001/shard-1-001/cores/collection1
    [junit4] 2> 470591 INFO (TEST-TestCryptoKeys.test-seed#[1104211D32EE6CEA]) [ ] o.a.s.c.CorePropertiesLocator Found 1 core definitions
    [junit4] 2> 470592 INFO (TEST-TestCryptoKeys.test-seed#[1104211D32EE6CEA]) [ ] o.a.s.s.SolrDispatchFilter user.dir=/home/jenkins/workspace/Lucene-Solr-6.x-Linux/solr/build/solr-core/test/J2
    [junit4] 2> 470592 INFO (TEST-TestCryptoKeys.test-seed#[1104211D32EE6CEA]) [ ] o.a.s.s.SolrDispatchFilter SolrDispatchFilter.init() done
    [junit4] 2> 470592 INFO (coreLoadExecutor-1309-thread-1) [ ] o.a.s.c.ZkController publishing state=down
    [junit4] 2> 470592 INFO (coreLoadExecutor-1309-thread-1) [ ] o.a.s.c.ZkController numShards not found on descriptor - reading it from system property
    [junit4] 2> 470593 INFO (OverseerStateUpdate-95897533968089092-127.0.0.1:44989__-n_0000000000) [ ] o.a.s.c.Overseer processMessage: queueSize: 1, message = {
    [junit4] 2> "core":"collection1",
    [junit4] 2> "roles":null,
    [junit4] 2> "base_url":"http://127.0.0.1:34501/_",
    [junit4] 2> "node_name":"127.0.0.1:34501__",
    [junit4] 2> "numShards":"1",
    [junit4] 2> "state":"down",
    [junit4] 2> "shard":null,
    [junit4] 2> "collection":"collection1",
    [junit4] 2> "operation":"state"} current state version: 5
    [junit4] 2> 470593 INFO (OverseerStateUpdate-95897533968089092-127.0.0.1:44989__-n_0000000000) [ ] o.a.s.c.o.ReplicaMutator Update state numShards=1 message={
    [junit4] 2> "core":"collection1",
    [junit4] 2> "roles":null,
    [junit4] 2> "base_url":"http://127.0.0.1:34501/_",
    [junit4] 2> "node_name":"127.0.0.1:34501__",
    [junit4] 2> "numShards":"1",
    [junit4] 2> "state":"down",
    [junit4] 2> "shard":null,
    [junit4] 2> "collection":"collection1",
    [junit4] 2> "operation":"state"}
    [junit4] 2> 470593 INFO (OverseerStateUpdate-95897533968089092-127.0.0.1:44989__-n_0000000000) [ ] o.a.s.c.o.ReplicaMutator Collection already exists with numShards=1
    [junit4] 2> 470593 INFO (OverseerStateUpdate-95897533968089092-127.0.0.1:44989__-n_0000000000) [ ] o.a.s.c.o.ReplicaMutator Assigning new node to shard shard=shard1
    [junit4] 2> 470593 INFO (coreLoadExecutor-1309-thread-1) [ ] o.a.s.c.ZkController Registering watch for collection collection1
    [junit4] 2> 470594 INFO (coreLoadExecutor-1309-thread-1) [ ] o.a.s.c.c.ZkStateReader Add data for [collection1] ver [1]
    [junit4] 2> 470594 INFO (coreLoadExecutor-1309-thread-1) [ ] o.a.s.c.ZkController look for our core node name
    [junit4] 2> 470694 INFO (OverseerStateUpdate-95897533968089092-127.0.0.1:44989__-n_0000000000) [ ] o.a.s.c.o.ZkStateWriter going to update_collection /collections/collection1/state.json version: 1
    [junit4] 2> 470695 INFO (zkCallback-550-thread-1) [ ] o.a.s.c.c.ZkStateReader A cluster state change: [WatchedEvent state:SyncConnected type:NodeDataChanged path:/collections/collection1/state.json] for collection [collection1] has occurred - updating... (live nodes size: [2])
    [junit4] 2> 470695 INFO (zkCallback-550-thread-1) [ ] o.a.s.c.c.ZkStateReader Updating data for [collection1] from [1] to [2]
    [junit4] 2> 471594 INFO (coreLoadExecutor-1309-thread-1) [ ] o.a.s.c.ZkController waiting to find shard id in clusterstate for collection1
    [junit4] 2> 471594 INFO (coreLoadExecutor-1309-thread-1) [ ] o.a.s.c.ZkController Check for collection zkNode:collection1
    [junit4] 2> 471594 INFO (coreLoadExecutor-1309-thread-1) [ ] o.a.s.c.ZkController Collection zkNode exists
    [junit4] 2> 471594 INFO (coreLoadExecutor-1309-thread-1) [ ] o.a.s.c.c.ZkStateReader Load collection config from: [/collections/collection1]
    [junit4] 2> 471595 INFO (coreLoadExecutor-1309-thread-1) [ ] o.a.s.c.c.ZkStateReader path=[/collections/collection1] [configName]=[conf1] specified config exists in ZooKeeper
    [junit4] 2> 471595 INFO (coreLoadExecutor-1309-thread-1) [ ] o.a.s.c.SolrResourceLoader new SolrResourceLoader for directory: '/home/jenkins/workspace/Lucene-Solr-6.x-Linux/solr/build/solr-core/test/J2/temp/solr.cloud.TestCryptoKeys_1104211D32EE6CEA-001/shard-1-001/cores/collection1'
    [junit4] 2> 471595 INFO (coreLoadExecutor-1309-thread-1) [ ] o.a.s.c.SolrResourceLoader JNDI not configured for solr (NoInitialContextEx)
    [junit4] 2> 471595 INFO (coreLoadExecutor-1309-thread-1) [ ] o.a.s.c.SolrResourceLoader solr home defaulted to 'solr/' (could not find system property or JNDI)
    [junit4] 2> 471596 INFO (coreLoadExecutor-1309-thread-1) [ ] o.a.s.c.Config loaded config solrconfig.xml with version 0
    [junit4] 2> 471599 INFO (coreLoadExecutor-1309-thread-1) [ ] o.a.s.c.SolrConfig current version of requestparams : -1
    [junit4] 2> 471602 INFO (coreLoadExecutor-1309-thread-1) [ ] o.a.s.c.SolrConfig Using Lucene MatchVersion: 6.1.0
    [junit4] 2> 471607 INFO (coreLoadExecutor-1309-thread-1) [ ] o.a.s.c.SolrConfig Loaded SolrConfig: solrconfig.xml
    [junit4] 2> 471620 INFO (coreLoadExecutor-1309-thread-1) [ ] o.a.s.s.IndexSchema [collection1] Schema name=test
    [junit4] 2> 471678 INFO (coreLoadExecutor-1309-thread-1) [ ] o.a.s.s.OpenExchangeRatesOrgProvider Initialized with rates=open-exchange-rates.json, refreshInterval=1440.
    [junit4] 2> 471683 INFO (coreLoadExecutor-1309-thread-1) [ ] o.a.s.s.IndexSchema default search field in schema is text
    [junit4] 2> 471684 INFO (coreLoadExecutor-1309-thread-1) [ ] o.a.s.s.IndexSchema unique key field: id
    [junit4] 2> 471688 INFO (coreLoadExecutor-1309-thread-1) [ ] o.a.s.s.FileExchangeRateProvider Reloading exchange rates from file currency.xml
    [junit4] 2> 471689 INFO (coreLoadExecutor-1309-thread-1) [ ] o.a.s.s.FileExchangeRateProvider Reloading exchange rates from file currency.xml
    [junit4] 2> 471690 INFO (coreLoadExecutor-1309-thread-1) [ ] o.a.s.s.OpenExchangeRatesOrgProvider Reloading exchange rates from open-exchange-rates.json
    [junit4] 2> 471691 INFO (coreLoadExecutor-1309-thread-1) [ ] o.a.s.s.OpenExchangeRatesOrgProvider Reloading exchange rates from open-exchange-rates.json
    [junit4] 2> 471692 INFO (coreLoadExecutor-1309-thread-1) [ ] o.a.s.c.ConfigSetProperties Did not find ConfigSet properties, assuming default properties: Can't find resource 'configsetprops.json' in classpath or '/configs/conf1', cwd=/home/jenkins/workspace/Lucene-Solr-6.x-Linux/solr/build/solr-core/test/J2
    [junit4] 2> 471692 INFO (coreLoadExecutor-1309-thread-1) [ ] o.a.s.c.CoreContainer Creating SolrCore 'collection1' using configuration from collection collection1
    [junit4] 2> 471692 INFO (coreLoadExecutor-1309-thread-1) [ ] o.a.s.c.SolrCore org.apache.solr.core.MockDirectoryFactory
    [junit4] 2> 471692 INFO (coreLoadExecutor-1309-thread-1) [ ] o.a.s.c.SolrCore [[collection1] ] Opening new SolrCore at [/home/jenkins/workspace/Lucene-Solr-6.x-Linux/solr/build/solr-core/test/J2/temp/solr.cloud.TestCryptoKeys_1104211D32EE6CEA-001/shard-1-001/cores/collection1], dataDir=[/home/jenkins/workspace/Lucene-Solr-6.x-Linux/solr/build/solr-core/test/J2/temp/solr.cloud.TestCryptoKeys_1104211D32EE6CEA-001/shard-1-001/cores/collection1/data/]
    [junit4] 2> 471692 INFO (coreLoadExecutor-1309-thread-1) [ ] o.a.s.c.JmxMonitoredMap JMX monitoring is enabled. Adding Solr mbeans to JMX Server: com.sun.jmx.mbeanserver.JmxMBeanServer@194e622
    [junit4] 2> 471692 INFO (coreLoadExecutor-1309-thread-1) [ ] o.a.s.c.CachingDirectoryFactory return new directory for /home/jenkins/workspace/Lucene-Solr-6.x-Linux/solr/build/solr-core/test/J2/temp/solr.cloud.TestCryptoKeys_1104211D32EE6CEA-001/shard-1-001/cores/collection1/data
    [junit4] 2> 471693 INFO (coreLoadExecutor-1309-thread-1) [ ] o.a.s.c.SolrCore New index directory detected: old=null new=/home/jenkins/workspace/Lucene-Solr-6.x-Linux/solr/build/solr-core/test/J2/temp/solr.cloud.TestCryptoKeys_1104211D32EE6CEA-001/shard-1-001/cores/collection1/data/index/
    [junit4] 2> 471693 WARN (coreLoadExecutor-1309-thread-1) [ ] o.a.s.c.SolrCore [collection1] Solr index directory '/home/jenkins/workspace/Lucene-Solr-6.x-Linux/solr/build/solr-core/test/J2/temp/solr.cloud.TestCryptoKeys_1104211D32EE6CEA-001/shard-1-001/cores/collection1/data/index' doesn't exist. Creating new index...
    [junit4] 2> 471693 INFO (coreLoadExecutor-1309-thread-1) [ ] o.a.s.c.CachingDirectoryFactory return new directory for /home/jenkins/workspace/Lucene-Solr-6.x-Linux/solr/build/solr-core/test/J2/temp/solr.cloud.TestCryptoKeys_1104211D32EE6CEA-001/shard-1-001/cores/collection1/data/index
    [junit4] 2> 471693 INFO (coreLoadExecutor-1309-thread-1) [ ] o.a.s.u.RandomMergePolicy RandomMergePolicy wrapping class org.apache.lucene.index.LogDocMergePolicy: [LogDocMergePolicy: minMergeSize=1000, mergeFactor=10, maxMergeSize=9223372036854775807, maxMergeSizeForForcedMerge=9223372036854775807, calibrateSizeByDeletes=false, maxMergeDocs=2147483647, maxCFSSegmentSizeMB=8.796093022207999E12, noCFSRatio=0.0]
    [junit4] 2> 471694 INFO (coreLoadExecutor-1309-thread-1) [ ] o.a.s.c.SolrDeletionPolicy SolrDeletionPolicy.onCommit: commits: num=1
    [junit4] 2> commit{dir=MockDirectoryWrapper(RAMDirectory@163c90c lockFactory=org.apache.lucene.store.SingleInstanceLockFactory@7ea8cc),segFN=segments_1,generation=1}
    [junit4] 2> 471694 INFO (coreLoadExecutor-1309-thread-1) [ ] o.a.s.c.SolrDeletionPolicy newest commit generation = 1
    [junit4] 2> 471694 INFO (OldIndexDirectoryCleanupThreadForCore-collection1) [ ] o.a.s.c.SolrCore Looking for old index directories to cleanup for core collection1 in /home/jenkins/workspace/Lucene-Solr-6.x-Linux/solr/build/solr-core/test/J2/temp/solr.cloud.TestCryptoKeys_1104211D32EE6CEA-001/shard-1-001/cores/collection1/data/
    [junit4] 2> 471695 WARN (OldIndexDirectoryCleanupThreadForCore-collection1) [ ] o.a.s.c.DirectoryFactory /home/jenkins/workspace/Lucene-Solr-6.x-Linux/solr/build/solr-core/test/J2/temp/solr.cloud.TestCryptoKeys_1104211D32EE6CEA-001/shard-1-001/cores/collection1/data/ does not point to a valid data directory; skipping clean-up of old index directories.
    [junit4] 2> 471698 INFO (coreLoadExecutor-1309-thread-1) [ ] o.a.s.u.p.UpdateRequestProcessorChain creating updateRequestProcessorChain "nodistrib"
    [junit4] 2> 471698 INFO (coreLoadExecutor-1309-thread-1) [ ] o.a.s.u.p.UpdateRequestProcessorChain creating updateRequestProcessorChain "dedupe"
    [junit4] 2> 471698 INFO (coreLoadExecutor-1309-thread-1) [ ] o.a.s.u.p.UpdateRequestProcessorChain inserting DistributedUpdateProcessorFactory into updateRequestProcessorChain "dedupe"
    [junit4] 2> 471698 INFO (coreLoadExecutor-1309-thread-1) [ ] o.a.s.u.p.UpdateRequestProcessorChain creating updateRequestProcessorChain "stored_sig"
    [junit4] 2> 471698 INFO (coreLoadExecutor-1309-thread-1) [ ] o.a.s.u.p.UpdateRequestProcessorChain inserting DistributedUpdateProcessorFactory into updateRequestProcessorChain "stored_sig"
    [junit4] 2> 471698 INFO (coreLoadExecutor-1309-thread-1) [ ] o.a.s.u.p.UpdateRequestProcessorChain creating updateRequestProcessorChain "distrib-dup-test-chain-explicit"
    [junit4] 2> 471698 INFO (coreLoadExecutor-1309-thread-1) [ ] o.a.s.u.p.UpdateRequestProcessorChain creating updateRequestProcessorChain "distrib-dup-test-chain-implicit"
    [junit4] 2> 471699 INFO (coreLoadExecutor-1309-thread-1) [ ] o.a.s.u.p.UpdateRequestProcessorChain inserting DistributedUpdateProcessorFactory into updateRequestProcessorChain "distrib-dup-test-chain-implicit"
    [junit4] 2> 471699 INFO (coreLoadExecutor-1309-thread-1) [ ] o.a.s.c.SolrCore no updateRequestProcessorChain defined as default, creating implicit default
    [junit4] 2> 471699 WARN (coreLoadExecutor-1309-thread-1) [ ] o.a.s.c.RequestHandlers INVALID paramSet a in requestHandler {type = requestHandler,name = /dump,class = DumpRequestHandler,args = {defaults={a=A,b=B}}}
    [junit4] 2> 471701 INFO (coreLoadExecutor-1309-thread-1) [ ] o.a.s.h.l.XMLLoader xsltCacheLifetimeSeconds=60
    [junit4] 2> 471702 INFO (coreLoadExecutor-1309-thread-1) [ ] o.a.s.h.l.XMLLoader xsltCacheLifetimeSeconds=60
    [junit4] 2> 471702 INFO (coreLoadExecutor-1309-thread-1) [ ] o.a.s.h.l.XMLLoader xsltCacheLifetimeSeconds=60
    [junit4] 2> 471703 INFO (coreLoadExecutor-1309-thread-1) [ ] o.a.s.h.l.XMLLoader xsltCacheLifetimeSeconds=60
    [junit4] 2> 471707 INFO (coreLoadExecutor-1309-thread-1) [ ] o.a.s.c.RequestHandlers Registered paths: /admin/mbeans,standard,/update/json/docs,/admin/luke,/export,/get,/admin/properties,/update/json,/admin/threads,/dump,/update/csv,/sql,/graph,/admin/segments,/admin/system,/replication,/config,/stream,/schema,/admin/plugins,/admin/logging,/admin/ping,/update,/admin/file
    [junit4] 2> 471707 INFO (coreLoadExecutor-1309-thread-1) [ ] o.a.s.c.SolrCore Using default statsCache cache: org.apache.solr.search.stats.LocalStatsCache
    [junit4] 2> 471708 INFO (coreLoadExecutor-1309-thread-1) [ ] o.a.s.u.UpdateHandler Using UpdateLog implementation: org.apache.solr.update.UpdateLog
    [junit4] 2> 471708 INFO (coreLoadExecutor-1309-thread-1) [ ] o.a.s.u.UpdateLog Initializing UpdateLog: dataDir= defaultSyncLevel=FLUSH numRecordsToKeep=100 maxNumLogsToKeep=10 numVersionBuckets=65536
    [junit4] 2> 471708 INFO (coreLoadExecutor-1309-thread-1) [ ] o.a.s.u.CommitTracker Hard AutoCommit: disabled
    [junit4] 2> 471708 INFO (coreLoadExecutor-1309-thread-1) [ ] o.a.s.u.CommitTracker Soft AutoCommit: disabled
    [junit4] 2> 471709 INFO (coreLoadExecutor-1309-thread-1) [ ] o.a.s.u.RandomMergePolicy RandomMergePolicy wrapping class org.apache.lucene.index.TieredMergePolicy: [TieredMergePolicy: maxMergeAtOnce=30, maxMergeAtOnceExplicit=31, maxMergedSegmentMB=72.3759765625, floorSegmentMB=2.1787109375, forceMergeDeletesPctAllowed=23.89870661722077, segmentsPerTier=45.0, maxCFSSegmentSizeMB=8.796093022207999E12, noCFSRatio=0.4642506595267081
    [junit4] 2> 471710 INFO (coreLoadExecutor-1309-thread-1) [ ] o.a.s.c.SolrDeletionPolicy SolrDeletionPolicy.onInit: commits: num=1
    [junit4] 2> commit{dir=MockDirectoryWrapper(RAMDirectory@163c90c lockFactory=org.apache.lucene.store.SingleInstanceLockFactory@7ea8cc),segFN=segments_1,generation=1}
    [junit4] 2> 471710 INFO (coreLoadExecutor-1309-thread-1) [ ] o.a.s.c.SolrDeletionPolicy newest commit generation = 1
    [junit4] 2> 471710 INFO (coreLoadExecutor-1309-thread-1) [ ] o.a.s.s.SolrIndexSearcher Opening [Searcher@1b52e48[collection1] main]
    [junit4] 2> 471710 INFO (coreLoadExecutor-1309-thread-1) [ ] o.a.s.c.c.ZkStateReader Load collection config from: [/collections/collection1]
    [junit4] 2> 471710 INFO (coreLoadExecutor-1309-thread-1) [ ] o.a.s.c.c.ZkStateReader path=[/collections/collection1] [configName]=[conf1] specified config exists in ZooKeeper
    [junit4] 2> 471710 INFO (coreLoadExecutor-1309-thread-1) [ ] o.a.s.r.ManagedResourceStorage Setting up ZooKeeper-based storage for the RestManager with znodeBase: /configs/conf1
    [junit4] 2> 471710 INFO (coreLoadExecutor-1309-thread-1) [ ] o.a.s.r.ManagedResourceStorage Configured ZooKeeperStorageIO with znodeBase: /configs/conf1
    [junit4] 2> 471710 INFO (coreLoadExecutor-1309-thread-1) [ ] o.a.s.r.RestManager Initializing RestManager with initArgs: {}
    [junit4] 2> 471711 INFO (coreLoadExecutor-1309-thread-1) [ ] o.a.s.r.ManagedResourceStorage Reading _rest_managed.json using ZooKeeperStorageIO:path=/configs/conf1
    [junit4] 2> 471711 INFO (coreLoadExecutor-1309-thread-1) [ ] o.a.s.r.ManagedResourceStorage No data found for znode /configs/conf1/_rest_managed.json
    [junit4] 2> 471711 INFO (coreLoadExecutor-1309-thread-1) [ ] o.a.s.r.ManagedResourceStorage Loaded null at path _rest_managed.json using ZooKeeperStorageIO:path=/configs/conf1
    [junit4] 2> 471711 INFO (coreLoadExecutor-1309-thread-1) [ ] o.a.s.r.RestManager Initializing 0 registered ManagedResources
    [junit4] 2> 471711 INFO (coreLoadExecutor-1309-thread-1) [ ] o.a.s.h.ReplicationHandler Commits will be reserved for 10000
    [junit4] 2> 471712 INFO (searcherExecutor-1310-thread-1) [ ] o.a.s.c.SolrCore [collection1] Registered new searcher Searcher@1b52e48[collection1] main{ExitableDirectoryReader(UninvertingDirectoryReader())}
    [junit4] 2> 471712 INFO (coreLoadExecutor-1309-thread-1) [ ] o.a.s.u.UpdateLog Looking up max value of version field to seed version buckets
    [junit4] 2> 471712 INFO (coreLoadExecutor-1309-thread-1) [ ] o.a.s.u.VersionInfo Refreshing highest value of _version_ for 65536 version buckets from index
    [junit4] 2> 471712 INFO (coreLoadExecutor-1309-thread-1) [ ] o.a.s.u.VersionInfo No terms found for _version_, cannot seed version bucket highest value from index
    [junit4] 2> 471712 INFO (coreLoadExecutor-1309-thread-1) [ ] o.a.s.u.UpdateLog Could not find max version in index or recent updates, using new clock 1534360547645980672
    [junit4] 2> 471714 INFO (coreLoadExecutor-1309-thread-1) [ ] o.a.s.u.UpdateLog Took 1.0ms to seed version buckets with highest version 1534360547645980672
    [junit4] 2> 471714 INFO (coreLoadExecutor-1309-thread-1) [ ] o.a.s.c.ZkController watch zkdir /configs/conf1
    [junit4] 2> 471715 INFO (coreLoadExecutor-1309-thread-1) [ ] o.a.s.c.CoreContainer registering core: collection1
    [junit4] 2> 471715 INFO (coreZkRegister-1304-thread-1) [ ] o.a.s.c.ZkController Register replica - core:collection1 address:http://127.0.0.1:34501/_ collection:collection1 shard:shard1
    [junit4] 2> 471716 INFO (coreZkRegister-1304-thread-1) [ ] o.a.s.c.c.SolrZkClient makePath: /collections/collection1/leader_elect/shard1/election
    [junit4] 2> 471720 INFO (coreZkRegister-1304-thread-1) [ ] o.a.s.c.LeaderElector Joined leadership election with path: /collections/collection1/leader_elect/shard1/election/95897533968089097-core_node1-n_0000000000
    [junit4] 2> 471720 INFO (coreZkRegister-1304-thread-1) [ ] o.a.s.c.ShardLeaderElectionContext Running the leader process for shard=shard1 and weAreReplacement=false and leaderVoteWait=10000
    [junit4] 2> 471722 INFO (OverseerStateUpdate-95897533968089092-127.0.0.1:44989__-n_0000000000) [ ] o.a.s.c.Overseer processMessage: queueSize: 1, message = {
    [junit4] 2> "operation":"leader",
    [junit4] 2> "shard":"shard1",
    [junit4] 2> "collection":"collection1"} current state version: 5
    [junit4] 2> 471722 INFO (coreZkRegister-1304-thread-1) [ ] o.a.s.c.ShardLeaderElectionContext Enough replicas found to continue.
    [junit4] 2> 471722 INFO (coreZkRegister-1304-thread-1) [ ] o.a.s.c.ShardLeaderElectionContext I may be the new leader - try and sync
    [junit4] 2> 471722 INFO (coreZkRegister-1304-thread-1) [ ] o.a.s.c.SyncStrategy Sync replicas to http://127.0.0.1:34501/_/collection1/
    [junit4] 2> 471723 INFO (coreZkRegister-1304-thread-1) [ ] o.a.s.c.SyncStrategy Sync Success - now sync replicas to me
    [junit4] 2> 471723 INFO (coreZkRegister-1304-thread-1) [ ] o.a.s.c.SyncStrategy http://127.0.0.1:34501/_/collection1/ has no replicas
    [junit4] 2> 471723 INFO (coreZkRegister-1304-thread-1) [ ] o.a.s.c.c.SolrZkClient makePath: /collections/collection1/leaders/shard1
    [junit4] 2> 471725 INFO (coreZkRegister-1304-thread-1) [ ] o.a.s.c.ShardLeaderElectionContextBase Creating leader regist

[...truncated too long message...]

core/test/J2/temp/solr.cloud.TestCryptoKeys_1104211D32EE6CEA-001/shard-4-001/cores/collection1/data [CachedDir<<refCount=0;path=/home/jenkins/workspace/Lucene-Solr-6.x-Linux/solr/build/solr-core/test/J2/../../../../../../../../../home/jenkins/workspace/Lucene-Solr-6.x-Linux/solr/build/solr-core/test/J2/temp/solr.cloud.TestCryptoKeys_1104211D32EE6CEA-001/shard-4-001/cores/collection1/data;done=false>>]
    [junit4] 2> 517627 INFO (zkCallback-570-thread-2) [ ] o.a.s.c.CachingDirectoryFactory Closing directory, CoreContainer#isShutdown=true
    [junit4] 2> 517628 INFO (zkCallback-570-thread-2) [ ] o.a.s.c.CachingDirectoryFactory Closing directory: /home/jenkins/workspace/Lucene-Solr-6.x-Linux/solr/build/solr-core/test/J2/../../../../../../../../../home/jenkins/workspace/Lucene-Solr-6.x-Linux/solr/build/solr-core/test/J2/temp/solr.cloud.TestCryptoKeys_1104211D32EE6CEA-001/shard-4-001/cores/collection1/data
    [junit4] 2> 517628 INFO (zkCallback-570-thread-2) [ ] o.a.s.c.ElectionContext Canceling election /collections/collection1/leader_elect/shard1/election/95897533968089106-core_node4-n_0000000003
    [junit4] 2> 517628 WARN (zkCallback-570-thread-2) [ ] o.a.s.c.LeaderElector
    [junit4] 2> org.apache.zookeeper.KeeperException$SessionExpiredException: KeeperErrorCode = Session expired for /collections/collection1/leader_elect/shard1/election/95897533968089106-core_node4-n_0000000003
    [junit4] 2> at org.apache.zookeeper.KeeperException.create(KeeperException.java:127)
    [junit4] 2> at org.apache.zookeeper.KeeperException.create(KeeperException.java:51)
    [junit4] 2> at org.apache.zookeeper.ZooKeeper.delete(ZooKeeper.java:873)
    [junit4] 2> at org.apache.solr.common.cloud.SolrZkClient$2.execute(SolrZkClient.java:244)
    [junit4] 2> at org.apache.solr.common.cloud.SolrZkClient$2.execute(SolrZkClient.java:241)
    [junit4] 2> at org.apache.solr.common.cloud.ZkCmdExecutor.retryOperation(ZkCmdExecutor.java:60)
    [junit4] 2> at org.apache.solr.common.cloud.SolrZkClient.delete(SolrZkClient.java:241)
    [junit4] 2> at org.apache.solr.cloud.ElectionContext.cancelElection(ElectionContext.java:86)
    [junit4] 2> at org.apache.solr.cloud.ShardLeaderElectionContextBase.cancelElection(ElectionContext.java:143)
    [junit4] 2> at org.apache.solr.cloud.ShardLeaderElectionContext.cancelElection(ElectionContext.java:279)
    [junit4] 2> at org.apache.solr.cloud.ShardLeaderElectionContext.runLeaderProcess(ElectionContext.java:455)
    [junit4] 2> at org.apache.solr.cloud.LeaderElector.runIamLeaderProcess(LeaderElector.java:170)
    [junit4] 2> at org.apache.solr.cloud.LeaderElector.checkIfIamLeader(LeaderElector.java:135)
    [junit4] 2> at org.apache.solr.cloud.LeaderElector.access$200(LeaderElector.java:56)
    [junit4] 2> at org.apache.solr.cloud.LeaderElector$ElectionWatcher.process(LeaderElector.java:348)
    [junit4] 2> at org.apache.solr.common.cloud.SolrZkClient$3.lambda$process$0(SolrZkClient.java:266)
    [junit4] 2> at java.util.concurrent.Executors$RunnableAdapter.call(java.base@9-ea/Executors.java:514)
    [junit4] 2> at java.util.concurrent.FutureTask.run(java.base@9-ea/FutureTask.java:266)
    [junit4] 2> at org.apache.solr.common.util.ExecutorUtil$MDCAwareThreadPoolExecutor.lambda$execute$0(ExecutorUtil.java:229)
    [junit4] 2> at java.util.concurrent.ThreadPoolExecutor.runWorker(java.base@9-ea/ThreadPoolExecutor.java:1158)
    [junit4] 2> at java.util.concurrent.ThreadPoolExecutor$Worker.run(java.base@9-ea/ThreadPoolExecutor.java:632)
    [junit4] 2> at java.lang.Thread.run(java.base@9-ea/Thread.java:804)
    [junit4] 2> 517629 INFO (TEST-TestCryptoKeys.test-seed#[1104211D32EE6CEA]) [ ] o.e.j.s.ServerConnector Stopped ServerConnector@1b3d071{HTTP/1.1,[http/1.1]}{127.0.0.1:0}
    [junit4] 2> 517629 INFO (TEST-TestCryptoKeys.test-seed#[1104211D32EE6CEA]) [ ] o.e.j.s.h.ContextHandler Stopped o.e.j.s.ServletContextHandler@1991332{/_,null,UNAVAILABLE}
    [junit4] 2> 517630 INFO (TEST-TestCryptoKeys.test-seed#[1104211D32EE6CEA]) [ ] o.a.s.c.ZkTestServer connecting to 127.0.0.1:33646 33646
    [junit4] 2> 527763 INFO (Thread-1023) [ ] o.a.s.c.ZkTestServer connecting to 127.0.0.1:33646 33646
    [junit4] 2> 527764 WARN (Thread-1023) [ ] o.a.s.c.ZkTestServer Watch limit violations:
    [junit4] 2> Maximum concurrent create/delete watches above limit:
    [junit4] 2>
    [junit4] 2> 7 /solr/aliases.json
    [junit4] 2> 7 /solr/clusterprops.json
    [junit4] 2> 5 /solr/security.json
    [junit4] 2> 5 /solr/configs/conf1
    [junit4] 2>
    [junit4] 2> Maximum concurrent data watches above limit:
    [junit4] 2>
    [junit4] 2> 7 /solr/clusterstate.json
    [junit4] 2> 4 /solr/collections/collection1/state.json
    [junit4] 2> 2 /solr/collections/.system/state.json
    [junit4] 2>
    [junit4] 2> Maximum concurrent children watches above limit:
    [junit4] 2>
    [junit4] 2> 7 /solr/live_nodes
    [junit4] 2> 7 /solr/collections
    [junit4] 2> 5 /solr/overseer/collection-queue-work
    [junit4] 2> 4 /solr/overseer/queue
    [junit4] 2> 3 /solr/overseer/queue-work
    [junit4] 2>
    [junit4] 2> NOTE: reproduce with: ant test -Dtestcase=TestCryptoKeys -Dtests.method=test -Dtests.seed=1104211D32EE6CEA -Dtests.multiplier=3 -Dtests.slow=true -Dtests.locale=en-VI -Dtests.timezone=America/Argentina/ComodRivadavia -Dtests.asserts=true -Dtests.file.encoding=ISO-8859-1
    [junit4] FAILURE 60.0s J2 | TestCryptoKeys.test <<<
    [junit4] > Throwable #1: java.lang.AssertionError: Could not find collection:.system
    [junit4] > at __randomizedtesting.SeedInfo.seed([1104211D32EE6CEA:99501EC79C120112]:0)
    [junit4] > at org.apache.solr.cloud.AbstractDistribZkTestBase.waitForRecoveriesToFinish(AbstractDistribZkTestBase.java:154)
    [junit4] > at org.apache.solr.cloud.AbstractDistribZkTestBase.waitForRecoveriesToFinish(AbstractDistribZkTestBase.java:139)
    [junit4] > at org.apache.solr.cloud.AbstractDistribZkTestBase.waitForRecoveriesToFinish(AbstractDistribZkTestBase.java:134)
    [junit4] > at org.apache.solr.cloud.AbstractFullDistribZkTestBase.waitForRecoveriesToFinish(AbstractFullDistribZkTestBase.java:852)
    [junit4] > at org.apache.solr.cloud.TestCryptoKeys.test(TestCryptoKeys.java:118)
    [junit4] > at jdk.internal.reflect.NativeMethodAccessorImpl.invoke0(java.base@9-ea/Native Method)
    [junit4] > at jdk.internal.reflect.NativeMethodAccessorImpl.invoke(java.base@9-ea/NativeMethodAccessorImpl.java:62)
    [junit4] > at jdk.internal.reflect.DelegatingMethodAccessorImpl.invoke(java.base@9-ea/DelegatingMethodAccessorImpl.java:43)
    [junit4] > at org.apache.solr.BaseDistributedSearchTestCase$ShardsRepeatRule$ShardsFixedStatement.callStatement(BaseDistributedSearchTestCase.java:992)
    [junit4] > at org.apache.solr.BaseDistributedSearchTestCase$ShardsRepeatRule$ShardsStatement.evaluate(BaseDistributedSearchTestCase.java:967)
    [junit4] > at java.lang.Thread.run(java.base@9-ea/Thread.java:804)
    [junit4] 2> 527767 INFO (SUITE-TestCryptoKeys-seed#[1104211D32EE6CEA]-worker) [ ] o.a.s.SolrTestCaseJ4 ###deleteCore
    [junit4] 2> NOTE: leaving temporary files on disk at: /home/jenkins/workspace/Lucene-Solr-6.x-Linux/solr/build/solr-core/test/J2/temp/solr.cloud.TestCryptoKeys_1104211D32EE6CEA-001
    [junit4] 2> NOTE: test params are: codec=Asserting(Lucene60): {}, docValues:{}, maxPointsInLeafNode=164, maxMBSortInHeap=7.639528029364109, sim=ClassicSimilarity, locale=en-VI, timezone=America/Argentina/ComodRivadavia
    [junit4] 2> NOTE: Linux 4.4.0-21-generic i386/Oracle Corporation 9-ea (32-bit)/cpus=12,threads=1,free=45021336,total=312213504
    [junit4] 2> NOTE: All tests run in this JVM: [AnalyticsMergeStrategyTest, TestJmxIntegration, DistributedQueryComponentCustomSortTest, TestSolrJ, BigEndianAscendingWordDeserializerTest, ChangedSchemaMergeTest, TestSizeLimitedDistributedMap, UpdateParamsTest, DirectUpdateHandlerTest, DeleteInactiveReplicaTest, TestBlendedInfixSuggestions, TestBulkSchemaAPI, HdfsBasicDistributedZkTest, TestFilteredDocIdSet, TestBlobHandler, ConnectionManagerTest, CollectionStateFormat2Test, TestSweetSpotSimilarityFactory, RollingRestartTest, TestMinMaxOnMultiValuedField, TestConfigOverlay, QueryParsingTest, TestXIncludeConfig, ExplicitHLLTest, MigrateRouteKeyTest, BasicDistributedZk2Test, DistribDocExpirationUpdateProcessorTest, BlockJoinFacetSimpleTest, ExitableDirectoryReaderTest, TestMiniSolrCloudClusterSSL, HdfsRecoveryZkTest, TestInitQParser, DateMathParserTest, HardAutoCommitTest, TestCryptoKeys]
    [junit4] Completed [108/598 (1!)] on J2 in 60.04s, 1 test, 1 failure <<< FAILURES!

[...truncated 1583 lines...]
BUILD FAILED
/home/jenkins/workspace/Lucene-Solr-6.x-Linux/build.xml:740: The following error occurred while executing this line:
/home/jenkins/workspace/Lucene-Solr-6.x-Linux/build.xml:684: The following error occurred while executing this line:
/home/jenkins/workspace/Lucene-Solr-6.x-Linux/build.xml:59: The following error occurred while executing this line:
/home/jenkins/workspace/Lucene-Solr-6.x-Linux/solr/build.xml:233: The following error occurred while executing this line:
/home/jenkins/workspace/Lucene-Solr-6.x-Linux/solr/common-build.xml:529: The following error occurred while executing this line:
/home/jenkins/workspace/Lucene-Solr-6.x-Linux/lucene/common-build.xml:1457: The following error occurred while executing this line:
/home/jenkins/workspace/Lucene-Solr-6.x-Linux/lucene/common-build.xml:1014: There were test failures: 598 suites (10 ignored), 2420 tests, 1 failure, 117 ignored (71 assumptions) [seed: 1104211D32EE6CEA]

Total time: 66 minutes 35 seconds
Build step 'Invoke Ant' marked build as failure
Archiving artifacts
[WARNINGS] Skipping publisher since build result is FAILURE
Recording test results
Email was triggered for: Failure - Any
Sending email for trigger: Failure - Any

Search Discussions

Related Discussions

Discussion Navigation
viewthread | post
Discussion Overview
groupdev @
categorieslucene
postedMay 15, '16 at 3:32a
activeMay 15, '16 at 3:32a
posts1
users1
websitelucene.apache.org

1 user in discussion

Policeman Jenkins Server: 1 post

People

Translate

site design / logo © 2018 Grokbase