FAQ
Build: https://builds.apache.org/job/Lucene-Artifacts-5.x/655/

No tests ran.

Build Log:
[...truncated 599 lines...]
     [javac] Compiling 392 source files to /usr/home/jenkins/jenkins-slave/workspace/Lucene-Artifacts-5.x/lucene/build/analysis/common/classes/java
     [javac] /usr/home/jenkins/jenkins-slave/workspace/Lucene-Artifacts-5.x/lucene/analysis/common/src/java/org/apache/lucene/analysis/standard/std40/StandardTokenizer40.java:24: error: cannot find symbol
     [javac] import org.apache.lucene.analysis.standard.StandardTokenizerInterface;
     [javac] ^
     [javac] symbol: class StandardTokenizerInterface
     [javac] location: package org.apache.lucene.analysis.standard
     [javac] /usr/home/jenkins/jenkins-slave/workspace/Lucene-Artifacts-5.x/lucene/analysis/common/src/java/org/apache/lucene/analysis/standard/std40/StandardTokenizer40.java:38: error: cannot find symbol
     [javac] private StandardTokenizerInterface scanner;
     [javac] ^
     [javac] symbol: class StandardTokenizerInterface
     [javac] location: class StandardTokenizer40
     [javac] /usr/home/jenkins/jenkins-slave/workspace/Lucene-Artifacts-5.x/lucene/analysis/common/src/java/org/apache/lucene/analysis/standard/std40/StandardTokenizerImpl40.java:22: error: cannot find symbol
     [javac] import org.apache.lucene.analysis.standard.StandardTokenizerInterface;
     [javac] ^
     [javac] symbol: class StandardTokenizerInterface
     [javac] location: package org.apache.lucene.analysis.standard
     [javac] /usr/home/jenkins/jenkins-slave/workspace/Lucene-Artifacts-5.x/lucene/analysis/common/src/java/org/apache/lucene/analysis/standard/std40/StandardTokenizerImpl40.java:32: error: cannot find symbol
     [javac] public final class StandardTokenizerImpl40 implements StandardTokenizerInterface {
     [javac] ^
     [javac] symbol: class StandardTokenizerInterface
     [javac] /usr/home/jenkins/jenkins-slave/workspace/Lucene-Artifacts-5.x/lucene/analysis/common/src/java/org/apache/lucene/analysis/standard/std40/UAX29URLEmailTokenizerImpl40.java:22: error: cannot find symbol
     [javac] import org.apache.lucene.analysis.standard.StandardTokenizerInterface;
     [javac] ^
     [javac] symbol: class StandardTokenizerInterface
     [javac] location: package org.apache.lucene.analysis.standard
     [javac] /usr/home/jenkins/jenkins-slave/workspace/Lucene-Artifacts-5.x/lucene/analysis/common/src/java/org/apache/lucene/analysis/standard/std40/UAX29URLEmailTokenizerImpl40.java:32: error: cannot find symbol
     [javac] public final class UAX29URLEmailTokenizerImpl40 implements StandardTokenizerInterface {
     [javac] ^
     [javac] symbol: class StandardTokenizerInterface
     [javac] /usr/home/jenkins/jenkins-slave/workspace/Lucene-Artifacts-5.x/lucene/analysis/common/src/java/org/apache/lucene/analysis/hunspell/Stemmer.java:270: warning: [rawtypes] found raw type: Arc
     [javac] final FST.Arc<IntsRef> prefixArcs[] = new FST.Arc[3];
     [javac] ^
     [javac] missing type arguments for generic class Arc<T>
     [javac] where T is a type-variable:
     [javac] T extends Object declared in class Arc
     [javac] /usr/home/jenkins/jenkins-slave/workspace/Lucene-Artifacts-5.x/lucene/analysis/common/src/java/org/apache/lucene/analysis/hunspell/Stemmer.java:274: warning: [rawtypes] found raw type: Arc
     [javac] final FST.Arc<IntsRef> suffixArcs[] = new FST.Arc[3];
     [javac] ^
     [javac] missing type arguments for generic class Arc<T>
     [javac] where T is a type-variable:
     [javac] T extends Object declared in class Arc
     [javac] /usr/home/jenkins/jenkins-slave/workspace/Lucene-Artifacts-5.x/lucene/analysis/common/src/java/org/tartarus/snowball/Among.java:46: warning: [rawtypes] found raw type: Class
     [javac] private static final Class<?>[] EMPTY_PARAMS = new Class[0];
     [javac] ^
     [javac] missing type arguments for generic class Class<T>
     [javac] where T is a type-variable:
     [javac] T extends Object declared in class Class
     [javac] /usr/home/jenkins/jenkins-slave/workspace/Lucene-Artifacts-5.x/lucene/analysis/common/src/java/org/apache/lucene/analysis/standard/std40/StandardTokenizer40.java:143: error: cannot find symbol
     [javac] if (tokenType == StandardTokenizerInterface.YYEOF) {
     [javac] ^
     [javac] symbol: variable StandardTokenizerInterface
     [javac] location: class StandardTokenizer40
     [javac] /usr/home/jenkins/jenkins-slave/workspace/Lucene-Artifacts-5.x/lucene/analysis/common/src/java/org/apache/lucene/analysis/standard/std40/StandardTokenizerImpl40.java:35: warning: [dep-ann] deprecated item is not annotated with @Deprecated
     [javac] public static final int YYEOF = -1;
     [javac] ^
     [javac] /usr/home/jenkins/jenkins-slave/workspace/Lucene-Artifacts-5.x/lucene/analysis/common/src/java/org/apache/lucene/analysis/standard/std40/StandardTokenizerImpl40.java:1190: error: cannot find symbol
     [javac] return StandardTokenizerInterface.YYEOF;
     [javac] ^
     [javac] symbol: variable StandardTokenizerInterface
     [javac] location: class StandardTokenizerImpl40
     [javac] /usr/home/jenkins/jenkins-slave/workspace/Lucene-Artifacts-5.x/lucene/analysis/common/src/java/org/apache/lucene/analysis/standard/std40/UAX29URLEmailTokenizerImpl40.java:35: warning: [dep-ann] deprecated item is not annotated with @Deprecated
     [javac] public static final int YYEOF = -1;
     [javac] ^
     [javac] /usr/home/jenkins/jenkins-slave/workspace/Lucene-Artifacts-5.x/lucene/analysis/common/src/java/org/apache/lucene/analysis/standard/std40/UAX29URLEmailTokenizerImpl40.java:4391: error: cannot find symbol
     [javac] return StandardTokenizerInterface.YYEOF;
     [javac] ^
     [javac] symbol: variable StandardTokenizerInterface
     [javac] location: class UAX29URLEmailTokenizerImpl40
     [javac] Note: Some input files use or override a deprecated API.
     [javac] Note: Recompile with -Xlint:deprecation for details.
     [javac] 9 errors

[...truncated 1 lines...]
BUILD FAILED
/usr/home/jenkins/jenkins-slave/workspace/Lucene-Artifacts-5.x/lucene/build.xml:447: The following error occurred while executing this line:
/usr/home/jenkins/jenkins-slave/workspace/Lucene-Artifacts-5.x/lucene/common-build.xml:2142: The following error occurred while executing this line:
/usr/home/jenkins/jenkins-slave/workspace/Lucene-Artifacts-5.x/lucene/analysis/build.xml:100: The following error occurred while executing this line:
/usr/home/jenkins/jenkins-slave/workspace/Lucene-Artifacts-5.x/lucene/analysis/build.xml:38: The following error occurred while executing this line:
/usr/home/jenkins/jenkins-slave/workspace/Lucene-Artifacts-5.x/lucene/module-build.xml:55: The following error occurred while executing this line:
/usr/home/jenkins/jenkins-slave/workspace/Lucene-Artifacts-5.x/lucene/common-build.xml:506: The following error occurred while executing this line:
/usr/home/jenkins/jenkins-slave/workspace/Lucene-Artifacts-5.x/lucene/common-build.xml:1867: Compile failed; see the compiler error output for details.

Total time: 27 seconds
Build step 'Invoke Ant' marked build as failure
Archiving artifacts
Publishing Javadoc
Email was triggered for: Failure
Sending email for trigger: Failure

Search Discussions

Related Discussions

Discussion Navigation
viewthread | post
Discussion Overview
groupdev @
categorieslucene
postedOct 9, '14 at 7:22a
activeOct 9, '14 at 7:22a
posts1
users1
websitelucene.apache.org

1 user in discussion

Apache Jenkins Server: 1 post

People

Translate

site design / logo © 2018 Grokbase