FAQ
See <https://hudson.apache.org/hudson/job/Solr-3.x/119/changes>

Changes:

[koji] SOLR-2111: improve facet exception handling, change exception return type (merge 995253)

------------------------------------------
[...truncated 4964 lines...]
AU lucene/backwards/src/test/org/apache/lucene/search/TestTimeLimitingCollector.java
AU lucene/backwards/src/test/org/apache/lucene/search/TestCachingWrapperFilter.java
AU lucene/backwards/src/test/org/apache/lucene/search/TestPrefixFilter.java
AU lucene/backwards/src/test/org/apache/lucene/search/TestBooleanQuery.java
AU lucene/backwards/src/test/org/apache/lucene/search/TestPhraseQuery.java
AU lucene/backwards/src/test/org/apache/lucene/search/TestPositionIncrement.java
AU lucene/backwards/src/test/org/apache/lucene/search/TestTermRangeQuery.java
AU lucene/backwards/src/test/org/apache/lucene/search/TestBooleanMinShouldMatch.java
AU lucene/backwards/src/test/org/apache/lucene/search/TestSloppyPhraseQuery.java
AU lucene/backwards/src/test/org/apache/lucene/search/TestBooleanOr.java
AU lucene/backwards/src/test/org/apache/lucene/search/TestDateSort.java
AU lucene/backwards/src/test/org/apache/lucene/search/TestSort.java
AU lucene/backwards/src/test/org/apache/lucene/search/TestMultiTermConstantScore.java
A lucene/backwards/src/test/org/apache/lucene/search/payloads
AU lucene/backwards/src/test/org/apache/lucene/search/payloads/TestPayloadNearQuery.java
AU lucene/backwards/src/test/org/apache/lucene/search/payloads/TestPayloadTermQuery.java
AU lucene/backwards/src/test/org/apache/lucene/search/payloads/PayloadHelper.java
AU lucene/backwards/src/test/org/apache/lucene/search/TestBooleanScorer.java
AU lucene/backwards/src/test/org/apache/lucene/search/TestDocIdSet.java
A lucene/backwards/src/test/org/apache/lucene/search/spans
AU lucene/backwards/src/test/org/apache/lucene/search/spans/TestNearSpansOrdered.java
AU lucene/backwards/src/test/org/apache/lucene/search/spans/TestBasics.java
AU lucene/backwards/src/test/org/apache/lucene/search/spans/TestSpans.java
AU lucene/backwards/src/test/org/apache/lucene/search/spans/TestFieldMaskingSpanQuery.java
AU lucene/backwards/src/test/org/apache/lucene/search/spans/TestSpanExplanations.java
AU lucene/backwards/src/test/org/apache/lucene/search/spans/JustCompileSearchSpans.java
AU lucene/backwards/src/test/org/apache/lucene/search/spans/TestSpansAdvanced.java
AU lucene/backwards/src/test/org/apache/lucene/search/spans/TestSpanExplanationsOfNonMatches.java
AU lucene/backwards/src/test/org/apache/lucene/search/spans/TestSpansAdvanced2.java
AU lucene/backwards/src/test/org/apache/lucene/search/spans/TestPayloadSpans.java
AU lucene/backwards/src/test/org/apache/lucene/search/CheckHits.java
AU lucene/backwards/src/test/org/apache/lucene/search/TestMultiSearcher.java
A lucene/backwards/src/test/org/apache/lucene/search/TestQueryWrapperFilter.java
AU lucene/backwards/src/test/org/apache/lucene/search/TestTermVectors.java
AU lucene/backwards/src/test/org/apache/lucene/search/TestScoreCachingWrappingScorer.java
AU lucene/backwards/src/test/org/apache/lucene/search/TestSimpleExplanations.java
AU lucene/backwards/src/test/org/apache/lucene/search/TestQueryTermVector.java
AU lucene/backwards/src/test/org/apache/lucene/search/TestMultiValuedNumericRangeQuery.java
AU lucene/backwards/src/test/org/apache/lucene/search/TestTopDocsCollector.java
AU lucene/backwards/src/test/org/apache/lucene/search/TestSimpleExplanationsOfNonMatches.java
AU lucene/backwards/src/test/org/apache/lucene/search/TestParallelMultiSearcher.java
AU lucene/backwards/src/test/org/apache/lucene/search/TestTermScorer.java
AU lucene/backwards/src/test/org/apache/lucene/search/TestPhrasePrefixQuery.java
AU lucene/backwards/src/test/org/apache/lucene/search/TestSetNorm.java
AU lucene/backwards/src/test/org/apache/lucene/search/TestWildcard.java
AU lucene/backwards/src/test/org/apache/lucene/search/BaseTestRangeFilter.java
AU lucene/backwards/src/test/org/apache/lucene/search/TestBoolean2.java
A lucene/backwards/src/test/org/apache/lucene/search/function
AU lucene/backwards/src/test/org/apache/lucene/search/function/TestOrdValues.java
AU lucene/backwards/src/test/org/apache/lucene/search/function/TestDocValues.java
AU lucene/backwards/src/test/org/apache/lucene/search/function/TestFieldScoreQuery.java
AU lucene/backwards/src/test/org/apache/lucene/search/function/FunctionTestSetup.java
AU lucene/backwards/src/test/org/apache/lucene/search/function/JustCompileSearchSpans.java
AU lucene/backwards/src/test/org/apache/lucene/search/function/TestCustomScoreQuery.java
AU lucene/backwards/src/test/org/apache/lucene/search/TestExplanations.java
AU lucene/backwards/src/test/org/apache/lucene/search/TestThreadSafe.java
AU lucene/backwards/src/test/org/apache/lucene/search/TestFieldCache.java
AU lucene/backwards/src/test/org/apache/lucene/search/TestScorerPerf.java
AU lucene/backwards/src/test/org/apache/lucene/search/TestFuzzyQuery.java
AU lucene/backwards/src/test/org/apache/lucene/search/SingleDocTestFilter.java
AU lucene/backwards/src/test/org/apache/lucene/search/TestMultiThreadTermVectors.java
AU lucene/backwards/src/test/org/apache/lucene/search/TestDateFilter.java
AU lucene/backwards/src/test/org/apache/lucene/search/TestMatchAllDocsQuery.java
AU lucene/backwards/src/test/org/apache/lucene/search/TestFilteredSearch.java
AU lucene/backwards/src/test/org/apache/lucene/search/JustCompileSearch.java
AU lucene/backwards/src/test/org/apache/lucene/search/TestDisjunctionMaxQuery.java
AU lucene/backwards/src/test/org/apache/lucene/search/TestSimilarity.java
AU lucene/backwards/src/test/org/apache/lucene/search/TestFieldCacheRangeFilter.java
AU lucene/backwards/src/test/org/apache/lucene/search/TestTopScoreDocCollector.java
AU lucene/backwards/src/test/org/apache/lucene/search/TestComplexExplanations.java
AU lucene/backwards/src/test/org/apache/lucene/search/TestSpanQueryFilter.java
AU lucene/backwards/src/test/org/apache/lucene/search/MockFilter.java
AU lucene/backwards/src/test/org/apache/lucene/search/TestCustomSearcherSort.java
AU lucene/backwards/src/test/org/apache/lucene/search/TestComplexExplanationsOfNonMatches.java
AU lucene/backwards/src/test/org/apache/lucene/search/TestNumericRangeQuery32.java
AU lucene/backwards/src/test/org/apache/lucene/search/TestPrefixInBooleanQuery.java
AU lucene/backwards/src/test/org/apache/lucene/search/TestDocBoost.java
AU lucene/backwards/src/test/org/apache/lucene/search/TestElevationComparator.java
AU lucene/backwards/src/test/org/apache/lucene/search/TestNumericRangeQuery64.java
AU lucene/backwards/src/test/org/apache/lucene/search/TestMultiSearcherRanking.java
AU lucene/backwards/src/test/org/apache/lucene/search/TestBooleanPrefixQuery.java
AU lucene/backwards/src/test/org/apache/lucene/search/TestPrefixQuery.java
AU lucene/backwards/src/test/org/apache/lucene/search/TestMultiPhraseQuery.java
AU lucene/backwards/src/test/org/apache/lucene/search/TestFilteredQuery.java
AU lucene/backwards/src/test/org/apache/lucene/search/QueryUtils.java
AU lucene/backwards/src/test/org/apache/lucene/search/TestFieldCacheTermsFilter.java
AU lucene/backwards/src/test/org/apache/lucene/search/TestTermRangeFilter.java
AU lucene/backwards/src/test/org/apache/lucene/search/TestPositiveScoresOnlyCollector.java
A lucene/backwards/src/test/org/apache/lucene/index
AU lucene/backwards/src/test/org/apache/lucene/index/TestDoc.java
AU lucene/backwards/src/test/org/apache/lucene/index/TestParallelTermEnum.java
AU lucene/backwards/src/test/org/apache/lucene/index/TestIndexReaderClone.java
AU lucene/backwards/src/test/org/apache/lucene/index/TestSegmentTermEnum.java
AU lucene/backwards/src/test/org/apache/lucene/index/index.21.nocfs.zip
AU lucene/backwards/src/test/org/apache/lucene/index/index.23.nocfs.zip
AU lucene/backwards/src/test/org/apache/lucene/index/TestIndexInput.java
AU lucene/backwards/src/test/org/apache/lucene/index/index.29.nocfs.zip
AU lucene/backwards/src/test/org/apache/lucene/index/TestIndexReader.java
AU lucene/backwards/src/test/org/apache/lucene/index/TestStressIndexing2.java
AU lucene/backwards/src/test/org/apache/lucene/index/TestWordlistLoader.java
AU lucene/backwards/src/test/org/apache/lucene/index/TestTermVectorsReader.java
AU lucene/backwards/src/test/org/apache/lucene/index/MockIndexInput.java
AU lucene/backwards/src/test/org/apache/lucene/index/TestSegmentTermDocs.java
AU lucene/backwards/src/test/org/apache/lucene/index/TestIndexWriter.java
AU lucene/backwards/src/test/org/apache/lucene/index/TestCheckIndex.java
AU lucene/backwards/src/test/org/apache/lucene/index/TestMultiLevelSkipList.java
AU lucene/backwards/src/test/org/apache/lucene/index/TestIndexWriterExceptions.java
AU lucene/backwards/src/test/org/apache/lucene/index/TestTransactions.java
AU lucene/backwards/src/test/org/apache/lucene/index/TestDocumentWriter.java
AU lucene/backwards/src/test/org/apache/lucene/index/TestIndexFileDeleter.java
AU lucene/backwards/src/test/org/apache/lucene/index/TestIndexWriterLockRelease.java
AU lucene/backwards/src/test/org/apache/lucene/index/TestAddIndexesNoOptimize.java
AU lucene/backwards/src/test/org/apache/lucene/index/index.19.nocfs.zip
AU lucene/backwards/src/test/org/apache/lucene/index/index.19.cfs.zip
AU lucene/backwards/src/test/org/apache/lucene/index/TestIndexReaderCloneNorms.java
AU lucene/backwards/src/test/org/apache/lucene/index/TestCrash.java
AU lucene/backwards/src/test/org/apache/lucene/index/TestThreadedOptimize.java
AU lucene/backwards/src/test/org/apache/lucene/index/TestConcurrentMergeScheduler.java
AU lucene/backwards/src/test/org/apache/lucene/index/TestOmitTf.java
AU lucene/backwards/src/test/org/apache/lucene/index/DocHelper.java
AU lucene/backwards/src/test/org/apache/lucene/index/TestMultiReader.java
AU lucene/backwards/src/test/org/apache/lucene/index/TestAtomicUpdate.java
AU lucene/backwards/src/test/org/apache/lucene/index/index.20.nocfs.zip
AU lucene/backwards/src/test/org/apache/lucene/index/index.22.nocfs.zip
AU lucene/backwards/src/test/org/apache/lucene/index/TestFieldInfos.java
AU lucene/backwards/src/test/org/apache/lucene/index/index.20.cfs.zip
AU lucene/backwards/src/test/org/apache/lucene/index/index.24.nocfs.zip
AU lucene/backwards/src/test/org/apache/lucene/index/TestPositionBasedTermVectorMapper.java
AU lucene/backwards/src/test/org/apache/lucene/index/index.21.cfs.zip
AU lucene/backwards/src/test/org/apache/lucene/index/TestCompoundFile.java
AU lucene/backwards/src/test/org/apache/lucene/index/index.22.cfs.zip
AU lucene/backwards/src/test/org/apache/lucene/index/index.23.cfs.zip
AU lucene/backwards/src/test/org/apache/lucene/index/index.24.cfs.zip
AU lucene/backwards/src/test/org/apache/lucene/index/TestIndexWriterReader.java
AU lucene/backwards/src/test/org/apache/lucene/index/TestIndexWriterDelete.java
AU lucene/backwards/src/test/org/apache/lucene/index/TestDirectoryReader.java
AU lucene/backwards/src/test/org/apache/lucene/index/TestFieldsReader.java
AU lucene/backwards/src/test/org/apache/lucene/index/index.29.cfs.zip
AU lucene/backwards/src/test/org/apache/lucene/index/TestNRTReaderWithThreads.java
AU lucene/backwards/src/test/org/apache/lucene/index/TestTransactionRollback.java
AU lucene/backwards/src/test/org/apache/lucene/index/TestFilterIndexReader.java
AU lucene/backwards/src/test/org/apache/lucene/index/TestIndexReaderReopen.java
AU lucene/backwards/src/test/org/apache/lucene/index/TestSegmentMerger.java
AU lucene/backwards/src/test/org/apache/lucene/index/TestTerm.java
AU lucene/backwards/src/test/org/apache/lucene/index/TestStressIndexing.java
AU lucene/backwards/src/test/org/apache/lucene/index/TestTermdocPerf.java
AU lucene/backwards/src/test/org/apache/lucene/index/TestPayloads.java
AU lucene/backwards/src/test/org/apache/lucene/index/TestLazyBug.java
AU lucene/backwards/src/test/org/apache/lucene/index/TestIndexWriterMerging.java
AU lucene/backwards/src/test/org/apache/lucene/index/TestParallelReader.java
AU lucene/backwards/src/test/org/apache/lucene/index/TestDeletionPolicy.java
AU lucene/backwards/src/test/org/apache/lucene/index/TestSegmentReader.java
AU lucene/backwards/src/test/org/apache/lucene/index/TestParallelReaderEmptyIndex.java
AU lucene/backwards/src/test/org/apache/lucene/index/TestBackwardsCompatibility.java
AU lucene/backwards/src/test/org/apache/lucene/index/TestLazyProxSkipping.java
AU lucene/backwards/src/test/org/apache/lucene/index/TestNorms.java
A lucene/backwards/src/test/org/apache/lucene/messages
AU lucene/backwards/src/test/org/apache/lucene/messages/MessagesTestBundle.java
AU lucene/backwards/src/test/org/apache/lucene/messages/MessagesTestBundle_ja.properties
AU lucene/backwards/src/test/org/apache/lucene/messages/MessagesTestBundle.properties
AU lucene/backwards/src/test/org/apache/lucene/messages/TestNLS.java
AU lucene/backwards/src/test/org/apache/lucene/TestSearchForDuplicates.java
A lucene/backwards/src/test/org/apache/lucene/store
AU lucene/backwards/src/test/org/apache/lucene/store/TestLockFactory.java
AU lucene/backwards/src/test/org/apache/lucene/store/TestDirectory.java
AU lucene/backwards/src/test/org/apache/lucene/store/TestRAMDirectory.java
AU lucene/backwards/src/test/org/apache/lucene/store/MockRAMInputStream.java
AU lucene/backwards/src/test/org/apache/lucene/store/TestWindowsMMap.java
AU lucene/backwards/src/test/org/apache/lucene/store/MockRAMOutputStream.java
AU lucene/backwards/src/test/org/apache/lucene/store/TestFileSwitchDirectory.java
AU lucene/backwards/src/test/org/apache/lucene/store/TestHugeRamFile.java
AU lucene/backwards/src/test/org/apache/lucene/store/TestLock.java
AU lucene/backwards/src/test/org/apache/lucene/store/TestBufferedIndexInput.java
AU lucene/backwards/src/test/org/apache/lucene/store/MockRAMDirectory.java
AU lucene/backwards/src/test/org/apache/lucene/store/_TestHelper.java
A lucene/backwards/src/test/org/apache/lucene/util
AU lucene/backwards/src/test/org/apache/lucene/util/TestBitVector.java
AU lucene/backwards/src/test/org/apache/lucene/util/LocalizedTestCase.java
AU lucene/backwards/src/test/org/apache/lucene/util/LuceneJUnitDividingSelector.java
AU lucene/backwards/src/test/org/apache/lucene/util/TestStringHelper.java
AU lucene/backwards/src/test/org/apache/lucene/util/LuceneTestCase.java
AU lucene/backwards/src/test/org/apache/lucene/util/LuceneJUnitResultFormatter.java
AU lucene/backwards/src/test/org/apache/lucene/util/TestIndexableBinaryStringTools.java
AU lucene/backwards/src/test/org/apache/lucene/util/_TestUtil.java
AU lucene/backwards/src/test/org/apache/lucene/util/ArrayUtilTest.java
AU lucene/backwards/src/test/org/apache/lucene/util/TestOpenBitSet.java
AU lucene/backwards/src/test/org/apache/lucene/util/TestNumericUtils.java
AU lucene/backwards/src/test/org/apache/lucene/util/TestAttributeSource.java
AU lucene/backwards/src/test/org/apache/lucene/util/TestFieldCacheSanityChecker.java
AU lucene/backwards/src/test/org/apache/lucene/util/TestVersion.java
AU lucene/backwards/src/test/org/apache/lucene/util/TestStringIntern.java
AU lucene/backwards/src/test/org/apache/lucene/util/TestPriorityQueue.java
AU lucene/backwards/src/test/org/apache/lucene/util/English.java
AU lucene/backwards/src/test/org/apache/lucene/util/TestRamUsageEstimator.java
AU lucene/backwards/src/test/org/apache/lucene/util/TestCloseableThreadLocal.java
AU lucene/backwards/src/test/org/apache/lucene/util/TestSortedVIntList.java
AU lucene/backwards/src/test/org/apache/lucene/util/TestSmallFloat.java
A lucene/backwards/src/test/org/apache/lucene/document
AU lucene/backwards/src/test/org/apache/lucene/document/TestBinaryDocument.java
AU lucene/backwards/src/test/org/apache/lucene/document/TestNumberTools.java
AU lucene/backwards/src/test/org/apache/lucene/document/TestDateTools.java
AU lucene/backwards/src/test/org/apache/lucene/document/TestDocument.java
AU lucene/backwards/backwards-readme.txt
AU lucene/lucene-core-pom.xml.template
AU lucene/lucene-parent-pom.xml.template
A lucene/lib
AU lucene/lib/ant-1.7.1.jar
AU lucene/lib/ant-junit-1.7.1.jar
AU lucene/lib/servlet-api-2.4.jar
AU lucene/lib/junit-4.7.jar
AU lucene/index.html
AU lucene/README.txt
AU lucene/lucene-contrib-pom.xml.template
AU lucene/JRE_VERSION_MIGRATION.txt
AU lucene/BUILD.txt
AU lucene/.cvsignore
A build.xml
U .
At revision 1003387
Checking out http://svn.apache.org/repos/asf/lucene/dev/nightly
AU hudson-lucene-trunk.sh
AU hudson-settings.sh
AU hudson-solr-trunk.sh
AU hudson-lucene-3.x.sh
AU hudson-solr-3.x.sh
At revision 1003387
no change for http://svn.apache.org/repos/asf/lucene/dev/nightly since the previous build
[Solr-3.x] $ /bin/bash -xe /var/tmp/hudson53121.sh
+ sh <https://hudson.apache.org/hudson/job/Solr-3.x/ws/nightly/hudson-solr-3.x.sh>
+ . <https://hudson.apache.org/hudson/job/Solr-3.x/ws/nightly/hudson-settings.sh>
+ ANT_HOME=/export/home/hudson/tools/ant/latest
+ SVNVERSION_EXE=/opt/subversion-1.6.9/bin/svnversion
+ SVN_EXE=/opt/subversion-1.6.9/bin/svn
+ MAVEN_SUPPORT=/export/home/nigel/hudsonSupport/maven
+ CLOVER=/export/home/hudson/tools/clover/clover2latest
+ VERSION=3.1-2010-10-01_05-05-18
+ SVN_SOLR_BRANCH_DIR=branch_3x/solr
+ SVN_LUCENE_BRANCH_DIR=branch_3x/lucene
+ cd <https://hudson.apache.org/hudson/job/Solr-3.x/ws/branch_3x/solr>
+ echo 'Workspace: <https://hudson.apache.org/hudson/job/Solr-3.x/ws/'>
Workspace: <https://hudson.apache.org/hudson/job/Solr-3.x/ws/>
+ /export/home/hudson/tools/ant/latest/bin/ant -Dversion=3.1-2010-10-01_05-05-18 -Dlucene_version=3.1-2010-10-01_05-05-18 -Dsvnversion.exe=/opt/subversion-1.6.9/bin/svnversion -Dtests.threadspercpu=0 -Djunit.formatter=xml clean nightly
<https://hudson.apache.org/hudson/job/Solr-3.x/ws/nightly/hudson-solr-3.x.sh>: /export/home/hudson/tools/ant/latest/bin/ant: not found
[TASKS] Skipping publisher since build result is FAILURE
Publishing Javadoc
Archiving artifacts
Recording test results
Publishing Clover coverage report...
No Clover report will be published due to a Build Failure


---------------------------------------------------------------------
To unsubscribe, e-mail: dev-unsubscribe@lucene.apache.org
For additional commands, e-mail: dev-help@lucene.apache.org

Search Discussions

  • Apache Hudson Server at Oct 2, 2010 at 8:47 am
    See <https://hudson.apache.org/hudson/job/Solr-3.x/120/changes>

    Changes:

    [koji] SOLR-1297: fix sort by function parsing (merge 1003107 and part of 997870,998707(JSONTestUtil.java) to pass TestFunctionQuery)

    [koji] SOLR-2133: check garbage after func(s), allow parsing comma delimited list of functions (merge 1001318)

    [koji] SOLR-2128: full param substitution for function queries (merge 1000000)

    [hossman] SOLR-2135: merge r1003703 from trunk

    [uschindler] Enable unchecked warnings: we have now only some violations in contrib and the recently introduced ones by Ryan. As we want to get rid of them (the contrib ones seem to be easy), I switch it globally on.

    [mikemccand] LUCENE-2678: prevent false failure due to fast GC

    [mikemccand] LUCENE-2676: disable reader pooling for this test case since that causes added disk usage

    [uschindler] for clover runs we can disable the test repetitions, its simply too slow. For clover the number of runs is simply useless, as the code coverage (should) not really change.
    Its better to have more loops in the main tests when clover runs fine.

    [uschindler] prepare hudson on new machine, maven support is included in ant installation, so dir not needed (TODO: remove)

    [koji] SOLR-2110: merge #995264, #995286, #995557 from trunk

    ------------------------------------------
    [...truncated 6284 lines...]
    [junit] Tests run: 3, Failures: 0, Errors: 0, Time elapsed: 0.483 sec
    [junit]
    [junit] Testsuite: org.apache.solr.handler.JsonLoaderTest
    [junit] Tests run: 1, Failures: 0, Errors: 0, Time elapsed: 0.021 sec
    [junit]
    [junit] Testsuite: org.apache.solr.handler.MoreLikeThisHandlerTest
    [junit] Tests run: 1, Failures: 0, Errors: 0, Time elapsed: 0.496 sec
    [junit]
    [junit] Testsuite: org.apache.solr.handler.SpellCheckerRequestHandlerTest
    [junit] Tests run: 5, Failures: 0, Errors: 0, Time elapsed: 0.847 sec
    [junit]
    [junit] Testsuite: org.apache.solr.handler.StandardRequestHandlerTest
    [junit] Tests run: 1, Failures: 0, Errors: 0, Time elapsed: 0.506 sec
    [junit]
    [junit] Testsuite: org.apache.solr.handler.TestCSVLoader
    [junit] Tests run: 4, Failures: 0, Errors: 0, Time elapsed: 1.143 sec
    [junit]
    [junit] Testsuite: org.apache.solr.handler.TestReplicationHandler
    [junit] Tests run: 7, Failures: 0, Errors: 0, Time elapsed: 23.172 sec
    [junit]
    [junit] Testsuite: org.apache.solr.handler.XmlUpdateRequestHandlerTest
    [junit] Tests run: 1, Failures: 0, Errors: 0, Time elapsed: 0.649 sec
    [junit]
    [junit] Testsuite: org.apache.solr.handler.admin.LukeRequestHandlerTest
    [junit] Tests run: 1, Failures: 0, Errors: 0, Time elapsed: 0.677 sec
    [junit]
    [junit] Testsuite: org.apache.solr.handler.admin.SystemInfoHandlerTest
    [junit] Tests run: 1, Failures: 0, Errors: 0, Time elapsed: 0.009 sec
    [junit]
    [junit] Testsuite: org.apache.solr.handler.component.DistributedSpellCheckComponentTest
    [junit] Tests run: 1, Failures: 0, Errors: 0, Time elapsed: 7.673 sec
    [junit]
    [junit] Testsuite: org.apache.solr.handler.component.DistributedTermsComponentTest
    [junit] Tests run: 1, Failures: 0, Errors: 0, Time elapsed: 7.254 sec
    [junit]
    [junit] Testsuite: org.apache.solr.handler.component.QueryElevationComponentTest
    [junit] Tests run: 4, Failures: 0, Errors: 0, Time elapsed: 0.752 sec
    [junit]
    [junit] Testsuite: org.apache.solr.handler.component.SearchHandlerTest
    [junit] Tests run: 1, Failures: 0, Errors: 0, Time elapsed: 0.613 sec
    [junit]
    [junit] Testsuite: org.apache.solr.handler.component.SpellCheckComponentTest
    [junit] Tests run: 10, Failures: 0, Errors: 0, Time elapsed: 0.951 sec
    [junit]
    [junit] Testsuite: org.apache.solr.handler.component.StatsComponentTest
    [junit] Tests run: 1, Failures: 0, Errors: 0, Time elapsed: 2.721 sec
    [junit]
    [junit] Testsuite: org.apache.solr.handler.component.TermVectorComponentTest
    [junit] Tests run: 5, Failures: 0, Errors: 0, Time elapsed: 0.627 sec
    [junit]
    [junit] Testsuite: org.apache.solr.handler.component.TermsComponentTest
    [junit] Tests run: 13, Failures: 0, Errors: 0, Time elapsed: 0.58 sec
    [junit]
    [junit] Testsuite: org.apache.solr.highlight.FastVectorHighlighterTest
    [junit] Tests run: 2, Failures: 0, Errors: 0, Time elapsed: 0.496 sec
    [junit]
    [junit] Testsuite: org.apache.solr.highlight.HighlighterConfigTest
    [junit] Tests run: 1, Failures: 0, Errors: 0, Time elapsed: 0.422 sec
    [junit]
    [junit] Testsuite: org.apache.solr.highlight.HighlighterTest
    [junit] Tests run: 23, Failures: 0, Errors: 0, Time elapsed: 1.625 sec
    [junit]
    [junit] Testsuite: org.apache.solr.request.JSONWriterTest
    [junit] Tests run: 3, Failures: 0, Errors: 0, Time elapsed: 0.662 sec
    [junit]
    [junit] Testsuite: org.apache.solr.request.SimpleFacetsTest
    [junit] Tests run: 7, Failures: 0, Errors: 0, Time elapsed: 3.406 sec
    [junit]
    [junit] Testsuite: org.apache.solr.request.TestBinaryResponseWriter
    [junit] Tests run: 1, Failures: 0, Errors: 0, Time elapsed: 0.454 sec
    [junit]
    [junit] Testsuite: org.apache.solr.request.TestFaceting
    [junit] Tests run: 3, Failures: 0, Errors: 0, Time elapsed: 4.115 sec
    [junit]
    [junit] Testsuite: org.apache.solr.request.TestWriterPerf
    [junit] Tests run: 1, Failures: 0, Errors: 0, Time elapsed: 0.771 sec
    [junit]
    [junit] ------------- Standard Output ---------------
    [junit] writer xml, size=7211, encodeRate=76, decodeRate=285
    [junit] writer json, size=4497, encodeRate=500, decodeRate=N/A
    [junit] writer javabin, size=2006, encodeRate=N/A, decodeRate=N/A
    [junit] ------------- ---------------- ---------------
    [junit] Testsuite: org.apache.solr.response.TestCSVResponseWriter
    [junit] Tests run: 1, Failures: 0, Errors: 0, Time elapsed: 0.72 sec
    [junit]
    [junit] Testsuite: org.apache.solr.schema.BadIndexSchemaTest
    [junit] Tests run: 1, Failures: 0, Errors: 0, Time elapsed: 0.162 sec
    [junit]
    [junit] Testsuite: org.apache.solr.schema.CopyFieldTest
    [junit] Tests run: 6, Failures: 0, Errors: 0, Time elapsed: 0.411 sec
    [junit]
    [junit] Testsuite: org.apache.solr.schema.DateFieldTest
    [junit] Tests run: 6, Failures: 0, Errors: 0, Time elapsed: 0.016 sec
    [junit]
    [junit] Testsuite: org.apache.solr.schema.IndexSchemaTest
    [junit] Tests run: 5, Failures: 0, Errors: 0, Time elapsed: 0.511 sec
    [junit]
    [junit] Testsuite: org.apache.solr.schema.LegacyDateFieldTest
    [junit] Tests run: 4, Failures: 0, Errors: 0, Time elapsed: 0.012 sec
    [junit]
    [junit] Testsuite: org.apache.solr.schema.NotRequiredUniqueKeyTest
    [junit] Tests run: 1, Failures: 0, Errors: 0, Time elapsed: 0.166 sec
    [junit]
    [junit] Testsuite: org.apache.solr.schema.PolyFieldTest
    [junit] Tests run: 4, Failures: 0, Errors: 0, Time elapsed: 0.571 sec
    [junit]
    [junit] Testsuite: org.apache.solr.schema.RequiredFieldsTest
    [junit] Tests run: 3, Failures: 0, Errors: 0, Time elapsed: 0.529 sec
    [junit]
    [junit] Testsuite: org.apache.solr.schema.TestBinaryField
    [junit] Tests run: 1, Failures: 0, Errors: 0, Time elapsed: 0.267 sec
    [junit]
    [junit] Testsuite: org.apache.solr.schema.UUIDFieldTest
    [junit] Tests run: 1, Failures: 0, Errors: 0, Time elapsed: 0.007 sec
    [junit]
    [junit] Testsuite: org.apache.solr.search.FunctionQParserTest
    [junit] Tests run: 1, Failures: 0, Errors: 0, Time elapsed: 0.189 sec
    [junit]
    [junit] Testsuite: org.apache.solr.search.QueryParsingTest
    [junit] Tests run: 2, Failures: 0, Errors: 0, Time elapsed: 1.299 sec
    [junit]
    [junit] Testsuite: org.apache.solr.search.SpatialFilterTest
    [junit] Tests run: 3, Failures: 0, Errors: 0, Time elapsed: 0.964 sec
    [junit]
    [junit] Testsuite: org.apache.solr.search.TestDocSet
    [junit] Tests run: 2, Failures: 0, Errors: 0, Time elapsed: 0.729 sec
    [junit]
    [junit] Testsuite: org.apache.solr.search.TestExtendedDismaxParser
    [junit] Tests run: 1, Failures: 0, Errors: 0, Time elapsed: 0.697 sec
    [junit]
    [junit] Testsuite: org.apache.solr.search.TestFastLRUCache
    [junit] Tests run: 2, Failures: 0, Errors: 0, Time elapsed: 0.011 sec
    [junit]
    [junit] Testsuite: org.apache.solr.search.TestIndexSearcher
    [junit] Tests run: 1, Failures: 0, Errors: 0, Time elapsed: 0.454 sec
    [junit]
    [junit] Testsuite: org.apache.solr.search.TestQueryTypes
    [junit] Tests run: 1, Failures: 0, Errors: 0, Time elapsed: 0.695 sec
    [junit]
    [junit] Testsuite: org.apache.solr.search.TestQueryUtils
    [junit] Tests run: 1, Failures: 0, Errors: 0, Time elapsed: 0.873 sec
    [junit]
    [junit] Testsuite: org.apache.solr.search.TestRangeQuery
    [junit] Tests run: 2, Failures: 0, Errors: 0, Time elapsed: 17.984 sec
    [junit]
    [junit] Testsuite: org.apache.solr.search.TestSearchPerf
    [junit] Tests run: 1, Failures: 0, Errors: 0, Time elapsed: 0.562 sec
    [junit]
    [junit] Testsuite: org.apache.solr.search.TestSolrQueryParser
    [junit] Tests run: 1, Failures: 0, Errors: 0, Time elapsed: 0.596 sec
    [junit]
    [junit] Testsuite: org.apache.solr.search.TestSort
    [junit] Tests run: 1, Failures: 0, Errors: 0, Time elapsed: 1.736 sec
    [junit]
    [junit] Testsuite: org.apache.solr.search.function.SortByFunctionTest
    [junit] Tests run: 1, Failures: 0, Errors: 0, Time elapsed: 0.503 sec
    [junit]
    [junit] Testsuite: org.apache.solr.search.function.TestFunctionQuery
    [junit] Tests run: 7, Failures: 0, Errors: 0, Time elapsed: 1.474 sec
    [junit]
    [junit] Testsuite: org.apache.solr.search.function.distance.DistanceFunctionTest
    [junit] Tests run: 2, Failures: 0, Errors: 0, Time elapsed: 0.478 sec
    [junit]
    [junit] Testsuite: org.apache.solr.servlet.CacheHeaderTest
    [junit] Tests run: 5, Failures: 0, Errors: 0, Time elapsed: 0.816 sec
    [junit]
    [junit] Testsuite: org.apache.solr.servlet.DirectSolrConnectionTest
    [junit] Tests run: 2, Failures: 0, Errors: 0, Time elapsed: 0.311 sec
    [junit]
    [junit] Testsuite: org.apache.solr.servlet.NoCacheHeaderTest
    [junit] Tests run: 3, Failures: 0, Errors: 0, Time elapsed: 0.714 sec
    [junit]
    [junit] Testsuite: org.apache.solr.servlet.SolrRequestParserTest
    [junit] Tests run: 4, Failures: 0, Errors: 0, Time elapsed: 0.76 sec
    [junit]
    [junit] Testsuite: org.apache.solr.spelling.FileBasedSpellCheckerTest
    [junit] Tests run: 3, Failures: 0, Errors: 0, Time elapsed: 0.678 sec
    [junit]
    [junit] Testsuite: org.apache.solr.spelling.IndexBasedSpellCheckerTest
    [junit] Tests run: 5, Failures: 0, Errors: 0, Time elapsed: 0.756 sec
    [junit]
    [junit] Testsuite: org.apache.solr.spelling.SpellingQueryConverterTest
    [junit] Tests run: 4, Failures: 0, Errors: 0, Time elapsed: 0.02 sec
    [junit]
    [junit] Testsuite: org.apache.solr.spelling.suggest.SuggesterTest
    [junit] Tests run: 2, Failures: 0, Errors: 0, Time elapsed: 0.164 sec
    [junit]
    [junit] Testsuite: org.apache.solr.update.AutoCommitTest
    [junit] Tests run: 1, Failures: 0, Errors: 0, Time elapsed: 4.38 sec
    [junit]
    [junit] Testsuite: org.apache.solr.update.DirectUpdateHandlerOptimizeTest
    [junit] Tests run: 1, Failures: 0, Errors: 0, Time elapsed: 0.683 sec
    [junit]
    [junit] Testsuite: org.apache.solr.update.DirectUpdateHandlerTest
    [junit] Tests run: 7, Failures: 0, Errors: 0, Time elapsed: 2.153 sec
    [junit]
    [junit] Testsuite: org.apache.solr.update.DocumentBuilderTest
    [junit] Tests run: 3, Failures: 0, Errors: 0, Time elapsed: 0.54 sec
    [junit]
    [junit] Testsuite: org.apache.solr.update.TestIndexingPerformance
    [junit] Tests run: 1, Failures: 0, Errors: 0, Time elapsed: 0.632 sec
    [junit]
    [junit] ------------- Standard Output ---------------
    [junit] includeDoc=true doc=[text, simple, text, test, text, how now brown cow, text, what's that?, text, radical!, text, what's all this about, anyway?, text, just how fast is this text indexing?]
    [junit] iter=1000 time=143 throughput=6993
    [junit] ------------- ---------------- ---------------
    [junit] Testsuite: org.apache.solr.update.processor.SignatureUpdateProcessorFactoryTest
    [junit] Tests run: 2, Failures: 0, Errors: 0, Time elapsed: 1.27 sec
    [junit]
    [junit] Testsuite: org.apache.solr.update.processor.UpdateRequestProcessorFactoryTest
    [junit] Tests run: 1, Failures: 0, Errors: 0, Time elapsed: 0.814 sec
    [junit]
    [junit] Testsuite: org.apache.solr.util.ArraysUtilsTest
    [junit] Tests run: 1, Failures: 0, Errors: 0, Time elapsed: 0.01 sec
    [junit]
    [junit] Testsuite: org.apache.solr.util.DateMathParserTest
    [junit] Tests run: 7, Failures: 0, Errors: 0, Time elapsed: 0.062 sec
    [junit]
    [junit] Testsuite: org.apache.solr.util.PrimUtilsTest
    [junit] Tests run: 1, Failures: 0, Errors: 0, Time elapsed: 0.017 sec
    [junit]
    [junit] Testsuite: org.apache.solr.util.SolrPluginUtilsTest
    [junit] Tests run: 7, Failures: 0, Errors: 0, Time elapsed: 0.684 sec
    [junit]
    [junit] Testsuite: org.apache.solr.util.TestNumberUtils
    [junit] Tests run: 1, Failures: 0, Errors: 0, Time elapsed: 0.272 sec
    [junit]
    [junit] Testsuite: org.apache.solr.util.TestOpenBitSet
    [junit] Tests run: 3, Failures: 0, Errors: 0, Time elapsed: 0.728 sec
    [junit]
    [junit] Testsuite: org.apache.solr.util.TestUtils
    [junit] Tests run: 3, Failures: 0, Errors: 0, Time elapsed: 0.025 sec
    [junit]
    [junit] Testsuite: org.apache.solr.velocity.VelocityResponseWriterTest
    [junit] Tests run: 1, Failures: 0, Errors: 0, Time elapsed: 0.598 sec
    [junit]
    [junit] Tests FAILED

    BUILD FAILED
    /usr<https://hudson.apache.org/hudson/job/Solr-3.x/ws/branch_3x/solr/build.xml>:381: The following error occurred while executing this line:
    /usr<https://hudson.apache.org/hudson/job/Solr-3.x/ws/branch_3x/solr/build.xml>:481: Tests failed!

    Total time: 19 minutes 57 seconds
    [TASKS] Skipping publisher since build result is FAILURE
    Publishing Javadoc
    Archiving artifacts
    Recording test results
    Publishing Clover coverage report...
    No Clover report will be published due to a Build Failure


    ---------------------------------------------------------------------
    To unsubscribe, e-mail: dev-unsubscribe@lucene.apache.org
    For additional commands, e-mail: dev-help@lucene.apache.org
  • Uwe Schindler at Oct 2, 2010 at 8:49 am
    Here we seem to have a configuration problem:



    [junit] Testsuite: org.apache.solr.MinimalSchemaTest

    [junit] Testcase: testAllConfiguredHandlers(org.apache.solr.MinimalSchemaTest): Caused an ERROR

    [junit] exception w/handler: '/admin/system'

    [junit] java.lang.RuntimeException: exception w/handler: '/admin/system'

    [junit] at org.apache.solr.MinimalSchemaTest.testAllConfiguredHandlers(MinimalSchemaTest.java:122)

    [junit] at org.apache.lucene.util.LuceneTestCase$LuceneTestCaseRunner.runChild(LuceneTestCase.java:693)

    [junit] at org.apache.lucene.util.LuceneTestCase$LuceneTestCaseRunner.runChild(LuceneTestCase.java:666)

    [junit] Caused by: java.lang.RuntimeException: Exception during query

    [junit] at org.apache.solr.SolrTestCaseJ4.assertQ(SolrTestCaseJ4.java:339)

    [junit] at org.apache.solr.MinimalSchemaTest.testAllConfiguredHandlers(MinimalSchemaTest.java:115)

    [junit] Caused by: java.net.UnknownHostException: lucene2.apache.org: lucene2.apache.org

    [junit] at java.net.InetAddress.getLocalHost(InetAddress.java:1346)

    [junit] at org.apache.solr.handler.admin.SystemInfoHandler.getCoreInfo(SystemInfoHandler.java:82)

    [junit] at org.apache.solr.handler.admin.SystemInfoHandler.handleRequestBody(SystemInfoHandler.java:64)

    [junit] at org.apache.solr.handler.RequestHandlerBase.handleRequest(RequestHandlerBase.java:131)

    [junit] at org.apache.solr.core.SolrCore.execute(SolrCore.java:1322)

    [junit] at org.apache.solr.util.TestHarness.queryAndResponse(TestHarness.java:334)

    [junit] at org.apache.solr.util.TestHarness.query(TestHarness.java:321)

    [junit] at org.apache.solr.util.TestHarness.query(TestHarness.java:307)

    [junit] at org.apache.solr.SolrTestCaseJ4.assertQ(SolrTestCaseJ4.java:317)

    [junit]

    [junit]

    [junit] Tests run: 3, Failures: 0, Errors: 1, Time elapsed: 0.356 sec



    The Hudson machine's network setting seem to be mixed up, I'll ask infra!



    Uwe



    -----

    Uwe Schindler

    H.-H.-Meier-Allee 63, D-28213 Bremen

    http://www.thetaphi.de

    eMail: uwe@thetaphi.de




    -----Original Message-----
    From: Apache Hudson Server
    Sent: Saturday, October 02, 2010 10:47 AM
    To: dev@lucene.apache.org
    Subject: Build failed in Hudson: Solr-3.x #120 >
    See < <https://hudson.apache.org/hudson/job/Solr-3.x/120/changes> https://hudson.apache.org/hudson/job/Solr-3.x/120/changes> >
    Changes: >
    [koji] SOLR-1297: fix sort by function parsing (merge 1003107 and part of
    997870,998707(JSONTestUtil.java) to pass TestFunctionQuery) >
    [koji] SOLR-2133: check garbage after func(s), allow parsing comma delimited
    list of functions (merge 1001318) >
    [koji] SOLR-2128: full param substitution for function queries (merge 1000000) >
    [hossman] SOLR-2135: merge r1003703 from trunk >
    [uschindler] Enable unchecked warnings: we have now only some violations in
    contrib and the recently introduced ones by Ryan. As we want to get rid of
    them (the contrib ones seem to be easy), I switch it globally on. >
    [mikemccand] LUCENE-2678: prevent false failure due to fast GC >
    [mikemccand] LUCENE-2676: disable reader pooling for this test case since that
    causes added disk usage >
    [uschindler] for clover runs we can disable the test repetitions, its simply too
    slow. For clover the number of runs is simply useless, as the code coverage
    (should) not really change.
    Its better to have more loops in the main tests when clover runs fine. >
    [uschindler] prepare hudson on new machine, maven support is included in ant
    installation, so dir not needed (TODO: remove) >
    [koji] SOLR-2110: merge #995264, #995286, #995557 from trunk >
    ------------------------------------------
    [...truncated 6284 lines...]
    [junit] Tests run: 3, Failures: 0, Errors: 0, Time elapsed: 0.483 sec
    [junit]
    [junit] Testsuite: org.apache.solr.handler.JsonLoaderTest
    [junit] Tests run: 1, Failures: 0, Errors: 0, Time elapsed: 0.021 sec
    [junit]
    [junit] Testsuite: org.apache.solr.handler.MoreLikeThisHandlerTest
    [junit] Tests run: 1, Failures: 0, Errors: 0, Time elapsed: 0.496 sec
    [junit]
    [junit] Testsuite: org.apache.solr.handler.SpellCheckerRequestHandlerTest
    [junit] Tests run: 5, Failures: 0, Errors: 0, Time elapsed: 0.847 sec
    [junit]
    [junit] Testsuite: org.apache.solr.handler.StandardRequestHandlerTest
    [junit] Tests run: 1, Failures: 0, Errors: 0, Time elapsed: 0.506 sec
    [junit]
    [junit] Testsuite: org.apache.solr.handler.TestCSVLoader
    [junit] Tests run: 4, Failures: 0, Errors: 0, Time elapsed: 1.143 sec
    [junit]
    [junit] Testsuite: org.apache.solr.handler.TestReplicationHandler
    [junit] Tests run: 7, Failures: 0, Errors: 0, Time elapsed: 23.172 sec
    [junit]
    [junit] Testsuite: org.apache.solr.handler.XmlUpdateRequestHandlerTest
    [junit] Tests run: 1, Failures: 0, Errors: 0, Time elapsed: 0.649 sec
    [junit]
    [junit] Testsuite: org.apache.solr.handler.admin.LukeRequestHandlerTest
    [junit] Tests run: 1, Failures: 0, Errors: 0, Time elapsed: 0.677 sec
    [junit]
    [junit] Testsuite: org.apache.solr.handler.admin.SystemInfoHandlerTest
    [junit] Tests run: 1, Failures: 0, Errors: 0, Time elapsed: 0.009 sec
    [junit]
    [junit] Testsuite:
    org.apache.solr.handler.component.DistributedSpellCheckComponentTest
    [junit] Tests run: 1, Failures: 0, Errors: 0, Time elapsed: 7.673 sec
    [junit]
    [junit] Testsuite:
    org.apache.solr.handler.component.DistributedTermsComponentTest
    [junit] Tests run: 1, Failures: 0, Errors: 0, Time elapsed: 7.254 sec
    [junit]
    [junit] Testsuite:
    org.apache.solr.handler.component.QueryElevationComponentTest
    [junit] Tests run: 4, Failures: 0, Errors: 0, Time elapsed: 0.752 sec
    [junit]
    [junit] Testsuite: org.apache.solr.handler.component.SearchHandlerTest
    [junit] Tests run: 1, Failures: 0, Errors: 0, Time elapsed: 0.613 sec
    [junit]
    [junit] Testsuite:
    org.apache.solr.handler.component.SpellCheckComponentTest
    [junit] Tests run: 10, Failures: 0, Errors: 0, Time elapsed: 0.951 sec
    [junit]
    [junit] Testsuite: org.apache.solr.handler.component.StatsComponentTest
    [junit] Tests run: 1, Failures: 0, Errors: 0, Time elapsed: 2.721 sec
    [junit]
    [junit] Testsuite:
    org.apache.solr.handler.component.TermVectorComponentTest
    [junit] Tests run: 5, Failures: 0, Errors: 0, Time elapsed: 0.627 sec
    [junit]
    [junit] Testsuite: org.apache.solr.handler.component.TermsComponentTest
    [junit] Tests run: 13, Failures: 0, Errors: 0, Time elapsed: 0.58 sec
    [junit]
    [junit] Testsuite: org.apache.solr.highlight.FastVectorHighlighterTest
    [junit] Tests run: 2, Failures: 0, Errors: 0, Time elapsed: 0.496 sec
    [junit]
    [junit] Testsuite: org.apache.solr.highlight.HighlighterConfigTest
    [junit] Tests run: 1, Failures: 0, Errors: 0, Time elapsed: 0.422 sec
    [junit]
    [junit] Testsuite: org.apache.solr.highlight.HighlighterTest
    [junit] Tests run: 23, Failures: 0, Errors: 0, Time elapsed: 1.625 sec
    [junit]
    [junit] Testsuite: org.apache.solr.request.JSONWriterTest
    [junit] Tests run: 3, Failures: 0, Errors: 0, Time elapsed: 0.662 sec
    [junit]
    [junit] Testsuite: org.apache.solr.request.SimpleFacetsTest
    [junit] Tests run: 7, Failures: 0, Errors: 0, Time elapsed: 3.406 sec
    [junit]
    [junit] Testsuite: org.apache.solr.request.TestBinaryResponseWriter
    [junit] Tests run: 1, Failures: 0, Errors: 0, Time elapsed: 0.454 sec
    [junit]
    [junit] Testsuite: org.apache.solr.request.TestFaceting
    [junit] Tests run: 3, Failures: 0, Errors: 0, Time elapsed: 4.115 sec
    [junit]
    [junit] Testsuite: org.apache.solr.request.TestWriterPerf
    [junit] Tests run: 1, Failures: 0, Errors: 0, Time elapsed: 0.771 sec
    [junit]
    [junit] ------------- Standard Output ---------------
    [junit] writer xml, size=7211, encodeRate=76, decodeRate=285
    [junit] writer json, size=4497, encodeRate=500, decodeRate=N/A
    [junit] writer javabin, size=2006, encodeRate=N/A, decodeRate=N/A
    [junit] ------------- ---------------- ---------------
    [junit] Testsuite: org.apache.solr.response.TestCSVResponseWriter
    [junit] Tests run: 1, Failures: 0, Errors: 0, Time elapsed: 0.72 sec
    [junit]
    [junit] Testsuite: org.apache.solr.schema.BadIndexSchemaTest
    [junit] Tests run: 1, Failures: 0, Errors: 0, Time elapsed: 0.162 sec
    [junit]
    [junit] Testsuite: org.apache.solr.schema.CopyFieldTest
    [junit] Tests run: 6, Failures: 0, Errors: 0, Time elapsed: 0.411 sec
    [junit]
    [junit] Testsuite: org.apache.solr.schema.DateFieldTest
    [junit] Tests run: 6, Failures: 0, Errors: 0, Time elapsed: 0.016 sec
    [junit]
    [junit] Testsuite: org.apache.solr.schema.IndexSchemaTest
    [junit] Tests run: 5, Failures: 0, Errors: 0, Time elapsed: 0.511 sec
    [junit]
    [junit] Testsuite: org.apache.solr.schema.LegacyDateFieldTest
    [junit] Tests run: 4, Failures: 0, Errors: 0, Time elapsed: 0.012 sec
    [junit]
    [junit] Testsuite: org.apache.solr.schema.NotRequiredUniqueKeyTest
    [junit] Tests run: 1, Failures: 0, Errors: 0, Time elapsed: 0.166 sec
    [junit]
    [junit] Testsuite: org.apache.solr.schema.PolyFieldTest
    [junit] Tests run: 4, Failures: 0, Errors: 0, Time elapsed: 0.571 sec
    [junit]
    [junit] Testsuite: org.apache.solr.schema.RequiredFieldsTest
    [junit] Tests run: 3, Failures: 0, Errors: 0, Time elapsed: 0.529 sec
    [junit]
    [junit] Testsuite: org.apache.solr.schema.TestBinaryField
    [junit] Tests run: 1, Failures: 0, Errors: 0, Time elapsed: 0.267 sec
    [junit]
    [junit] Testsuite: org.apache.solr.schema.UUIDFieldTest
    [junit] Tests run: 1, Failures: 0, Errors: 0, Time elapsed: 0.007 sec
    [junit]
    [junit] Testsuite: org.apache.solr.search.FunctionQParserTest
    [junit] Tests run: 1, Failures: 0, Errors: 0, Time elapsed: 0.189 sec
    [junit]
    [junit] Testsuite: org.apache.solr.search.QueryParsingTest
    [junit] Tests run: 2, Failures: 0, Errors: 0, Time elapsed: 1.299 sec
    [junit]
    [junit] Testsuite: org.apache.solr.search.SpatialFilterTest
    [junit] Tests run: 3, Failures: 0, Errors: 0, Time elapsed: 0.964 sec
    [junit]
    [junit] Testsuite: org.apache.solr.search.TestDocSet
    [junit] Tests run: 2, Failures: 0, Errors: 0, Time elapsed: 0.729 sec
    [junit]
    [junit] Testsuite: org.apache.solr.search.TestExtendedDismaxParser
    [junit] Tests run: 1, Failures: 0, Errors: 0, Time elapsed: 0.697 sec
    [junit]
    [junit] Testsuite: org.apache.solr.search.TestFastLRUCache
    [junit] Tests run: 2, Failures: 0, Errors: 0, Time elapsed: 0.011 sec
    [junit]
    [junit] Testsuite: org.apache.solr.search.TestIndexSearcher
    [junit] Tests run: 1, Failures: 0, Errors: 0, Time elapsed: 0.454 sec
    [junit]
    [junit] Testsuite: org.apache.solr.search.TestQueryTypes
    [junit] Tests run: 1, Failures: 0, Errors: 0, Time elapsed: 0.695 sec
    [junit]
    [junit] Testsuite: org.apache.solr.search.TestQueryUtils
    [junit] Tests run: 1, Failures: 0, Errors: 0, Time elapsed: 0.873 sec
    [junit]
    [junit] Testsuite: org.apache.solr.search.TestRangeQuery
    [junit] Tests run: 2, Failures: 0, Errors: 0, Time elapsed: 17.984 sec
    [junit]
    [junit] Testsuite: org.apache.solr.search.TestSearchPerf
    [junit] Tests run: 1, Failures: 0, Errors: 0, Time elapsed: 0.562 sec
    [junit]
    [junit] Testsuite: org.apache.solr.search.TestSolrQueryParser
    [junit] Tests run: 1, Failures: 0, Errors: 0, Time elapsed: 0.596 sec
    [junit]
    [junit] Testsuite: org.apache.solr.search.TestSort
    [junit] Tests run: 1, Failures: 0, Errors: 0, Time elapsed: 1.736 sec
    [junit]
    [junit] Testsuite: org.apache.solr.search.function.SortByFunctionTest
    [junit] Tests run: 1, Failures: 0, Errors: 0, Time elapsed: 0.503 sec
    [junit]
    [junit] Testsuite: org.apache.solr.search.function.TestFunctionQuery
    [junit] Tests run: 7, Failures: 0, Errors: 0, Time elapsed: 1.474 sec
    [junit]
    [junit] Testsuite:
    org.apache.solr.search.function.distance.DistanceFunctionTest
    [junit] Tests run: 2, Failures: 0, Errors: 0, Time elapsed: 0.478 sec
    [junit]
    [junit] Testsuite: org.apache.solr.servlet.CacheHeaderTest
    [junit] Tests run: 5, Failures: 0, Errors: 0, Time elapsed: 0.816 sec
    [junit]
    [junit] Testsuite: org.apache.solr.servlet.DirectSolrConnectionTest
    [junit] Tests run: 2, Failures: 0, Errors: 0, Time elapsed: 0.311 sec
    [junit]
    [junit] Testsuite: org.apache.solr.servlet.NoCacheHeaderTest
    [junit] Tests run: 3, Failures: 0, Errors: 0, Time elapsed: 0.714 sec
    [junit]
    [junit] Testsuite: org.apache.solr.servlet.SolrRequestParserTest
    [junit] Tests run: 4, Failures: 0, Errors: 0, Time elapsed: 0.76 sec
    [junit]
    [junit] Testsuite: org.apache.solr.spelling.FileBasedSpellCheckerTest
    [junit] Tests run: 3, Failures: 0, Errors: 0, Time elapsed: 0.678 sec
    [junit]
    [junit] Testsuite: org.apache.solr.spelling.IndexBasedSpellCheckerTest
    [junit] Tests run: 5, Failures: 0, Errors: 0, Time elapsed: 0.756 sec
    [junit]
    [junit] Testsuite: org.apache.solr.spelling.SpellingQueryConverterTest
    [junit] Tests run: 4, Failures: 0, Errors: 0, Time elapsed: 0.02 sec
    [junit]
    [junit] Testsuite: org.apache.solr.spelling.suggest.SuggesterTest
    [junit] Tests run: 2, Failures: 0, Errors: 0, Time elapsed: 0.164 sec
    [junit]
    [junit] Testsuite: org.apache.solr.update.AutoCommitTest
    [junit] Tests run: 1, Failures: 0, Errors: 0, Time elapsed: 4.38 sec
    [junit]
    [junit] Testsuite: org.apache.solr.update.DirectUpdateHandlerOptimizeTest
    [junit] Tests run: 1, Failures: 0, Errors: 0, Time elapsed: 0.683 sec
    [junit]
    [junit] Testsuite: org.apache.solr.update.DirectUpdateHandlerTest
    [junit] Tests run: 7, Failures: 0, Errors: 0, Time elapsed: 2.153 sec
    [junit]
    [junit] Testsuite: org.apache.solr.update.DocumentBuilderTest
    [junit] Tests run: 3, Failures: 0, Errors: 0, Time elapsed: 0.54 sec
    [junit]
    [junit] Testsuite: org.apache.solr.update.TestIndexingPerformance
    [junit] Tests run: 1, Failures: 0, Errors: 0, Time elapsed: 0.632 sec
    [junit]
    [junit] ------------- Standard Output ---------------
    [junit] includeDoc=true doc=[text, simple, text, test, text, how now brown
    cow, text, what's that?, text, radical!, text, what's all this about, anyway?, text,
    just how fast is this text indexing?]
    [junit] iter=1000 time=143 throughput=6993
    [junit] ------------- ---------------- ---------------
    [junit] Testsuite:
    org.apache.solr.update.processor.SignatureUpdateProcessorFactoryTest
    [junit] Tests run: 2, Failures: 0, Errors: 0, Time elapsed: 1.27 sec
    [junit]
    [junit] Testsuite:
    org.apache.solr.update.processor.UpdateRequestProcessorFactoryTest
    [junit] Tests run: 1, Failures: 0, Errors: 0, Time elapsed: 0.814 sec
    [junit]
    [junit] Testsuite: org.apache.solr.util.ArraysUtilsTest
    [junit] Tests run: 1, Failures: 0, Errors: 0, Time elapsed: 0.01 sec
    [junit]
    [junit] Testsuite: org.apache.solr.util.DateMathParserTest
    [junit] Tests run: 7, Failures: 0, Errors: 0, Time elapsed: 0.062 sec
    [junit]
    [junit] Testsuite: org.apache.solr.util.PrimUtilsTest
    [junit] Tests run: 1, Failures: 0, Errors: 0, Time elapsed: 0.017 sec
    [junit]
    [junit] Testsuite: org.apache.solr.util.SolrPluginUtilsTest
    [junit] Tests run: 7, Failures: 0, Errors: 0, Time elapsed: 0.684 sec
    [junit]
    [junit] Testsuite: org.apache.solr.util.TestNumberUtils
    [junit] Tests run: 1, Failures: 0, Errors: 0, Time elapsed: 0.272 sec
    [junit]
    [junit] Testsuite: org.apache.solr.util.TestOpenBitSet
    [junit] Tests run: 3, Failures: 0, Errors: 0, Time elapsed: 0.728 sec
    [junit]
    [junit] Testsuite: org.apache.solr.util.TestUtils
    [junit] Tests run: 3, Failures: 0, Errors: 0, Time elapsed: 0.025 sec
    [junit]
    [junit] Testsuite: org.apache.solr.velocity.VelocityResponseWriterTest
    [junit] Tests run: 1, Failures: 0, Errors: 0, Time elapsed: 0.598 sec
    [junit]
    [junit] Tests FAILED >
    BUILD FAILED
    /usr< <https://hudson.apache.org/hudson/job/Solr-3.x/ws/branch_3x/solr/build.xml> https://hudson.apache.org/hudson/job/Solr-
    <https://hudson.apache.org/hudson/job/Solr-3.x/ws/branch_3x/solr/build.xml> > 3.x/ws/branch_3x/solr/build.xml>:381: The following error occurred while
    executing this line:
    /usr< <https://hudson.apache.org/hudson/job/Solr-3.x/ws/branch_3x/solr/build.xml> https://hudson.apache.org/hudson/job/Solr-
    <https://hudson.apache.org/hudson/job/Solr-3.x/ws/branch_3x/solr/build.xml> > 3.x/ws/branch_3x/solr/build.xml>:481: Tests failed!

    >
    Total time: 19 minutes 57 seconds
    [TASKS] Skipping publisher since build result is FAILURE Publishing Javadoc
    Archiving artifacts Recording test results Publishing Clover coverage report...
    No Clover report will be published due to a Build Failure
    >

    >
    ---------------------------------------------------------------------
    To unsubscribe, e-mail: dev-unsubscribe@lucene.apache.org For additional
    commands, e-mail: dev-help@lucene.apache.org
  • Apache Hudson Server at Oct 2, 2010 at 10:59 am
    See <https://hudson.apache.org/hudson/job/Solr-3.x/121/>

    ------------------------------------------
    [...truncated 11158 lines...]
    [junit] at org.apache.solr.util.TestHarness.queryAndResponse(TestHarness.java:334)
    [junit] at org.apache.solr.util.TestHarness.query(TestHarness.java:321)
    [junit] at org.apache.solr.handler.dataimport.AbstractDataImportHandlerTestCase.runFullImport(AbstractDataImportHandlerTestCase.java:108)
    [junit] at org.apache.solr.handler.dataimport.TestDocBuilder2.testFileListEntityProcessor_lastIndexTime(TestDocBuilder2.java:245)
    [junit] at sun.reflect.NativeMethodAccessorImpl.invoke0(Native Method)
    [junit] at sun.reflect.NativeMethodAccessorImpl.invoke(NativeMethodAccessorImpl.java:39)
    [junit] at sun.reflect.DelegatingMethodAccessorImpl.invoke(DelegatingMethodAccessorImpl.java:25)
    [junit] at java.lang.reflect.Method.invoke(Method.java:585)
    [junit] at org.junit.runners.model.FrameworkMethod$1.runReflectiveCall(FrameworkMethod.java:44)
    [junit] at org.junit.internal.runners.model.ReflectiveCallable.run(ReflectiveCallable.java:15)
    [junit] at org.junit.runners.model.FrameworkMethod.invokeExplosively(FrameworkMethod.java:41)
    [junit] at org.junit.internal.runners.statements.InvokeMethod.evaluate(InvokeMethod.java:20)
    [junit] at org.junit.rules.TestWatchman$1.evaluate(TestWatchman.java:48)
    [junit] at org.junit.internal.runners.statements.RunBefores.evaluate(RunBefores.java:28)
    [junit] at org.junit.internal.runners.statements.RunAfters.evaluate(RunAfters.java:31)
    [junit] at org.junit.runners.BlockJUnit4ClassRunner.runChild(BlockJUnit4ClassRunner.java:76)
    [junit] at org.apache.lucene.util.LuceneTestCase$LuceneTestCaseRunner.runChild(LuceneTestCase.java:693)
    [junit] at org.apache.lucene.util.LuceneTestCase$LuceneTestCaseRunner.runChild(LuceneTestCase.java:666)
    [junit] at org.junit.runners.ParentRunner$3.run(ParentRunner.java:193)
    [junit] at org.junit.runners.ParentRunner$1.schedule(ParentRunner.java:52)
    [junit] at org.junit.runners.ParentRunner.runChildren(ParentRunner.java:191)
    [junit] at org.junit.runners.ParentRunner.access$000(ParentRunner.java:42)
    [junit] at org.junit.runners.ParentRunner$2.evaluate(ParentRunner.java:184)
    [junit] at org.junit.internal.runners.statements.RunBefores.evaluate(RunBefores.java:28)
    [junit] at org.junit.internal.runners.statements.RunAfters.evaluate(RunAfters.java:31)
    [junit] at org.junit.runners.ParentRunner.run(ParentRunner.java:236)
    [junit] at junit.framework.JUnit4TestAdapter.run(JUnit4TestAdapter.java:39)
    [junit] at org.apache.tools.ant.taskdefs.optional.junit.JUnitTestRunner.run(JUnitTestRunner.java:421)
    [junit] at org.apache.tools.ant.taskdefs.optional.junit.JUnitTestRunner.launch(JUnitTestRunner.java:912)
    [junit] at org.apache.tools.ant.taskdefs.optional.junit.JUnitTestRunner.main(JUnitTestRunner.java:743)
    [junit] Caused by: java.text.ParseException: Unparseable date: "1969-12-31 19:00:00"
    [junit] at java.text.DateFormat.parse(DateFormat.java:335)
    [junit] at org.apache.solr.handler.dataimport.FileListEntityProcessor.getDate(FileListEntityProcessor.java:165)
    [junit] ... 40 more
    [junit] 2.10.2010 1:58:51 org.apache.solr.handler.dataimport.DataImporter doFullImport
    [junit] SEVERE: Full Import failed
    [junit] org.apache.solr.handler.dataimport.DataImportHandlerException: Invalid expression for date Processing Document # 1
    [junit] at org.apache.solr.handler.dataimport.FileListEntityProcessor.getDate(FileListEntityProcessor.java:167)
    [junit] at org.apache.solr.handler.dataimport.FileListEntityProcessor.nextRow(FileListEntityProcessor.java:204)
    [junit] at org.apache.solr.handler.dataimport.EntityProcessorWrapper.nextRow(EntityProcessorWrapper.java:233)
    [junit] at org.apache.solr.handler.dataimport.DocBuilder.buildDocument(DocBuilder.java:579)
    [junit] at org.apache.solr.handler.dataimport.DocBuilder.doFullDump(DocBuilder.java:260)
    [junit] at org.apache.solr.handler.dataimport.DocBuilder.execute(DocBuilder.java:184)
    [junit] at org.apache.solr.handler.dataimport.DataImporter.doFullImport(DataImporter.java:334)
    [junit] at org.apache.solr.handler.dataimport.DataImporter.runCmd(DataImporter.java:392)
    [junit] at org.apache.solr.handler.dataimport.DataImportHandler.handleRequestBody(DataImportHandler.java:203)
    [junit] at org.apache.solr.handler.RequestHandlerBase.handleRequest(RequestHandlerBase.java:131)
    [junit] at org.apache.solr.core.SolrCore.execute(SolrCore.java:1322)
    [junit] at org.apache.solr.util.TestHarness.queryAndResponse(TestHarness.java:334)
    [junit] at org.apache.solr.util.TestHarness.query(TestHarness.java:321)
    [junit] at org.apache.solr.handler.dataimport.AbstractDataImportHandlerTestCase.runFullImport(AbstractDataImportHandlerTestCase.java:108)
    [junit] at org.apache.solr.handler.dataimport.TestDocBuilder2.testFileListEntityProcessor_lastIndexTime(TestDocBuilder2.java:245)
    [junit] at sun.reflect.NativeMethodAccessorImpl.invoke0(Native Method)
    [junit] at sun.reflect.NativeMethodAccessorImpl.invoke(NativeMethodAccessorImpl.java:39)
    [junit] at sun.reflect.DelegatingMethodAccessorImpl.invoke(DelegatingMethodAccessorImpl.java:25)
    [junit] at java.lang.reflect.Method.invoke(Method.java:585)
    [junit] at org.junit.runners.model.FrameworkMethod$1.runReflectiveCall(FrameworkMethod.java:44)
    [junit] at org.junit.internal.runners.model.ReflectiveCallable.run(ReflectiveCallable.java:15)
    [junit] at org.junit.runners.model.FrameworkMethod.invokeExplosively(FrameworkMethod.java:41)
    [junit] at org.junit.internal.runners.statements.InvokeMethod.evaluate(InvokeMethod.java:20)
    [junit] at org.junit.rules.TestWatchman$1.evaluate(TestWatchman.java:48)
    [junit] at org.junit.internal.runners.statements.RunBefores.evaluate(RunBefores.java:28)
    [junit] at org.junit.internal.runners.statements.RunAfters.evaluate(RunAfters.java:31)
    [junit] at org.junit.runners.BlockJUnit4ClassRunner.runChild(BlockJUnit4ClassRunner.java:76)
    [junit] at org.apache.lucene.util.LuceneTestCase$LuceneTestCaseRunner.runChild(LuceneTestCase.java:693)
    [junit] at org.apache.lucene.util.LuceneTestCase$LuceneTestCaseRunner.runChild(LuceneTestCase.java:666)
    [junit] at org.junit.runners.ParentRunner$3.run(ParentRunner.java:193)
    [junit] at org.junit.runners.ParentRunner$1.schedule(ParentRunner.java:52)
    [junit] at org.junit.runners.ParentRunner.runChildren(ParentRunner.java:191)
    [junit] at org.junit.runners.ParentRunner.access$000(ParentRunner.java:42)
    [junit] at org.junit.runners.ParentRunner$2.evaluate(ParentRunner.java:184)
    [junit] at org.junit.internal.runners.statements.RunBefores.evaluate(RunBefores.java:28)
    [junit] at org.junit.internal.runners.statements.RunAfters.evaluate(RunAfters.java:31)
    [junit] at org.junit.runners.ParentRunner.run(ParentRunner.java:236)
    [junit] at junit.framework.JUnit4TestAdapter.run(JUnit4TestAdapter.java:39)
    [junit] at org.apache.tools.ant.taskdefs.optional.junit.JUnitTestRunner.run(JUnitTestRunner.java:421)
    [junit] at org.apache.tools.ant.taskdefs.optional.junit.JUnitTestRunner.launch(JUnitTestRunner.java:912)
    [junit] at org.apache.tools.ant.taskdefs.optional.junit.JUnitTestRunner.main(JUnitTestRunner.java:743)
    [junit] Caused by: java.text.ParseException: Unparseable date: "1969-12-31 19:00:00"
    [junit] at java.text.DateFormat.parse(DateFormat.java:335)
    [junit] at org.apache.solr.handler.dataimport.FileListEntityProcessor.getDate(FileListEntityProcessor.java:165)
    [junit] ... 40 more
    [junit] ------------- ---------------- ---------------
    [junit] TEST org.apache.solr.handler.dataimport.TestDocBuilder2 FAILED
    [junit] Testsuite: org.apache.solr.handler.dataimport.TestEntityProcessorBase
    [junit] Tests run: 1, Failures: 0, Errors: 0, Time elapsed: 0.019 sec
    [junit]
    [junit] Testsuite: org.apache.solr.handler.dataimport.TestErrorHandling
    [junit] Tests run: 4, Failures: 0, Errors: 0, Time elapsed: 1.012 sec
    [junit]
    [junit] Testsuite: org.apache.solr.handler.dataimport.TestEvaluatorBag
    [junit] Tests run: 5, Failures: 0, Errors: 0, Time elapsed: 0.021 sec
    [junit]
    [junit] Testsuite: org.apache.solr.handler.dataimport.TestFieldReader
    [junit] Tests run: 1, Failures: 0, Errors: 0, Time elapsed: 0.014 sec
    [junit]
    [junit] Testsuite: org.apache.solr.handler.dataimport.TestFileListEntityProcessor
    [junit] Testcase: testNTOT(org.apache.solr.handler.dataimport.TestFileListEntityProcessor): Caused an ERROR
    [junit] Invalid expression for date
    [junit] org.apache.solr.handler.dataimport.DataImportHandlerException: Invalid expression for date
    [junit] at org.apache.solr.handler.dataimport.FileListEntityProcessor.getDate(FileListEntityProcessor.java:167)
    [junit] at org.apache.solr.handler.dataimport.FileListEntityProcessor.nextRow(FileListEntityProcessor.java:204)
    [junit] at org.apache.solr.handler.dataimport.TestFileListEntityProcessor.getFiles(TestFileListEntityProcessor.java:127)
    [junit] at org.apache.solr.handler.dataimport.TestFileListEntityProcessor.testNTOT(TestFileListEntityProcessor.java:166)
    [junit] at org.apache.lucene.util.LuceneTestCase$LuceneTestCaseRunner.runChild(LuceneTestCase.java:693)
    [junit] at org.apache.lucene.util.LuceneTestCase$LuceneTestCaseRunner.runChild(LuceneTestCase.java:666)
    [junit] Caused by: java.text.ParseException: Unparseable date: "2010-10-02 06:58:02"
    [junit] at java.text.DateFormat.parse(DateFormat.java:335)
    [junit] at org.apache.solr.handler.dataimport.FileListEntityProcessor.getDate(FileListEntityProcessor.java:165)
    [junit]
    [junit]
    [junit] Tests run: 4, Failures: 0, Errors: 1, Time elapsed: 0.02 sec
    [junit]
    [junit] ------------- Standard Output ---------------
    [junit] NOTE: reproduce with: ant test -Dtestcase=TestFileListEntityProcessor -Dtestmethod=testNTOT -Dtests.seed=572684061116443423:-5663898800630360505
    [junit] NOTE: test params are: locale=fi, timezone=Brazil/East
    [junit] ------------- ---------------- ---------------
    [junit] TEST org.apache.solr.handler.dataimport.TestFileListEntityProcessor FAILED
    [junit] Testsuite: org.apache.solr.handler.dataimport.TestJdbcDataSource
    [junit] Tests run: 3, Failures: 0, Errors: 0, Time elapsed: 0.055 sec
    [junit]
    [junit] Testsuite: org.apache.solr.handler.dataimport.TestLineEntityProcessor
    [junit] Tests run: 4, Failures: 0, Errors: 0, Time elapsed: 0.034 sec
    [junit]
    [junit] ------------- Standard Output ---------------
    [junit]
    [junit] rawLine=''
    [junit] rawLine='# this is what the output from 'find . -ls; looks like, athough the format'
    [junit] rawLine='# of the time stamp varies depending on the age of the file and your LANG '
    [junit] rawLine='# env setting'
    [junit] rawLine='412577 0 drwxr-xr-x 6 user group 204 1 Apr 10:53 /Volumes/spare/ts'
    [junit] rawLine='412582 0 drwxr-xr-x 13 user group 442 1 Apr 10:18 /Volumes/spare/ts/config'
    [junit] rawLine='412583 24 -rwxr-xr-x 1 user group 8318 1 Apr 11:10 /Volumes/spare/ts/config/dc.xsd'
    [junit] rawLine='412584 32 -rwxr-xr-x 1 user group 12847 1 Apr 11:10 /Volumes/spare/ts/config/dcterms.xsd'
    [junit] rawLine='412585 8 -rwxr-xr-x 1 user group 3156 1 Apr 11:10 /Volumes/spare/ts/config/s-deliver.css'
    [junit] rawLine='412586 192 -rwxr-xr-x 1 user group 97764 1 Apr 11:10 /Volumes/spare/ts/config/s-deliver.xsl'
    [junit] rawLine='412587 224 -rwxr-xr-x 1 user group 112700 1 Apr 11:10 /Volumes/spare/ts/config/sml-delivery-2.1.xsd'
    [junit] rawLine='412588 208 -rwxr-xr-x 1 user group 103419 1 Apr 11:10 /Volumes/spare/ts/config/sml-delivery-norm-2.0.dtd'
    [junit] rawLine='412589 248 -rwxr-xr-x 1 user group 125296 1 Apr 11:10 /Volumes/spare/ts/config/sml-delivery-norm-2.1.dtd'
    [junit] rawLine='412590 72 -rwxr-xr-x 1 user group 36256 1 Apr 11:10 /Volumes/spare/ts/config/jm.xsd'
    [junit] rawLine='412591 8 -rwxr-xr-x 1 user group 990 1 Apr 11:10 /Volumes/spare/ts/config/video.gif'
    [junit] rawLine='412592 8 -rwxr-xr-x 1 user group 1498 1 Apr 11:10 /Volumes/spare/ts/config/xlink.xsd'
    [junit] rawLine='412593 8 -rwxr-xr-x 1 user group 1155 1 Apr 11:10 /Volumes/spare/ts/config/xml.xsd'
    [junit] rawLine='412594 0 drwxr-xr-x 4 user group 136 1 Apr 10:18 /Volumes/spare/ts/acm19'
    [junit] rawLine='412621 0 drwxr-xr-x 57 user group 1938 1 Apr 10:18 /Volumes/spare/ts/acm19/data'
    [junit] rawLine='412622 24 -rwxr-xr-x 1 user group 8894 1 Apr 11:09 /Volumes/spare/ts/acm19/data/00000510.xml'
    [junit] rawLine='412623 32 -rwxr-xr-x 1 user group 14124 1 Apr 11:09 /Volumes/spare/ts/acm19/data/00000603.xml'
    [junit] rawLine='412624 24 -rwxr-xr-x 1 user group 11976 1 Apr 11:09 /Volumes/spare/ts/acm19/data/00001292.xml'
    [junit] rawLine='# tacked on an extra line to cause a file to be deleted.'
    [junit] rawLine='DELETE /Volumes/spare/ts/acm19/data/00001292old.xml'
    [junit] ------------- ---------------- ---------------
    [junit] Testsuite: org.apache.solr.handler.dataimport.TestNumberFormatTransformer
    [junit] Tests run: 9, Failures: 0, Errors: 0, Time elapsed: 0.028 sec
    [junit]
    [junit] Testsuite: org.apache.solr.handler.dataimport.TestPlainTextEntityProcessor
    [junit] Tests run: 1, Failures: 0, Errors: 0, Time elapsed: 0.021 sec
    [junit]
    [junit] Testsuite: org.apache.solr.handler.dataimport.TestRegexTransformer
    [junit] Tests run: 5, Failures: 0, Errors: 0, Time elapsed: 0.015 sec
    [junit]
    [junit] Testsuite: org.apache.solr.handler.dataimport.TestScriptTransformer
    [junit] Tests run: 0, Failures: 0, Errors: 0, Time elapsed: 0.011 sec
    [junit]
    [junit] Testsuite: org.apache.solr.handler.dataimport.TestSqlEntityProcessor
    [junit] Tests run: 4, Failures: 0, Errors: 0, Time elapsed: 0.023 sec
    [junit]
    [junit] xml response was: <?xml version="1.0" encoding="UTF-8"?>
    [junit] <response>
    [junit] <lst name="responseHeader"><int name="status">0</int><int name="QTime">3</int><lst name="params"><str name="rows">20</str><str name="start">0</str><str name="q">id:5</str><str name="qt">standard</str><str name="version">2.2</str></lst></lst><result name="response" numFound="0" start="0"/>
    [junit] </response>
    [junit]
    [junit] request was: rows=20&start=0&q=id:5&qt=standard&version=2.2)
    [junit] Testsuite: org.apache.solr.handler.dataimport.TestSqlEntityProcessor2
    [junit] Testcase: testLastIndexTime(org.apache.solr.handler.dataimport.TestSqlEntityProcessor2): FAILED
    [junit] query failed XPath: //*[@numFound='1']
    [junit] xml response was: <?xml version="1.0" encoding="UTF-8"?>
    [junit] <response>
    [junit] <lst name="responseHeader"><int name="status">0</int><int name="QTime">3</int><lst name="params"><str name="rows">20</str><str name="start">0</str><str name="q">id:5</str><str name="qt">standard</str><str name="version">2.2</str></lst></lst><result name="response" numFound="0" start="0"/>
    [junit] </response>
    [junit]
    [junit] request was: rows=20&start=0&q=id:5&qt=standard&version=2.2
    [junit] junit.framework.AssertionFailedError: query failed XPath: //*[@numFound='1']
    [junit] xml response was: <?xml version="1.0" encoding="UTF-8"?>
    [junit] <response>
    [junit] <lst name="responseHeader"><int name="status">0</int><int name="QTime">3</int><lst name="params"><str name="rows">20</str><str name="start">0</str><str name="q">id:5</str><str name="qt">standard</str><str name="version">2.2</str></lst></lst><result name="response" numFound="0" start="0"/>
    [junit] </response>
    [junit]
    [junit] request was: rows=20&start=0&q=id:5&qt=standard&version=2.2
    [junit] at org.apache.lucene.util.LuceneTestCase$LuceneTestCaseRunner.runChild(LuceneTestCase.java:693)
    [junit] at org.apache.lucene.util.LuceneTestCase$LuceneTestCaseRunner.runChild(LuceneTestCase.java:666)
    [junit] xml response was: <?xml version="1.0" encoding="UTF-8"?>
    [junit] <response>
    [junit] <lst name="responseHeader"><int name="status">0</int><int name="QTime">3</int><lst name="params"><str name="rows">20</str><str name="start">0</str><str name="q">id:5</str><str name="qt">standard</str><str name="version">2.2</str></lst></lst><result name="response" numFound="0" start="0"/>
    [junit] </response>
    [junit]
    [junit] request was: rows=20&start=0&q=id:5&qt=standard&version=2.2
    [junit] at org.apache.solr.util.AbstractSolrTestCase.assertQ(AbstractSolrTestCase.java:237)
    [junit] at org.apache.solr.util.AbstractSolrTestCase.assertQ(AbstractSolrTestCase.java:227)
    [junit] at org.apache.solr.handler.dataimport.TestSqlEntityProcessor2.testLastIndexTime(TestSqlEntityProcessor2.java:218)
    [junit]
    [junit]
    [junit] Tests run: 7, Failures: 1, Errors: 0, Time elapsed: 1.852 sec
    [junit]
    [junit] ------------- Standard Output ---------------
    [junit] NOTE: reproduce with: ant test -Dtestcase=TestSqlEntityProcessor2 -Dtestmethod=testLastIndexTime -Dtests.seed=445224230905445182:8257404862138200036
    [junit] NOTE: test params are: locale=en_CA, timezone=W-SU
    [junit] ------------- ---------------- ---------------
    [junit] TEST org.apache.solr.handler.dataimport.TestSqlEntityProcessor2 FAILED
    [junit] Testsuite: org.apache.solr.handler.dataimport.TestSqlEntityProcessorDelta
    [junit] Tests run: 8, Failures: 0, Errors: 0, Time elapsed: 2.842 sec
    [junit]
    [junit] Testsuite: org.apache.solr.handler.dataimport.TestSqlEntityProcessorDelta2
    [junit] Tests run: 8, Failures: 0, Errors: 0, Time elapsed: 2.51 sec
    [junit]
    [junit] Testsuite: org.apache.solr.handler.dataimport.TestTemplateString
    [junit] Tests run: 1, Failures: 0, Errors: 0, Time elapsed: 0.018 sec
    [junit]
    [junit] Testsuite: org.apache.solr.handler.dataimport.TestTemplateTransformer
    [junit] Tests run: 1, Failures: 0, Errors: 0, Time elapsed: 0.009 sec
    [junit]
    [junit] Testsuite: org.apache.solr.handler.dataimport.TestThreaded
    [junit] Tests run: 1, Failures: 0, Errors: 0, Time elapsed: 0.256 sec
    [junit]
    [junit] Testsuite: org.apache.solr.handler.dataimport.TestURLDataSource
    [junit] Tests run: 1, Failures: 0, Errors: 0, Time elapsed: 0.016 sec
    [junit]
    [junit] Testsuite: org.apache.solr.handler.dataimport.TestVariableResolver
    [junit] Tests run: 9, Failures: 0, Errors: 0, Time elapsed: 0.022 sec
    [junit]
    [junit] Testsuite: org.apache.solr.handler.dataimport.TestXPathEntityProcessor
    [junit] Tests run: 8, Failures: 0, Errors: 0, Time elapsed: 0.443 sec
    [junit]
    [junit] Testsuite: org.apache.solr.handler.dataimport.TestXPathRecordReader
    [junit] Tests run: 21, Failures: 0, Errors: 0, Time elapsed: 0.041 sec
    [junit]
    [junit] Tests FAILED

    BUILD FAILED
    /usr<https://hudson.apache.org/hudson/job/Solr-3.x/ws/branch_3x/solr/common-build.xml>:455: The following error occurred while executing this line:
    /usr<https://hudson.apache.org/hudson/job/Solr-3.x/ws/branch_3x/solr/common-build.xml>:316: The following error occurred while executing this line:
    /usr<https://hudson.apache.org/hudson/job/Solr-3.x/ws/branch_3x/solr/contrib/dataimporthandler/build.xml>:171: Tests failed!

    Total time: 21 minutes 41 seconds
    [TASKS] Skipping publisher since build result is FAILURE
    Publishing Javadoc
    Archiving artifacts
    Recording test results
    Publishing Clover coverage report...
    No Clover report will be published due to a Build Failure


    ---------------------------------------------------------------------
    To unsubscribe, e-mail: dev-unsubscribe@lucene.apache.org
    For additional commands, e-mail: dev-help@lucene.apache.org
  • Uwe Schindler at Oct 2, 2010 at 11:16 am
    These seem to be real errors, have no idea...

    -----
    Uwe Schindler
    H.-H.-Meier-Allee 63, D-28213 Bremen
    http://www.thetaphi.de
    eMail: uwe@thetaphi.de

    -----Original Message-----
    From: Apache Hudson Server
    Sent: Saturday, October 02, 2010 12:59 PM
    To: dev@lucene.apache.org
    Subject: Build failed in Hudson: Solr-3.x #121

    See <https://hudson.apache.org/hudson/job/Solr-3.x/121/>

    ------------------------------------------
    [...truncated 11158 lines...]
    [junit] at
    org.apache.solr.util.TestHarness.queryAndResponse(TestHarness.java:334)
    [junit] at org.apache.solr.util.TestHarness.query(TestHarness.java:321)
    [junit] at
    org.apache.solr.handler.dataimport.AbstractDataImportHandlerTestCase.runFu
    llImport(AbstractDataImportHandlerTestCase.java:108)
    [junit] at
    org.apache.solr.handler.dataimport.TestDocBuilder2.testFileListEntityProcessor
    _lastIndexTime(TestDocBuilder2.java:245)
    [junit] at sun.reflect.NativeMethodAccessorImpl.invoke0(Native
    Method)
    [junit] at
    sun.reflect.NativeMethodAccessorImpl.invoke(NativeMethodAccessorImpl.java:
    39)
    [junit] at
    sun.reflect.DelegatingMethodAccessorImpl.invoke(DelegatingMethodAccessorI
    mpl.java:25)
    [junit] at java.lang.reflect.Method.invoke(Method.java:585)
    [junit] at
    org.junit.runners.model.FrameworkMethod$1.runReflectiveCall(FrameworkMe
    thod.java:44)
    [junit] at
    org.junit.internal.runners.model.ReflectiveCallable.run(ReflectiveCallable.java:
    15)
    [junit] at
    org.junit.runners.model.FrameworkMethod.invokeExplosively(FrameworkMeth
    od.java:41)
    [junit] at
    org.junit.internal.runners.statements.InvokeMethod.evaluate(InvokeMethod.jav
    a:20)
    [junit] at
    org.junit.rules.TestWatchman$1.evaluate(TestWatchman.java:48)
    [junit] at
    org.junit.internal.runners.statements.RunBefores.evaluate(RunBefores.java:28)
    [junit] at
    org.junit.internal.runners.statements.RunAfters.evaluate(RunAfters.java:31)
    [junit] at
    org.junit.runners.BlockJUnit4ClassRunner.runChild(BlockJUnit4ClassRunner.java
    :76)
    [junit] at
    org.apache.lucene.util.LuceneTestCase$LuceneTestCaseRunner.runChild(Lucen
    eTestCase.java:693)
    [junit] at
    org.apache.lucene.util.LuceneTestCase$LuceneTestCaseRunner.runChild(Lucen
    eTestCase.java:666)
    [junit] at
    org.junit.runners.ParentRunner$3.run(ParentRunner.java:193)
    [junit] at
    org.junit.runners.ParentRunner$1.schedule(ParentRunner.java:52)
    [junit] at
    org.junit.runners.ParentRunner.runChildren(ParentRunner.java:191)
    [junit] at
    org.junit.runners.ParentRunner.access$000(ParentRunner.java:42)
    [junit] at
    org.junit.runners.ParentRunner$2.evaluate(ParentRunner.java:184)
    [junit] at
    org.junit.internal.runners.statements.RunBefores.evaluate(RunBefores.java:28)
    [junit] at
    org.junit.internal.runners.statements.RunAfters.evaluate(RunAfters.java:31)
    [junit] at org.junit.runners.ParentRunner.run(ParentRunner.java:236)
    [junit] at
    junit.framework.JUnit4TestAdapter.run(JUnit4TestAdapter.java:39)
    [junit] at
    org.apache.tools.ant.taskdefs.optional.junit.JUnitTestRunner.run(JUnitTestRunn
    er.java:421)
    [junit] at
    org.apache.tools.ant.taskdefs.optional.junit.JUnitTestRunner.launch(JUnitTestRu
    nner.java:912)
    [junit] at
    org.apache.tools.ant.taskdefs.optional.junit.JUnitTestRunner.main(JUnitTestRun
    ner.java:743)
    [junit] Caused by: java.text.ParseException: Unparseable date: "1969-12-31
    19:00:00"
    [junit] at java.text.DateFormat.parse(DateFormat.java:335)
    [junit] at
    org.apache.solr.handler.dataimport.FileListEntityProcessor.getDate(FileListEntit
    yProcessor.java:165)
    [junit] ... 40 more
    [junit] 2.10.2010 1:58:51 org.apache.solr.handler.dataimport.DataImporter
    doFullImport
    [junit] SEVERE: Full Import failed
    [junit] org.apache.solr.handler.dataimport.DataImportHandlerException:
    Invalid expression for date Processing Document # 1
    [junit] at
    org.apache.solr.handler.dataimport.FileListEntityProcessor.getDate(FileListEntit
    yProcessor.java:167)
    [junit] at
    org.apache.solr.handler.dataimport.FileListEntityProcessor.nextRow(FileListEnti
    tyProcessor.java:204)
    [junit] at
    org.apache.solr.handler.dataimport.EntityProcessorWrapper.nextRow(EntityPro
    cessorWrapper.java:233)
    [junit] at
    org.apache.solr.handler.dataimport.DocBuilder.buildDocument(DocBuilder.java
    :579)
    [junit] at
    org.apache.solr.handler.dataimport.DocBuilder.doFullDump(DocBuilder.java:26
    0)
    [junit] at
    org.apache.solr.handler.dataimport.DocBuilder.execute(DocBuilder.java:184)
    [junit] at
    org.apache.solr.handler.dataimport.DataImporter.doFullImport(DataImporter.j
    ava:334)
    [junit] at
    org.apache.solr.handler.dataimport.DataImporter.runCmd(DataImporter.java:3
    92)
    [junit] at
    org.apache.solr.handler.dataimport.DataImportHandler.handleRequestBody(Da
    taImportHandler.java:203)
    [junit] at
    org.apache.solr.handler.RequestHandlerBase.handleRequest(RequestHandlerB
    ase.java:131)
    [junit] at org.apache.solr.core.SolrCore.execute(SolrCore.java:1322)
    [junit] at
    org.apache.solr.util.TestHarness.queryAndResponse(TestHarness.java:334)
    [junit] at org.apache.solr.util.TestHarness.query(TestHarness.java:321)
    [junit] at
    org.apache.solr.handler.dataimport.AbstractDataImportHandlerTestCase.runFu
    llImport(AbstractDataImportHandlerTestCase.java:108)
    [junit] at
    org.apache.solr.handler.dataimport.TestDocBuilder2.testFileListEntityProcessor
    _lastIndexTime(TestDocBuilder2.java:245)
    [junit] at sun.reflect.NativeMethodAccessorImpl.invoke0(Native
    Method)
    [junit] at
    sun.reflect.NativeMethodAccessorImpl.invoke(NativeMethodAccessorImpl.java:
    39)
    [junit] at
    sun.reflect.DelegatingMethodAccessorImpl.invoke(DelegatingMethodAccessorI
    mpl.java:25)
    [junit] at java.lang.reflect.Method.invoke(Method.java:585)
    [junit] at
    org.junit.runners.model.FrameworkMethod$1.runReflectiveCall(FrameworkMe
    thod.java:44)
    [junit] at
    org.junit.internal.runners.model.ReflectiveCallable.run(ReflectiveCallable.java:
    15)
    [junit] at
    org.junit.runners.model.FrameworkMethod.invokeExplosively(FrameworkMeth
    od.java:41)
    [junit] at
    org.junit.internal.runners.statements.InvokeMethod.evaluate(InvokeMethod.jav
    a:20)
    [junit] at
    org.junit.rules.TestWatchman$1.evaluate(TestWatchman.java:48)
    [junit] at
    org.junit.internal.runners.statements.RunBefores.evaluate(RunBefores.java:28)
    [junit] at
    org.junit.internal.runners.statements.RunAfters.evaluate(RunAfters.java:31)
    [junit] at
    org.junit.runners.BlockJUnit4ClassRunner.runChild(BlockJUnit4ClassRunner.java
    :76)
    [junit] at
    org.apache.lucene.util.LuceneTestCase$LuceneTestCaseRunner.runChild(Lucen
    eTestCase.java:693)
    [junit] at
    org.apache.lucene.util.LuceneTestCase$LuceneTestCaseRunner.runChild(Lucen
    eTestCase.java:666)
    [junit] at
    org.junit.runners.ParentRunner$3.run(ParentRunner.java:193)
    [junit] at
    org.junit.runners.ParentRunner$1.schedule(ParentRunner.java:52)
    [junit] at
    org.junit.runners.ParentRunner.runChildren(ParentRunner.java:191)
    [junit] at
    org.junit.runners.ParentRunner.access$000(ParentRunner.java:42)
    [junit] at
    org.junit.runners.ParentRunner$2.evaluate(ParentRunner.java:184)
    [junit] at
    org.junit.internal.runners.statements.RunBefores.evaluate(RunBefores.java:28)
    [junit] at
    org.junit.internal.runners.statements.RunAfters.evaluate(RunAfters.java:31)
    [junit] at org.junit.runners.ParentRunner.run(ParentRunner.java:236)
    [junit] at
    junit.framework.JUnit4TestAdapter.run(JUnit4TestAdapter.java:39)
    [junit] at
    org.apache.tools.ant.taskdefs.optional.junit.JUnitTestRunner.run(JUnitTestRunn
    er.java:421)
    [junit] at
    org.apache.tools.ant.taskdefs.optional.junit.JUnitTestRunner.launch(JUnitTestRu
    nner.java:912)
    [junit] at
    org.apache.tools.ant.taskdefs.optional.junit.JUnitTestRunner.main(JUnitTestRun
    ner.java:743)
    [junit] Caused by: java.text.ParseException: Unparseable date: "1969-12-31
    19:00:00"
    [junit] at java.text.DateFormat.parse(DateFormat.java:335)
    [junit] at
    org.apache.solr.handler.dataimport.FileListEntityProcessor.getDate(FileListEntit
    yProcessor.java:165)
    [junit] ... 40 more
    [junit] ------------- ---------------- ---------------
    [junit] TEST org.apache.solr.handler.dataimport.TestDocBuilder2 FAILED
    [junit] Testsuite: org.apache.solr.handler.dataimport.TestEntityProcessorBase
    [junit] Tests run: 1, Failures: 0, Errors: 0, Time elapsed: 0.019 sec
    [junit]
    [junit] Testsuite: org.apache.solr.handler.dataimport.TestErrorHandling
    [junit] Tests run: 4, Failures: 0, Errors: 0, Time elapsed: 1.012 sec
    [junit]
    [junit] Testsuite: org.apache.solr.handler.dataimport.TestEvaluatorBag
    [junit] Tests run: 5, Failures: 0, Errors: 0, Time elapsed: 0.021 sec
    [junit]
    [junit] Testsuite: org.apache.solr.handler.dataimport.TestFieldReader
    [junit] Tests run: 1, Failures: 0, Errors: 0, Time elapsed: 0.014 sec
    [junit]
    [junit] Testsuite:
    org.apache.solr.handler.dataimport.TestFileListEntityProcessor
    [junit] Testcase:
    testNTOT(org.apache.solr.handler.dataimport.TestFileListEntityProcessor):
    Caused an ERROR
    [junit] Invalid expression for date
    [junit] org.apache.solr.handler.dataimport.DataImportHandlerException:
    Invalid expression for date
    [junit] at
    org.apache.solr.handler.dataimport.FileListEntityProcessor.getDate(FileListEntit
    yProcessor.java:167)
    [junit] at
    org.apache.solr.handler.dataimport.FileListEntityProcessor.nextRow(FileListEnti
    tyProcessor.java:204)
    [junit] at
    org.apache.solr.handler.dataimport.TestFileListEntityProcessor.getFiles(TestFile
    ListEntityProcessor.java:127)
    [junit] at
    org.apache.solr.handler.dataimport.TestFileListEntityProcessor.testNTOT(TestFi
    leListEntityProcessor.java:166)
    [junit] at
    org.apache.lucene.util.LuceneTestCase$LuceneTestCaseRunner.runChild(Lucen
    eTestCase.java:693)
    [junit] at
    org.apache.lucene.util.LuceneTestCase$LuceneTestCaseRunner.runChild(Lucen
    eTestCase.java:666)
    [junit] Caused by: java.text.ParseException: Unparseable date: "2010-10-02
    06:58:02"
    [junit] at java.text.DateFormat.parse(DateFormat.java:335)
    [junit] at
    org.apache.solr.handler.dataimport.FileListEntityProcessor.getDate(FileListEntit
    yProcessor.java:165)
    [junit]
    [junit]
    [junit] Tests run: 4, Failures: 0, Errors: 1, Time elapsed: 0.02 sec
    [junit]
    [junit] ------------- Standard Output ---------------
    [junit] NOTE: reproduce with: ant test -Dtestcase=TestFileListEntityProcessor
    -Dtestmethod=testNTOT -Dtests.seed=572684061116443423:-
    5663898800630360505
    [junit] NOTE: test params are: locale=fi, timezone=Brazil/East
    [junit] ------------- ---------------- ---------------
    [junit] TEST org.apache.solr.handler.dataimport.TestFileListEntityProcessor
    FAILED
    [junit] Testsuite: org.apache.solr.handler.dataimport.TestJdbcDataSource
    [junit] Tests run: 3, Failures: 0, Errors: 0, Time elapsed: 0.055 sec
    [junit]
    [junit] Testsuite: org.apache.solr.handler.dataimport.TestLineEntityProcessor
    [junit] Tests run: 4, Failures: 0, Errors: 0, Time elapsed: 0.034 sec
    [junit]
    [junit] ------------- Standard Output ---------------
    [junit]
    [junit] rawLine=''
    [junit] rawLine='# this is what the output from 'find . -ls; looks like,
    athough the format'
    [junit] rawLine='# of the time stamp varies depending on the age of the
    file and your LANG '
    [junit] rawLine='# env setting'
    [junit] rawLine='412577 0 drwxr-xr-x 6 user group 204 1 Apr 10:53
    /Volumes/spare/ts'
    [junit] rawLine='412582 0 drwxr-xr-x 13 user group 442 1 Apr 10:18
    /Volumes/spare/ts/config'
    [junit] rawLine='412583 24 -rwxr-xr-x 1 user group 8318 1 Apr 11:10
    /Volumes/spare/ts/config/dc.xsd'
    [junit] rawLine='412584 32 -rwxr-xr-x 1 user group 12847 1 Apr 11:10
    /Volumes/spare/ts/config/dcterms.xsd'
    [junit] rawLine='412585 8 -rwxr-xr-x 1 user group 3156 1 Apr 11:10
    /Volumes/spare/ts/config/s-deliver.css'
    [junit] rawLine='412586 192 -rwxr-xr-x 1 user group 97764 1 Apr 11:10
    /Volumes/spare/ts/config/s-deliver.xsl'
    [junit] rawLine='412587 224 -rwxr-xr-x 1 user group 112700 1 Apr 11:10
    /Volumes/spare/ts/config/sml-delivery-2.1.xsd'
    [junit] rawLine='412588 208 -rwxr-xr-x 1 user group 103419 1 Apr 11:10
    /Volumes/spare/ts/config/sml-delivery-norm-2.0.dtd'
    [junit] rawLine='412589 248 -rwxr-xr-x 1 user group 125296 1 Apr 11:10
    /Volumes/spare/ts/config/sml-delivery-norm-2.1.dtd'
    [junit] rawLine='412590 72 -rwxr-xr-x 1 user group 36256 1 Apr 11:10
    /Volumes/spare/ts/config/jm.xsd'
    [junit] rawLine='412591 8 -rwxr-xr-x 1 user group 990 1 Apr 11:10
    /Volumes/spare/ts/config/video.gif'
    [junit] rawLine='412592 8 -rwxr-xr-x 1 user group 1498 1 Apr 11:10
    /Volumes/spare/ts/config/xlink.xsd'
    [junit] rawLine='412593 8 -rwxr-xr-x 1 user group 1155 1 Apr 11:10
    /Volumes/spare/ts/config/xml.xsd'
    [junit] rawLine='412594 0 drwxr-xr-x 4 user group 136 1 Apr 10:18
    /Volumes/spare/ts/acm19'
    [junit] rawLine='412621 0 drwxr-xr-x 57 user group 1938 1 Apr 10:18
    /Volumes/spare/ts/acm19/data'
    [junit] rawLine='412622 24 -rwxr-xr-x 1 user group 8894 1 Apr 11:09
    /Volumes/spare/ts/acm19/data/00000510.xml'
    [junit] rawLine='412623 32 -rwxr-xr-x 1 user group 14124 1 Apr 11:09
    /Volumes/spare/ts/acm19/data/00000603.xml'
    [junit] rawLine='412624 24 -rwxr-xr-x 1 user group 11976 1 Apr 11:09
    /Volumes/spare/ts/acm19/data/00001292.xml'
    [junit] rawLine='# tacked on an extra line to cause a file to be deleted.'
    [junit] rawLine='DELETE
    /Volumes/spare/ts/acm19/data/00001292old.xml'
    [junit] ------------- ---------------- ---------------
    [junit] Testsuite:
    org.apache.solr.handler.dataimport.TestNumberFormatTransformer
    [junit] Tests run: 9, Failures: 0, Errors: 0, Time elapsed: 0.028 sec
    [junit]
    [junit] Testsuite:
    org.apache.solr.handler.dataimport.TestPlainTextEntityProcessor
    [junit] Tests run: 1, Failures: 0, Errors: 0, Time elapsed: 0.021 sec
    [junit]
    [junit] Testsuite: org.apache.solr.handler.dataimport.TestRegexTransformer
    [junit] Tests run: 5, Failures: 0, Errors: 0, Time elapsed: 0.015 sec
    [junit]
    [junit] Testsuite: org.apache.solr.handler.dataimport.TestScriptTransformer
    [junit] Tests run: 0, Failures: 0, Errors: 0, Time elapsed: 0.011 sec
    [junit]
    [junit] Testsuite: org.apache.solr.handler.dataimport.TestSqlEntityProcessor
    [junit] Tests run: 4, Failures: 0, Errors: 0, Time elapsed: 0.023 sec
    [junit]
    [junit] xml response was: <?xml version="1.0" encoding="UTF-8"?>
    [junit] <response>
    [junit] <lst name="responseHeader"><int name="status">0</int><int
    name="QTime">3</int><lst name="params"><str name="rows">20</str><str
    name="start">0</str><str name="q">id:5</str><str
    name="qt">standard</str><str name="version">2.2</str></lst></lst><result
    name="response" numFound="0" start="0"/>
    [junit] </response>
    [junit]
    [junit] request was: rows=20&start=0&q=id:5&qt=standard&version=2.2)
    [junit] Testsuite: org.apache.solr.handler.dataimport.TestSqlEntityProcessor2
    [junit] Testcase:
    testLastIndexTime(org.apache.solr.handler.dataimport.TestSqlEntityProcessor2)
    : FAILED
    [junit] query failed XPath: //*[@numFound='1']
    [junit] xml response was: <?xml version="1.0" encoding="UTF-8"?>
    [junit] <response>
    [junit] <lst name="responseHeader"><int name="status">0</int><int
    name="QTime">3</int><lst name="params"><str name="rows">20</str><str
    name="start">0</str><str name="q">id:5</str><str
    name="qt">standard</str><str name="version">2.2</str></lst></lst><result
    name="response" numFound="0" start="0"/>
    [junit] </response>
    [junit]
    [junit] request was: rows=20&start=0&q=id:5&qt=standard&version=2.2
    [junit] junit.framework.AssertionFailedError: query failed XPath:
    //*[@numFound='1']
    [junit] xml response was: <?xml version="1.0" encoding="UTF-8"?>
    [junit] <response>
    [junit] <lst name="responseHeader"><int name="status">0</int><int
    name="QTime">3</int><lst name="params"><str name="rows">20</str><str
    name="start">0</str><str name="q">id:5</str><str
    name="qt">standard</str><str name="version">2.2</str></lst></lst><result
    name="response" numFound="0" start="0"/>
    [junit] </response>
    [junit]
    [junit] request was: rows=20&start=0&q=id:5&qt=standard&version=2.2
    [junit] at
    org.apache.lucene.util.LuceneTestCase$LuceneTestCaseRunner.runChild(Lucen
    eTestCase.java:693)
    [junit] at
    org.apache.lucene.util.LuceneTestCase$LuceneTestCaseRunner.runChild(Lucen
    eTestCase.java:666)
    [junit] xml response was: <?xml version="1.0" encoding="UTF-8"?>
    [junit] <response>
    [junit] <lst name="responseHeader"><int name="status">0</int><int
    name="QTime">3</int><lst name="params"><str name="rows">20</str><str
    name="start">0</str><str name="q">id:5</str><str
    name="qt">standard</str><str name="version">2.2</str></lst></lst><result
    name="response" numFound="0" start="0"/>
    [junit] </response>
    [junit]
    [junit] request was: rows=20&start=0&q=id:5&qt=standard&version=2.2
    [junit] at
    org.apache.solr.util.AbstractSolrTestCase.assertQ(AbstractSolrTestCase.java:23
    7)
    [junit] at
    org.apache.solr.util.AbstractSolrTestCase.assertQ(AbstractSolrTestCase.java:22
    7)
    [junit] at
    org.apache.solr.handler.dataimport.TestSqlEntityProcessor2.testLastIndexTime(
    TestSqlEntityProcessor2.java:218)
    [junit]
    [junit]
    [junit] Tests run: 7, Failures: 1, Errors: 0, Time elapsed: 1.852 sec
    [junit]
    [junit] ------------- Standard Output ---------------
    [junit] NOTE: reproduce with: ant test -Dtestcase=TestSqlEntityProcessor2 -
    Dtestmethod=testLastIndexTime -
    Dtests.seed=445224230905445182:8257404862138200036
    [junit] NOTE: test params are: locale=en_CA, timezone=W-SU
    [junit] ------------- ---------------- ---------------
    [junit] TEST org.apache.solr.handler.dataimport.TestSqlEntityProcessor2
    FAILED
    [junit] Testsuite:
    org.apache.solr.handler.dataimport.TestSqlEntityProcessorDelta
    [junit] Tests run: 8, Failures: 0, Errors: 0, Time elapsed: 2.842 sec
    [junit]
    [junit] Testsuite:
    org.apache.solr.handler.dataimport.TestSqlEntityProcessorDelta2
    [junit] Tests run: 8, Failures: 0, Errors: 0, Time elapsed: 2.51 sec
    [junit]
    [junit] Testsuite: org.apache.solr.handler.dataimport.TestTemplateString
    [junit] Tests run: 1, Failures: 0, Errors: 0, Time elapsed: 0.018 sec
    [junit]
    [junit] Testsuite:
    org.apache.solr.handler.dataimport.TestTemplateTransformer
    [junit] Tests run: 1, Failures: 0, Errors: 0, Time elapsed: 0.009 sec
    [junit]
    [junit] Testsuite: org.apache.solr.handler.dataimport.TestThreaded
    [junit] Tests run: 1, Failures: 0, Errors: 0, Time elapsed: 0.256 sec
    [junit]
    [junit] Testsuite: org.apache.solr.handler.dataimport.TestURLDataSource
    [junit] Tests run: 1, Failures: 0, Errors: 0, Time elapsed: 0.016 sec
    [junit]
    [junit] Testsuite: org.apache.solr.handler.dataimport.TestVariableResolver
    [junit] Tests run: 9, Failures: 0, Errors: 0, Time elapsed: 0.022 sec
    [junit]
    [junit] Testsuite:
    org.apache.solr.handler.dataimport.TestXPathEntityProcessor
    [junit] Tests run: 8, Failures: 0, Errors: 0, Time elapsed: 0.443 sec
    [junit]
    [junit] Testsuite: org.apache.solr.handler.dataimport.TestXPathRecordReader
    [junit] Tests run: 21, Failures: 0, Errors: 0, Time elapsed: 0.041 sec
    [junit]
    [junit] Tests FAILED

    BUILD FAILED
    /usr<https://hudson.apache.org/hudson/job/Solr-
    3.x/ws/branch_3x/solr/common-build.xml>:455: The following error occurred
    while executing this line:
    /usr<https://hudson.apache.org/hudson/job/Solr-
    3.x/ws/branch_3x/solr/common-build.xml>:316: The following error occurred
    while executing this line:
    /usr<https://hudson.apache.org/hudson/job/Solr-
    3.x/ws/branch_3x/solr/contrib/dataimporthandler/build.xml>:171: Tests failed!

    Total time: 21 minutes 41 seconds
    [TASKS] Skipping publisher since build result is FAILURE Publishing Javadoc
    Archiving artifacts Recording test results Publishing Clover coverage report...
    No Clover report will be published due to a Build Failure


    ---------------------------------------------------------------------
    To unsubscribe, e-mail: dev-unsubscribe@lucene.apache.org For additional
    commands, e-mail: dev-help@lucene.apache.org


    ---------------------------------------------------------------------
    To unsubscribe, e-mail: dev-unsubscribe@lucene.apache.org
    For additional commands, e-mail: dev-help@lucene.apache.org
  • Apache Hudson Server at Oct 3, 2010 at 5:29 am
    See <https://hudson.apache.org/hudson/job/Solr-3.x/122/changes>

    Changes:

    [rmuir] regenerate with consistent newlines, and fix eol-style

    [rmuir] add missing eol-style

    [rmuir] clean up some fallthru/deprecation warnings

    [rmuir] merge warnings enabling and fixing of some trivial ones

    [uschindler] remove useless maven lib support (is included on hudson's ant)

    ------------------------------------------
    [...truncated 7484 lines...]
    [junit] Tests run: 3, Failures: 0, Errors: 0, Time elapsed: 0.935 sec
    [junit]
    [junit] Testsuite: org.apache.solr.handler.JsonLoaderTest
    [junit] Tests run: 1, Failures: 0, Errors: 0, Time elapsed: 0.032 sec
    [junit]
    [junit] Testsuite: org.apache.solr.handler.MoreLikeThisHandlerTest
    [junit] Tests run: 1, Failures: 0, Errors: 0, Time elapsed: 0.86 sec
    [junit]
    [junit] Testsuite: org.apache.solr.handler.SpellCheckerRequestHandlerTest
    [junit] Tests run: 5, Failures: 0, Errors: 0, Time elapsed: 1.55 sec
    [junit]
    [junit] Testsuite: org.apache.solr.handler.StandardRequestHandlerTest
    [junit] Tests run: 1, Failures: 0, Errors: 0, Time elapsed: 0.768 sec
    [junit]
    [junit] Testsuite: org.apache.solr.handler.TestCSVLoader
    [junit] Tests run: 4, Failures: 0, Errors: 0, Time elapsed: 1.472 sec
    [junit]
    [junit] Testsuite: org.apache.solr.handler.TestReplicationHandler
    [junit] Tests run: 7, Failures: 0, Errors: 0, Time elapsed: 31.908 sec
    [junit]
    [junit] Testsuite: org.apache.solr.handler.XmlUpdateRequestHandlerTest
    [junit] Tests run: 1, Failures: 0, Errors: 0, Time elapsed: 0.723 sec
    [junit]
    [junit] Testsuite: org.apache.solr.handler.admin.LukeRequestHandlerTest
    [junit] Tests run: 1, Failures: 0, Errors: 0, Time elapsed: 1.894 sec
    [junit]
    [junit] Testsuite: org.apache.solr.handler.admin.SystemInfoHandlerTest
    [junit] Tests run: 1, Failures: 0, Errors: 0, Time elapsed: 0.345 sec
    [junit]
    [junit] Testsuite: org.apache.solr.handler.component.DistributedSpellCheckComponentTest
    [junit] Tests run: 1, Failures: 0, Errors: 0, Time elapsed: 9.029 sec
    [junit]
    [junit] Testsuite: org.apache.solr.handler.component.DistributedTermsComponentTest
    [junit] Tests run: 1, Failures: 0, Errors: 0, Time elapsed: 8.395 sec
    [junit]
    [junit] Testsuite: org.apache.solr.handler.component.QueryElevationComponentTest
    [junit] Tests run: 4, Failures: 0, Errors: 0, Time elapsed: 0.9 sec
    [junit]
    [junit] Testsuite: org.apache.solr.handler.component.SearchHandlerTest
    [junit] Tests run: 1, Failures: 0, Errors: 0, Time elapsed: 0.666 sec
    [junit]
    [junit] Testsuite: org.apache.solr.handler.component.SpellCheckComponentTest
    [junit] Tests run: 10, Failures: 0, Errors: 0, Time elapsed: 1.219 sec
    [junit]
    [junit] Testsuite: org.apache.solr.handler.component.StatsComponentTest
    [junit] Tests run: 1, Failures: 0, Errors: 0, Time elapsed: 2.898 sec
    [junit]
    [junit] Testsuite: org.apache.solr.handler.component.TermVectorComponentTest
    [junit] Tests run: 5, Failures: 0, Errors: 0, Time elapsed: 0.785 sec
    [junit]
    [junit] Testsuite: org.apache.solr.handler.component.TermsComponentTest
    [junit] Tests run: 13, Failures: 0, Errors: 0, Time elapsed: 0.65 sec
    [junit]
    [junit] Testsuite: org.apache.solr.highlight.FastVectorHighlighterTest
    [junit] Tests run: 2, Failures: 0, Errors: 0, Time elapsed: 0.881 sec
    [junit]
    [junit] Testsuite: org.apache.solr.highlight.HighlighterConfigTest
    [junit] Tests run: 1, Failures: 0, Errors: 0, Time elapsed: 0.468 sec
    [junit]
    [junit] Testsuite: org.apache.solr.highlight.HighlighterTest
    [junit] Tests run: 23, Failures: 0, Errors: 0, Time elapsed: 3.369 sec
    [junit]
    [junit] Testsuite: org.apache.solr.request.JSONWriterTest
    [junit] Tests run: 3, Failures: 0, Errors: 0, Time elapsed: 0.85 sec
    [junit]
    [junit] Testsuite: org.apache.solr.request.SimpleFacetsTest
    [junit] Tests run: 7, Failures: 0, Errors: 0, Time elapsed: 3.38 sec
    [junit]
    [junit] Testsuite: org.apache.solr.request.TestBinaryResponseWriter
    [junit] Tests run: 1, Failures: 0, Errors: 0, Time elapsed: 0.518 sec
    [junit]
    [junit] Testsuite: org.apache.solr.request.TestFaceting
    [junit] Tests run: 3, Failures: 0, Errors: 0, Time elapsed: 3.799 sec
    [junit]
    [junit] Testsuite: org.apache.solr.request.TestWriterPerf
    [junit] Tests run: 1, Failures: 0, Errors: 0, Time elapsed: 0.826 sec
    [junit]
    [junit] ------------- Standard Output ---------------
    [junit] writer xml, size=7211, encodeRate=666, decodeRate=222
    [junit] writer json, size=4497, encodeRate=105, decodeRate=N/A
    [junit] writer javabin, size=2006, encodeRate=N/A, decodeRate=N/A
    [junit] ------------- ---------------- ---------------
    [junit] Testsuite: org.apache.solr.response.TestCSVResponseWriter
    [junit] Tests run: 1, Failures: 0, Errors: 0, Time elapsed: 0.845 sec
    [junit]
    [junit] Testsuite: org.apache.solr.schema.BadIndexSchemaTest
    [junit] Tests run: 1, Failures: 0, Errors: 0, Time elapsed: 0.265 sec
    [junit]
    [junit] Testsuite: org.apache.solr.schema.CopyFieldTest
    [junit] Tests run: 6, Failures: 0, Errors: 0, Time elapsed: 0.609 sec
    [junit]
    [junit] Testsuite: org.apache.solr.schema.DateFieldTest
    [junit] Tests run: 6, Failures: 0, Errors: 0, Time elapsed: 0.058 sec
    [junit]
    [junit] Testsuite: org.apache.solr.schema.IndexSchemaTest
    [junit] Tests run: 5, Failures: 0, Errors: 0, Time elapsed: 0.852 sec
    [junit]
    [junit] Testsuite: org.apache.solr.schema.LegacyDateFieldTest
    [junit] Tests run: 4, Failures: 0, Errors: 0, Time elapsed: 0.029 sec
    [junit]
    [junit] Testsuite: org.apache.solr.schema.NotRequiredUniqueKeyTest
    [junit] Tests run: 1, Failures: 0, Errors: 0, Time elapsed: 0.282 sec
    [junit]
    [junit] Testsuite: org.apache.solr.schema.PolyFieldTest
    [junit] Tests run: 4, Failures: 0, Errors: 0, Time elapsed: 1.038 sec
    [junit]
    [junit] Testsuite: org.apache.solr.schema.RequiredFieldsTest
    [junit] Tests run: 3, Failures: 0, Errors: 0, Time elapsed: 6.233 sec
    [junit]
    [junit] Testsuite: org.apache.solr.schema.TestBinaryField
    [junit] Tests run: 1, Failures: 0, Errors: 0, Time elapsed: 0.369 sec
    [junit]
    [junit] Testsuite: org.apache.solr.schema.UUIDFieldTest
    [junit] Tests run: 1, Failures: 0, Errors: 0, Time elapsed: 0.013 sec
    [junit]
    [junit] Testsuite: org.apache.solr.search.FunctionQParserTest
    [junit] Tests run: 1, Failures: 0, Errors: 0, Time elapsed: 0.303 sec
    [junit]
    [junit] Testsuite: org.apache.solr.search.QueryParsingTest
    [junit] Tests run: 2, Failures: 0, Errors: 0, Time elapsed: 0.797 sec
    [junit]
    [junit] Testsuite: org.apache.solr.search.SpatialFilterTest
    [junit] Tests run: 3, Failures: 0, Errors: 0, Time elapsed: 1.089 sec
    [junit]
    [junit] Testsuite: org.apache.solr.search.TestDocSet
    [junit] Tests run: 2, Failures: 0, Errors: 0, Time elapsed: 0.697 sec
    [junit]
    [junit] Testsuite: org.apache.solr.search.TestExtendedDismaxParser
    [junit] Tests run: 1, Failures: 0, Errors: 0, Time elapsed: 0.739 sec
    [junit]
    [junit] Testsuite: org.apache.solr.search.TestFastLRUCache
    [junit] Tests run: 2, Failures: 0, Errors: 0, Time elapsed: 0.011 sec
    [junit]
    [junit] Testsuite: org.apache.solr.search.TestIndexSearcher
    [junit] Tests run: 1, Failures: 0, Errors: 0, Time elapsed: 0.553 sec
    [junit]
    [junit] Testsuite: org.apache.solr.search.TestQueryTypes
    [junit] Tests run: 1, Failures: 0, Errors: 0, Time elapsed: 0.895 sec
    [junit]
    [junit] Testsuite: org.apache.solr.search.TestQueryUtils
    [junit] Tests run: 1, Failures: 0, Errors: 0, Time elapsed: 1.002 sec
    [junit]
    [junit] Testsuite: org.apache.solr.search.TestRangeQuery
    [junit] Tests run: 2, Failures: 0, Errors: 0, Time elapsed: 21.573 sec
    [junit]
    [junit] Testsuite: org.apache.solr.search.TestSearchPerf
    [junit] Tests run: 1, Failures: 0, Errors: 0, Time elapsed: 0.45 sec
    [junit]
    [junit] Testsuite: org.apache.solr.search.TestSolrQueryParser
    [junit] Tests run: 1, Failures: 0, Errors: 0, Time elapsed: 0.73 sec
    [junit]
    [junit] Testsuite: org.apache.solr.search.TestSort
    [junit] Tests run: 1, Failures: 0, Errors: 0, Time elapsed: 1.716 sec
    [junit]
    [junit] Testsuite: org.apache.solr.search.function.SortByFunctionTest
    [junit] Tests run: 1, Failures: 0, Errors: 0, Time elapsed: 0.587 sec
    [junit]
    [junit] Testsuite: org.apache.solr.search.function.TestFunctionQuery
    [junit] Tests run: 7, Failures: 0, Errors: 0, Time elapsed: 1.761 sec
    [junit]
    [junit] Testsuite: org.apache.solr.search.function.distance.DistanceFunctionTest
    [junit] Tests run: 2, Failures: 0, Errors: 0, Time elapsed: 0.494 sec
    [junit]
    [junit] Testsuite: org.apache.solr.servlet.CacheHeaderTest
    [junit] Tests run: 5, Failures: 0, Errors: 0, Time elapsed: 0.826 sec
    [junit]
    [junit] Testsuite: org.apache.solr.servlet.DirectSolrConnectionTest
    [junit] Tests run: 2, Failures: 0, Errors: 0, Time elapsed: 0.398 sec
    [junit]
    [junit] Testsuite: org.apache.solr.servlet.NoCacheHeaderTest
    [junit] Tests run: 3, Failures: 0, Errors: 0, Time elapsed: 0.932 sec
    [junit]
    [junit] Testsuite: org.apache.solr.servlet.SolrRequestParserTest
    [junit] Tests run: 4, Failures: 0, Errors: 0, Time elapsed: 0.776 sec
    [junit]
    [junit] Testsuite: org.apache.solr.spelling.FileBasedSpellCheckerTest
    [junit] Tests run: 3, Failures: 0, Errors: 0, Time elapsed: 0.796 sec
    [junit]
    [junit] Testsuite: org.apache.solr.spelling.IndexBasedSpellCheckerTest
    [junit] Tests run: 5, Failures: 0, Errors: 0, Time elapsed: 0.806 sec
    [junit]
    [junit] Testsuite: org.apache.solr.spelling.SpellingQueryConverterTest
    [junit] Tests run: 4, Failures: 0, Errors: 0, Time elapsed: 0.022 sec
    [junit]
    [junit] Testsuite: org.apache.solr.spelling.suggest.SuggesterTest
    [junit] Tests run: 2, Failures: 0, Errors: 0, Time elapsed: 0.496 sec
    [junit]
    [junit] Testsuite: org.apache.solr.update.AutoCommitTest
    [junit] Tests run: 1, Failures: 0, Errors: 0, Time elapsed: 4.524 sec
    [junit]
    [junit] Testsuite: org.apache.solr.update.DirectUpdateHandlerOptimizeTest
    [junit] Tests run: 1, Failures: 0, Errors: 0, Time elapsed: 0.724 sec
    [junit]
    [junit] Testsuite: org.apache.solr.update.DirectUpdateHandlerTest
    [junit] Tests run: 7, Failures: 0, Errors: 0, Time elapsed: 5.497 sec
    [junit]
    [junit] Testsuite: org.apache.solr.update.DocumentBuilderTest
    [junit] Tests run: 3, Failures: 0, Errors: 0, Time elapsed: 0.616 sec
    [junit]
    [junit] Testsuite: org.apache.solr.update.TestIndexingPerformance
    [junit] Tests run: 1, Failures: 0, Errors: 0, Time elapsed: 0.753 sec
    [junit]
    [junit] ------------- Standard Output ---------------
    [junit] includeDoc=true doc=[text, simple, text, test, text, how now brown cow, text, what's that?, text, radical!, text, what's all this about, anyway?, text, just how fast is this text indexing?]
    [junit] iter=1000 time=171 throughput=5847
    [junit] ------------- ---------------- ---------------
    [junit] Testsuite: org.apache.solr.update.processor.SignatureUpdateProcessorFactoryTest
    [junit] Tests run: 2, Failures: 0, Errors: 0, Time elapsed: 7.933 sec
    [junit]
    [junit] Testsuite: org.apache.solr.update.processor.UpdateRequestProcessorFactoryTest
    [junit] Tests run: 1, Failures: 0, Errors: 0, Time elapsed: 1.001 sec
    [junit]
    [junit] Testsuite: org.apache.solr.util.ArraysUtilsTest
    [junit] Tests run: 1, Failures: 0, Errors: 0, Time elapsed: 0.017 sec
    [junit]
    [junit] Testsuite: org.apache.solr.util.DateMathParserTest
    [junit] Tests run: 7, Failures: 0, Errors: 0, Time elapsed: 0.05 sec
    [junit]
    [junit] Testsuite: org.apache.solr.util.PrimUtilsTest
    [junit] Tests run: 1, Failures: 0, Errors: 0, Time elapsed: 0.028 sec
    [junit]
    [junit] Testsuite: org.apache.solr.util.SolrPluginUtilsTest
    [junit] Tests run: 7, Failures: 0, Errors: 0, Time elapsed: 0.702 sec
    [junit]
    [junit] Testsuite: org.apache.solr.util.TestNumberUtils
    [junit] Tests run: 1, Failures: 0, Errors: 0, Time elapsed: 0.374 sec
    [junit]
    [junit] Testsuite: org.apache.solr.util.TestOpenBitSet
    [junit] Tests run: 3, Failures: 0, Errors: 0, Time elapsed: 0.628 sec
    [junit]
    [junit] Testsuite: org.apache.solr.util.TestUtils
    [junit] Tests run: 3, Failures: 0, Errors: 0, Time elapsed: 0.009 sec
    [junit]
    [junit] Testsuite: org.apache.solr.velocity.VelocityResponseWriterTest
    [junit] Tests run: 1, Failures: 0, Errors: 0, Time elapsed: 0.871 sec
    [junit]
    [junit] Tests FAILED

    BUILD FAILED
    /usr<https://hudson.apache.org/hudson/job/Solr-3.x/ws/branch_3x/solr/build.xml>:381: The following error occurred while executing this line:
    /usr<https://hudson.apache.org/hudson/job/Solr-3.x/ws/branch_3x/solr/build.xml>:481: Tests failed!

    Total time: 21 minutes 17 seconds
    [TASKS] Skipping publisher since build result is FAILURE
    Publishing Javadoc
    Archiving artifacts
    Recording test results
    Publishing Clover coverage report...
    No Clover report will be published due to a Build Failure


    ---------------------------------------------------------------------
    To unsubscribe, e-mail: dev-unsubscribe@lucene.apache.org
    For additional commands, e-mail: dev-help@lucene.apache.org
  • Apache Hudson Server at Oct 4, 2010 at 6:05 am
    See <https://hudson.apache.org/hudson/job/Solr-3.x/123/changes>

    Changes:

    [rmuir] clear up some compiler warnings (non-generics)

    [rmuir] clear up javadocs warnings

    [rmuir] clear up more warnings in modules/contrib

    [rmuir] LUCENE-2681: fix generics violations in contrib/modules

    [rmuir] clear up some 3.x warnings

    [rmuir] clear up javadocs warnings/errors

    [rmuir] add dependency to prevent javadocs warnings/errors

    [rmuir] clear up more compiler warnings

    [mikemccand] LUCENE-2663: don't try to clear prior lock in IndexWriter when create=true

    ------------------------------------------
    [...truncated 14199 lines...]
    [junit] Tests run: 3, Failures: 0, Errors: 0, Time elapsed: 0.452 sec
    [junit]
    [junit] Testsuite: org.apache.solr.handler.JsonLoaderTest
    [junit] Tests run: 1, Failures: 0, Errors: 0, Time elapsed: 0.012 sec
    [junit]
    [junit] Testsuite: org.apache.solr.handler.MoreLikeThisHandlerTest
    [junit] Tests run: 1, Failures: 0, Errors: 0, Time elapsed: 0.523 sec
    [junit]
    [junit] Testsuite: org.apache.solr.handler.SpellCheckerRequestHandlerTest
    [junit] Tests run: 5, Failures: 0, Errors: 0, Time elapsed: 0.93 sec
    [junit]
    [junit] Testsuite: org.apache.solr.handler.StandardRequestHandlerTest
    [junit] Tests run: 1, Failures: 0, Errors: 0, Time elapsed: 0.512 sec
    [junit]
    [junit] Testsuite: org.apache.solr.handler.TestCSVLoader
    [junit] Tests run: 4, Failures: 0, Errors: 0, Time elapsed: 1.467 sec
    [junit]
    [junit] Testsuite: org.apache.solr.handler.TestReplicationHandler
    [junit] Tests run: 7, Failures: 0, Errors: 0, Time elapsed: 23.638 sec
    [junit]
    [junit] Testsuite: org.apache.solr.handler.XmlUpdateRequestHandlerTest
    [junit] Tests run: 1, Failures: 0, Errors: 0, Time elapsed: 0.721 sec
    [junit]
    [junit] Testsuite: org.apache.solr.handler.admin.LukeRequestHandlerTest
    [junit] Tests run: 1, Failures: 0, Errors: 0, Time elapsed: 0.702 sec
    [junit]
    [junit] Testsuite: org.apache.solr.handler.admin.SystemInfoHandlerTest
    [junit] Tests run: 1, Failures: 0, Errors: 0, Time elapsed: 0.01 sec
    [junit]
    [junit] Testsuite: org.apache.solr.handler.component.DistributedSpellCheckComponentTest
    [junit] Tests run: 1, Failures: 0, Errors: 0, Time elapsed: 9.247 sec
    [junit]
    [junit] Testsuite: org.apache.solr.handler.component.DistributedTermsComponentTest
    [junit] Tests run: 1, Failures: 0, Errors: 0, Time elapsed: 7.397 sec
    [junit]
    [junit] Testsuite: org.apache.solr.handler.component.QueryElevationComponentTest
    [junit] Tests run: 4, Failures: 0, Errors: 0, Time elapsed: 0.815 sec
    [junit]
    [junit] Testsuite: org.apache.solr.handler.component.SearchHandlerTest
    [junit] Tests run: 1, Failures: 0, Errors: 0, Time elapsed: 0.597 sec
    [junit]
    [junit] Testsuite: org.apache.solr.handler.component.SpellCheckComponentTest
    [junit] Tests run: 10, Failures: 0, Errors: 0, Time elapsed: 0.894 sec
    [junit]
    [junit] Testsuite: org.apache.solr.handler.component.StatsComponentTest
    [junit] Tests run: 1, Failures: 0, Errors: 0, Time elapsed: 2.941 sec
    [junit]
    [junit] Testsuite: org.apache.solr.handler.component.TermVectorComponentTest
    [junit] Tests run: 5, Failures: 0, Errors: 0, Time elapsed: 0.776 sec
    [junit]
    [junit] Testsuite: org.apache.solr.handler.component.TermsComponentTest
    [junit] Tests run: 13, Failures: 0, Errors: 0, Time elapsed: 0.851 sec
    [junit]
    [junit] Testsuite: org.apache.solr.highlight.FastVectorHighlighterTest
    [junit] Tests run: 2, Failures: 0, Errors: 0, Time elapsed: 0.655 sec
    [junit]
    [junit] Testsuite: org.apache.solr.highlight.HighlighterConfigTest
    [junit] Tests run: 1, Failures: 0, Errors: 0, Time elapsed: 0.626 sec
    [junit]
    [junit] Testsuite: org.apache.solr.highlight.HighlighterTest
    [junit] Tests run: 23, Failures: 0, Errors: 0, Time elapsed: 2.243 sec
    [junit]
    [junit] Testsuite: org.apache.solr.request.JSONWriterTest
    [junit] Tests run: 3, Failures: 0, Errors: 0, Time elapsed: 0.717 sec
    [junit]
    [junit] Testsuite: org.apache.solr.request.SimpleFacetsTest
    [junit] Tests run: 7, Failures: 0, Errors: 0, Time elapsed: 3.264 sec
    [junit]
    [junit] Testsuite: org.apache.solr.request.TestBinaryResponseWriter
    [junit] Tests run: 1, Failures: 0, Errors: 0, Time elapsed: 0.514 sec
    [junit]
    [junit] Testsuite: org.apache.solr.request.TestFaceting
    [junit] Tests run: 3, Failures: 0, Errors: 0, Time elapsed: 4.499 sec
    [junit]
    [junit] Testsuite: org.apache.solr.request.TestWriterPerf
    [junit] Tests run: 1, Failures: 0, Errors: 0, Time elapsed: 0.869 sec
    [junit]
    [junit] ------------- Standard Output ---------------
    [junit] writer xml, size=7212, encodeRate=500, decodeRate=166
    [junit] writer json, size=4497, encodeRate=200, decodeRate=N/A
    [junit] writer javabin, size=2006, encodeRate=N/A, decodeRate=N/A
    [junit] ------------- ---------------- ---------------
    [junit] Testsuite: org.apache.solr.response.TestCSVResponseWriter
    [junit] Tests run: 1, Failures: 0, Errors: 0, Time elapsed: 0.757 sec
    [junit]
    [junit] Testsuite: org.apache.solr.schema.BadIndexSchemaTest
    [junit] Tests run: 1, Failures: 0, Errors: 0, Time elapsed: 0.235 sec
    [junit]
    [junit] Testsuite: org.apache.solr.schema.CopyFieldTest
    [junit] Tests run: 6, Failures: 0, Errors: 0, Time elapsed: 0.626 sec
    [junit]
    [junit] Testsuite: org.apache.solr.schema.DateFieldTest
    [junit] Tests run: 6, Failures: 0, Errors: 0, Time elapsed: 0.033 sec
    [junit]
    [junit] Testsuite: org.apache.solr.schema.IndexSchemaTest
    [junit] Tests run: 5, Failures: 0, Errors: 0, Time elapsed: 0.813 sec
    [junit]
    [junit] Testsuite: org.apache.solr.schema.LegacyDateFieldTest
    [junit] Tests run: 4, Failures: 0, Errors: 0, Time elapsed: 0.012 sec
    [junit]
    [junit] Testsuite: org.apache.solr.schema.NotRequiredUniqueKeyTest
    [junit] Tests run: 1, Failures: 0, Errors: 0, Time elapsed: 0.238 sec
    [junit]
    [junit] Testsuite: org.apache.solr.schema.PolyFieldTest
    [junit] Tests run: 4, Failures: 0, Errors: 0, Time elapsed: 0.921 sec
    [junit]
    [junit] Testsuite: org.apache.solr.schema.RequiredFieldsTest
    [junit] Tests run: 3, Failures: 0, Errors: 0, Time elapsed: 0.689 sec
    [junit]
    [junit] Testsuite: org.apache.solr.schema.TestBinaryField
    [junit] Tests run: 1, Failures: 0, Errors: 0, Time elapsed: 0.654 sec
    [junit]
    [junit] Testsuite: org.apache.solr.schema.UUIDFieldTest
    [junit] Tests run: 1, Failures: 0, Errors: 0, Time elapsed: 0.015 sec
    [junit]
    [junit] Testsuite: org.apache.solr.search.FunctionQParserTest
    [junit] Tests run: 1, Failures: 0, Errors: 0, Time elapsed: 0.29 sec
    [junit]
    [junit] Testsuite: org.apache.solr.search.QueryParsingTest
    [junit] Tests run: 2, Failures: 0, Errors: 0, Time elapsed: 0.646 sec
    [junit]
    [junit] Testsuite: org.apache.solr.search.SpatialFilterTest
    [junit] Tests run: 3, Failures: 0, Errors: 0, Time elapsed: 1.104 sec
    [junit]
    [junit] Testsuite: org.apache.solr.search.TestDocSet
    [junit] Tests run: 2, Failures: 0, Errors: 0, Time elapsed: 1.961 sec
    [junit]
    [junit] Testsuite: org.apache.solr.search.TestExtendedDismaxParser
    [junit] Tests run: 1, Failures: 0, Errors: 0, Time elapsed: 0.558 sec
    [junit]
    [junit] Testsuite: org.apache.solr.search.TestFastLRUCache
    [junit] Tests run: 2, Failures: 0, Errors: 0, Time elapsed: 0.007 sec
    [junit]
    [junit] Testsuite: org.apache.solr.search.TestIndexSearcher
    [junit] Tests run: 1, Failures: 0, Errors: 0, Time elapsed: 0.409 sec
    [junit]
    [junit] Testsuite: org.apache.solr.search.TestQueryTypes
    [junit] Tests run: 1, Failures: 0, Errors: 0, Time elapsed: 0.58 sec
    [junit]
    [junit] Testsuite: org.apache.solr.search.TestQueryUtils
    [junit] Tests run: 1, Failures: 0, Errors: 0, Time elapsed: 0.704 sec
    [junit]
    [junit] Testsuite: org.apache.solr.search.TestRangeQuery
    [junit] Tests run: 2, Failures: 0, Errors: 0, Time elapsed: 22.362 sec
    [junit]
    [junit] Testsuite: org.apache.solr.search.TestSearchPerf
    [junit] Tests run: 1, Failures: 0, Errors: 0, Time elapsed: 0.255 sec
    [junit]
    [junit] Testsuite: org.apache.solr.search.TestSolrQueryParser
    [junit] Tests run: 1, Failures: 0, Errors: 0, Time elapsed: 0.689 sec
    [junit]
    [junit] Testsuite: org.apache.solr.search.TestSort
    [junit] Tests run: 1, Failures: 0, Errors: 0, Time elapsed: 3.627 sec
    [junit]
    [junit] Testsuite: org.apache.solr.search.function.SortByFunctionTest
    [junit] Tests run: 1, Failures: 0, Errors: 0, Time elapsed: 0.538 sec
    [junit]
    [junit] Testsuite: org.apache.solr.search.function.TestFunctionQuery
    [junit] Tests run: 7, Failures: 0, Errors: 0, Time elapsed: 1.523 sec
    [junit]
    [junit] Testsuite: org.apache.solr.search.function.distance.DistanceFunctionTest
    [junit] Tests run: 2, Failures: 0, Errors: 0, Time elapsed: 0.411 sec
    [junit]
    [junit] Testsuite: org.apache.solr.servlet.CacheHeaderTest
    [junit] Tests run: 5, Failures: 0, Errors: 0, Time elapsed: 0.703 sec
    [junit]
    [junit] Testsuite: org.apache.solr.servlet.DirectSolrConnectionTest
    [junit] Tests run: 2, Failures: 0, Errors: 0, Time elapsed: 0.289 sec
    [junit]
    [junit] Testsuite: org.apache.solr.servlet.NoCacheHeaderTest
    [junit] Tests run: 3, Failures: 0, Errors: 0, Time elapsed: 0.704 sec
    [junit]
    [junit] Testsuite: org.apache.solr.servlet.SolrRequestParserTest
    [junit] Tests run: 4, Failures: 0, Errors: 0, Time elapsed: 0.949 sec
    [junit]
    [junit] Testsuite: org.apache.solr.spelling.FileBasedSpellCheckerTest
    [junit] Tests run: 3, Failures: 0, Errors: 0, Time elapsed: 0.806 sec
    [junit]
    [junit] Testsuite: org.apache.solr.spelling.IndexBasedSpellCheckerTest
    [junit] Tests run: 5, Failures: 0, Errors: 0, Time elapsed: 0.764 sec
    [junit]
    [junit] Testsuite: org.apache.solr.spelling.SpellingQueryConverterTest
    [junit] Tests run: 4, Failures: 0, Errors: 0, Time elapsed: 0.009 sec
    [junit]
    [junit] Testsuite: org.apache.solr.spelling.suggest.SuggesterTest
    [junit] Tests run: 2, Failures: 0, Errors: 0, Time elapsed: 0.134 sec
    [junit]
    [junit] Testsuite: org.apache.solr.update.AutoCommitTest
    [junit] Tests run: 1, Failures: 0, Errors: 0, Time elapsed: 4.046 sec
    [junit]
    [junit] Testsuite: org.apache.solr.update.DirectUpdateHandlerOptimizeTest
    [junit] Tests run: 1, Failures: 0, Errors: 0, Time elapsed: 0.763 sec
    [junit]
    [junit] Testsuite: org.apache.solr.update.DirectUpdateHandlerTest
    [junit] Tests run: 7, Failures: 0, Errors: 0, Time elapsed: 2.414 sec
    [junit]
    [junit] Testsuite: org.apache.solr.update.DocumentBuilderTest
    [junit] Tests run: 3, Failures: 0, Errors: 0, Time elapsed: 0.682 sec
    [junit]
    [junit] Testsuite: org.apache.solr.update.TestIndexingPerformance
    [junit] Tests run: 1, Failures: 0, Errors: 0, Time elapsed: 1.361 sec
    [junit]
    [junit] ------------- Standard Output ---------------
    [junit] includeDoc=true doc=[text, simple, text, test, text, how now brown cow, text, what's that?, text, radical!, text, what's all this about, anyway?, text, just how fast is this text indexing?]
    [junit] iter=1000 time=695 throughput=1438
    [junit] ------------- ---------------- ---------------
    [junit] Testsuite: org.apache.solr.update.processor.SignatureUpdateProcessorFactoryTest
    [junit] Tests run: 2, Failures: 0, Errors: 0, Time elapsed: 1.322 sec
    [junit]
    [junit] Testsuite: org.apache.solr.update.processor.UpdateRequestProcessorFactoryTest
    [junit] Tests run: 1, Failures: 0, Errors: 0, Time elapsed: 0.958 sec
    [junit]
    [junit] Testsuite: org.apache.solr.util.ArraysUtilsTest
    [junit] Tests run: 1, Failures: 0, Errors: 0, Time elapsed: 0.011 sec
    [junit]
    [junit] Testsuite: org.apache.solr.util.DateMathParserTest
    [junit] Tests run: 7, Failures: 0, Errors: 0, Time elapsed: 0.052 sec
    [junit]
    [junit] Testsuite: org.apache.solr.util.PrimUtilsTest
    [junit] Tests run: 1, Failures: 0, Errors: 0, Time elapsed: 0.028 sec
    [junit]
    [junit] Testsuite: org.apache.solr.util.SolrPluginUtilsTest
    [junit] Tests run: 7, Failures: 0, Errors: 0, Time elapsed: 0.683 sec
    [junit]
    [junit] Testsuite: org.apache.solr.util.TestNumberUtils
    [junit] Tests run: 1, Failures: 0, Errors: 0, Time elapsed: 0.372 sec
    [junit]
    [junit] Testsuite: org.apache.solr.util.TestOpenBitSet
    [junit] Tests run: 3, Failures: 0, Errors: 0, Time elapsed: 0.553 sec
    [junit]
    [junit] Testsuite: org.apache.solr.util.TestUtils
    [junit] Tests run: 3, Failures: 0, Errors: 0, Time elapsed: 0.007 sec
    [junit]
    [junit] Testsuite: org.apache.solr.velocity.VelocityResponseWriterTest
    [junit] Tests run: 1, Failures: 0, Errors: 0, Time elapsed: 0.706 sec
    [junit]
    [junit] Tests FAILED

    BUILD FAILED
    /usr<https://hudson.apache.org/hudson/job/Solr-3.x/ws/branch_3x/solr/build.xml>:381: The following error occurred while executing this line:
    /usr<https://hudson.apache.org/hudson/job/Solr-3.x/ws/branch_3x/solr/build.xml>:481: Tests failed!

    Total time: 25 minutes 51 seconds
    [TASKS] Skipping publisher since build result is FAILURE
    Publishing Javadoc
    Archiving artifacts
    Recording test results
    Publishing Clover coverage report...
    No Clover report will be published due to a Build Failure


    ---------------------------------------------------------------------
    To unsubscribe, e-mail: dev-unsubscribe@lucene.apache.org
    For additional commands, e-mail: dev-help@lucene.apache.org

Related Discussions

Discussion Navigation
viewthread | post
Discussion Overview
groupdev @
categorieslucene
postedOct 1, '10 at 5:06a
activeOct 4, '10 at 6:05a
posts7
users2
websitelucene.apache.org

People

Translate

site design / logo © 2021 Grokbase