Grokbase Groups HBase dev July 2012
FAQ
See <https://builds.apache.org/job/HBase-0.94/372/>

------------------------------------------
[...truncated 589 lines...]
Tests run: 2, Failures: 0, Errors: 0, Skipped: 0, Time elapsed: 90.581 sec
Running org.apache.hadoop.hbase.coprocessor.TestClassLoading
Tests run: 6, Failures: 0, Errors: 0, Skipped: 0, Time elapsed: 37.659 sec
Running org.apache.hadoop.hbase.coprocessor.TestAggregateProtocol
Tests run: 45, Failures: 0, Errors: 0, Skipped: 0, Time elapsed: 22.231 sec
Running org.apache.hadoop.hbase.io.encoding.TestChangingEncoding
Tests run: 4, Failures: 0, Errors: 0, Skipped: 0, Time elapsed: 352.058 sec
Running org.apache.hadoop.hbase.coprocessor.TestRegionObserverBypass
Tests run: 2, Failures: 0, Errors: 0, Skipped: 0, Time elapsed: 28.774 sec
Running org.apache.hadoop.hbase.coprocessor.TestRegionServerCoprocessorExceptionWithAbort
Tests run: 1, Failures: 0, Errors: 0, Skipped: 0, Time elapsed: 38.33 sec
Running org.apache.hadoop.hbase.coprocessor.TestCoprocessorEndpoint
Tests run: 3, Failures: 0, Errors: 0, Skipped: 1, Time elapsed: 38.734 sec
Running org.apache.hadoop.hbase.coprocessor.TestMasterCoprocessorExceptionWithRemove
Tests run: 1, Failures: 0, Errors: 0, Skipped: 0, Time elapsed: 20.78 sec
Running org.apache.hadoop.hbase.coprocessor.TestRegionObserverInterface
Tests run: 7, Failures: 0, Errors: 0, Skipped: 0, Time elapsed: 49.051 sec
Running org.apache.hadoop.hbase.coprocessor.TestRegionServerCoprocessorExceptionWithRemove
Tests run: 1, Failures: 0, Errors: 0, Skipped: 0, Time elapsed: 25.384 sec
Running org.apache.hadoop.hbase.coprocessor.TestWALObserver
Tests run: 3, Failures: 0, Errors: 0, Skipped: 0, Time elapsed: 28.36 sec
Running org.apache.hadoop.hbase.coprocessor.TestMasterCoprocessorExceptionWithAbort
Tests run: 1, Failures: 0, Errors: 0, Skipped: 0, Time elapsed: 18.283 sec
Running org.apache.hadoop.hbase.replication.TestReplication
Tests run: 10, Failures: 0, Errors: 0, Skipped: 0, Time elapsed: 202.441 sec
Running org.apache.hadoop.hbase.coprocessor.TestMasterObserver
Tests run: 3, Failures: 0, Errors: 0, Skipped: 0, Time elapsed: 44.235 sec
Running org.apache.hadoop.hbase.util.hbck.TestOfflineMetaRebuildOverlap
Tests run: 1, Failures: 0, Errors: 0, Skipped: 0, Time elapsed: 37.115 sec
Running org.apache.hadoop.hbase.util.TestMergeTable
Tests run: 1, Failures: 0, Errors: 0, Skipped: 0, Time elapsed: 47.499 sec
Running org.apache.hadoop.hbase.util.TestFSUtils
Tests run: 4, Failures: 0, Errors: 0, Skipped: 0, Time elapsed: 57.137 sec
Running org.apache.hadoop.hbase.util.hbck.TestOfflineMetaRebuildBase
Tests run: 1, Failures: 0, Errors: 0, Skipped: 0, Time elapsed: 60.044 sec
Running org.apache.hadoop.hbase.util.TestPoolMap$TestRoundRobinPoolType
Tests run: 3, Failures: 0, Errors: 0, Skipped: 0, Time elapsed: 0.066 sec
Running org.apache.hadoop.hbase.util.hbck.TestOfflineMetaRebuildHole
Running org.apache.hadoop.hbase.util.TestPoolMap$TestThreadLocalPoolType
Tests run: 3, Failures: 0, Errors: 0, Skipped: 0, Time elapsed: 0.158 sec
Tests run: 1, Failures: 0, Errors: 0, Skipped: 0, Time elapsed: 55.252 sec
Running org.apache.hadoop.hbase.util.TestPoolMap$TestReusablePoolType
Tests run: 3, Failures: 0, Errors: 0, Skipped: 0, Time elapsed: 0.277 sec
Running org.apache.hadoop.hbase.util.TestIdLock
Tests run: 1, Failures: 0, Errors: 0, Skipped: 0, Time elapsed: 15.426 sec
Running org.apache.hadoop.hbase.util.TestDefaultEnvironmentEdge
Tests run: 1, Failures: 0, Errors: 0, Skipped: 0, Time elapsed: 0.21 sec
Running org.apache.hadoop.hbase.util.TestMiniClusterLoadEncoded
Tests run: 4, Failures: 0, Errors: 0, Skipped: 0, Time elapsed: 239.077 sec
Running org.apache.hadoop.hbase.util.TestFSTableDescriptors
Tests run: 10, Failures: 0, Errors: 0, Skipped: 0, Time elapsed: 1.032 sec
Running org.apache.hadoop.hbase.util.TestEnvironmentEdgeManager
Tests run: 2, Failures: 0, Errors: 0, Skipped: 0, Time elapsed: 0.724 sec
Running org.apache.hadoop.hbase.util.TestMergeTool
Tests run: 1, Failures: 0, Errors: 0, Skipped: 0, Time elapsed: 325.491 sec
Running org.apache.hadoop.hbase.util.TestMiniClusterLoadSequential
Tests run: 4, Failures: 0, Errors: 0, Skipped: 0, Time elapsed: 405.652 sec
Running org.apache.hadoop.hbase.mapred.TestTableInputFormat
Tests run: 10, Failures: 0, Errors: 0, Skipped: 0, Time elapsed: 88.301 sec
Running org.apache.hadoop.hbase.util.TestRegionSplitter
Tests run: 5, Failures: 0, Errors: 0, Skipped: 0, Time elapsed: 126.887 sec
Running org.apache.hadoop.hbase.util.TestMiniClusterLoadParallel
Tests run: 4, Failures: 0, Errors: 0, Skipped: 0, Time elapsed: 380.376 sec
Running org.apache.hadoop.hbase.regionserver.TestStore
Tests run: 12, Failures: 0, Errors: 0, Skipped: 0, Time elapsed: 9.495 sec
Running org.apache.hadoop.hbase.regionserver.TestStoreFileBlockCacheSummary
Tests run: 1, Failures: 0, Errors: 0, Skipped: 0, Time elapsed: 48.257 sec
Running org.apache.hadoop.hbase.regionserver.TestRegionServerMetrics
Tests run: 3, Failures: 0, Errors: 0, Skipped: 0, Time elapsed: 98.263 sec
Running org.apache.hadoop.hbase.regionserver.handler.TestOpenRegionHandler
Tests run: 3, Failures: 0, Errors: 0, Skipped: 0, Time elapsed: 1.622 sec
Running org.apache.hadoop.hbase.regionserver.TestSplitTransactionOnCluster
Tests run: 7, Failures: 0, Errors: 0, Skipped: 0, Time elapsed: 94.373 sec
Running org.apache.hadoop.hbase.regionserver.handler.TestCloseRegionHandler
Tests run: 3, Failures: 0, Errors: 0, Skipped: 0, Time elapsed: 1.896 sec
Running org.apache.hadoop.hbase.mapred.TestTableMapReduce
Tests run: 1, Failures: 0, Errors: 0, Skipped: 0, Time elapsed: 168.093 sec
Running org.apache.hadoop.hbase.regionserver.TestParallelPut
Tests run: 2, Failures: 0, Errors: 0, Skipped: 0, Time elapsed: 5.36 sec
Running org.apache.hadoop.hbase.util.TestHBaseFsck
Tests run: 22, Failures: 0, Errors: 0, Skipped: 0, Time elapsed: 622.689 sec
Running org.apache.hadoop.hbase.regionserver.TestBlocksRead
Tests run: 4, Failures: 0, Errors: 0, Skipped: 0, Time elapsed: 2.755 sec
Running org.apache.hadoop.hbase.regionserver.TestMasterAddressManager
Tests run: 1, Failures: 0, Errors: 0, Skipped: 0, Time elapsed: 1.7 sec
Running org.apache.hadoop.hbase.regionserver.TestAtomicOperation
Tests run: 5, Failures: 0, Errors: 0, Skipped: 0, Time elapsed: 18.038 sec
Running org.apache.hadoop.hbase.regionserver.TestServerCustomProtocol
Tests run: 7, Failures: 0, Errors: 0, Skipped: 0, Time elapsed: 29.388 sec
Running org.apache.hadoop.hbase.regionserver.TestHRegionOnCluster
Tests run: 1, Failures: 0, Errors: 0, Skipped: 0, Time elapsed: 37.83 sec
Running org.apache.hadoop.hbase.regionserver.wal.TestLogRollingNoCluster
Tests run: 1, Failures: 0, Errors: 0, Skipped: 0, Time elapsed: 2.38 sec
Running org.apache.hadoop.hbase.regionserver.wal.TestHLogBench
Tests run: 1, Failures: 0, Errors: 0, Skipped: 0, Time elapsed: 1.577 sec
Running org.apache.hadoop.hbase.regionserver.wal.TestWALReplayCompressed
Tests run: 6, Failures: 0, Errors: 0, Skipped: 0, Time elapsed: 69.101 sec
Running org.apache.hadoop.hbase.regionserver.wal.TestWALReplay
Tests run: 6, Failures: 0, Errors: 0, Skipped: 0, Time elapsed: 55.129 sec
Running org.apache.hadoop.hbase.regionserver.wal.TestHLog
Tests run: 10, Failures: 0, Errors: 0, Skipped: 0, Time elapsed: 74.747 sec
Running org.apache.hadoop.hbase.regionserver.metrics.TestSchemaMetrics
Tests run: 6, Failures: 0, Errors: 0, Skipped: 0, Time elapsed: 15.047 sec
Running org.apache.hadoop.hbase.regionserver.TestRpcMetrics
Tests run: 1, Failures: 0, Errors: 0, Skipped: 0, Time elapsed: 9.278 sec
Running org.apache.hadoop.hbase.regionserver.TestStoreScanner
Tests run: 16, Failures: 0, Errors: 0, Skipped: 0, Time elapsed: 0.373 sec
Running org.apache.hadoop.hbase.regionserver.TestCacheOnWriteInSchema
Tests run: 3, Failures: 0, Errors: 0, Skipped: 0, Time elapsed: 1.644 sec
Running org.apache.hadoop.hbase.regionserver.TestSeekOptimizations
Tests run: 6, Failures: 0, Errors: 0, Skipped: 0, Time elapsed: 2.791 sec
Running org.apache.hadoop.hbase.regionserver.TestFSErrorsExposed
Tests run: 3, Failures: 0, Errors: 0, Skipped: 0, Time elapsed: 31.729 sec
Running org.apache.hadoop.hbase.regionserver.wal.TestLogRollAbort
Tests run: 1, Failures: 0, Errors: 0, Skipped: 0, Time elapsed: 163.674 sec
Running org.apache.hadoop.hbase.regionserver.TestSplitLogWorker
Tests run: 5, Failures: 0, Errors: 0, Skipped: 0, Time elapsed: 3.346 sec
Running org.apache.hadoop.hbase.regionserver.TestHRegionServerBulkLoad
Tests run: 1, Failures: 0, Errors: 0, Skipped: 0, Time elapsed: 51.093 sec
Running org.apache.hadoop.hbase.regionserver.TestMultiColumnScanner
Tests run: 12, Failures: 0, Errors: 0, Skipped: 0, Time elapsed: 42.512 sec
Running org.apache.hadoop.hbase.regionserver.TestHRegion
Tests run: 66, Failures: 0, Errors: 0, Skipped: 0, Time elapsed: 55.488 sec
Running org.apache.hadoop.hbase.regionserver.TestEndToEndSplitTransaction
Tests run: 2, Failures: 0, Errors: 0, Skipped: 0, Time elapsed: 76.624 sec
Running org.apache.hadoop.hbase.client.replication.TestReplicationAdmin
Tests run: 1, Failures: 0, Errors: 0, Skipped: 0, Time elapsed: 1.082 sec
Running org.apache.hadoop.hbase.client.TestTimestampsFilter
Tests run: 3, Failures: 0, Errors: 0, Skipped: 0, Time elapsed: 27.963 sec
Running org.apache.hadoop.hbase.regionserver.TestCompactionState
Tests run: 2, Failures: 0, Errors: 0, Skipped: 0, Time elapsed: 38.444 sec
Running org.apache.hadoop.hbase.client.TestMultipleTimestamps
Tests run: 8, Failures: 0, Errors: 0, Skipped: 0, Time elapsed: 42.994 sec
Running org.apache.hadoop.hbase.client.TestHCM
Tests run: 6, Failures: 0, Errors: 0, Skipped: 0, Time elapsed: 29.71 sec
Running org.apache.hadoop.hbase.regionserver.wal.TestHLogSplit
Tests run: 30, Failures: 0, Errors: 0, Skipped: 1, Time elapsed: 320.62 sec
Running org.apache.hadoop.hbase.client.TestHTablePool$TestHTableReusablePool
Tests run: 9, Failures: 0, Errors: 0, Skipped: 0, Time elapsed: 8.346 sec
Running org.apache.hadoop.hbase.client.TestHTablePool$TestHTableThreadLocalPool
Tests run: 9, Failures: 0, Errors: 0, Skipped: 0, Time elapsed: 33.336 sec
Running org.apache.hadoop.hbase.client.TestHTableUtil
Tests run: 2, Failures: 0, Errors: 0, Skipped: 0, Time elapsed: 21.169 sec
Running org.apache.hadoop.hbase.regionserver.wal.TestLogRolling
Tests run: 3, Failures: 0, Errors: 0, Skipped: 0, Time elapsed: 475.715 sec
Running org.apache.hadoop.hbase.client.TestMetaScanner
Tests run: 1, Failures: 0, Errors: 0, Skipped: 0, Time elapsed: 22.43 sec
Running org.apache.hadoop.hbase.client.TestScannerTimeout
Tests run: 4, Failures: 0, Errors: 0, Skipped: 0, Time elapsed: 51.143 sec
Running org.apache.hadoop.hbase.client.TestMetaMigrationRemovingHTD
Tests run: 3, Failures: 0, Errors: 0, Skipped: 0, Time elapsed: 39.768 sec
Running org.apache.hadoop.hbase.client.TestShell
Tests run: 1, Failures: 0, Errors: 0, Skipped: 0, Time elapsed: 129.878 sec
Running org.apache.hadoop.hbase.client.TestFromClientSide
Tests run: 55, Failures: 0, Errors: 0, Skipped: 3, Time elapsed: 246.677 sec
Running org.apache.hadoop.hbase.TestMultiVersions
Tests run: 3, Failures: 0, Errors: 0, Skipped: 0, Time elapsed: 47.097 sec
Running org.apache.hadoop.hbase.client.TestMultiParallel
Tests run: 11, Failures: 0, Errors: 0, Skipped: 0, Time elapsed: 76.478 sec
Running org.apache.hadoop.hbase.thrift.TestThriftServer
Tests run: 1, Failures: 0, Errors: 0, Skipped: 0, Time elapsed: 88.441 sec
Running org.apache.hadoop.hbase.master.TestActiveMasterManager
Tests run: 2, Failures: 0, Errors: 0, Skipped: 0, Time elapsed: 1.592 sec
Running org.apache.hadoop.hbase.master.TestDeadServer
Tests run: 1, Failures: 0, Errors: 0, Skipped: 0, Time elapsed: 0.205 sec
Running org.apache.hadoop.hbase.master.TestLogsCleaner
Tests run: 1, Failures: 0, Errors: 0, Skipped: 0, Time elapsed: 6.804 sec
Running org.apache.hadoop.hbase.client.TestAdmin
Tests run: 38, Failures: 0, Errors: 0, Skipped: 0, Time elapsed: 350.237 sec
Running org.apache.hadoop.hbase.master.TestZKBasedOpenCloseRegion
Tests run: 4, Failures: 0, Errors: 0, Skipped: 0, Time elapsed: 74.802 sec
Running org.apache.hadoop.hbase.master.TestMaster
Tests run: 1, Failures: 0, Errors: 0, Skipped: 0, Time elapsed: 43.642 sec
Running org.apache.hadoop.hbase.master.TestMasterTransitions
Tests run: 3, Failures: 0, Errors: 0, Skipped: 3, Time elapsed: 65.893 sec
Running org.apache.hadoop.hbase.master.TestClockSkewDetection
Tests run: 1, Failures: 0, Errors: 0, Skipped: 0, Time elapsed: 0.286 sec
Running org.apache.hadoop.hbase.master.TestOpenedRegionHandler
Tests run: 2, Failures: 0, Errors: 0, Skipped: 0, Time elapsed: 47.519 sec
Running org.apache.hadoop.hbase.master.TestSplitLogManager
Tests run: 12, Failures: 1, Errors: 0, Skipped: 0, Time elapsed: 20.869 sec <<< FAILURE!
Running org.apache.hadoop.hbase.master.TestMasterRestartAfterDisablingTable
Tests run: 1, Failures: 0, Errors: 0, Skipped: 0, Time elapsed: 29.104 sec
Running org.apache.hadoop.hbase.master.TestDefaultLoadBalancer
Tests run: 4, Failures: 0, Errors: 0, Skipped: 0, Time elapsed: 1.46 sec
Running org.apache.hadoop.hbase.master.TestMasterStatusServlet
Tests run: 5, Failures: 0, Errors: 0, Skipped: 0, Time elapsed: 1 sec
Running org.apache.hadoop.hbase.master.TestHMasterRPCException
Tests run: 1, Failures: 0, Errors: 0, Skipped: 0, Time elapsed: 5.703 sec
Running org.apache.hadoop.hbase.master.TestRollingRestart
Tests run: 1, Failures: 0, Errors: 1, Skipped: 0, Time elapsed: 300.224 sec <<< FAILURE!
Running org.apache.hadoop.hbase.master.TestMasterFailover
Tests run: 4, Failures: 0, Errors: 0, Skipped: 0, Time elapsed: 115.343 sec
Running org.apache.hadoop.hbase.master.TestMasterZKSessionRecovery
Tests run: 4, Failures: 0, Errors: 0, Skipped: 0, Time elapsed: 98.953 sec
Running org.apache.hadoop.hbase.master.TestDistributedLogSplitting
Tests run: 4, Failures: 0, Errors: 0, Skipped: 0, Time elapsed: 163.148 sec
Running org.apache.hadoop.hbase.master.TestMasterShutdown
Tests run: 1, Failures: 0, Errors: 0, Skipped: 0, Time elapsed: 19.424 sec
Running org.apache.hadoop.hbase.master.TestRestartCluster
Tests run: 2, Failures: 0, Errors: 0, Skipped: 0, Time elapsed: 44.316 sec
Running org.apache.hadoop.hbase.avro.TestAvroServer
Tests run: 3, Failures: 0, Errors: 0, Skipped: 0, Time elapsed: 35.173 sec
Running org.apache.hadoop.hbase.TestZooKeeper
Tests run: 7, Failures: 0, Errors: 0, Skipped: 0, Time elapsed: 27.611 sec
Running org.apache.hadoop.hbase.ipc.TestDelayedRpc
Tests run: 4, Failures: 0, Errors: 0, Skipped: 0, Time elapsed: 2.48 sec
Running org.apache.hadoop.hbase.TestRegionRebalancing
Tests run: 1, Failures: 0, Errors: 0, Skipped: 0, Time elapsed: 69.647 sec
Running org.apache.hadoop.hbase.TestInfoServers
Tests run: 2, Failures: 0, Errors: 0, Skipped: 0, Time elapsed: 14.347 sec
Running org.apache.hadoop.hbase.thrift2.TestThriftHBaseServiceHandler
Tests run: 12, Failures: 0, Errors: 0, Skipped: 0, Time elapsed: 19.44 sec
Running org.apache.hadoop.hbase.thrift.TestThriftServerCmdLine
Tests run: 20, Failures: 0, Errors: 1, Skipped: 0, Time elapsed: 573.824 sec <<< FAILURE!
Running org.apache.hadoop.hbase.TestAcidGuarantees
Tests run: 3, Failures: 0, Errors: 0, Skipped: 0, Time elapsed: 107.906 sec

Results :

Failed tests: testLeaderSelection(org.apache.hadoop.hbase.zookeeper.TestZKLeaderManager): Leader should exist
testMultipleResubmits(org.apache.hadoop.hbase.master.TestSplitLogManager)

Tests in error:
testBasicRollingRestart(org.apache.hadoop.hbase.master.TestRollingRestart): test timed out after 300000 milliseconds
testRunThriftServer[0](org.apache.hadoop.hbase.thrift.TestThriftServerCmdLine)

Tests run: 952, Failures: 2, Errors: 2, Skipped: 9

[INFO] ------------------------------------------------------------------------
[INFO] BUILD FAILURE
[INFO] ------------------------------------------------------------------------
[INFO] Total time: 56:40.452s
[INFO] Finished at: Fri Jul 27 00:15:38 UTC 2012
[INFO] Final Memory: 47M/508M
[INFO] ------------------------------------------------------------------------
[ERROR] Failed to execute goal org.apache.maven.plugins:maven-surefire-plugin:2.12-TRUNK-HBASE-2:test (secondPartTestsExecution) on project hbase: There are test failures.
[ERROR]
[ERROR] Please refer to <https://builds.apache.org/job/HBase-0.94/ws/trunk/target/surefire-reports> for the individual test results.
[ERROR] -> [Help 1]
[ERROR]
[ERROR] To see the full stack trace of the errors, re-run Maven with the -e switch.
[ERROR] Re-run Maven using the -X switch to enable full debug logging.
[ERROR]
[ERROR] For more information about the errors and possible solutions, please read the following articles:
[ERROR] [Help 1] http://cwiki.apache.org/confluence/display/MAVEN/MojoFailureException
Build step 'Invoke top-level Maven targets' marked build as failure
Archiving artifacts
Recording test results

Search Discussions

  • Apache Jenkins Server at Jul 28, 2012 at 6:28 am
    See <https://builds.apache.org/job/HBase-0.94/373/>

    ------------------------------------------
    [...truncated 585 lines...]
    Tests run: 1, Failures: 0, Errors: 0, Skipped: 0, Time elapsed: 6.941 sec
    Running org.apache.hadoop.hbase.replication.TestMasterReplication
    Tests run: 2, Failures: 0, Errors: 0, Skipped: 0, Time elapsed: 106.298 sec
    Running org.apache.hadoop.hbase.coprocessor.TestClassLoading
    Tests run: 6, Failures: 0, Errors: 0, Skipped: 0, Time elapsed: 40.402 sec
    Running org.apache.hadoop.hbase.coprocessor.TestAggregateProtocol
    Tests run: 45, Failures: 0, Errors: 0, Skipped: 0, Time elapsed: 22.45 sec
    Running org.apache.hadoop.hbase.io.encoding.TestChangingEncoding
    Tests run: 4, Failures: 0, Errors: 0, Skipped: 0, Time elapsed: 369.547 sec
    Running org.apache.hadoop.hbase.coprocessor.TestRegionObserverBypass
    Tests run: 2, Failures: 0, Errors: 0, Skipped: 0, Time elapsed: 25.508 sec
    Running org.apache.hadoop.hbase.coprocessor.TestRegionServerCoprocessorExceptionWithAbort
    Tests run: 1, Failures: 0, Errors: 0, Skipped: 0, Time elapsed: 29.89 sec
    Running org.apache.hadoop.hbase.coprocessor.TestCoprocessorEndpoint
    Tests run: 3, Failures: 0, Errors: 0, Skipped: 1, Time elapsed: 41.313 sec
    Running org.apache.hadoop.hbase.coprocessor.TestMasterCoprocessorExceptionWithRemove
    Tests run: 1, Failures: 0, Errors: 0, Skipped: 0, Time elapsed: 21.251 sec
    Running org.apache.hadoop.hbase.coprocessor.TestRegionServerCoprocessorExceptionWithRemove
    Tests run: 1, Failures: 0, Errors: 0, Skipped: 0, Time elapsed: 28.84 sec
    Running org.apache.hadoop.hbase.coprocessor.TestRegionObserverInterface
    Tests run: 7, Failures: 0, Errors: 0, Skipped: 0, Time elapsed: 52.637 sec
    Running org.apache.hadoop.hbase.coprocessor.TestWALObserver
    Tests run: 3, Failures: 0, Errors: 0, Skipped: 0, Time elapsed: 26.356 sec
    Running org.apache.hadoop.hbase.coprocessor.TestMasterCoprocessorExceptionWithAbort
    Tests run: 1, Failures: 0, Errors: 0, Skipped: 0, Time elapsed: 17.183 sec
    Running org.apache.hadoop.hbase.replication.TestReplication
    Tests run: 10, Failures: 0, Errors: 0, Skipped: 0, Time elapsed: 197.009 sec
    Running org.apache.hadoop.hbase.coprocessor.TestMasterObserver
    Tests run: 3, Failures: 0, Errors: 0, Skipped: 0, Time elapsed: 41.298 sec
    Running org.apache.hadoop.hbase.util.TestMergeTable
    Tests run: 1, Failures: 0, Errors: 0, Skipped: 0, Time elapsed: 47.586 sec
    Running org.apache.hadoop.hbase.util.TestFSUtils
    Tests run: 4, Failures: 0, Errors: 0, Skipped: 0, Time elapsed: 53.619 sec
    Running org.apache.hadoop.hbase.util.hbck.TestOfflineMetaRebuildOverlap
    Tests run: 1, Failures: 0, Errors: 0, Skipped: 0, Time elapsed: 39.863 sec
    Running org.apache.hadoop.hbase.util.hbck.TestOfflineMetaRebuildBase
    Tests run: 1, Failures: 0, Errors: 0, Skipped: 0, Time elapsed: 42.045 sec
    Running org.apache.hadoop.hbase.util.TestPoolMap$TestRoundRobinPoolType
    Tests run: 3, Failures: 0, Errors: 0, Skipped: 0, Time elapsed: 0.721 sec
    Running org.apache.hadoop.hbase.util.TestPoolMap$TestThreadLocalPoolType
    Tests run: 3, Failures: 0, Errors: 0, Skipped: 0, Time elapsed: 0.851 sec
    Running org.apache.hadoop.hbase.util.TestPoolMap$TestReusablePoolType
    Tests run: 3, Failures: 0, Errors: 0, Skipped: 0, Time elapsed: 1.588 sec
    Running org.apache.hadoop.hbase.util.TestIdLock
    Tests run: 1, Failures: 0, Errors: 0, Skipped: 0, Time elapsed: 15.749 sec
    Running org.apache.hadoop.hbase.util.hbck.TestOfflineMetaRebuildHole
    Tests run: 1, Failures: 0, Errors: 0, Skipped: 0, Time elapsed: 61.142 sec
    Running org.apache.hadoop.hbase.util.TestDefaultEnvironmentEdge
    Tests run: 1, Failures: 0, Errors: 0, Skipped: 0, Time elapsed: 0.198 sec
    Running org.apache.hadoop.hbase.util.TestMiniClusterLoadEncoded
    Tests run: 4, Failures: 0, Errors: 0, Skipped: 0, Time elapsed: 244.92 sec
    Running org.apache.hadoop.hbase.util.TestFSTableDescriptors
    Tests run: 10, Failures: 0, Errors: 0, Skipped: 0, Time elapsed: 0.903 sec
    Running org.apache.hadoop.hbase.util.TestEnvironmentEdgeManager
    Tests run: 2, Failures: 0, Errors: 0, Skipped: 0, Time elapsed: 5.842 sec
    Running org.apache.hadoop.hbase.util.TestMiniClusterLoadSequential
    Tests run: 4, Failures: 0, Errors: 0, Skipped: 0, Time elapsed: 322.136 sec
    Running org.apache.hadoop.hbase.util.TestMergeTool
    Tests run: 1, Failures: 0, Errors: 0, Skipped: 0, Time elapsed: 274.849 sec
    Running org.apache.hadoop.hbase.util.TestRegionSplitter
    Tests run: 5, Failures: 0, Errors: 0, Skipped: 0, Time elapsed: 95.311 sec
    Running org.apache.hadoop.hbase.mapred.TestTableInputFormat
    Tests run: 10, Failures: 0, Errors: 0, Skipped: 0, Time elapsed: 128.464 sec
    Running org.apache.hadoop.hbase.regionserver.TestStoreFileBlockCacheSummary
    Tests run: 1, Failures: 0, Errors: 0, Skipped: 0, Time elapsed: 40.926 sec
    Running org.apache.hadoop.hbase.regionserver.TestStore
    Tests run: 12, Failures: 1, Errors: 0, Skipped: 0, Time elapsed: 8.826 sec <<< FAILURE!
    Running org.apache.hadoop.hbase.util.TestMiniClusterLoadParallel
    Tests run: 4, Failures: 0, Errors: 0, Skipped: 0, Time elapsed: 337.53 sec
    Running org.apache.hadoop.hbase.mapred.TestTableMapReduce
    Tests run: 1, Failures: 0, Errors: 0, Skipped: 0, Time elapsed: 169.829 sec
    Running org.apache.hadoop.hbase.regionserver.handler.TestOpenRegionHandler
    Tests run: 3, Failures: 0, Errors: 0, Skipped: 0, Time elapsed: 1.297 sec
    Running org.apache.hadoop.hbase.regionserver.handler.TestCloseRegionHandler
    Tests run: 3, Failures: 0, Errors: 0, Skipped: 0, Time elapsed: 1.759 sec
    Running org.apache.hadoop.hbase.util.TestHBaseFsck
    Tests run: 22, Failures: 0, Errors: 0, Skipped: 0, Time elapsed: 540.931 sec
    Running org.apache.hadoop.hbase.regionserver.TestParallelPut
    Tests run: 2, Failures: 0, Errors: 0, Skipped: 0, Time elapsed: 5.189 sec
    Running org.apache.hadoop.hbase.regionserver.TestSplitTransactionOnCluster
    Tests run: 7, Failures: 0, Errors: 1, Skipped: 0, Time elapsed: 77.632 sec <<< FAILURE!
    Running org.apache.hadoop.hbase.regionserver.TestRegionServerMetrics
    Tests run: 3, Failures: 0, Errors: 0, Skipped: 0, Time elapsed: 99.487 sec
    Running org.apache.hadoop.hbase.regionserver.TestBlocksRead
    Tests run: 4, Failures: 0, Errors: 0, Skipped: 0, Time elapsed: 1.213 sec
    Running org.apache.hadoop.hbase.regionserver.TestMasterAddressManager
    Tests run: 1, Failures: 0, Errors: 0, Skipped: 0, Time elapsed: 1.43 sec
    Running org.apache.hadoop.hbase.regionserver.TestAtomicOperation
    Tests run: 5, Failures: 0, Errors: 0, Skipped: 0, Time elapsed: 17.687 sec
    Running org.apache.hadoop.hbase.regionserver.TestServerCustomProtocol
    Tests run: 7, Failures: 0, Errors: 0, Skipped: 0, Time elapsed: 36.536 sec
    Running org.apache.hadoop.hbase.regionserver.TestHRegionOnCluster
    Tests run: 1, Failures: 0, Errors: 0, Skipped: 0, Time elapsed: 47.706 sec
    Running org.apache.hadoop.hbase.regionserver.wal.TestLogRollingNoCluster
    Tests run: 1, Failures: 0, Errors: 0, Skipped: 0, Time elapsed: 2.2 sec
    Running org.apache.hadoop.hbase.regionserver.wal.TestHLogBench
    Tests run: 1, Failures: 0, Errors: 0, Skipped: 0, Time elapsed: 1.547 sec
    Running org.apache.hadoop.hbase.regionserver.wal.TestWALReplayCompressed
    Tests run: 6, Failures: 0, Errors: 0, Skipped: 0, Time elapsed: 68.289 sec
    Running org.apache.hadoop.hbase.regionserver.wal.TestWALReplay
    Tests run: 6, Failures: 0, Errors: 0, Skipped: 0, Time elapsed: 62.513 sec
    Running org.apache.hadoop.hbase.regionserver.wal.TestHLog
    Tests run: 10, Failures: 0, Errors: 0, Skipped: 0, Time elapsed: 82.554 sec
    Running org.apache.hadoop.hbase.regionserver.wal.TestLogRollAbort
    Tests run: 1, Failures: 0, Errors: 0, Skipped: 0, Time elapsed: 19.366 sec
    Running org.apache.hadoop.hbase.regionserver.TestRpcMetrics
    Tests run: 1, Failures: 0, Errors: 0, Skipped: 0, Time elapsed: 1.92 sec
    Running org.apache.hadoop.hbase.regionserver.TestStoreScanner
    Tests run: 16, Failures: 0, Errors: 0, Skipped: 0, Time elapsed: 0.05 sec
    Running org.apache.hadoop.hbase.regionserver.TestCacheOnWriteInSchema
    Tests run: 3, Failures: 0, Errors: 0, Skipped: 0, Time elapsed: 1.621 sec
    Running org.apache.hadoop.hbase.regionserver.TestSeekOptimizations
    Tests run: 6, Failures: 0, Errors: 0, Skipped: 0, Time elapsed: 2.747 sec
    Running org.apache.hadoop.hbase.regionserver.metrics.TestSchemaMetrics
    Tests run: 6, Failures: 0, Errors: 0, Skipped: 0, Time elapsed: 15.12 sec
    Running org.apache.hadoop.hbase.regionserver.TestFSErrorsExposed
    Tests run: 3, Failures: 0, Errors: 0, Skipped: 0, Time elapsed: 32.98 sec
    Running org.apache.hadoop.hbase.regionserver.TestSplitLogWorker
    Tests run: 5, Failures: 0, Errors: 0, Skipped: 0, Time elapsed: 2.99 sec
    Running org.apache.hadoop.hbase.regionserver.TestHRegionServerBulkLoad
    Tests run: 1, Failures: 0, Errors: 0, Skipped: 0, Time elapsed: 46.329 sec
    Running org.apache.hadoop.hbase.regionserver.TestMultiColumnScanner
    Tests run: 12, Failures: 0, Errors: 0, Skipped: 0, Time elapsed: 41.395 sec
    Running org.apache.hadoop.hbase.regionserver.TestEndToEndSplitTransaction
    Tests run: 2, Failures: 0, Errors: 0, Skipped: 0, Time elapsed: 78.005 sec
    Running org.apache.hadoop.hbase.regionserver.TestHRegion
    Tests run: 66, Failures: 0, Errors: 0, Skipped: 0, Time elapsed: 50.221 sec
    Running org.apache.hadoop.hbase.client.replication.TestReplicationAdmin
    Tests run: 1, Failures: 0, Errors: 0, Skipped: 0, Time elapsed: 1.859 sec
    Running org.apache.hadoop.hbase.client.TestTimestampsFilter
    Tests run: 3, Failures: 0, Errors: 0, Skipped: 0, Time elapsed: 26.88 sec
    Running org.apache.hadoop.hbase.regionserver.TestCompactionState
    Tests run: 2, Failures: 0, Errors: 0, Skipped: 0, Time elapsed: 37.662 sec
    Running org.apache.hadoop.hbase.regionserver.wal.TestLogRolling
    Tests run: 3, Failures: 0, Errors: 0, Skipped: 0, Time elapsed: 316.92 sec
    Running org.apache.hadoop.hbase.client.TestHCM
    Tests run: 6, Failures: 0, Errors: 0, Skipped: 0, Time elapsed: 23.659 sec
    Running org.apache.hadoop.hbase.client.TestMultipleTimestamps
    Tests run: 8, Failures: 0, Errors: 0, Skipped: 0, Time elapsed: 40.916 sec
    Running org.apache.hadoop.hbase.regionserver.wal.TestHLogSplit
    Tests run: 30, Failures: 0, Errors: 0, Skipped: 1, Time elapsed: 276.297 sec
    Running org.apache.hadoop.hbase.client.TestHTablePool$TestHTableReusablePool
    Tests run: 9, Failures: 0, Errors: 0, Skipped: 0, Time elapsed: 6.231 sec
    Running org.apache.hadoop.hbase.client.TestHTableUtil
    Tests run: 2, Failures: 0, Errors: 0, Skipped: 0, Time elapsed: 18.134 sec
    Running org.apache.hadoop.hbase.client.TestHTablePool$TestHTableThreadLocalPool
    Tests run: 9, Failures: 0, Errors: 0, Skipped: 0, Time elapsed: 28.437 sec
    Running org.apache.hadoop.hbase.client.TestMetaScanner
    Tests run: 1, Failures: 0, Errors: 0, Skipped: 0, Time elapsed: 19.421 sec
    Running org.apache.hadoop.hbase.client.TestScannerTimeout
    Tests run: 4, Failures: 0, Errors: 0, Skipped: 0, Time elapsed: 47.177 sec
    Running org.apache.hadoop.hbase.client.TestMetaMigrationRemovingHTD
    Tests run: 3, Failures: 0, Errors: 0, Skipped: 0, Time elapsed: 27.561 sec
    Running org.apache.hadoop.hbase.client.TestShell
    Tests run: 1, Failures: 0, Errors: 0, Skipped: 0, Time elapsed: 105.144 sec
    Running org.apache.hadoop.hbase.TestMultiVersions
    Tests run: 3, Failures: 0, Errors: 0, Skipped: 0, Time elapsed: 30.067 sec
    Running org.apache.hadoop.hbase.client.TestMultiParallel
    Tests run: 11, Failures: 0, Errors: 0, Skipped: 0, Time elapsed: 54.163 sec
    Running org.apache.hadoop.hbase.client.TestFromClientSide
    Tests run: 55, Failures: 0, Errors: 0, Skipped: 3, Time elapsed: 212.645 sec
    Running org.apache.hadoop.hbase.thrift.TestThriftServer
    Tests run: 1, Failures: 0, Errors: 0, Skipped: 0, Time elapsed: 49.811 sec
    Running org.apache.hadoop.hbase.master.TestActiveMasterManager
    Tests run: 2, Failures: 0, Errors: 0, Skipped: 0, Time elapsed: 1.322 sec
    Running org.apache.hadoop.hbase.master.TestDeadServer
    Tests run: 1, Failures: 0, Errors: 0, Skipped: 0, Time elapsed: 0.206 sec
    Running org.apache.hadoop.hbase.master.TestLogsCleaner
    Tests run: 1, Failures: 0, Errors: 0, Skipped: 0, Time elapsed: 3.36 sec
    Running org.apache.hadoop.hbase.master.TestRollingRestart
    Tests run: 1, Failures: 0, Errors: 0, Skipped: 0, Time elapsed: 56.669 sec
    Running org.apache.hadoop.hbase.client.TestAdmin
    Tests run: 38, Failures: 0, Errors: 0, Skipped: 0, Time elapsed: 235.457 sec
    Running org.apache.hadoop.hbase.master.TestZKBasedOpenCloseRegion
    Tests run: 4, Failures: 0, Errors: 0, Skipped: 0, Time elapsed: 28.879 sec
    Running org.apache.hadoop.hbase.master.TestMaster
    Tests run: 1, Failures: 0, Errors: 0, Skipped: 0, Time elapsed: 19.786 sec
    Running org.apache.hadoop.hbase.master.TestClockSkewDetection
    Tests run: 1, Failures: 0, Errors: 0, Skipped: 0, Time elapsed: 0.291 sec
    Running org.apache.hadoop.hbase.master.TestOpenedRegionHandler
    Tests run: 2, Failures: 0, Errors: 0, Skipped: 0, Time elapsed: 18.153 sec
    Running org.apache.hadoop.hbase.master.TestSplitLogManager
    Tests run: 12, Failures: 0, Errors: 0, Skipped: 0, Time elapsed: 15.75 sec
    Running org.apache.hadoop.hbase.master.TestMasterTransitions
    Tests run: 3, Failures: 0, Errors: 0, Skipped: 3, Time elapsed: 25.581 sec
    Running org.apache.hadoop.hbase.master.TestDefaultLoadBalancer
    Tests run: 4, Failures: 0, Errors: 0, Skipped: 0, Time elapsed: 1.458 sec
    Running org.apache.hadoop.hbase.master.TestMasterStatusServlet
    Tests run: 5, Failures: 0, Errors: 0, Skipped: 0, Time elapsed: 0.972 sec
    Running org.apache.hadoop.hbase.master.TestHMasterRPCException
    Tests run: 1, Failures: 0, Errors: 0, Skipped: 0, Time elapsed: 1.23 sec
    Running org.apache.hadoop.hbase.master.TestMasterRestartAfterDisablingTable
    Tests run: 1, Failures: 0, Errors: 0, Skipped: 0, Time elapsed: 21.182 sec
    Running org.apache.hadoop.hbase.master.TestMasterFailover
    Tests run: 4, Failures: 0, Errors: 0, Skipped: 0, Time elapsed: 84.48 sec
    Running org.apache.hadoop.hbase.master.TestMasterZKSessionRecovery
    Tests run: 4, Failures: 0, Errors: 0, Skipped: 0, Time elapsed: 69.736 sec
    Running org.apache.hadoop.hbase.master.TestMasterShutdown
    Tests run: 1, Failures: 0, Errors: 0, Skipped: 0, Time elapsed: 16.846 sec
    Running org.apache.hadoop.hbase.master.TestRestartCluster
    Tests run: 2, Failures: 0, Errors: 0, Skipped: 0, Time elapsed: 38.054 sec
    Running org.apache.hadoop.hbase.master.TestDistributedLogSplitting
    Tests run: 4, Failures: 0, Errors: 0, Skipped: 0, Time elapsed: 131.285 sec
    Running org.apache.hadoop.hbase.avro.TestAvroServer
    Tests run: 3, Failures: 0, Errors: 0, Skipped: 0, Time elapsed: 33.914 sec
    Running org.apache.hadoop.hbase.TestRegionRebalancing
    Tests run: 1, Failures: 0, Errors: 0, Skipped: 0, Time elapsed: 69.188 sec
    Running org.apache.hadoop.hbase.ipc.TestDelayedRpc
    Tests run: 4, Failures: 0, Errors: 0, Skipped: 0, Time elapsed: 2.443 sec
    Running org.apache.hadoop.hbase.TestZooKeeper
    Tests run: 7, Failures: 0, Errors: 0, Skipped: 0, Time elapsed: 24.904 sec
    Running org.apache.hadoop.hbase.thrift2.TestThriftHBaseServiceHandler
    Tests run: 12, Failures: 0, Errors: 0, Skipped: 0, Time elapsed: 22.558 sec
    Running org.apache.hadoop.hbase.TestInfoServers
    Tests run: 2, Failures: 0, Errors: 0, Skipped: 0, Time elapsed: 19.81 sec
    Running org.apache.hadoop.hbase.TestAcidGuarantees
    Tests run: 3, Failures: 0, Errors: 0, Skipped: 0, Time elapsed: 114.699 sec
    Running org.apache.hadoop.hbase.thrift.TestThriftServerCmdLine
    Tests run: 20, Failures: 0, Errors: 0, Skipped: 0, Time elapsed: 459.169 sec

    Results :

    Failed tests: testDeleteExpiredStoreFiles(org.apache.hadoop.hbase.regionserver.TestStore): expected:<1> but was:<2>

    Tests in error:
    testShutdownFixupWhenDaughterHasSplit(org.apache.hadoop.hbase.regionserver.TestSplitTransactionOnCluster)

    Tests run: 952, Failures: 1, Errors: 1, Skipped: 9

    [INFO] ------------------------------------------------------------------------
    [INFO] BUILD FAILURE
    [INFO] ------------------------------------------------------------------------
    [INFO] Total time: 53:09.512s
    [INFO] Finished at: Sat Jul 28 06:27:20 UTC 2012
    [INFO] Final Memory: 42M/428M
    [INFO] ------------------------------------------------------------------------
    [ERROR] Failed to execute goal org.apache.maven.plugins:maven-surefire-plugin:2.12-TRUNK-HBASE-2:test (secondPartTestsExecution) on project hbase: There are test failures.
    [ERROR]
    [ERROR] Please refer to <https://builds.apache.org/job/HBase-0.94/ws/trunk/target/surefire-reports> for the individual test results.
    [ERROR] -> [Help 1]
    [ERROR]
    [ERROR] To see the full stack trace of the errors, re-run Maven with the -e switch.
    [ERROR] Re-run Maven using the -X switch to enable full debug logging.
    [ERROR]
    [ERROR] For more information about the errors and possible solutions, please read the following articles:
    [ERROR] [Help 1] http://cwiki.apache.org/confluence/display/MAVEN/MojoFailureException
    Build step 'Invoke top-level Maven targets' marked build as failure
    Archiving artifacts
    Recording test results
  • Apache Jenkins Server at Jul 28, 2012 at 8:55 am
    See <https://builds.apache.org/job/HBase-0.94/374/>

    ------------------------------------------
    [...truncated 567 lines...]
    Tests run: 1, Failures: 0, Errors: 0, Skipped: 0, Time elapsed: 6.507 sec
    Running org.apache.hadoop.hbase.replication.TestMasterReplication
    Tests run: 2, Failures: 0, Errors: 0, Skipped: 0, Time elapsed: 108.232 sec
    Running org.apache.hadoop.hbase.coprocessor.TestAggregateProtocol
    Tests run: 45, Failures: 0, Errors: 0, Skipped: 0, Time elapsed: 23.533 sec
    Running org.apache.hadoop.hbase.coprocessor.TestClassLoading
    Tests run: 6, Failures: 0, Errors: 0, Skipped: 0, Time elapsed: 44.928 sec
    Running org.apache.hadoop.hbase.coprocessor.TestRegionObserverBypass
    Tests run: 2, Failures: 0, Errors: 0, Skipped: 0, Time elapsed: 24.057 sec
    Running org.apache.hadoop.hbase.io.encoding.TestChangingEncoding
    Tests run: 4, Failures: 0, Errors: 0, Skipped: 0, Time elapsed: 381.199 sec
    Running org.apache.hadoop.hbase.coprocessor.TestRegionServerCoprocessorExceptionWithAbort
    Tests run: 1, Failures: 0, Errors: 0, Skipped: 0, Time elapsed: 29.706 sec
    Running org.apache.hadoop.hbase.coprocessor.TestMasterCoprocessorExceptionWithRemove
    Tests run: 1, Failures: 0, Errors: 0, Skipped: 0, Time elapsed: 20.538 sec
    Running org.apache.hadoop.hbase.coprocessor.TestCoprocessorEndpoint
    Tests run: 3, Failures: 0, Errors: 0, Skipped: 1, Time elapsed: 41.771 sec
    Running org.apache.hadoop.hbase.coprocessor.TestRegionObserverInterface
    Tests run: 7, Failures: 0, Errors: 0, Skipped: 0, Time elapsed: 55.572 sec
    Running org.apache.hadoop.hbase.coprocessor.TestRegionServerCoprocessorExceptionWithRemove
    Tests run: 1, Failures: 0, Errors: 0, Skipped: 0, Time elapsed: 31.975 sec
    Running org.apache.hadoop.hbase.coprocessor.TestWALObserver
    Tests run: 3, Failures: 0, Errors: 0, Skipped: 0, Time elapsed: 28.062 sec
    Running org.apache.hadoop.hbase.coprocessor.TestMasterCoprocessorExceptionWithAbort
    Tests run: 1, Failures: 0, Errors: 0, Skipped: 0, Time elapsed: 17.269 sec
    Running org.apache.hadoop.hbase.replication.TestReplication
    Tests run: 10, Failures: 0, Errors: 0, Skipped: 0, Time elapsed: 217.173 sec
    Running org.apache.hadoop.hbase.coprocessor.TestMasterObserver
    Tests run: 3, Failures: 0, Errors: 0, Skipped: 0, Time elapsed: 43.324 sec
    Running org.apache.hadoop.hbase.util.TestMergeTable
    Tests run: 1, Failures: 0, Errors: 0, Skipped: 0, Time elapsed: 51.79 sec
    Running org.apache.hadoop.hbase.util.TestFSUtils
    Tests run: 4, Failures: 0, Errors: 0, Skipped: 0, Time elapsed: 62.06 sec
    Running org.apache.hadoop.hbase.util.hbck.TestOfflineMetaRebuildOverlap
    Tests run: 1, Failures: 0, Errors: 0, Skipped: 0, Time elapsed: 62.429 sec
    Running org.apache.hadoop.hbase.util.hbck.TestOfflineMetaRebuildBase
    Tests run: 1, Failures: 0, Errors: 0, Skipped: 0, Time elapsed: 40.841 sec
    Running org.apache.hadoop.hbase.util.hbck.TestOfflineMetaRebuildHole
    Tests run: 1, Failures: 0, Errors: 0, Skipped: 0, Time elapsed: 35.033 sec
    Running org.apache.hadoop.hbase.util.TestPoolMap$TestRoundRobinPoolType
    Tests run: 3, Failures: 0, Errors: 0, Skipped: 0, Time elapsed: 0.44 sec
    Running org.apache.hadoop.hbase.util.TestPoolMap$TestThreadLocalPoolType
    Tests run: 3, Failures: 0, Errors: 0, Skipped: 0, Time elapsed: 0.218 sec
    Running org.apache.hadoop.hbase.util.TestPoolMap$TestReusablePoolType
    Tests run: 3, Failures: 0, Errors: 0, Skipped: 0, Time elapsed: 0.68 sec
    Running org.apache.hadoop.hbase.util.TestIdLock
    Tests run: 1, Failures: 0, Errors: 0, Skipped: 0, Time elapsed: 15.758 sec
    Running org.apache.hadoop.hbase.util.TestDefaultEnvironmentEdge
    Tests run: 1, Failures: 0, Errors: 0, Skipped: 0, Time elapsed: 0.198 sec
    Running org.apache.hadoop.hbase.util.TestMiniClusterLoadEncoded
    Tests run: 4, Failures: 0, Errors: 0, Skipped: 0, Time elapsed: 201.644 sec
    Running org.apache.hadoop.hbase.util.TestFSTableDescriptors
    Tests run: 10, Failures: 0, Errors: 0, Skipped: 0, Time elapsed: 1.097 sec
    Running org.apache.hadoop.hbase.util.TestEnvironmentEdgeManager
    Tests run: 2, Failures: 0, Errors: 0, Skipped: 0, Time elapsed: 0.398 sec
    Running org.apache.hadoop.hbase.util.TestMergeTool
    Tests run: 1, Failures: 0, Errors: 0, Skipped: 0, Time elapsed: 317.834 sec
    Running org.apache.hadoop.hbase.util.TestMiniClusterLoadSequential
    Tests run: 4, Failures: 0, Errors: 1, Skipped: 0, Time elapsed: 453.437 sec <<< FAILURE!
    Running org.apache.hadoop.hbase.util.TestRegionSplitter
    Running org.apache.hadoop.hbase.util.TestMiniClusterLoadParallel
    Tests run: 5, Failures: 0, Errors: 0, Skipped: 0, Time elapsed: 160.982 sec
    Tests run: 4, Failures: 0, Errors: 0, Skipped: 0, Time elapsed: 396.13 sec
    Running org.apache.hadoop.hbase.mapred.TestTableInputFormat
    Tests run: 10, Failures: 0, Errors: 0, Skipped: 0, Time elapsed: 73.376 sec
    Running org.apache.hadoop.hbase.regionserver.TestStore
    Tests run: 12, Failures: 0, Errors: 0, Skipped: 0, Time elapsed: 9.632 sec
    Running org.apache.hadoop.hbase.regionserver.TestStoreFileBlockCacheSummary
    Tests run: 1, Failures: 0, Errors: 0, Skipped: 0, Time elapsed: 23.998 sec
    Running org.apache.hadoop.hbase.util.TestHBaseFsck
    Tests run: 22, Failures: 0, Errors: 0, Skipped: 0, Time elapsed: 598.257 sec
    Running org.apache.hadoop.hbase.regionserver.handler.TestOpenRegionHandler
    Tests run: 3, Failures: 0, Errors: 0, Skipped: 0, Time elapsed: 2.441 sec
    Running org.apache.hadoop.hbase.regionserver.handler.TestCloseRegionHandler
    Tests run: 3, Failures: 0, Errors: 0, Skipped: 0, Time elapsed: 1.617 sec
    Running org.apache.hadoop.hbase.mapred.TestTableMapReduce
    Tests run: 1, Failures: 0, Errors: 0, Skipped: 0, Time elapsed: 108.072 sec
    Running org.apache.hadoop.hbase.regionserver.TestSplitTransactionOnCluster
    Tests run: 7, Failures: 1, Errors: 0, Skipped: 0, Time elapsed: 86.883 sec <<< FAILURE!
    Running org.apache.hadoop.hbase.regionserver.TestParallelPut
    Tests run: 2, Failures: 0, Errors: 0, Skipped: 0, Time elapsed: 5.352 sec
    Running org.apache.hadoop.hbase.regionserver.TestRegionServerMetrics
    Tests run: 3, Failures: 0, Errors: 0, Skipped: 0, Time elapsed: 101.607 sec
    Running org.apache.hadoop.hbase.regionserver.TestBlocksRead
    Tests run: 4, Failures: 0, Errors: 0, Skipped: 0, Time elapsed: 1.045 sec
    Running org.apache.hadoop.hbase.regionserver.TestMasterAddressManager
    Tests run: 1, Failures: 0, Errors: 0, Skipped: 0, Time elapsed: 1.519 sec
    Running org.apache.hadoop.hbase.regionserver.TestAtomicOperation
    Tests run: 5, Failures: 0, Errors: 0, Skipped: 0, Time elapsed: 16.798 sec
    Running org.apache.hadoop.hbase.regionserver.TestServerCustomProtocol
    Tests run: 7, Failures: 0, Errors: 0, Skipped: 0, Time elapsed: 29.357 sec
    Running org.apache.hadoop.hbase.regionserver.TestHRegionOnCluster
    Tests run: 1, Failures: 0, Errors: 0, Skipped: 0, Time elapsed: 40.659 sec
    Running org.apache.hadoop.hbase.regionserver.wal.TestLogRollingNoCluster
    Tests run: 1, Failures: 0, Errors: 0, Skipped: 0, Time elapsed: 2.179 sec
    Running org.apache.hadoop.hbase.regionserver.wal.TestHLogBench
    Tests run: 1, Failures: 0, Errors: 0, Skipped: 0, Time elapsed: 1.392 sec
    Running org.apache.hadoop.hbase.regionserver.wal.TestWALReplayCompressed
    Tests run: 6, Failures: 0, Errors: 0, Skipped: 0, Time elapsed: 66.554 sec
    Running org.apache.hadoop.hbase.regionserver.wal.TestHLog
    Tests run: 10, Failures: 0, Errors: 0, Skipped: 0, Time elapsed: 76.181 sec
    Running org.apache.hadoop.hbase.regionserver.wal.TestWALReplay
    Tests run: 6, Failures: 0, Errors: 0, Skipped: 0, Time elapsed: 71.333 sec
    Running org.apache.hadoop.hbase.regionserver.wal.TestLogRollAbort
    Tests run: 1, Failures: 0, Errors: 0, Skipped: 0, Time elapsed: 22.903 sec
    Running org.apache.hadoop.hbase.regionserver.TestRpcMetrics
    Tests run: 1, Failures: 0, Errors: 0, Skipped: 0, Time elapsed: 1.939 sec
    Running org.apache.hadoop.hbase.regionserver.TestStoreScanner
    Tests run: 16, Failures: 0, Errors: 0, Skipped: 0, Time elapsed: 0.375 sec
    Running org.apache.hadoop.hbase.regionserver.metrics.TestSchemaMetrics
    Running org.apache.hadoop.hbase.regionserver.TestCacheOnWriteInSchema
    Tests run: 3, Failures: 0, Errors: 0, Skipped: 0, Time elapsed: 1.849 sec
    Tests run: 6, Failures: 0, Errors: 0, Skipped: 0, Time elapsed: 15.064 sec
    Running org.apache.hadoop.hbase.regionserver.TestSeekOptimizations
    Tests run: 6, Failures: 0, Errors: 0, Skipped: 0, Time elapsed: 2.824 sec
    Running org.apache.hadoop.hbase.regionserver.TestFSErrorsExposed
    Tests run: 3, Failures: 0, Errors: 0, Skipped: 0, Time elapsed: 34.371 sec
    Running org.apache.hadoop.hbase.regionserver.wal.TestLogRolling
    Tests run: 3, Failures: 0, Errors: 0, Skipped: 0, Time elapsed: 182.188 sec
    Running org.apache.hadoop.hbase.regionserver.TestSplitLogWorker
    Tests run: 5, Failures: 0, Errors: 0, Skipped: 0, Time elapsed: 3.439 sec
    Running org.apache.hadoop.hbase.regionserver.TestHRegionServerBulkLoad
    Tests run: 1, Failures: 0, Errors: 0, Skipped: 0, Time elapsed: 54.226 sec
    Running org.apache.hadoop.hbase.regionserver.TestMultiColumnScanner
    Tests run: 12, Failures: 0, Errors: 0, Skipped: 0, Time elapsed: 42.157 sec
    Running org.apache.hadoop.hbase.regionserver.TestHRegion
    Tests run: 66, Failures: 0, Errors: 0, Skipped: 0, Time elapsed: 48.854 sec
    Running org.apache.hadoop.hbase.client.replication.TestReplicationAdmin
    Tests run: 1, Failures: 0, Errors: 0, Skipped: 0, Time elapsed: 1.08 sec
    Running org.apache.hadoop.hbase.regionserver.TestEndToEndSplitTransaction
    Tests run: 2, Failures: 0, Errors: 0, Skipped: 0, Time elapsed: 72.567 sec
    Running org.apache.hadoop.hbase.regionserver.TestCompactionState
    Tests run: 2, Failures: 0, Errors: 0, Skipped: 0, Time elapsed: 41.402 sec
    Running org.apache.hadoop.hbase.client.TestTimestampsFilter
    Tests run: 3, Failures: 0, Errors: 0, Skipped: 0, Time elapsed: 29.978 sec
    Running org.apache.hadoop.hbase.client.TestMultipleTimestamps
    Tests run: 8, Failures: 0, Errors: 0, Skipped: 0, Time elapsed: 47.727 sec
    Running org.apache.hadoop.hbase.client.TestHCM
    Tests run: 6, Failures: 0, Errors: 0, Skipped: 0, Time elapsed: 29.014 sec
    Running org.apache.hadoop.hbase.client.TestHTablePool$TestHTableReusablePool
    Tests run: 9, Failures: 0, Errors: 0, Skipped: 0, Time elapsed: 7.373 sec
    Running org.apache.hadoop.hbase.client.TestHTableUtil
    Tests run: 2, Failures: 0, Errors: 0, Skipped: 0, Time elapsed: 21.789 sec
    Running org.apache.hadoop.hbase.client.TestHTablePool$TestHTableThreadLocalPool
    Tests run: 9, Failures: 0, Errors: 0, Skipped: 0, Time elapsed: 32.309 sec
    Running org.apache.hadoop.hbase.client.TestMetaScanner
    Tests run: 1, Failures: 0, Errors: 0, Skipped: 0, Time elapsed: 20.808 sec
    Running org.apache.hadoop.hbase.regionserver.wal.TestHLogSplit
    Tests run: 30, Failures: 0, Errors: 0, Skipped: 1, Time elapsed: 287.721 sec
    Running org.apache.hadoop.hbase.client.TestScannerTimeout
    Tests run: 4, Failures: 0, Errors: 0, Skipped: 0, Time elapsed: 54.261 sec
    Running org.apache.hadoop.hbase.client.TestMetaMigrationRemovingHTD
    Tests run: 3, Failures: 0, Errors: 0, Skipped: 0, Time elapsed: 34.539 sec
    Running org.apache.hadoop.hbase.client.TestShell
    Tests run: 1, Failures: 0, Errors: 0, Skipped: 0, Time elapsed: 128.657 sec
    Running org.apache.hadoop.hbase.client.TestMultiParallel
    Tests run: 11, Failures: 0, Errors: 0, Skipped: 0, Time elapsed: 63.214 sec
    Running org.apache.hadoop.hbase.client.TestFromClientSide
    Tests run: 55, Failures: 0, Errors: 0, Skipped: 3, Time elapsed: 256.883 sec
    Running org.apache.hadoop.hbase.TestMultiVersions
    Tests run: 3, Failures: 0, Errors: 0, Skipped: 0, Time elapsed: 38.617 sec
    Running org.apache.hadoop.hbase.thrift.TestThriftServer
    Tests run: 1, Failures: 0, Errors: 0, Skipped: 0, Time elapsed: 56.363 sec
    Running org.apache.hadoop.hbase.master.TestActiveMasterManager
    Tests run: 2, Failures: 0, Errors: 0, Skipped: 0, Time elapsed: 1.548 sec
    Running org.apache.hadoop.hbase.master.TestDeadServer
    Tests run: 1, Failures: 0, Errors: 0, Skipped: 0, Time elapsed: 0.203 sec
    Running org.apache.hadoop.hbase.master.TestLogsCleaner
    Tests run: 1, Failures: 0, Errors: 0, Skipped: 0, Time elapsed: 3.298 sec
    Running org.apache.hadoop.hbase.master.TestRollingRestart
    Tests run: 1, Failures: 0, Errors: 0, Skipped: 0, Time elapsed: 83.266 sec
    Running org.apache.hadoop.hbase.master.TestZKBasedOpenCloseRegion
    Tests run: 4, Failures: 0, Errors: 0, Skipped: 0, Time elapsed: 42.538 sec
    Running org.apache.hadoop.hbase.master.TestMaster
    Tests run: 1, Failures: 0, Errors: 0, Skipped: 0, Time elapsed: 22.332 sec
    Running org.apache.hadoop.hbase.master.TestOpenedRegionHandler
    Tests run: 2, Failures: 0, Errors: 0, Skipped: 0, Time elapsed: 21.6 sec
    Running org.apache.hadoop.hbase.master.TestClockSkewDetection
    Tests run: 1, Failures: 0, Errors: 0, Skipped: 0, Time elapsed: 0.286 sec
    Running org.apache.hadoop.hbase.master.TestMasterTransitions
    Tests run: 3, Failures: 0, Errors: 0, Skipped: 3, Time elapsed: 32.277 sec
    Running org.apache.hadoop.hbase.master.TestSplitLogManager
    Tests run: 12, Failures: 0, Errors: 0, Skipped: 0, Time elapsed: 18.187 sec
    Running org.apache.hadoop.hbase.client.TestAdmin
    Tests run: 38, Failures: 0, Errors: 0, Skipped: 0, Time elapsed: 351.626 sec
    Running org.apache.hadoop.hbase.master.TestDefaultLoadBalancer
    Tests run: 4, Failures: 0, Errors: 0, Skipped: 0, Time elapsed: 1.485 sec
    Running org.apache.hadoop.hbase.master.TestMasterRestartAfterDisablingTable
    Tests run: 1, Failures: 0, Errors: 0, Skipped: 0, Time elapsed: 27.109 sec
    Running org.apache.hadoop.hbase.master.TestMasterStatusServlet
    Tests run: 5, Failures: 0, Errors: 0, Skipped: 0, Time elapsed: 1.231 sec
    Running org.apache.hadoop.hbase.master.TestHMasterRPCException
    Tests run: 1, Failures: 0, Errors: 0, Skipped: 0, Time elapsed: 1.47 sec
    Running org.apache.hadoop.hbase.master.TestMasterZKSessionRecovery
    Tests run: 4, Failures: 0, Errors: 0, Skipped: 0, Time elapsed: 93.715 sec
    Running org.apache.hadoop.hbase.master.TestMasterFailover
    Tests run: 4, Failures: 0, Errors: 0, Skipped: 0, Time elapsed: 113.866 sec
    Running org.apache.hadoop.hbase.master.TestMasterShutdown
    Tests run: 1, Failures: 0, Errors: 0, Skipped: 0, Time elapsed: 24.54 sec
    Running org.apache.hadoop.hbase.master.TestRestartCluster
    Tests run: 2, Failures: 0, Errors: 0, Skipped: 0, Time elapsed: 49.293 sec
    Running org.apache.hadoop.hbase.master.TestDistributedLogSplitting
    Tests run: 4, Failures: 0, Errors: 0, Skipped: 0, Time elapsed: 194.795 sec
    Running org.apache.hadoop.hbase.avro.TestAvroServer
    Tests run: 3, Failures: 0, Errors: 0, Skipped: 0, Time elapsed: 51.963 sec
    Running org.apache.hadoop.hbase.TestRegionRebalancing
    Tests run: 1, Failures: 0, Errors: 0, Skipped: 0, Time elapsed: 97.979 sec
    Running org.apache.hadoop.hbase.ipc.TestDelayedRpc
    Tests run: 4, Failures: 0, Errors: 0, Skipped: 0, Time elapsed: 2.42 sec
    Running org.apache.hadoop.hbase.thrift2.TestThriftHBaseServiceHandler
    Tests run: 12, Failures: 0, Errors: 0, Skipped: 0, Time elapsed: 19.982 sec
    Running org.apache.hadoop.hbase.TestZooKeeper
    Tests run: 7, Failures: 0, Errors: 0, Skipped: 0, Time elapsed: 33.17 sec
    Running org.apache.hadoop.hbase.TestInfoServers
    Tests run: 2, Failures: 0, Errors: 0, Skipped: 0, Time elapsed: 18.82 sec
    Running org.apache.hadoop.hbase.TestAcidGuarantees
    Tests run: 3, Failures: 0, Errors: 0, Skipped: 0, Time elapsed: 113.861 sec
    Running org.apache.hadoop.hbase.thrift.TestThriftServerCmdLine
    Tests run: 20, Failures: 0, Errors: 0, Skipped: 0, Time elapsed: 501.591 sec

    Results :

    Failed tests: testExistingZnodeBlocksSplitAndWeRollback(org.apache.hadoop.hbase.regionserver.TestSplitTransactionOnCluster): expected:<1> but was:<0>

    Tests in error:
    loadTest[3](org.apache.hadoop.hbase.util.TestMiniClusterLoadSequential): test timed out after 120000 milliseconds

    Tests run: 952, Failures: 1, Errors: 1, Skipped: 9

    [INFO] ------------------------------------------------------------------------
    [INFO] BUILD FAILURE
    [INFO] ------------------------------------------------------------------------
    [INFO] Total time: 54:02.906s
    [INFO] Finished at: Sat Jul 28 08:54:03 UTC 2012
    [INFO] Final Memory: 41M/258M
    [INFO] ------------------------------------------------------------------------
    [ERROR] Failed to execute goal org.apache.maven.plugins:maven-surefire-plugin:2.12-TRUNK-HBASE-2:test (secondPartTestsExecution) on project hbase: There are test failures.
    [ERROR]
    [ERROR] Please refer to <https://builds.apache.org/job/HBase-0.94/ws/trunk/target/surefire-reports> for the individual test results.
    [ERROR] -> [Help 1]
    [ERROR]
    [ERROR] To see the full stack trace of the errors, re-run Maven with the -e switch.
    [ERROR] Re-run Maven using the -X switch to enable full debug logging.
    [ERROR]
    [ERROR] For more information about the errors and possible solutions, please read the following articles:
    [ERROR] [Help 1] http://cwiki.apache.org/confluence/display/MAVEN/MojoFailureException
    Build step 'Invoke top-level Maven targets' marked build as failure
    Archiving artifacts
    Recording test results
  • Apache Jenkins Server at Jul 28, 2012 at 10:15 am
    See <https://builds.apache.org/job/HBase-0.94/375/>

    ------------------------------------------
    [...truncated 568 lines...]
    Running org.apache.hadoop.hbase.replication.TestMasterReplication
    Tests run: 2, Failures: 0, Errors: 0, Skipped: 0, Time elapsed: 94.947 sec
    Running org.apache.hadoop.hbase.coprocessor.TestAggregateProtocol
    Tests run: 45, Failures: 0, Errors: 0, Skipped: 0, Time elapsed: 21.373 sec
    Running org.apache.hadoop.hbase.coprocessor.TestClassLoading
    Tests run: 6, Failures: 0, Errors: 0, Skipped: 0, Time elapsed: 41.074 sec
    Running org.apache.hadoop.hbase.io.encoding.TestChangingEncoding
    Tests run: 4, Failures: 0, Errors: 0, Skipped: 0, Time elapsed: 368.626 sec
    Running org.apache.hadoop.hbase.coprocessor.TestRegionObserverBypass
    Tests run: 2, Failures: 0, Errors: 0, Skipped: 0, Time elapsed: 24.807 sec
    Running org.apache.hadoop.hbase.coprocessor.TestRegionServerCoprocessorExceptionWithAbort
    Tests run: 1, Failures: 0, Errors: 0, Skipped: 0, Time elapsed: 27.697 sec
    Running org.apache.hadoop.hbase.coprocessor.TestMasterCoprocessorExceptionWithRemove
    Tests run: 1, Failures: 0, Errors: 0, Skipped: 0, Time elapsed: 21.846 sec
    Running org.apache.hadoop.hbase.coprocessor.TestCoprocessorEndpoint
    Tests run: 3, Failures: 0, Errors: 0, Skipped: 1, Time elapsed: 38.86 sec
    Running org.apache.hadoop.hbase.coprocessor.TestRegionObserverInterface
    Tests run: 7, Failures: 0, Errors: 0, Skipped: 0, Time elapsed: 51.531 sec
    Running org.apache.hadoop.hbase.coprocessor.TestWALObserver
    Tests run: 3, Failures: 0, Errors: 0, Skipped: 0, Time elapsed: 25.198 sec
    Running org.apache.hadoop.hbase.coprocessor.TestRegionServerCoprocessorExceptionWithRemove
    Tests run: 1, Failures: 0, Errors: 0, Skipped: 0, Time elapsed: 31.043 sec
    Running org.apache.hadoop.hbase.coprocessor.TestMasterCoprocessorExceptionWithAbort
    Tests run: 1, Failures: 0, Errors: 0, Skipped: 0, Time elapsed: 16.531 sec
    Running org.apache.hadoop.hbase.replication.TestReplication
    Tests run: 10, Failures: 0, Errors: 0, Skipped: 0, Time elapsed: 194.258 sec
    Running org.apache.hadoop.hbase.coprocessor.TestMasterObserver
    Tests run: 3, Failures: 0, Errors: 0, Skipped: 0, Time elapsed: 39.864 sec
    Running org.apache.hadoop.hbase.util.TestMergeTable
    Tests run: 1, Failures: 0, Errors: 0, Skipped: 0, Time elapsed: 58.132 sec
    Running org.apache.hadoop.hbase.util.TestFSUtils
    Tests run: 4, Failures: 0, Errors: 0, Skipped: 0, Time elapsed: 70.321 sec
    Running org.apache.hadoop.hbase.util.hbck.TestOfflineMetaRebuildOverlap
    Tests run: 1, Failures: 0, Errors: 0, Skipped: 0, Time elapsed: 58.065 sec
    Running org.apache.hadoop.hbase.util.hbck.TestOfflineMetaRebuildBase
    Tests run: 1, Failures: 0, Errors: 0, Skipped: 0, Time elapsed: 42.48 sec
    Running org.apache.hadoop.hbase.util.TestPoolMap$TestRoundRobinPoolType
    Tests run: 3, Failures: 0, Errors: 0, Skipped: 0, Time elapsed: 0.02 sec
    Running org.apache.hadoop.hbase.util.TestPoolMap$TestThreadLocalPoolType
    Tests run: 3, Failures: 0, Errors: 0, Skipped: 0, Time elapsed: 0.012 sec
    Running org.apache.hadoop.hbase.util.TestPoolMap$TestReusablePoolType
    Tests run: 3, Failures: 0, Errors: 0, Skipped: 0, Time elapsed: 0.065 sec
    Running org.apache.hadoop.hbase.util.hbck.TestOfflineMetaRebuildHole
    Tests run: 1, Failures: 0, Errors: 0, Skipped: 0, Time elapsed: 40.13 sec
    Running org.apache.hadoop.hbase.util.TestIdLock
    Tests run: 1, Failures: 0, Errors: 0, Skipped: 0, Time elapsed: 15.504 sec
    Running org.apache.hadoop.hbase.util.TestDefaultEnvironmentEdge
    Tests run: 1, Failures: 0, Errors: 0, Skipped: 0, Time elapsed: 0.196 sec
    Running org.apache.hadoop.hbase.util.TestMiniClusterLoadEncoded
    Tests run: 4, Failures: 0, Errors: 0, Skipped: 0, Time elapsed: 246.349 sec
    Running org.apache.hadoop.hbase.util.TestFSTableDescriptors
    Tests run: 10, Failures: 0, Errors: 0, Skipped: 0, Time elapsed: 1.069 sec
    Running org.apache.hadoop.hbase.util.TestEnvironmentEdgeManager
    Tests run: 2, Failures: 0, Errors: 0, Skipped: 0, Time elapsed: 0.721 sec
    Running org.apache.hadoop.hbase.util.TestMiniClusterLoadSequential
    Tests run: 4, Failures: 0, Errors: 0, Skipped: 0, Time elapsed: 346.094 sec
    Running org.apache.hadoop.hbase.util.TestMergeTool
    Tests run: 1, Failures: 0, Errors: 0, Skipped: 0, Time elapsed: 303.436 sec
    Running org.apache.hadoop.hbase.mapred.TestTableInputFormat
    Tests run: 10, Failures: 0, Errors: 0, Skipped: 0, Time elapsed: 75.711 sec
    Running org.apache.hadoop.hbase.util.TestRegionSplitter
    Tests run: 5, Failures: 0, Errors: 0, Skipped: 0, Time elapsed: 156.759 sec
    Running org.apache.hadoop.hbase.util.TestMiniClusterLoadParallel
    Tests run: 4, Failures: 0, Errors: 1, Skipped: 0, Time elapsed: 382.458 sec <<< FAILURE!
    Running org.apache.hadoop.hbase.regionserver.TestStore
    Tests run: 12, Failures: 0, Errors: 0, Skipped: 0, Time elapsed: 12.454 sec
    Running org.apache.hadoop.hbase.regionserver.TestStoreFileBlockCacheSummary
    Tests run: 1, Failures: 0, Errors: 0, Skipped: 0, Time elapsed: 78.28 sec
    Running org.apache.hadoop.hbase.mapred.TestTableMapReduce
    Tests run: 1, Failures: 0, Errors: 0, Skipped: 0, Time elapsed: 207.142 sec
    Running org.apache.hadoop.hbase.regionserver.handler.TestOpenRegionHandler
    Tests run: 3, Failures: 0, Errors: 0, Skipped: 0, Time elapsed: 1.496 sec
    Running org.apache.hadoop.hbase.regionserver.handler.TestCloseRegionHandler
    Tests run: 3, Failures: 0, Errors: 0, Skipped: 0, Time elapsed: 1.901 sec
    Running org.apache.hadoop.hbase.regionserver.TestParallelPut
    Tests run: 2, Failures: 0, Errors: 0, Skipped: 0, Time elapsed: 5.183 sec
    Running org.apache.hadoop.hbase.util.TestHBaseFsck
    Tests run: 22, Failures: 0, Errors: 1, Skipped: 0, Time elapsed: 615.494 sec <<< FAILURE!
    Running org.apache.hadoop.hbase.regionserver.TestServerCustomProtocol
    Tests run: 7, Failures: 0, Errors: 0, Skipped: 0, Time elapsed: 21.05 sec
    Running org.apache.hadoop.hbase.regionserver.TestRegionServerMetrics
    Tests run: 3, Failures: 0, Errors: 0, Skipped: 0, Time elapsed: 101.882 sec
    Running org.apache.hadoop.hbase.regionserver.TestBlocksRead
    Tests run: 4, Failures: 0, Errors: 0, Skipped: 0, Time elapsed: 2.305 sec
    Running org.apache.hadoop.hbase.regionserver.TestMasterAddressManager
    Tests run: 1, Failures: 0, Errors: 0, Skipped: 0, Time elapsed: 1.061 sec
    Running org.apache.hadoop.hbase.regionserver.TestHRegionOnCluster
    Tests run: 1, Failures: 0, Errors: 0, Skipped: 0, Time elapsed: 28.876 sec
    Running org.apache.hadoop.hbase.regionserver.TestAtomicOperation
    Tests run: 5, Failures: 0, Errors: 0, Skipped: 0, Time elapsed: 16.167 sec
    Running org.apache.hadoop.hbase.regionserver.TestSplitTransactionOnCluster
    Tests run: 7, Failures: 0, Errors: 0, Skipped: 0, Time elapsed: 103.743 sec
    Running org.apache.hadoop.hbase.regionserver.wal.TestLogRollingNoCluster
    Tests run: 1, Failures: 0, Errors: 0, Skipped: 0, Time elapsed: 2.154 sec
    Running org.apache.hadoop.hbase.regionserver.wal.TestHLogBench
    Tests run: 1, Failures: 0, Errors: 0, Skipped: 0, Time elapsed: 1.31 sec
    Running org.apache.hadoop.hbase.regionserver.wal.TestWALReplay
    Tests run: 6, Failures: 0, Errors: 0, Skipped: 0, Time elapsed: 54.242 sec
    Running org.apache.hadoop.hbase.regionserver.wal.TestWALReplayCompressed
    Tests run: 6, Failures: 0, Errors: 0, Skipped: 0, Time elapsed: 64.262 sec
    Running org.apache.hadoop.hbase.regionserver.wal.TestHLog
    Tests run: 10, Failures: 0, Errors: 0, Skipped: 0, Time elapsed: 81.349 sec
    Running org.apache.hadoop.hbase.regionserver.metrics.TestSchemaMetrics
    Tests run: 6, Failures: 0, Errors: 0, Skipped: 0, Time elapsed: 15.051 sec
    Running org.apache.hadoop.hbase.regionserver.TestRpcMetrics
    Tests run: 1, Failures: 0, Errors: 0, Skipped: 0, Time elapsed: 2.232 sec
    Running org.apache.hadoop.hbase.regionserver.TestStoreScanner
    Tests run: 16, Failures: 0, Errors: 0, Skipped: 0, Time elapsed: 0.055 sec
    Running org.apache.hadoop.hbase.regionserver.TestCacheOnWriteInSchema
    Tests run: 3, Failures: 0, Errors: 0, Skipped: 0, Time elapsed: 1.598 sec
    Running org.apache.hadoop.hbase.regionserver.TestSeekOptimizations
    Tests run: 6, Failures: 0, Errors: 0, Skipped: 0, Time elapsed: 2.762 sec
    Running org.apache.hadoop.hbase.regionserver.TestFSErrorsExposed
    Tests run: 3, Failures: 0, Errors: 0, Skipped: 0, Time elapsed: 30.228 sec
    Running org.apache.hadoop.hbase.regionserver.wal.TestLogRollAbort
    Tests run: 1, Failures: 0, Errors: 0, Skipped: 0, Time elapsed: 160.929 sec
    Running org.apache.hadoop.hbase.regionserver.TestSplitLogWorker
    Tests run: 5, Failures: 0, Errors: 0, Skipped: 0, Time elapsed: 3 sec
    Running org.apache.hadoop.hbase.regionserver.TestHRegionServerBulkLoad
    Tests run: 1, Failures: 0, Errors: 0, Skipped: 0, Time elapsed: 47.007 sec
    Running org.apache.hadoop.hbase.regionserver.TestMultiColumnScanner
    Tests run: 12, Failures: 0, Errors: 0, Skipped: 0, Time elapsed: 41.702 sec
    Running org.apache.hadoop.hbase.regionserver.wal.TestLogRolling
    Tests run: 3, Failures: 0, Errors: 0, Skipped: 0, Time elapsed: 321.348 sec
    Running org.apache.hadoop.hbase.regionserver.TestEndToEndSplitTransaction
    Running org.apache.hadoop.hbase.regionserver.TestHRegion
    Tests run: 2, Failures: 0, Errors: 0, Skipped: 0, Time elapsed: 76.231 sec
    Tests run: 66, Failures: 0, Errors: 0, Skipped: 0, Time elapsed: 44.691 sec
    Running org.apache.hadoop.hbase.client.replication.TestReplicationAdmin
    Tests run: 1, Failures: 0, Errors: 0, Skipped: 0, Time elapsed: 1.1 sec
    Running org.apache.hadoop.hbase.client.TestTimestampsFilter
    Tests run: 3, Failures: 0, Errors: 0, Skipped: 0, Time elapsed: 27.979 sec
    Running org.apache.hadoop.hbase.regionserver.TestCompactionState
    Tests run: 2, Failures: 0, Errors: 0, Skipped: 0, Time elapsed: 40.471 sec
    Running org.apache.hadoop.hbase.client.TestMultipleTimestamps
    Tests run: 8, Failures: 0, Errors: 0, Skipped: 0, Time elapsed: 41.851 sec
    Running org.apache.hadoop.hbase.client.TestHCM
    Tests run: 6, Failures: 0, Errors: 0, Skipped: 0, Time elapsed: 24.635 sec
    Running org.apache.hadoop.hbase.client.TestHTablePool$TestHTableReusablePool
    Tests run: 9, Failures: 0, Errors: 0, Skipped: 0, Time elapsed: 8.225 sec
    Running org.apache.hadoop.hbase.client.TestHTablePool$TestHTableThreadLocalPool
    Tests run: 9, Failures: 0, Errors: 0, Skipped: 0, Time elapsed: 33.392 sec
    Running org.apache.hadoop.hbase.client.TestHTableUtil
    Tests run: 2, Failures: 0, Errors: 0, Skipped: 0, Time elapsed: 21.732 sec
    Running org.apache.hadoop.hbase.regionserver.wal.TestHLogSplit
    Tests run: 30, Failures: 0, Errors: 0, Skipped: 1, Time elapsed: 278.826 sec
    Running org.apache.hadoop.hbase.client.TestMetaScanner
    Tests run: 1, Failures: 0, Errors: 0, Skipped: 0, Time elapsed: 19.556 sec
    Running org.apache.hadoop.hbase.client.TestScannerTimeout
    Tests run: 4, Failures: 0, Errors: 0, Skipped: 0, Time elapsed: 48.316 sec
    Running org.apache.hadoop.hbase.client.TestMetaMigrationRemovingHTD
    Tests run: 3, Failures: 0, Errors: 0, Skipped: 0, Time elapsed: 28.98 sec
    Running org.apache.hadoop.hbase.client.TestShell
    Tests run: 1, Failures: 0, Errors: 0, Skipped: 0, Time elapsed: 105.96 sec
    Running org.apache.hadoop.hbase.TestMultiVersions
    Tests run: 3, Failures: 0, Errors: 0, Skipped: 0, Time elapsed: 32.265 sec
    Running org.apache.hadoop.hbase.client.TestMultiParallel
    Tests run: 11, Failures: 0, Errors: 0, Skipped: 0, Time elapsed: 55.545 sec
    Running org.apache.hadoop.hbase.client.TestFromClientSide
    Tests run: 55, Failures: 0, Errors: 0, Skipped: 3, Time elapsed: 228.352 sec
    Running org.apache.hadoop.hbase.thrift.TestThriftServer
    Tests run: 1, Failures: 0, Errors: 0, Skipped: 0, Time elapsed: 62.8 sec
    Running org.apache.hadoop.hbase.master.TestActiveMasterManager
    Tests run: 2, Failures: 0, Errors: 0, Skipped: 0, Time elapsed: 1.233 sec
    Running org.apache.hadoop.hbase.master.TestDeadServer
    Tests run: 1, Failures: 0, Errors: 0, Skipped: 0, Time elapsed: 0.208 sec
    Running org.apache.hadoop.hbase.master.TestLogsCleaner
    Tests run: 1, Failures: 0, Errors: 0, Skipped: 0, Time elapsed: 3.57 sec
    Running org.apache.hadoop.hbase.master.TestRollingRestart
    Tests run: 1, Failures: 0, Errors: 0, Skipped: 0, Time elapsed: 71.355 sec
    Running org.apache.hadoop.hbase.client.TestAdmin
    Tests run: 38, Failures: 0, Errors: 0, Skipped: 0, Time elapsed: 252.929 sec
    Running org.apache.hadoop.hbase.master.TestZKBasedOpenCloseRegion
    Tests run: 4, Failures: 0, Errors: 0, Skipped: 0, Time elapsed: 49.242 sec
    Running org.apache.hadoop.hbase.master.TestMaster
    Tests run: 1, Failures: 0, Errors: 0, Skipped: 0, Time elapsed: 36.767 sec
    Running org.apache.hadoop.hbase.master.TestClockSkewDetection
    Tests run: 1, Failures: 0, Errors: 0, Skipped: 0, Time elapsed: 0.285 sec
    Running org.apache.hadoop.hbase.master.TestMasterTransitions
    Tests run: 3, Failures: 0, Errors: 0, Skipped: 3, Time elapsed: 42.447 sec
    Running org.apache.hadoop.hbase.master.TestOpenedRegionHandler
    Tests run: 2, Failures: 0, Errors: 0, Skipped: 0, Time elapsed: 19.875 sec
    Running org.apache.hadoop.hbase.master.TestSplitLogManager
    Tests run: 12, Failures: 0, Errors: 0, Skipped: 0, Time elapsed: 16.376 sec
    Running org.apache.hadoop.hbase.master.TestDefaultLoadBalancer
    Tests run: 4, Failures: 0, Errors: 0, Skipped: 0, Time elapsed: 1.462 sec
    Running org.apache.hadoop.hbase.master.TestMasterStatusServlet
    Tests run: 5, Failures: 0, Errors: 0, Skipped: 0, Time elapsed: 1.068 sec
    Running org.apache.hadoop.hbase.master.TestHMasterRPCException
    Tests run: 1, Failures: 0, Errors: 0, Skipped: 0, Time elapsed: 1.554 sec
    Running org.apache.hadoop.hbase.master.TestMasterRestartAfterDisablingTable
    Tests run: 1, Failures: 0, Errors: 0, Skipped: 0, Time elapsed: 22.787 sec
    Running org.apache.hadoop.hbase.master.TestMasterZKSessionRecovery
    Tests run: 4, Failures: 0, Errors: 0, Skipped: 0, Time elapsed: 78.312 sec
    Running org.apache.hadoop.hbase.master.TestMasterFailover
    Tests run: 4, Failures: 0, Errors: 0, Skipped: 0, Time elapsed: 91.758 sec
    Running org.apache.hadoop.hbase.master.TestMasterShutdown
    Tests run: 1, Failures: 0, Errors: 0, Skipped: 0, Time elapsed: 16.067 sec
    Running org.apache.hadoop.hbase.master.TestDistributedLogSplitting
    Tests run: 4, Failures: 0, Errors: 0, Skipped: 0, Time elapsed: 140.029 sec
    Running org.apache.hadoop.hbase.master.TestRestartCluster
    Tests run: 2, Failures: 0, Errors: 0, Skipped: 0, Time elapsed: 38.172 sec
    Running org.apache.hadoop.hbase.TestRegionRebalancing
    Tests run: 1, Failures: 0, Errors: 0, Skipped: 0, Time elapsed: 56.041 sec
    Running org.apache.hadoop.hbase.avro.TestAvroServer
    Tests run: 3, Failures: 0, Errors: 0, Skipped: 0, Time elapsed: 29.828 sec
    Running org.apache.hadoop.hbase.ipc.TestDelayedRpc
    Tests run: 4, Failures: 0, Errors: 0, Skipped: 0, Time elapsed: 2.485 sec
    Running org.apache.hadoop.hbase.thrift2.TestThriftHBaseServiceHandler
    Tests run: 12, Failures: 0, Errors: 0, Skipped: 0, Time elapsed: 16.139 sec
    Running org.apache.hadoop.hbase.TestZooKeeper
    Tests run: 7, Failures: 0, Errors: 0, Skipped: 0, Time elapsed: 25.545 sec
    Running org.apache.hadoop.hbase.TestInfoServers
    Tests run: 2, Failures: 0, Errors: 0, Skipped: 0, Time elapsed: 13.361 sec
    Running org.apache.hadoop.hbase.TestAcidGuarantees
    Tests run: 3, Failures: 0, Errors: 0, Skipped: 0, Time elapsed: 104.663 sec
    Running org.apache.hadoop.hbase.thrift.TestThriftServerCmdLine
    Tests run: 20, Failures: 0, Errors: 0, Skipped: 0, Time elapsed: 457.068 sec

    Results :

    Failed tests: testLeaderSelection(org.apache.hadoop.hbase.zookeeper.TestZKLeaderManager): Leader should exist

    Tests in error:
    loadTest[0](org.apache.hadoop.hbase.util.TestMiniClusterLoadParallel): test timed out after 120000 milliseconds
    testNotInMetaHole(org.apache.hadoop.hbase.util.TestHBaseFsck): org.apache.hadoop.hbase.TableNotEnabledException: tableNotInMetaHole

    Tests run: 952, Failures: 1, Errors: 2, Skipped: 9

    [INFO] ------------------------------------------------------------------------
    [INFO] BUILD FAILURE
    [INFO] ------------------------------------------------------------------------
    [INFO] Total time: 52:52.510s
    [INFO] Finished at: Sat Jul 28 10:14:49 UTC 2012
    [INFO] Final Memory: 46M/730M
    [INFO] ------------------------------------------------------------------------
    [ERROR] Failed to execute goal org.apache.maven.plugins:maven-surefire-plugin:2.12-TRUNK-HBASE-2:test (secondPartTestsExecution) on project hbase: There are test failures.
    [ERROR]
    [ERROR] Please refer to <https://builds.apache.org/job/HBase-0.94/ws/trunk/target/surefire-reports> for the individual test results.
    [ERROR] -> [Help 1]
    [ERROR]
    [ERROR] To see the full stack trace of the errors, re-run Maven with the -e switch.
    [ERROR] Re-run Maven using the -X switch to enable full debug logging.
    [ERROR]
    [ERROR] For more information about the errors and possible solutions, please read the following articles:
    [ERROR] [Help 1] http://cwiki.apache.org/confluence/display/MAVEN/MojoFailureException
    Build step 'Invoke top-level Maven targets' marked build as failure
    Archiving artifacts
    Recording test results
  • Apache Jenkins Server at Jul 28, 2012 at 10:53 pm

Related Discussions

Discussion Navigation
viewthread | post
Discussion Overview
groupdev @
categorieshbase, hadoop
postedJul 27, '12 at 12:16a
activeJul 28, '12 at 10:53p
posts5
users1
websitehbase.apache.org

1 user in discussion

Apache Jenkins Server: 5 posts

People

Translate

site design / logo © 2022 Grokbase