Grokbase Groups HBase dev July 2012
FAQ
See <https://builds.apache.org/job/HBase-TRUNK/3179/changes>

Changes:

[stack] Add link to quora blooms answer

------------------------------------------
[...truncated 2567 lines...]
Tests run: 4, Failures: 0, Errors: 0, Skipped: 0, Time elapsed: 164.041 sec
Running org.apache.hadoop.hbase.util.hbck.TestOfflineMetaRebuildBase
Tests run: 1, Failures: 0, Errors: 0, Skipped: 0, Time elapsed: 53.263 sec
Running org.apache.hadoop.hbase.util.TestDefaultEnvironmentEdge
Tests run: 1, Failures: 0, Errors: 0, Skipped: 0, Time elapsed: 0.241 sec
Running org.apache.hadoop.hbase.util.TestIdLock
Tests run: 1, Failures: 0, Errors: 0, Skipped: 0, Time elapsed: 15.308 sec
Running org.apache.hadoop.hbase.util.TestFSTableDescriptors
Tests run: 10, Failures: 0, Errors: 0, Skipped: 0, Time elapsed: 1.712 sec
Running org.apache.hadoop.hbase.util.TestEnvironmentEdgeManager
Tests run: 2, Failures: 0, Errors: 0, Skipped: 0, Time elapsed: 6.64 sec
Running org.apache.hadoop.hbase.util.TestMergeTool
Tests run: 1, Failures: 0, Errors: 0, Skipped: 0, Time elapsed: 203.183 sec
Running org.apache.hadoop.hbase.util.TestProcessBasedCluster
Tests run: 1, Failures: 0, Errors: 0, Skipped: 0, Time elapsed: 0.687 sec
Running org.apache.hadoop.hbase.util.TestRegionSplitter
Tests run: 5, Failures: 0, Errors: 0, Skipped: 0, Time elapsed: 166.861 sec
Running org.apache.hadoop.hbase.util.TestMiniClusterLoadSequential
Tests run: 4, Failures: 0, Errors: 0, Skipped: 0, Time elapsed: 450.489 sec
Running org.apache.hadoop.hbase.util.TestMiniClusterLoadParallel
Tests run: 4, Failures: 0, Errors: 1, Skipped: 0, Time elapsed: 461.386 sec <<< FAILURE!
Running org.apache.hadoop.hbase.mapred.TestTableInputFormat
Tests run: 10, Failures: 0, Errors: 0, Skipped: 0, Time elapsed: 113.085 sec
Running org.apache.hadoop.hbase.regionserver.TestStore
Tests run: 12, Failures: 0, Errors: 0, Skipped: 0, Time elapsed: 9.481 sec
Running org.apache.hadoop.hbase.regionserver.TestStoreFileBlockCacheSummary
Tests run: 1, Failures: 0, Errors: 0, Skipped: 0, Time elapsed: 35.288 sec
Running org.apache.hadoop.hbase.regionserver.TestCompaction
Tests run: 15, Failures: 0, Errors: 0, Skipped: 0, Time elapsed: 49.993 sec
Running org.apache.hadoop.hbase.regionserver.TestMemStore
Tests run: 21, Failures: 0, Errors: 0, Skipped: 0, Time elapsed: 30.188 sec
Running org.apache.hadoop.hbase.mapred.TestTableMapReduce
Tests run: 1, Failures: 0, Errors: 0, Skipped: 0, Time elapsed: 161.763 sec
Running org.apache.hadoop.hbase.regionserver.handler.TestOpenRegionHandler
Tests run: 3, Failures: 0, Errors: 0, Skipped: 0, Time elapsed: 2.468 sec
Running org.apache.hadoop.hbase.regionserver.handler.TestCloseRegionHandler
Tests run: 3, Failures: 0, Errors: 0, Skipped: 0, Time elapsed: 1.577 sec
Running org.apache.hadoop.hbase.regionserver.TestParallelPut
Tests run: 2, Failures: 0, Errors: 0, Skipped: 0, Time elapsed: 5.81 sec
Running org.apache.hadoop.hbase.regionserver.TestServerCustomProtocol
Tests run: 7, Failures: 0, Errors: 0, Skipped: 0, Time elapsed: 23.116 sec
Running org.apache.hadoop.hbase.util.TestHBaseFsck
Tests run: 22, Failures: 0, Errors: 0, Skipped: 0, Time elapsed: 639.701 sec
Running org.apache.hadoop.hbase.regionserver.TestRegionServerMetrics
Tests run: 4, Failures: 0, Errors: 0, Skipped: 0, Time elapsed: 124.471 sec
Running org.apache.hadoop.hbase.regionserver.TestHRegionOnCluster
Tests run: 1, Failures: 0, Errors: 0, Skipped: 0, Time elapsed: 37.323 sec
Running org.apache.hadoop.hbase.regionserver.TestBlocksRead
Tests run: 4, Failures: 0, Errors: 0, Skipped: 0, Time elapsed: 1.17 sec
Running org.apache.hadoop.hbase.regionserver.TestAtomicOperation
Tests run: 5, Failures: 0, Errors: 0, Skipped: 0, Time elapsed: 16.196 sec
Running org.apache.hadoop.hbase.regionserver.TestMasterAddressManager
Tests run: 1, Failures: 0, Errors: 0, Skipped: 0, Time elapsed: 4.148 sec
Running org.apache.hadoop.hbase.regionserver.TestSplitTransactionOnCluster
Tests run: 7, Failures: 0, Errors: 0, Skipped: 0, Time elapsed: 82.514 sec
Running org.apache.hadoop.hbase.regionserver.TestRSKilledWhenMasterInitializing
Tests run: 1, Failures: 0, Errors: 0, Skipped: 0, Time elapsed: 77.562 sec
Running org.apache.hadoop.hbase.regionserver.wal.TestWALReplayCompressed
Tests run: 7, Failures: 0, Errors: 0, Skipped: 0, Time elapsed: 65.737 sec
Running org.apache.hadoop.hbase.regionserver.wal.TestWALReplay
Tests run: 7, Failures: 0, Errors: 0, Skipped: 0, Time elapsed: 66.482 sec
Running org.apache.hadoop.hbase.regionserver.wal.TestHLog
Tests run: 10, Failures: 0, Errors: 0, Skipped: 0, Time elapsed: 76.645 sec
Running org.apache.hadoop.hbase.regionserver.TestMXBean
Tests run: 1, Failures: 0, Errors: 0, Skipped: 0, Time elapsed: 11.876 sec
Running org.apache.hadoop.hbase.regionserver.metrics.TestSchemaMetrics
Tests run: 6, Failures: 0, Errors: 0, Skipped: 0, Time elapsed: 14.992 sec
Running org.apache.hadoop.hbase.regionserver.TestRpcMetrics
Tests run: 1, Failures: 0, Errors: 0, Skipped: 0, Time elapsed: 1.872 sec
Running org.apache.hadoop.hbase.regionserver.TestGetClosestAtOrBefore
Tests run: 3, Failures: 0, Errors: 0, Skipped: 0, Time elapsed: 0.971 sec
Running org.apache.hadoop.hbase.regionserver.TestStoreScanner
Tests run: 16, Failures: 0, Errors: 0, Skipped: 0, Time elapsed: 0.052 sec
Running org.apache.hadoop.hbase.regionserver.TestCacheOnWriteInSchema
Tests run: 3, Failures: 0, Errors: 0, Skipped: 0, Time elapsed: 1.742 sec
Running org.apache.hadoop.hbase.regionserver.TestSeekOptimizations
Tests run: 6, Failures: 0, Errors: 0, Skipped: 0, Time elapsed: 2.844 sec
Running org.apache.hadoop.hbase.regionserver.wal.TestLogRollAbort
Tests run: 1, Failures: 0, Errors: 0, Skipped: 0, Time elapsed: 155.953 sec
Running org.apache.hadoop.hbase.regionserver.TestFSErrorsExposed
Tests run: 3, Failures: 0, Errors: 0, Skipped: 0, Time elapsed: 42.56 sec
Running org.apache.hadoop.hbase.regionserver.TestSplitLogWorker
Tests run: 5, Failures: 0, Errors: 0, Skipped: 0, Time elapsed: 3.246 sec
Running org.apache.hadoop.hbase.regionserver.wal.TestLogRolling
Tests run: 2, Failures: 1, Errors: 0, Skipped: 0, Time elapsed: 220.388 sec <<< FAILURE!
Running org.apache.hadoop.hbase.regionserver.TestHRegionServerBulkLoad
Tests run: 1, Failures: 0, Errors: 0, Skipped: 0, Time elapsed: 51.943 sec
Running org.apache.hadoop.hbase.regionserver.TestMultiColumnScanner
Tests run: 12, Failures: 0, Errors: 0, Skipped: 0, Time elapsed: 43.079 sec
Running org.apache.hadoop.hbase.regionserver.TestCompoundBloomFilter
Tests run: 3, Failures: 0, Errors: 0, Skipped: 0, Time elapsed: 26.577 sec
Running org.apache.hadoop.hbase.regionserver.TestHRegion
Tests run: 66, Failures: 0, Errors: 1, Skipped: 0, Time elapsed: 46.7 sec <<< FAILURE!
Running org.apache.hadoop.hbase.client.replication.TestReplicationAdmin
Tests run: 1, Failures: 0, Errors: 0, Skipped: 0, Time elapsed: 1.159 sec
Running org.apache.hadoop.hbase.regionserver.TestCompactionState
Tests run: 2, Failures: 0, Errors: 0, Skipped: 0, Time elapsed: 53.793 sec
Running org.apache.hadoop.hbase.regionserver.TestEndToEndSplitTransaction
Tests run: 2, Failures: 0, Errors: 0, Skipped: 0, Time elapsed: 75.699 sec
Running org.apache.hadoop.hbase.client.TestTimestampsFilter
Tests run: 3, Failures: 0, Errors: 0, Skipped: 0, Time elapsed: 29.947 sec
Running org.apache.hadoop.hbase.client.TestMultipleTimestamps
Tests run: 8, Failures: 0, Errors: 0, Skipped: 0, Time elapsed: 34.356 sec
Running org.apache.hadoop.hbase.client.TestHCM
Tests run: 7, Failures: 0, Errors: 0, Skipped: 0, Time elapsed: 27.149 sec
Running org.apache.hadoop.hbase.client.TestHTablePool$TestHTableReusablePool
Tests run: 9, Failures: 0, Errors: 0, Skipped: 0, Time elapsed: 6.45 sec
Running org.apache.hadoop.hbase.client.TestHTablePool$TestHTableThreadLocalPool
Tests run: 9, Failures: 0, Errors: 0, Skipped: 0, Time elapsed: 30.208 sec
Running org.apache.hadoop.hbase.client.TestFromClientSide3
Tests run: 1, Failures: 0, Errors: 0, Skipped: 0, Time elapsed: 35.2 sec
Running org.apache.hadoop.hbase.regionserver.wal.TestHLogSplit
Tests run: 30, Failures: 0, Errors: 0, Skipped: 1, Time elapsed: 284.692 sec
Running org.apache.hadoop.hbase.client.TestHTableUtil
Tests run: 2, Failures: 0, Errors: 0, Skipped: 0, Time elapsed: 21.128 sec
Running org.apache.hadoop.hbase.client.TestMetaScanner
Tests run: 1, Failures: 0, Errors: 0, Skipped: 0, Time elapsed: 22.498 sec
Running org.apache.hadoop.hbase.client.TestScannerTimeout
Tests run: 4, Failures: 0, Errors: 0, Skipped: 0, Time elapsed: 55.167 sec
Running org.apache.hadoop.hbase.client.TestScannersFromClientSide
Tests run: 4, Failures: 0, Errors: 0, Skipped: 0, Time elapsed: 33.663 sec
Running org.apache.hadoop.hbase.client.TestShell
Tests run: 1, Failures: 0, Errors: 0, Skipped: 0, Time elapsed: 149.126 sec
Running org.apache.hadoop.hbase.client.TestMetaMigrationRemovingHTD
Tests run: 3, Failures: 0, Errors: 0, Skipped: 0, Time elapsed: 42.466 sec
Running org.apache.hadoop.hbase.client.TestFromClientSide
Tests run: 56, Failures: 0, Errors: 0, Skipped: 3, Time elapsed: 229.103 sec
Running org.apache.hadoop.hbase.TestMultiVersions
Tests run: 3, Failures: 0, Errors: 0, Skipped: 0, Time elapsed: 39.09 sec
Running org.apache.hadoop.hbase.client.TestMultiParallel
Tests run: 11, Failures: 0, Errors: 0, Skipped: 0, Time elapsed: 62.175 sec
Running org.apache.hadoop.hbase.client.TestAdmin
Tests run: 40, Failures: 0, Errors: 0, Skipped: 0, Time elapsed: 233.173 sec
Running org.apache.hadoop.hbase.master.TestActiveMasterManager
Tests run: 2, Failures: 0, Errors: 0, Skipped: 0, Time elapsed: 1.423 sec
Running org.apache.hadoop.hbase.master.TestMasterNoCluster
Tests run: 3, Failures: 0, Errors: 0, Skipped: 0, Time elapsed: 8.436 sec
Running org.apache.hadoop.hbase.thrift.TestThriftServer
Tests run: 1, Failures: 0, Errors: 0, Skipped: 0, Time elapsed: 96.634 sec
Running org.apache.hadoop.hbase.master.TestRollingRestart
Tests run: 1, Failures: 0, Errors: 0, Skipped: 0, Time elapsed: 74.465 sec
Running org.apache.hadoop.hbase.master.balancer.TestBaseLoadBalancer
Tests run: 3, Failures: 0, Errors: 0, Skipped: 0, Time elapsed: 0.356 sec
Running org.apache.hadoop.hbase.master.balancer.TestDefaultLoadBalancer
Tests run: 1, Failures: 0, Errors: 0, Skipped: 0, Time elapsed: 1.431 sec
Running org.apache.hadoop.hbase.master.TestMasterFileSystem
Tests run: 1, Failures: 0, Errors: 0, Skipped: 0, Time elapsed: 18.1 sec
Running org.apache.hadoop.hbase.master.TestZKBasedOpenCloseRegion
Tests run: 4, Failures: 0, Errors: 0, Skipped: 0, Time elapsed: 37.18 sec
Running org.apache.hadoop.hbase.master.TestMaster
Tests run: 1, Failures: 0, Errors: 0, Skipped: 0, Time elapsed: 25.55 sec
Running org.apache.hadoop.hbase.master.balancer.TestStochasticLoadBalancer
Tests run: 4, Failures: 0, Errors: 0, Skipped: 0, Time elapsed: 98.692 sec
Running org.apache.hadoop.hbase.master.TestOpenedRegionHandler
Tests run: 2, Failures: 0, Errors: 0, Skipped: 0, Time elapsed: 21.137 sec
Running org.apache.hadoop.hbase.master.TestMasterTransitions
Tests run: 3, Failures: 0, Errors: 0, Skipped: 3, Time elapsed: 32.094 sec
Running org.apache.hadoop.hbase.master.TestSplitLogManager
Tests run: 12, Failures: 0, Errors: 0, Skipped: 0, Time elapsed: 18.099 sec
Running org.apache.hadoop.hbase.master.TestAssignmentManagerOnCluster
Tests run: 3, Failures: 0, Errors: 1, Skipped: 0, Time elapsed: 24.768 sec <<< FAILURE!
Running org.apache.hadoop.hbase.master.TestAssignmentManager
Tests run: 12, Failures: 0, Errors: 0, Skipped: 0, Time elapsed: 3.411 sec
Running org.apache.hadoop.hbase.master.TestMasterRestartAfterDisablingTable
Tests run: 1, Failures: 0, Errors: 0, Skipped: 0, Time elapsed: 22.797 sec
Running org.apache.hadoop.hbase.master.TestMasterStatusServlet
Tests run: 5, Failures: 0, Errors: 0, Skipped: 0, Time elapsed: 1.903 sec
Running org.apache.hadoop.hbase.master.TestHMasterRPCException
Tests run: 1, Failures: 0, Errors: 0, Skipped: 0, Time elapsed: 1.253 sec
Running org.apache.hadoop.hbase.master.TestMasterFailover
Tests run: 4, Failures: 0, Errors: 0, Skipped: 0, Time elapsed: 104.805 sec
Running org.apache.hadoop.hbase.master.TestMasterShutdown
Tests run: 1, Failures: 0, Errors: 0, Skipped: 0, Time elapsed: 20.059 sec
Running org.apache.hadoop.hbase.master.cleaner.TestLogsCleaner
Tests run: 1, Failures: 0, Errors: 0, Skipped: 0, Time elapsed: 3.23 sec
Running org.apache.hadoop.hbase.master.TestDistributedLogSplitting
Tests run: 4, Failures: 0, Errors: 0, Skipped: 0, Time elapsed: 149.61 sec
Running org.apache.hadoop.hbase.master.TestRestartCluster
Tests run: 2, Failures: 0, Errors: 0, Skipped: 0, Time elapsed: 43.892 sec
Running org.apache.hadoop.hbase.avro.TestAvroServer
Tests run: 3, Failures: 0, Errors: 0, Skipped: 0, Time elapsed: 31.596 sec
Running org.apache.hadoop.hbase.TestRegionRebalancing
Tests run: 2, Failures: 0, Errors: 0, Skipped: 0, Time elapsed: 132.942 sec
Running org.apache.hadoop.hbase.thrift.TestThriftServerCmdLine
Tests run: 20, Failures: 0, Errors: 0, Skipped: 0, Time elapsed: 535.425 sec
Running org.apache.hadoop.hbase.ipc.TestDelayedRpc
Tests run: 4, Failures: 0, Errors: 0, Skipped: 0, Time elapsed: 2.351 sec
Running org.apache.hadoop.hbase.thrift2.TestThriftHBaseServiceHandler
Tests run: 12, Failures: 0, Errors: 0, Skipped: 0, Time elapsed: 15.912 sec
Running org.apache.hadoop.hbase.TestZooKeeper
Tests run: 9, Failures: 0, Errors: 0, Skipped: 0, Time elapsed: 34.56 sec
Running org.apache.hadoop.hbase.TestAcidGuarantees
Tests run: 3, Failures: 0, Errors: 0, Skipped: 0, Time elapsed: 111.273 sec
Running org.apache.hadoop.hbase.TestInfoServers
Tests run: 2, Failures: 0, Errors: 0, Skipped: 0, Time elapsed: 16.8 sec

Results :

Failed tests: testPermissionsWatcher(org.apache.hadoop.hbase.security.access.TestZKPermissionsWatcher)
testMultipleTables(org.apache.hadoop.hbase.backup.example.TestZooKeeperTableArchiveClient): Archived HFiles (hdfs://localhost:37236/user/hudson/hbase/.archive/otherTable/0b58a48c94573d1bd432415fd7b45595/fam) should have gotten deleted, but didn't, remaining files:[hdfs://localhost:37236/user/hudson/hbase/.archive/otherTable/0b58a48c94573d1bd432415fd7b45595/fam/543c1b0cc220425d9abf1bf0e6b51a64, hdfs://localhost:37236/user/hudson/hbase/.archive/otherTable/0b58a48c94573d1bd432415fd7b45595/fam/669ab96b2bdb4a5881c5aa1bbb83e1b8, hdfs://localhost:37236/user/hudson/hbase/.archive/otherTable/0b58a48c94573d1bd432415fd7b45595/fam/6b002d4d3a4443e9922f540edef52f7c, hdfs://localhost:37236/user/hudson/hbase/.archive/otherTable/0b58a48c94573d1bd432415fd7b45595/fam/81a1505a9fde457290673a81d7079f2c, hdfs://localhost:37236/user/hudson/hbase/.archive/otherTable/0b58a48c94573d1bd432415fd7b45595/fam/8b7488d0b93b48df871fb4b61a927b98, hdfs://localhost:37236/user/hudson/hbase/.archive/otherTable/0b58a48c94573d1bd432415fd7b45595/fam/8c1e1dfaa02f435c9328f55bf5f5f83f, hdfs://localhost:37236/user/hudson/hbase/.archive/otherTable/0b58a48c94573d1bd432415fd7b45595/fam/94a9f0edb185468ca1242c79fe3bb4de, hdfs://localhost:37236/user/hudson/hbase/.archive/otherTable/0b58a48c94573d1bd432415fd7b45595/fam/96c550d027994d6ab4ae127429102010, hdfs://localhost:37236/user/hudson/hbase/.archive/otherTable/0b58a48c94573d1bd432415fd7b45595/fam/987da9dd14204444820f945e6c88fc82, hdfs://localhost:37236/user/hudson/hbase/.archive/otherTable/0b58a48c94573d1bd432415fd7b45595/fam/a640eac9a3ed4abdb39db9f12013d4e3, hdfs://localhost:37236/user/hudson/hbase/.archive/otherTable/0b58a48c94573d1bd432415fd7b45595/fam/aad7b40aef5b4ad9bd75149d6b33c02c, hdfs://localhost:37236/user/hudson/hbase/.archive/otherTable/0b58a48c94573d1bd432415fd7b45595/fam/ac43494ac60740ada3706d032e1cb070, hdfs://localhost:37236/user/hudson/hbase/.archive/otherTable/0b58a48c94573d1bd432415fd7b45595/fam/ba05202857ec49c383ddaa69ecbf332d, hdfs://localhost:37236/user/hudson/hbase/.archive/otherTable/0b58a48c94573d1bd432415fd7b45595/fam/be33f9cac9854f469537662c9dfbfc1d, hdfs://localhost:37236/user/hudson/hbase/.archive/otherTable/0b58a48c94573d1bd432415fd7b45595/fam/d399ffabf448463998baaabc94819f23, hdfs://localhost:37236/user/hudson/hbase/.archive/otherTable/0b58a48c94573d1bd432415fd7b45595/fam/db1918c672f04fcb8b2d3fa4af26bc04, hdfs://localhost:37236/user/hudson/hbase/.archive/otherTable/0b58a48c94573d1bd432415fd7b45595/fam/dea054ace3654bb88b09ea3d9f57929e, hdfs://localhost:37236/user/hudson/hbase/.archive/otherTable/0b58a48c94573d1bd432415fd7b45595/fam/df76a82c730a4ccaa9e3fc1d4cd6a5de, hdfs://localhost:37236/user/hudson/hbase/.archive/otherTable/0b58a48c94573d1bd432415fd7b45595/fam/e8ba364baeb44f80becd84a4225f5d16, hdfs://localhost:37236/user/hudson/hbase/.archive/otherTable/0b58a48c94573d1bd432415fd7b45595/fam/f67e9fe38ce347fea007932774614a74, hdfs://localhost:37236/user/hudson/hbase/.archive/otherTable/0b58a48c94573d1bd432415fd7b45595/fam/f9080f91cf3c480cb633ae1b06c0d4b0, hdfs://localhost:37236/user/hudson/hbase/.archive/otherTable/0b58a48c94573d1bd432415fd7b45595/fam/fa09fb53e3474339be52b6657339f55a, hdfs://localhost:37236/user/hudson/hbase/.archive/otherTable/0b58a48c94573d1bd432415fd7b45595/fam/fb5a4db4cef446f880195e124f1087fe, hdfs://localhost:37236/user/hudson/hbase/.archive/otherTable/0b58a48c94573d1bd432415fd7b45595/fam/fc969d87e26e447082279e033d9718dc]
testLogRollOnDatanodeDeath(org.apache.hadoop.hbase.regionserver.wal.TestLogRolling): New log file should have the default replication instead of 1

Tests in error:
loadTest[0](org.apache.hadoop.hbase.util.TestMiniClusterLoadParallel): test timed out after 120000 milliseconds
testPutWithMemStoreFlush(org.apache.hadoop.hbase.regionserver.TestHRegion): Could not seek StoreFileScanner[HFileScanner for reader reader=<https://builds.apache.org/job/HBase-TRUNK/ws/trunk/hbase-server/target/test-data/fb0c7183-8861-45dd-8f81-b53420932af3/TestHRegiontestPutWithMemStoreFlush/testPutWithMemStoreFlush/269c29017d9f0682c6785dcf2add433b/family/6679f41592134a5594398a4f91e25a91,> compression=none, cacheConf=CacheConfig:enabled [cacheDataOnRead=true] [cacheDataOnWrite=false] [cacheIndexesOnWrite=false] [cacheBloomsOnWrite=false] [cacheEvictOnClose=false] [cacheCompressed=false], firstKey=putRow/family:qualifier/1234567/Put, lastKey=putRow/family:qualifier/1234567/Put, avgKeyLen=33, avgValueLen=6, entries=1, length=786, cur=putRow/family:qualifier/1234567/Maximum/vlen=0/ts=0] to key putRow/family:qualifier/LATEST_TIMESTAMP/Maximum/vlen=0/ts=0
testMoveRegion(org.apache.hadoop.hbase.master.TestAssignmentManagerOnCluster): org.apache.hadoop.hbase.TableNotDisabledException: testMoveRegion

Tests run: 1050, Failures: 3, Errors: 3, Skipped: 9

[INFO]
[INFO] ------------------------------------------------------------------------
[INFO] Skipping HBase
[INFO] This project has been banned from the build due to previous failures.
[INFO] ------------------------------------------------------------------------
[INFO]
[INFO] ------------------------------------------------------------------------
[INFO] Skipping HBase
[INFO] This project has been banned from the build due to previous failures.
[INFO] ------------------------------------------------------------------------
[INFO] ------------------------------------------------------------------------
[INFO] Reactor Summary:
[INFO]
[INFO] HBase ............................................. SUCCESS [8.945s]
[INFO] HBase - Common .................................... SUCCESS [6.842s]
[INFO] HBase - Hadoop Compatibility ...................... SUCCESS [1.313s]
[INFO] HBase - Hadoop One Compatibility .................. SUCCESS [1.730s]
[INFO] HBase - Server .................................... FAILURE [1:05:57.351s]
[INFO] HBase - Hadoop Two Compatibility .................. SKIPPED
[INFO] HBase - Integration Tests ......................... SKIPPED
[INFO] ------------------------------------------------------------------------
[INFO] BUILD FAILURE
[INFO] ------------------------------------------------------------------------
[INFO] Total time: 1:06:16.999s
[INFO] Finished at: Fri Jul 27 23:14:36 UTC 2012
[INFO] Final Memory: 98M/372M
[INFO] ------------------------------------------------------------------------
[ERROR] Failed to execute goal org.apache.maven.plugins:maven-surefire-plugin:2.12-TRUNK-HBASE-2:test (secondPartTestsExecution) on project hbase-server: Failure or timeout -> [Help 1]
[ERROR]
[ERROR] To see the full stack trace of the errors, re-run Maven with the -e switch.
[ERROR] Re-run Maven using the -X switch to enable full debug logging.
[ERROR]
[ERROR] For more information about the errors and possible solutions, please read the following articles:
[ERROR] [Help 1] http://cwiki.apache.org/confluence/display/MAVEN/MojoExecutionException
[ERROR]
[ERROR] After correcting the problems, you can resume the build with the command
[ERROR] mvn <goals> -rf :hbase-server
Build step 'Invoke top-level Maven targets' marked build as failure
Archiving artifacts
Recording test results

Search Discussions

  • Apache Jenkins Server at Jul 28, 2012 at 12:26 am
    See <https://builds.apache.org/job/HBase-TRUNK/3180/>

    ------------------------------------------
    [...truncated 2511 lines...]
    Running org.apache.hadoop.hbase.TestInfoServers
    Tests run: 2, Failures: 0, Errors: 0, Skipped: 0, Time elapsed: 11.258 sec
    Running org.apache.hadoop.hbase.regionserver.TestServerCustomProtocol
    Tests run: 7, Failures: 0, Errors: 0, Skipped: 0, Time elapsed: 16.591 sec
    Running org.apache.hadoop.hbase.regionserver.TestAtomicOperation
    Tests run: 5, Failures: 0, Errors: 0, Skipped: 0, Time elapsed: 18.023 sec
    Running org.apache.hadoop.hbase.regionserver.TestHRegion
    Tests run: 66, Failures: 0, Errors: 0, Skipped: 0, Time elapsed: 43.786 sec
    Running org.apache.hadoop.hbase.regionserver.TestCompaction
    Tests run: 15, Failures: 0, Errors: 0, Skipped: 0, Time elapsed: 46.668 sec
    Running org.apache.hadoop.hbase.backup.TestHFileArchiving
    Tests run: 3, Failures: 0, Errors: 0, Skipped: 0, Time elapsed: 93.408 sec
    Running org.apache.hadoop.hbase.regionserver.wal.TestWALReplayCompressed
    Tests run: 7, Failures: 0, Errors: 0, Skipped: 0, Time elapsed: 43.667 sec
    Running org.apache.hadoop.hbase.regionserver.TestEndToEndSplitTransaction
    Tests run: 2, Failures: 0, Errors: 0, Skipped: 0, Time elapsed: 58.521 sec
    Running org.apache.hadoop.hbase.regionserver.wal.TestHLog
    Tests run: 10, Failures: 0, Errors: 0, Skipped: 0, Time elapsed: 64.223 sec
    Running org.apache.hadoop.hbase.regionserver.wal.TestWALReplay
    Tests run: 7, Failures: 0, Errors: 0, Skipped: 0, Time elapsed: 40.89 sec
    Running org.apache.hadoop.hbase.backup.example.TestZooKeeperTableArchiveClient
    Tests run: 3, Failures: 0, Errors: 0, Skipped: 0, Time elapsed: 232.95 sec
    Running org.apache.hadoop.hbase.regionserver.wal.TestLogRollAbort
    Tests run: 1, Failures: 0, Errors: 0, Skipped: 0, Time elapsed: 151.745 sec
    Running org.apache.hadoop.hbase.regionserver.TestStore
    Tests run: 12, Failures: 0, Errors: 0, Skipped: 0, Time elapsed: 9.539 sec
    Running org.apache.hadoop.hbase.regionserver.TestRpcMetrics
    Tests run: 1, Failures: 0, Errors: 0, Skipped: 0, Time elapsed: 1.829 sec
    Running org.apache.hadoop.hbase.regionserver.TestBlocksRead
    Tests run: 4, Failures: 0, Errors: 0, Skipped: 0, Time elapsed: 1.155 sec
    Running org.apache.hadoop.hbase.regionserver.wal.TestLogRolling
    Tests run: 2, Failures: 0, Errors: 0, Skipped: 0, Time elapsed: 100.142 sec
    Running org.apache.hadoop.hbase.regionserver.TestCompoundBloomFilter
    Tests run: 3, Failures: 0, Errors: 0, Skipped: 0, Time elapsed: 25.462 sec
    Running org.apache.hadoop.hbase.regionserver.TestHRegionOnCluster
    Tests run: 1, Failures: 0, Errors: 0, Skipped: 0, Time elapsed: 20.121 sec
    Running org.apache.hadoop.hbase.regionserver.TestCacheOnWriteInSchema
    Tests run: 3, Failures: 0, Errors: 0, Skipped: 0, Time elapsed: 1.768 sec
    Running org.apache.hadoop.hbase.regionserver.metrics.TestSchemaMetrics
    Tests run: 6, Failures: 0, Errors: 0, Skipped: 0, Time elapsed: 15.283 sec
    Running org.apache.hadoop.hbase.regionserver.TestStoreScanner
    Tests run: 16, Failures: 0, Errors: 0, Skipped: 0, Time elapsed: 0.084 sec
    Running org.apache.hadoop.hbase.regionserver.TestParallelPut
    Tests run: 2, Failures: 0, Errors: 0, Skipped: 0, Time elapsed: 6.456 sec
    Running org.apache.hadoop.hbase.regionserver.TestStoreFileBlockCacheSummary
    Tests run: 1, Failures: 0, Errors: 0, Skipped: 0, Time elapsed: 13.943 sec
    Running org.apache.hadoop.hbase.regionserver.TestRegionServerMetrics
    Tests run: 4, Failures: 0, Errors: 0, Skipped: 0, Time elapsed: 66.152 sec
    Running org.apache.hadoop.hbase.regionserver.TestGetClosestAtOrBefore
    Tests run: 3, Failures: 0, Errors: 0, Skipped: 0, Time elapsed: 0.997 sec
    Running org.apache.hadoop.hbase.regionserver.TestMXBean
    Tests run: 1, Failures: 0, Errors: 0, Skipped: 0, Time elapsed: 10.66 sec
    Running org.apache.hadoop.hbase.regionserver.TestSplitTransactionOnCluster
    Tests run: 7, Failures: 0, Errors: 0, Skipped: 0, Time elapsed: 44.179 sec
    Running org.apache.hadoop.hbase.regionserver.handler.TestCloseRegionHandler
    Tests run: 3, Failures: 0, Errors: 0, Skipped: 0, Time elapsed: 1.467 sec
    Running org.apache.hadoop.hbase.regionserver.handler.TestOpenRegionHandler
    Tests run: 3, Failures: 0, Errors: 0, Skipped: 0, Time elapsed: 1.032 sec
    Running org.apache.hadoop.hbase.regionserver.TestMemStore
    Tests run: 21, Failures: 0, Errors: 0, Skipped: 0, Time elapsed: 31.241 sec
    Running org.apache.hadoop.hbase.regionserver.TestMultiColumnScanner
    Tests run: 12, Failures: 0, Errors: 0, Skipped: 0, Time elapsed: 44.769 sec
    Running org.apache.hadoop.hbase.regionserver.TestRSKilledWhenMasterInitializing
    Tests run: 1, Failures: 0, Errors: 0, Skipped: 0, Time elapsed: 39.774 sec
    Running org.apache.hadoop.hbase.regionserver.TestMasterAddressManager
    Tests run: 1, Failures: 0, Errors: 0, Skipped: 0, Time elapsed: 0.668 sec
    Running org.apache.hadoop.hbase.regionserver.TestSplitLogWorker
    Tests run: 5, Failures: 0, Errors: 0, Skipped: 0, Time elapsed: 1.463 sec
    Running org.apache.hadoop.hbase.regionserver.TestSeekOptimizations
    Tests run: 6, Failures: 0, Errors: 0, Skipped: 0, Time elapsed: 3.532 sec
    Running org.apache.hadoop.hbase.regionserver.TestHRegionServerBulkLoad
    Tests run: 1, Failures: 0, Errors: 0, Skipped: 0, Time elapsed: 50.205 sec
    Running org.apache.hadoop.hbase.filter.TestColumnRangeFilter
    Tests run: 1, Failures: 0, Errors: 0, Skipped: 0, Time elapsed: 19.256 sec
    Running org.apache.hadoop.hbase.regionserver.TestCompactionState
    Tests run: 2, Failures: 0, Errors: 0, Skipped: 0, Time elapsed: 29.27 sec
    Running org.apache.hadoop.hbase.regionserver.TestFSErrorsExposed
    Tests run: 3, Failures: 0, Errors: 0, Skipped: 0, Time elapsed: 29.701 sec
    Running org.apache.hadoop.hbase.regionserver.wal.TestHLogSplit
    Tests run: 30, Failures: 0, Errors: 0, Skipped: 1, Time elapsed: 242.2 sec
    Running org.apache.hadoop.hbase.TestGlobalMemStoreSize
    Tests run: 1, Failures: 0, Errors: 0, Skipped: 0, Time elapsed: 15.995 sec
    Running org.apache.hadoop.hbase.security.token.TestTokenAuthentication
    Tests run: 1, Failures: 0, Errors: 0, Skipped: 0, Time elapsed: 9.912 sec
    Running org.apache.hadoop.hbase.security.access.TestZKPermissionsWatcher
    Tests run: 1, Failures: 0, Errors: 0, Skipped: 0, Time elapsed: 9.923 sec
    Running org.apache.hadoop.hbase.security.token.TestZKSecretWatcher
    Tests run: 1, Failures: 0, Errors: 0, Skipped: 0, Time elapsed: 15.344 sec
    Running org.apache.hadoop.hbase.security.access.TestAccessControlFilter
    Tests run: 1, Failures: 0, Errors: 0, Skipped: 0, Time elapsed: 13.409 sec
    Running org.apache.hadoop.hbase.security.access.TestTablePermissions
    Tests run: 5, Failures: 0, Errors: 0, Skipped: 0, Time elapsed: 23.523 sec
    Running org.apache.hadoop.hbase.TestMultiVersions
    Tests run: 3, Failures: 0, Errors: 0, Skipped: 0, Time elapsed: 19.688 sec
    Running org.apache.hadoop.hbase.security.access.TestAccessController
    Tests run: 28, Failures: 0, Errors: 0, Skipped: 0, Time elapsed: 28.924 sec
    Running org.apache.hadoop.hbase.TestHBaseTestingUtility
    Tests run: 7, Failures: 0, Errors: 0, Skipped: 0, Time elapsed: 56.728 sec
    Running org.apache.hadoop.hbase.thrift2.TestThriftHBaseServiceHandler
    Tests run: 12, Failures: 0, Errors: 0, Skipped: 0, Time elapsed: 12.516 sec
    Running org.apache.hadoop.hbase.replication.TestReplicationZookeeper
    Tests run: 1, Failures: 0, Errors: 0, Skipped: 0, Time elapsed: 0.597 sec
    Running org.apache.hadoop.hbase.replication.regionserver.TestReplicationSourceManager
    Tests run: 1, Failures: 0, Errors: 0, Skipped: 0, Time elapsed: 0.976 sec
    Running org.apache.hadoop.hbase.TestRegionRebalancing
    Tests run: 2, Failures: 0, Errors: 0, Skipped: 0, Time elapsed: 38.933 sec
    Running org.apache.hadoop.hbase.replication.regionserver.TestReplicationSink
    Tests run: 5, Failures: 0, Errors: 0, Skipped: 0, Time elapsed: 14.039 sec
    Running org.apache.hadoop.hbase.replication.TestReplicationSource
    Tests run: 1, Failures: 0, Errors: 0, Skipped: 0, Time elapsed: 2.58 sec
    Running org.apache.hadoop.hbase.replication.TestMasterReplication
    Tests run: 2, Failures: 0, Errors: 0, Skipped: 0, Time elapsed: 55.132 sec
    Running org.apache.hadoop.hbase.avro.TestAvroServer
    Tests run: 3, Failures: 0, Errors: 0, Skipped: 0, Time elapsed: 25.187 sec
    Running org.apache.hadoop.hbase.replication.TestMultiSlaveReplication
    Tests run: 1, Failures: 0, Errors: 0, Skipped: 0, Time elapsed: 36.351 sec
    Running org.apache.hadoop.hbase.TestLocalHBaseCluster
    Tests run: 1, Failures: 0, Errors: 0, Skipped: 0, Time elapsed: 5.85 sec
    Running org.apache.hadoop.hbase.coprocessor.TestRegionServerCoprocessorExceptionWithRemove
    Tests run: 1, Failures: 0, Errors: 0, Skipped: 0, Time elapsed: 16.82 sec
    Running org.apache.hadoop.hbase.coprocessor.TestRegionObserverInterface
    Tests run: 7, Failures: 0, Errors: 0, Skipped: 0, Time elapsed: 34.345 sec
    Running org.apache.hadoop.hbase.coprocessor.TestMasterObserver
    Tests run: 3, Failures: 0, Errors: 0, Skipped: 0, Time elapsed: 28.675 sec
    Running org.apache.hadoop.hbase.coprocessor.TestWALObserver
    Tests run: 3, Failures: 0, Errors: 0, Skipped: 0, Time elapsed: 13.215 sec
    Running org.apache.hadoop.hbase.coprocessor.TestCoprocessorEndpoint
    Tests run: 3, Failures: 0, Errors: 0, Skipped: 1, Time elapsed: 29.849 sec
    Running org.apache.hadoop.hbase.replication.TestReplication
    Tests run: 10, Failures: 0, Errors: 0, Skipped: 0, Time elapsed: 141.091 sec
    Running org.apache.hadoop.hbase.coprocessor.TestRegionObserverBypass
    Tests run: 2, Failures: 0, Errors: 0, Skipped: 0, Time elapsed: 13.288 sec
    Running org.apache.hadoop.hbase.TestAcidGuarantees
    Tests run: 3, Failures: 0, Errors: 0, Skipped: 0, Time elapsed: 92.115 sec
    Running org.apache.hadoop.hbase.coprocessor.TestRegionServerCoprocessorExceptionWithAbort
    Tests run: 1, Failures: 0, Errors: 0, Skipped: 0, Time elapsed: 18.073 sec
    Running org.apache.hadoop.hbase.coprocessor.TestAggregateProtocol
    Tests run: 45, Failures: 0, Errors: 0, Skipped: 0, Time elapsed: 16.662 sec
    Running org.apache.hadoop.hbase.coprocessor.TestMasterCoprocessorExceptionWithAbort
    Tests run: 1, Failures: 0, Errors: 0, Skipped: 0, Time elapsed: 24.512 sec
    Running org.apache.hadoop.hbase.coprocessor.TestMasterCoprocessorExceptionWithRemove
    Tests run: 1, Failures: 0, Errors: 0, Skipped: 0, Time elapsed: 15.653 sec
    Running org.apache.hadoop.hbase.constraint.TestConstraint
    Tests run: 5, Failures: 0, Errors: 0, Skipped: 0, Time elapsed: 24.64 sec
    Running org.apache.hadoop.hbase.coprocessor.TestClassLoading
    Tests run: 6, Failures: 0, Errors: 0, Skipped: 0, Time elapsed: 28.507 sec
    Running org.apache.hadoop.hbase.coprocessor.TestRowProcessorEndpoint
    Tests run: 4, Failures: 0, Errors: 0, Skipped: 0, Time elapsed: 31.736 sec
    Running org.apache.hadoop.hbase.master.TestAssignmentManager
    Tests run: 12, Failures: 0, Errors: 0, Skipped: 0, Time elapsed: 2.285 sec
    Running org.apache.hadoop.hbase.master.TestActiveMasterManager
    Tests run: 2, Failures: 0, Errors: 0, Skipped: 0, Time elapsed: 0.934 sec
    Running org.apache.hadoop.hbase.master.TestOpenedRegionHandler
    Tests run: 2, Failures: 0, Errors: 0, Skipped: 0, Time elapsed: 12.977 sec
    Running org.apache.hadoop.hbase.mapred.TestTableInputFormat
    Tests run: 10, Failures: 0, Errors: 0, Skipped: 0, Time elapsed: 26.131 sec
    Running org.apache.hadoop.hbase.master.TestMasterRestartAfterDisablingTable
    Tests run: 1, Failures: 0, Errors: 0, Skipped: 0, Time elapsed: 16.876 sec
    Running org.apache.hadoop.hbase.master.TestMasterTransitions
    Tests run: 3, Failures: 0, Errors: 0, Skipped: 3, Time elapsed: 18.484 sec
    Running org.apache.hadoop.hbase.master.TestRollingRestart
    Tests run: 1, Failures: 0, Errors: 0, Skipped: 0, Time elapsed: 42.636 sec
    Running org.apache.hadoop.hbase.master.TestMasterStatusServlet
    Tests run: 5, Failures: 0, Errors: 0, Skipped: 0, Time elapsed: 1.178 sec
    Running org.apache.hadoop.hbase.master.TestHMasterRPCException
    Tests run: 1, Failures: 0, Errors: 0, Skipped: 0, Time elapsed: 1.044 sec
    Running org.apache.hadoop.hbase.mapred.TestTableMapReduce
    Tests run: 1, Failures: 0, Errors: 0, Skipped: 0, Time elapsed: 91.04 sec
    Running org.apache.hadoop.hbase.master.TestRestartCluster
    Tests run: 2, Failures: 0, Errors: 0, Skipped: 0, Time elapsed: 27.24 sec
    Running org.apache.hadoop.hbase.master.TestMXBean
    Tests run: 1, Failures: 1, Errors: 0, Skipped: 0, Time elapsed: 12.632 sec <<< FAILURE!
    Running org.apache.hadoop.hbase.master.balancer.TestBaseLoadBalancer
    Tests run: 3, Failures: 0, Errors: 0, Skipped: 0, Time elapsed: 0.384 sec
    Running org.apache.hadoop.hbase.master.TestAssignmentManagerOnCluster
    Tests run: 3, Failures: 0, Errors: 0, Skipped: 0, Time elapsed: 22.032 sec
    Running org.apache.hadoop.hbase.master.balancer.TestDefaultLoadBalancer
    Tests run: 1, Failures: 0, Errors: 0, Skipped: 0, Time elapsed: 1.443 sec
    Running org.apache.hadoop.hbase.master.TestMaster
    Tests run: 1, Failures: 0, Errors: 0, Skipped: 0, Time elapsed: 15.466 sec
    Running org.apache.hadoop.hbase.master.cleaner.TestLogsCleaner
    Tests run: 1, Failures: 0, Errors: 0, Skipped: 0, Time elapsed: 3.223 sec
    Running org.apache.hadoop.hbase.master.TestMasterShutdown
    Tests run: 1, Failures: 0, Errors: 0, Skipped: 0, Time elapsed: 13.429 sec
    Running org.apache.hadoop.hbase.master.TestMasterFailover
    Tests run: 4, Failures: 0, Errors: 0, Skipped: 0, Time elapsed: 123.015 sec
    Running org.apache.hadoop.hbase.master.TestMasterFileSystem
    Tests run: 1, Failures: 0, Errors: 0, Skipped: 0, Time elapsed: 10.138 sec
    Running org.apache.hadoop.hbase.master.TestMasterNoCluster
    Tests run: 3, Failures: 0, Errors: 0, Skipped: 0, Time elapsed: 5.565 sec
    Running org.apache.hadoop.hbase.master.TestSplitLogManager
    Tests run: 12, Failures: 0, Errors: 0, Skipped: 0, Time elapsed: 15.694 sec
    Running org.apache.hadoop.hbase.master.TestDistributedLogSplitting
    Tests run: 4, Failures: 0, Errors: 0, Skipped: 0, Time elapsed: 82.611 sec
    Running org.apache.hadoop.hbase.master.TestZKBasedOpenCloseRegion
    Tests run: 4, Failures: 0, Errors: 0, Skipped: 0, Time elapsed: 19.061 sec
    Running org.apache.hadoop.hbase.master.balancer.TestStochasticLoadBalancer
    Tests run: 4, Failures: 0, Errors: 0, Skipped: 0, Time elapsed: 96.156 sec

    Results :

    Failed tests: testRetrying(org.apache.hadoop.hbase.catalog.TestMetaReaderEditor): Timeout: test took 202 sec
    testInfo(org.apache.hadoop.hbase.master.TestMXBean)

    Tests run: 1051, Failures: 2, Errors: 0, Skipped: 9

    [INFO]
    [INFO] ------------------------------------------------------------------------
    [INFO] Skipping HBase
    [INFO] This project has been banned from the build due to previous failures.
    [INFO] ------------------------------------------------------------------------
    [INFO]
    [INFO] ------------------------------------------------------------------------
    [INFO] Skipping HBase
    [INFO] This project has been banned from the build due to previous failures.
    [INFO] ------------------------------------------------------------------------
    [INFO] ------------------------------------------------------------------------
    [INFO] Reactor Summary:
    [INFO]
    [INFO] HBase ............................................. SUCCESS [6.054s]
    [INFO] HBase - Common .................................... SUCCESS [6.971s]
    [INFO] HBase - Hadoop Compatibility ...................... SUCCESS [1.220s]
    [INFO] HBase - Hadoop One Compatibility .................. SUCCESS [1.879s]
    [INFO] HBase - Server .................................... FAILURE [37:09.423s]
    [INFO] HBase - Hadoop Two Compatibility .................. SKIPPED
    [INFO] HBase - Integration Tests ......................... SKIPPED
    [INFO] ------------------------------------------------------------------------
    [INFO] BUILD FAILURE
    [INFO] ------------------------------------------------------------------------
    [INFO] Total time: 37:26.322s
    [INFO] Finished at: Sat Jul 28 00:25:48 UTC 2012
    [INFO] Final Memory: 62M/615M
    [INFO] ------------------------------------------------------------------------
    [ERROR] Failed to execute goal org.apache.maven.plugins:maven-surefire-plugin:2.12-TRUNK-HBASE-2:test (secondPartTestsExecution) on project hbase-server: There are test failures.
    [ERROR]
    [ERROR] Please refer to <https://builds.apache.org/job/HBase-TRUNK/ws/trunk/hbase-server/target/surefire-reports> for the individual test results.
    [ERROR] -> [Help 1]
    [ERROR]
    [ERROR] To see the full stack trace of the errors, re-run Maven with the -e switch.
    [ERROR] Re-run Maven using the -X switch to enable full debug logging.
    [ERROR]
    [ERROR] For more information about the errors and possible solutions, please read the following articles:
    [ERROR] [Help 1] http://cwiki.apache.org/confluence/display/MAVEN/MojoFailureException
    [ERROR]
    [ERROR] After correcting the problems, you can resume the build with the command
    [ERROR] mvn <goals> -rf :hbase-server
    Build step 'Invoke top-level Maven targets' marked build as failure
    Archiving artifacts
    Recording test results
  • Apache Jenkins Server at Jul 28, 2012 at 6:23 am

Related Discussions

Discussion Navigation
viewthread | post
Discussion Overview
groupdev @
categorieshbase, hadoop
postedJul 27, '12 at 11:15p
activeJul 28, '12 at 6:23a
posts3
users1
websitehbase.apache.org

1 user in discussion

Apache Jenkins Server: 3 posts

People

Translate

site design / logo © 2022 Grokbase