Grokbase Groups HBase dev July 2012
FAQ
See <https://builds.apache.org/job/HBase-TRUNK/3147/changes>

Changes:

[tedyu] HBASE-6405 Addendum for Eclipse (Jesse Yates)

------------------------------------------
[...truncated 3217 lines...]
Running org.apache.hadoop.hbase.regionserver.wal.TestHLog
Tests run: 10, Failures: 0, Errors: 0, Skipped: 0, Time elapsed: 64.1 sec
Running org.apache.hadoop.hbase.regionserver.handler.TestCloseRegionHandler
Tests run: 3, Failures: 0, Errors: 0, Skipped: 0, Time elapsed: 1.259 sec
Running org.apache.hadoop.hbase.regionserver.handler.TestOpenRegionHandler
Tests run: 3, Failures: 0, Errors: 0, Skipped: 0, Time elapsed: 0.973 sec
Running org.apache.hadoop.hbase.filter.TestColumnRangeFilter
Tests run: 1, Failures: 0, Errors: 0, Skipped: 0, Time elapsed: 19.024 sec
Running org.apache.hadoop.hbase.regionserver.TestHRegionServerBulkLoad
Tests run: 1, Failures: 0, Errors: 0, Skipped: 0, Time elapsed: 49.86 sec
Running org.apache.hadoop.hbase.coprocessor.TestClassLoading
Tests run: 6, Failures: 0, Errors: 0, Skipped: 0, Time elapsed: 28.016 sec
Running org.apache.hadoop.hbase.coprocessor.TestAggregateProtocol
Tests run: 45, Failures: 0, Errors: 0, Skipped: 0, Time elapsed: 16.908 sec
Running org.apache.hadoop.hbase.coprocessor.TestRegionServerCoprocessorExceptionWithRemove
Tests run: 1, Failures: 0, Errors: 0, Skipped: 0, Time elapsed: 16.624 sec
Running org.apache.hadoop.hbase.coprocessor.TestRowProcessorEndpoint
Tests run: 4, Failures: 0, Errors: 0, Skipped: 0, Time elapsed: 33.725 sec
Running org.apache.hadoop.hbase.coprocessor.TestRegionServerCoprocessorExceptionWithAbort
Tests run: 1, Failures: 0, Errors: 0, Skipped: 0, Time elapsed: 19.467 sec
Running org.apache.hadoop.hbase.coprocessor.TestMasterObserver
Tests run: 3, Failures: 0, Errors: 0, Skipped: 0, Time elapsed: 30.269 sec
Running org.apache.hadoop.hbase.regionserver.wal.TestHLogSplit
Tests run: 30, Failures: 0, Errors: 0, Skipped: 1, Time elapsed: 245.871 sec
Running org.apache.hadoop.hbase.coprocessor.TestCoprocessorEndpoint
Tests run: 3, Failures: 0, Errors: 0, Skipped: 1, Time elapsed: 29.165 sec
Running org.apache.hadoop.hbase.coprocessor.TestWALObserver
Tests run: 3, Failures: 0, Errors: 0, Skipped: 0, Time elapsed: 16.168 sec
Running org.apache.hadoop.hbase.regionserver.wal.TestLogRolling
Tests run: 2, Failures: 0, Errors: 0, Skipped: 0, Time elapsed: 200.46 sec
Running org.apache.hadoop.hbase.coprocessor.TestMasterCoprocessorExceptionWithAbort
Tests run: 1, Failures: 0, Errors: 0, Skipped: 0, Time elapsed: 23.935 sec
Running org.apache.hadoop.hbase.coprocessor.TestRegionObserverBypass
Tests run: 2, Failures: 0, Errors: 0, Skipped: 0, Time elapsed: 12.976 sec
Running org.apache.hadoop.hbase.coprocessor.TestMasterCoprocessorExceptionWithRemove
Tests run: 1, Failures: 0, Errors: 0, Skipped: 0, Time elapsed: 15.909 sec
Running org.apache.hadoop.hbase.TestGlobalMemStoreSize
Tests run: 1, Failures: 0, Errors: 0, Skipped: 0, Time elapsed: 14.302 sec
Running org.apache.hadoop.hbase.coprocessor.TestRegionObserverInterface
Tests run: 7, Failures: 0, Errors: 0, Skipped: 0, Time elapsed: 40.148 sec
Running org.apache.hadoop.hbase.mapreduce.TestHLogRecordReader
Tests run: 2, Failures: 0, Errors: 0, Skipped: 0, Time elapsed: 5.78 sec
Running org.apache.hadoop.hbase.mapred.TestTableInputFormat
Tests run: 10, Failures: 0, Errors: 0, Skipped: 0, Time elapsed: 31.16 sec
Running org.apache.hadoop.hbase.mapred.TestTableMapReduce
Tests run: 1, Failures: 0, Errors: 0, Skipped: 0, Time elapsed: 106.764 sec
Running org.apache.hadoop.hbase.mapreduce.TestLoadIncrementalHFilesSplitRecovery
Tests run: 4, Failures: 0, Errors: 0, Skipped: 0, Time elapsed: 116.087 sec
Running org.apache.hadoop.hbase.mapreduce.TestTableMapReduce
Tests run: 1, Failures: 0, Errors: 0, Skipped: 0, Time elapsed: 130.965 sec
Running org.apache.hadoop.hbase.mapreduce.TestWALPlayer
Tests run: 1, Failures: 0, Errors: 0, Skipped: 0, Time elapsed: 51.464 sec
Running org.apache.hadoop.hbase.mapreduce.TestHFileOutputFormat
Tests run: 9, Failures: 0, Errors: 0, Skipped: 0, Time elapsed: 255.877 sec
Running org.apache.hadoop.hbase.mapreduce.TestMultithreadedTableMapper
Tests run: 1, Failures: 0, Errors: 0, Skipped: 0, Time elapsed: 129.603 sec
Running org.apache.hadoop.hbase.mapreduce.TestLoadIncrementalHFiles
Tests run: 6, Failures: 0, Errors: 0, Skipped: 0, Time elapsed: 30.753 sec
Running org.apache.hadoop.hbase.mapreduce.TestTimeRangeMapRed
Tests run: 1, Failures: 0, Errors: 0, Skipped: 0, Time elapsed: 41.197 sec
Running org.apache.hadoop.hbase.mapreduce.TestImportTsv
Tests run: 13, Failures: 0, Errors: 0, Skipped: 0, Time elapsed: 200.403 sec
Running org.apache.hadoop.hbase.thrift2.TestThriftHBaseServiceHandler
Tests run: 12, Failures: 0, Errors: 0, Skipped: 0, Time elapsed: 15.727 sec
Running org.apache.hadoop.hbase.catalog.TestMetaReaderEditorNoCluster
Tests run: 1, Failures: 0, Errors: 0, Skipped: 0, Time elapsed: 4.184 sec
Running org.apache.hadoop.hbase.mapreduce.TestImportExport
Tests run: 2, Failures: 0, Errors: 0, Skipped: 0, Time elapsed: 50.863 sec
Running org.apache.hadoop.hbase.catalog.TestMetaReaderEditor
Tests run: 5, Failures: 0, Errors: 0, Skipped: 0, Time elapsed: 27.666 sec
Running org.apache.hadoop.hbase.catalog.TestCatalogTracker
Tests run: 9, Failures: 0, Errors: 0, Skipped: 1, Time elapsed: 5.377 sec
Running org.apache.hadoop.hbase.TestAcidGuarantees
Tests run: 3, Failures: 0, Errors: 0, Skipped: 0, Time elapsed: 98.595 sec
Running org.apache.hadoop.hbase.client.TestFromClientSide3
Tests run: 1, Failures: 0, Errors: 0, Skipped: 0, Time elapsed: 27.482 sec
Running org.apache.hadoop.hbase.client.TestTimestampsFilter
Tests run: 3, Failures: 0, Errors: 0, Skipped: 0, Time elapsed: 24.166 sec
Running org.apache.hadoop.hbase.catalog.TestCatalogTrackerOnCluster
Tests run: 1, Failures: 0, Errors: 0, Skipped: 0, Time elapsed: 82.452 sec
Running org.apache.hadoop.hbase.client.TestScannersFromClientSide
Tests run: 4, Failures: 0, Errors: 0, Skipped: 0, Time elapsed: 18.53 sec
Running org.apache.hadoop.hbase.client.TestHCM
Tests run: 7, Failures: 0, Errors: 0, Skipped: 0, Time elapsed: 21.223 sec
Running org.apache.hadoop.hbase.client.TestShell
Tests run: 1, Failures: 0, Errors: 0, Skipped: 0, Time elapsed: 105.054 sec
Running org.apache.hadoop.hbase.client.TestScannerTimeout
Tests run: 4, Failures: 0, Errors: 0, Skipped: 0, Time elapsed: 44.824 sec
Running org.apache.hadoop.hbase.client.TestMetaScanner
Tests run: 1, Failures: 0, Errors: 0, Skipped: 0, Time elapsed: 14.39 sec
Running org.apache.hadoop.hbase.client.TestHTableUtil
Tests run: 2, Failures: 0, Errors: 0, Skipped: 0, Time elapsed: 18.389 sec
Running org.apache.hadoop.hbase.client.TestHTablePool$TestHTableReusablePool
Tests run: 9, Failures: 0, Errors: 0, Skipped: 0, Time elapsed: 6.154 sec
Running org.apache.hadoop.hbase.client.TestMetaMigrationRemovingHTD
Tests run: 3, Failures: 0, Errors: 0, Skipped: 0, Time elapsed: 27.948 sec
Running org.apache.hadoop.hbase.client.TestHTablePool$TestHTableThreadLocalPool
Tests run: 9, Failures: 0, Errors: 0, Skipped: 0, Time elapsed: 20.838 sec
Running org.apache.hadoop.hbase.client.replication.TestReplicationAdmin
Tests run: 1, Failures: 0, Errors: 0, Skipped: 0, Time elapsed: 0.803 sec
Running org.apache.hadoop.hbase.client.TestMultipleTimestamps
Tests run: 8, Failures: 0, Errors: 0, Skipped: 0, Time elapsed: 30.229 sec
Running org.apache.hadoop.hbase.client.TestMultiParallel
Tests run: 11, Failures: 0, Errors: 0, Skipped: 0, Time elapsed: 39.203 sec
Running org.apache.hadoop.hbase.client.TestFromClientSide
Tests run: 56, Failures: 0, Errors: 0, Skipped: 3, Time elapsed: 175.494 sec
Running org.apache.hadoop.hbase.rest.TestGzipFilter
Tests run: 3, Failures: 0, Errors: 0, Skipped: 0, Time elapsed: 13.393 sec
Running org.apache.hadoop.hbase.constraint.TestConstraint
Tests run: 5, Failures: 0, Errors: 0, Skipped: 0, Time elapsed: 27.715 sec
Running org.apache.hadoop.hbase.rest.TestMultiRowResource
Tests run: 3, Failures: 0, Errors: 0, Skipped: 0, Time elapsed: 15.707 sec
Running org.apache.hadoop.hbase.rest.TestScannersWithFilters
Tests run: 10, Failures: 0, Errors: 0, Skipped: 0, Time elapsed: 17.497 sec
Running org.apache.hadoop.hbase.rest.TestRowResource
Tests run: 11, Failures: 0, Errors: 0, Skipped: 0, Time elapsed: 15.604 sec
Running org.apache.hadoop.hbase.rest.client.TestRemoteAdmin
Tests run: 1, Failures: 0, Errors: 0, Skipped: 0, Time elapsed: 15.045 sec
Running org.apache.hadoop.hbase.rest.client.TestRemoteTable
Tests run: 3, Failures: 0, Errors: 0, Skipped: 0, Time elapsed: 13.98 sec
Running org.apache.hadoop.hbase.rest.TestVersionResource
Tests run: 7, Failures: 0, Errors: 0, Skipped: 0, Time elapsed: 12.07 sec
Running org.apache.hadoop.hbase.rest.TestTableResource
Tests run: 8, Failures: 0, Errors: 0, Skipped: 0, Time elapsed: 23.884 sec
Running org.apache.hadoop.hbase.rest.TestScannerResource
Tests run: 5, Failures: 0, Errors: 0, Skipped: 0, Time elapsed: 32.596 sec
Running org.apache.hadoop.hbase.mapreduce.TestTableInputFormatScan
Tests run: 12, Failures: 0, Errors: 0, Skipped: 0, Time elapsed: 585.448 sec
Running org.apache.hadoop.hbase.rest.TestStatusResource
Tests run: 2, Failures: 0, Errors: 0, Skipped: 0, Time elapsed: 10.637 sec
Running org.apache.hadoop.hbase.rest.TestSchemaResource
Tests run: 2, Failures: 0, Errors: 0, Skipped: 0, Time elapsed: 20.157 sec
Running org.apache.hadoop.hbase.client.TestAdmin
Tests run: 40, Failures: 0, Errors: 0, Skipped: 0, Time elapsed: 156.798 sec
Running org.apache.hadoop.hbase.io.encoding.TestLoadAndSwitchEncodeOnDisk
Tests run: 1, Failures: 0, Errors: 0, Skipped: 0, Time elapsed: 26.243 sec
Running org.apache.hadoop.hbase.io.encoding.TestEncodedSeekers
Tests run: 8, Failures: 0, Errors: 0, Skipped: 0, Time elapsed: 31.396 sec
Running org.apache.hadoop.hbase.thrift.TestThriftServer
Tests run: 1, Failures: 0, Errors: 0, Skipped: 0, Time elapsed: 78.003 sec
Running org.apache.hadoop.hbase.io.encoding.TestBufferedDataBlockEncoder
Tests run: 1, Failures: 0, Errors: 0, Skipped: 0, Time elapsed: 22.699 sec
Running org.apache.hadoop.hbase.io.encoding.TestUpgradeFromHFileV1ToEncoding
Tests run: 1, Failures: 0, Errors: 0, Skipped: 0, Time elapsed: 88.174 sec
Running org.apache.hadoop.hbase.io.hfile.TestHFileSeek
Tests run: 1, Failures: 0, Errors: 0, Skipped: 0, Time elapsed: 8.014 sec
Running org.apache.hadoop.hbase.io.encoding.TestDataBlockEncoders
Tests run: 12, Failures: 0, Errors: 0, Skipped: 0, Time elapsed: 113.814 sec
Running org.apache.hadoop.hbase.io.hfile.slab.TestSlabCache
Tests run: 7, Failures: 0, Errors: 0, Skipped: 0, Time elapsed: 18.167 sec
Running org.apache.hadoop.hbase.io.hfile.TestHFileBlockIndex
Tests run: 10, Failures: 0, Errors: 0, Skipped: 0, Time elapsed: 10.325 sec
Running org.apache.hadoop.hbase.io.hfile.slab.TestSingleSizeCache
Tests run: 5, Failures: 0, Errors: 0, Skipped: 0, Time elapsed: 28.443 sec
Running org.apache.hadoop.hbase.io.hfile.TestHFilePerformance
Tests run: 1, Failures: 0, Errors: 0, Skipped: 0, Time elapsed: 6.679 sec
Running org.apache.hadoop.hbase.io.hfile.TestForceCacheImportantBlocks
Tests run: 4, Failures: 0, Errors: 0, Skipped: 0, Time elapsed: 51.524 sec
Running org.apache.hadoop.hbase.io.hfile.TestScannerSelectionUsingTTL
Tests run: 6, Failures: 0, Errors: 0, Skipped: 0, Time elapsed: 61.289 sec
Running org.apache.hadoop.hbase.io.encoding.TestChangingEncoding
Tests run: 4, Failures: 0, Errors: 0, Skipped: 0, Time elapsed: 250.334 sec
Running org.apache.hadoop.hbase.TestClusterBootOrder
Tests run: 2, Failures: 0, Errors: 0, Skipped: 0, Time elapsed: 28.217 sec
Running org.apache.hadoop.hbase.io.hfile.TestHFileBlock
Tests run: 16, Failures: 0, Errors: 0, Skipped: 0, Time elapsed: 48.084 sec
Running org.apache.hadoop.hbase.io.hfile.TestCacheOnWrite
Tests run: 36, Failures: 0, Errors: 0, Skipped: 0, Time elapsed: 44.327 sec
Running org.apache.hadoop.hbase.replication.regionserver.TestReplicationSourceManager
Tests run: 1, Failures: 0, Errors: 0, Skipped: 0, Time elapsed: 0.985 sec
Running org.apache.hadoop.hbase.replication.regionserver.TestReplicationSink
Tests run: 5, Failures: 0, Errors: 0, Skipped: 0, Time elapsed: 15.084 sec
Running org.apache.hadoop.hbase.avro.TestAvroServer
Tests run: 3, Failures: 0, Errors: 0, Skipped: 0, Time elapsed: 28.082 sec
Running org.apache.hadoop.hbase.replication.TestReplicationSource
Tests run: 1, Failures: 0, Errors: 0, Skipped: 0, Time elapsed: 2.73 sec
Running org.apache.hadoop.hbase.replication.TestReplicationPeer
Tests run: 1, Failures: 0, Errors: 0, Skipped: 0, Time elapsed: 1.557 sec
Running org.apache.hadoop.hbase.replication.TestReplicationZookeeper
Tests run: 1, Failures: 0, Errors: 0, Skipped: 0, Time elapsed: 0.586 sec
Running org.apache.hadoop.hbase.replication.TestMultiSlaveReplication
Tests run: 1, Failures: 0, Errors: 0, Skipped: 0, Time elapsed: 40.018 sec
Running org.apache.hadoop.hbase.ipc.TestDelayedRpc
Tests run: 4, Failures: 0, Errors: 0, Skipped: 0, Time elapsed: 2.381 sec
Running org.apache.hadoop.hbase.replication.TestMasterReplication
Tests run: 2, Failures: 0, Errors: 0, Skipped: 0, Time elapsed: 60.321 sec
Running org.apache.hadoop.hbase.TestZooKeeper
Tests run: 11, Failures: 0, Errors: 0, Skipped: 0, Time elapsed: 66.045 sec
Running org.apache.hadoop.hbase.replication.TestReplication
Tests run: 10, Failures: 2, Errors: 0, Skipped: 0, Time elapsed: 96.433 sec <<< FAILURE!
Running org.apache.hadoop.hbase.TestHBaseTestingUtility
Tests run: 7, Failures: 0, Errors: 0, Skipped: 0, Time elapsed: 59.573 sec
Running org.apache.hadoop.hbase.thrift.TestThriftServerCmdLine
Tests run: 20, Failures: 0, Errors: 0, Skipped: 0, Time elapsed: 470.27 sec

Results :

Failed tests: testVerifyRepJob(org.apache.hadoop.hbase.replication.TestReplication): Waited too much time for truncate
queueFailover(org.apache.hadoop.hbase.replication.TestReplication): Waited too much time for truncate

Tests in error:
testDisablingTableRegionsAssignmentDuringCleanClusterStartup(org.apache.hadoop.hbase.master.TestAssignmentManager): Problem binding to janus.apache.org/67.195.138.60:60000 : Address already in use

Tests run: 1043, Failures: 2, Errors: 1, Skipped: 9

[INFO]
[INFO] ------------------------------------------------------------------------
[INFO] Skipping HBase
[INFO] This project has been banned from the build due to previous failures.
[INFO] ------------------------------------------------------------------------
[INFO]
[INFO] ------------------------------------------------------------------------
[INFO] Skipping HBase
[INFO] This project has been banned from the build due to previous failures.
[INFO] ------------------------------------------------------------------------
[INFO] ------------------------------------------------------------------------
[INFO] Reactor Summary:
[INFO]
[INFO] HBase ............................................. SUCCESS [9.037s]
[INFO] HBase - Common .................................... SUCCESS [6.043s]
[INFO] HBase - Hadoop Compatibility ...................... SUCCESS [1.252s]
[INFO] HBase - Hadoop One Compatibility .................. SUCCESS [1.679s]
[INFO] HBase - Server .................................... FAILURE [35:43.561s]
[INFO] HBase - Hadoop Two Compatibility .................. SKIPPED
[INFO] HBase - Integration Tests ......................... SKIPPED
[INFO] ------------------------------------------------------------------------
[INFO] BUILD FAILURE
[INFO] ------------------------------------------------------------------------
[INFO] Total time: 36:02.262s
[INFO] Finished at: Thu Jul 19 02:46:39 UTC 2012
[INFO] Final Memory: 62M/493M
[INFO] ------------------------------------------------------------------------
[ERROR] Failed to execute goal org.apache.maven.plugins:maven-surefire-plugin:2.12-TRUNK-HBASE-2:test (secondPartTestsExecution) on project hbase-server: There are test failures.
[ERROR]
[ERROR] Please refer to <https://builds.apache.org/job/HBase-TRUNK/ws/trunk/hbase-server/target/surefire-reports> for the individual test results.
[ERROR] -> [Help 1]
[ERROR]
[ERROR] To see the full stack trace of the errors, re-run Maven with the -e switch.
[ERROR] Re-run Maven using the -X switch to enable full debug logging.
[ERROR]
[ERROR] For more information about the errors and possible solutions, please read the following articles:
[ERROR] [Help 1] http://cwiki.apache.org/confluence/display/MAVEN/MojoFailureException
[ERROR]
[ERROR] After correcting the problems, you can resume the build with the command
[ERROR] mvn <goals> -rf :hbase-server
Build step 'Invoke top-level Maven targets' marked build as failure
Archiving artifacts
Recording test results
Updating HBASE-6405

Search Discussions

  • Apache Jenkins Server at Jul 19, 2012 at 5:12 am
    See <https://builds.apache.org/job/HBase-TRUNK/3148/changes>

    Changes:

    [larsh] HBASE-6406 Remove TestReplicationPeer

    [tedyu] HBASE-6421 [pom] add jettison and fix netty specification (Jesse Yates)

    ------------------------------------------
    [...truncated 2578 lines...]
    Running org.apache.hadoop.hbase.master.TestLogsCleaner
    Tests run: 1, Failures: 0, Errors: 0, Skipped: 0, Time elapsed: 3.043 sec
    Running org.apache.hadoop.hbase.master.TestOpenedRegionHandler
    Tests run: 2, Failures: 0, Errors: 0, Skipped: 0, Time elapsed: 13.587 sec
    Running org.apache.hadoop.hbase.master.TestMasterTransitions
    Tests run: 3, Failures: 0, Errors: 0, Skipped: 3, Time elapsed: 19.069 sec
    Running org.apache.hadoop.hbase.master.TestZKBasedOpenCloseRegion
    Tests run: 4, Failures: 0, Errors: 0, Skipped: 0, Time elapsed: 19.177 sec
    Running org.apache.hadoop.hbase.master.TestRollingRestart
    Tests run: 1, Failures: 0, Errors: 0, Skipped: 0, Time elapsed: 37.274 sec
    Running org.apache.hadoop.hbase.master.TestRestartCluster
    Tests run: 2, Failures: 0, Errors: 0, Skipped: 0, Time elapsed: 28.866 sec
    Running org.apache.hadoop.hbase.master.TestMaster
    Tests run: 1, Failures: 0, Errors: 0, Skipped: 0, Time elapsed: 17.155 sec
    Running org.apache.hadoop.hbase.master.TestMasterNoCluster
    Tests run: 3, Failures: 0, Errors: 0, Skipped: 0, Time elapsed: 5.68 sec
    Running org.apache.hadoop.hbase.master.TestSplitLogManager
    Tests run: 12, Failures: 0, Errors: 0, Skipped: 0, Time elapsed: 15.654 sec
    Running org.apache.hadoop.hbase.master.TestMXBean
    Tests run: 1, Failures: 0, Errors: 0, Skipped: 0, Time elapsed: 12.368 sec
    Running org.apache.hadoop.hbase.master.balancer.TestStochasticLoadBalancer
    Tests run: 4, Failures: 0, Errors: 0, Skipped: 0, Time elapsed: 97.268 sec
    Running org.apache.hadoop.hbase.master.TestMasterFailover
    Tests run: 4, Failures: 0, Errors: 0, Skipped: 0, Time elapsed: 62.311 sec
    Running org.apache.hadoop.hbase.master.TestMasterRestartAfterDisablingTable
    Tests run: 1, Failures: 0, Errors: 0, Skipped: 0, Time elapsed: 17.613 sec
    Running org.apache.hadoop.hbase.TestGlobalMemStoreSize
    Tests run: 1, Failures: 0, Errors: 0, Skipped: 0, Time elapsed: 14.446 sec
    Running org.apache.hadoop.hbase.replication.TestReplicationZookeeper
    Tests run: 1, Failures: 0, Errors: 0, Skipped: 0, Time elapsed: 0.725 sec
    Running org.apache.hadoop.hbase.TestFullLogReconstruction
    Tests run: 1, Failures: 0, Errors: 0, Skipped: 0, Time elapsed: 42.721 sec
    Running org.apache.hadoop.hbase.replication.TestReplicationSource
    Tests run: 1, Failures: 0, Errors: 0, Skipped: 0, Time elapsed: 2.774 sec
    Running org.apache.hadoop.hbase.TestZooKeeper
    Tests run: 11, Failures: 0, Errors: 0, Skipped: 0, Time elapsed: 32.55 sec
    Running org.apache.hadoop.hbase.master.TestDistributedLogSplitting
    Tests run: 4, Failures: 0, Errors: 0, Skipped: 0, Time elapsed: 87.078 sec
    Running org.apache.hadoop.hbase.replication.regionserver.TestReplicationSourceManager
    Tests run: 1, Failures: 0, Errors: 0, Skipped: 0, Time elapsed: 1.089 sec
    Running org.apache.hadoop.hbase.replication.regionserver.TestReplicationSink
    Tests run: 5, Failures: 0, Errors: 0, Skipped: 0, Time elapsed: 14.728 sec
    Running org.apache.hadoop.hbase.replication.TestMasterReplication
    Tests run: 2, Failures: 0, Errors: 0, Skipped: 0, Time elapsed: 65.427 sec
    Running org.apache.hadoop.hbase.replication.TestMultiSlaveReplication
    Tests run: 1, Failures: 0, Errors: 0, Skipped: 0, Time elapsed: 37.521 sec
    Running org.apache.hadoop.hbase.catalog.TestMetaReaderEditorNoCluster
    Tests run: 1, Failures: 0, Errors: 0, Skipped: 0, Time elapsed: 4.111 sec
    Running org.apache.hadoop.hbase.TestMultiVersions
    Tests run: 3, Failures: 0, Errors: 0, Skipped: 0, Time elapsed: 22.927 sec
    Running org.apache.hadoop.hbase.catalog.TestMetaReaderEditor
    Tests run: 5, Failures: 0, Errors: 0, Skipped: 0, Time elapsed: 22.22 sec
    Running org.apache.hadoop.hbase.catalog.TestCatalogTracker
    Tests run: 9, Failures: 0, Errors: 0, Skipped: 1, Time elapsed: 5.36 sec
    Running org.apache.hadoop.hbase.TestHBaseTestingUtility
    Tests run: 7, Failures: 0, Errors: 0, Skipped: 0, Time elapsed: 59.026 sec
    Running org.apache.hadoop.hbase.coprocessor.TestAggregateProtocol
    Tests run: 45, Failures: 0, Errors: 0, Skipped: 0, Time elapsed: 18.347 sec
    Running org.apache.hadoop.hbase.coprocessor.TestRowProcessorEndpoint
    Tests run: 4, Failures: 0, Errors: 0, Skipped: 0, Time elapsed: 33.342 sec
    Running org.apache.hadoop.hbase.coprocessor.TestMasterObserver
    Tests run: 3, Failures: 0, Errors: 0, Skipped: 0, Time elapsed: 31.232 sec
    Running org.apache.hadoop.hbase.coprocessor.TestCoprocessorEndpoint
    Tests run: 3, Failures: 0, Errors: 0, Skipped: 1, Time elapsed: 30.162 sec
    Running org.apache.hadoop.hbase.catalog.TestCatalogTrackerOnCluster
    Tests run: 1, Failures: 0, Errors: 0, Skipped: 0, Time elapsed: 79.363 sec
    Running org.apache.hadoop.hbase.coprocessor.TestClassLoading
    Tests run: 6, Failures: 0, Errors: 0, Skipped: 0, Time elapsed: 28.091 sec
    Running org.apache.hadoop.hbase.replication.TestReplication
    Running org.apache.hadoop.hbase.coprocessor.TestMasterCoprocessorExceptionWithRemove
    Tests run: 1, Failures: 0, Errors: 0, Skipped: 0, Time elapsed: 14.438 sec
    Tests run: 10, Failures: 0, Errors: 0, Skipped: 0, Time elapsed: 169.896 sec
    Running org.apache.hadoop.hbase.coprocessor.TestRegionServerCoprocessorExceptionWithRemove
    Tests run: 1, Failures: 0, Errors: 0, Skipped: 0, Time elapsed: 17.297 sec
    Running org.apache.hadoop.hbase.coprocessor.TestWALObserver
    Tests run: 3, Failures: 0, Errors: 0, Skipped: 0, Time elapsed: 15.385 sec
    Running org.apache.hadoop.hbase.coprocessor.TestRegionServerCoprocessorExceptionWithAbort
    Tests run: 1, Failures: 0, Errors: 0, Skipped: 0, Time elapsed: 18.301 sec
    Running org.apache.hadoop.hbase.coprocessor.TestRegionObserverInterface
    Tests run: 7, Failures: 0, Errors: 0, Skipped: 0, Time elapsed: 38.009 sec
    Running org.apache.hadoop.hbase.coprocessor.TestMasterCoprocessorExceptionWithAbort
    Tests run: 1, Failures: 0, Errors: 0, Skipped: 0, Time elapsed: 25.809 sec
    Running org.apache.hadoop.hbase.coprocessor.TestRegionObserverBypass
    Tests run: 2, Failures: 0, Errors: 0, Skipped: 0, Time elapsed: 13.041 sec
    Running org.apache.hadoop.hbase.thrift2.TestThriftHBaseServiceHandler
    Tests run: 12, Failures: 0, Errors: 0, Skipped: 0, Time elapsed: 11.72 sec
    Running org.apache.hadoop.hbase.avro.TestAvroServer
    Tests run: 3, Failures: 0, Errors: 0, Skipped: 0, Time elapsed: 24.703 sec
    Running org.apache.hadoop.hbase.regionserver.TestHRegionOnCluster
    Tests run: 1, Failures: 0, Errors: 0, Skipped: 0, Time elapsed: 21.484 sec
    Running org.apache.hadoop.hbase.regionserver.TestMemStore
    Tests run: 21, Failures: 0, Errors: 0, Skipped: 0, Time elapsed: 29.622 sec
    Running org.apache.hadoop.hbase.regionserver.TestMasterAddressManager
    Tests run: 1, Failures: 0, Errors: 0, Skipped: 0, Time elapsed: 0.718 sec
    Running org.apache.hadoop.hbase.regionserver.TestHRegion
    Tests run: 66, Failures: 0, Errors: 0, Skipped: 0, Time elapsed: 42.184 sec
    Running org.apache.hadoop.hbase.thrift.TestThriftServer
    Tests run: 1, Failures: 0, Errors: 0, Skipped: 0, Time elapsed: 82.346 sec
    Running org.apache.hadoop.hbase.regionserver.TestSplitLogWorker
    Tests run: 5, Failures: 0, Errors: 0, Skipped: 0, Time elapsed: 2.266 sec
    Running org.apache.hadoop.hbase.regionserver.TestCompoundBloomFilter
    Tests run: 3, Failures: 0, Errors: 0, Skipped: 0, Time elapsed: 24.87 sec
    Running org.apache.hadoop.hbase.regionserver.TestServerCustomProtocol
    Tests run: 7, Failures: 0, Errors: 0, Skipped: 0, Time elapsed: 15.264 sec
    Running org.apache.hadoop.hbase.regionserver.TestStore
    Tests run: 12, Failures: 0, Errors: 0, Skipped: 0, Time elapsed: 9.543 sec
    Running org.apache.hadoop.hbase.regionserver.TestStoreFileBlockCacheSummary
    Tests run: 1, Failures: 0, Errors: 0, Skipped: 0, Time elapsed: 16.081 sec
    Running org.apache.hadoop.hbase.regionserver.TestRegionServerMetrics
    Tests run: 4, Failures: 0, Errors: 0, Skipped: 0, Time elapsed: 68.939 sec
    Running org.apache.hadoop.hbase.regionserver.TestBlocksRead
    Tests run: 4, Failures: 0, Errors: 0, Skipped: 0, Time elapsed: 1.404 sec
    Running org.apache.hadoop.hbase.regionserver.TestAtomicOperation
    Tests run: 5, Failures: 0, Errors: 0, Skipped: 0, Time elapsed: 29.014 sec
    Running org.apache.hadoop.hbase.regionserver.TestCompactionState
    Tests run: 2, Failures: 0, Errors: 0, Skipped: 0, Time elapsed: 36.394 sec
    Running org.apache.hadoop.hbase.regionserver.TestSeekOptimizations
    Tests run: 6, Failures: 0, Errors: 0, Skipped: 0, Time elapsed: 2.873 sec
    Running org.apache.hadoop.hbase.regionserver.TestRSKilledWhenMasterInitializing
    Tests run: 1, Failures: 0, Errors: 0, Skipped: 0, Time elapsed: 39.164 sec
    Running org.apache.hadoop.hbase.regionserver.handler.TestCloseRegionHandler
    Tests run: 3, Failures: 0, Errors: 0, Skipped: 0, Time elapsed: 1.281 sec
    Running org.apache.hadoop.hbase.regionserver.handler.TestOpenRegionHandler
    Tests run: 3, Failures: 0, Errors: 0, Skipped: 0, Time elapsed: 1.102 sec
    Running org.apache.hadoop.hbase.regionserver.metrics.TestSchemaMetrics
    Tests run: 6, Failures: 0, Errors: 0, Skipped: 0, Time elapsed: 15.029 sec
    Running org.apache.hadoop.hbase.regionserver.TestFSErrorsExposed
    Tests run: 3, Failures: 0, Errors: 0, Skipped: 0, Time elapsed: 29.35 sec
    Running org.apache.hadoop.hbase.regionserver.TestGetClosestAtOrBefore
    Tests run: 3, Failures: 0, Errors: 0, Skipped: 0, Time elapsed: 1.021 sec
    Running org.apache.hadoop.hbase.regionserver.TestParallelPut
    Tests run: 2, Failures: 0, Errors: 0, Skipped: 0, Time elapsed: 5.769 sec
    Running org.apache.hadoop.hbase.regionserver.TestCacheOnWriteInSchema
    Tests run: 3, Failures: 0, Errors: 0, Skipped: 0, Time elapsed: 1.589 sec
    Running org.apache.hadoop.hbase.regionserver.wal.TestLogRollAbort
    Tests run: 1, Failures: 0, Errors: 0, Skipped: 0, Time elapsed: 18.485 sec
    Running org.apache.hadoop.hbase.regionserver.TestHRegionServerBulkLoad
    Tests run: 1, Failures: 0, Errors: 0, Skipped: 0, Time elapsed: 50.56 sec
    Running org.apache.hadoop.hbase.regionserver.TestSplitTransactionOnCluster
    Tests run: 7, Failures: 0, Errors: 0, Skipped: 0, Time elapsed: 104.902 sec
    Running org.apache.hadoop.hbase.regionserver.wal.TestHLog
    Tests run: 10, Failures: 0, Errors: 1, Skipped: 0, Time elapsed: 68.183 sec <<< FAILURE!
    Running org.apache.hadoop.hbase.regionserver.wal.TestWALReplay
    Tests run: 7, Failures: 0, Errors: 0, Skipped: 0, Time elapsed: 46.896 sec
    Running org.apache.hadoop.hbase.regionserver.wal.TestLogRolling
    Tests run: 2, Failures: 0, Errors: 0, Skipped: 0, Time elapsed: 205.071 sec
    Running org.apache.hadoop.hbase.regionserver.TestStoreScanner
    Tests run: 16, Failures: 0, Errors: 0, Skipped: 0, Time elapsed: 0.051 sec
    Running org.apache.hadoop.hbase.regionserver.wal.TestWALReplayCompressed
    Tests run: 7, Failures: 0, Errors: 0, Skipped: 0, Time elapsed: 50.671 sec
    Running org.apache.hadoop.hbase.thrift.TestThriftServerCmdLine
    Tests run: 20, Failures: 0, Errors: 0, Skipped: 0, Time elapsed: 483.935 sec
    Running org.apache.hadoop.hbase.regionserver.TestEndToEndSplitTransaction
    Tests run: 2, Failures: 0, Errors: 0, Skipped: 0, Time elapsed: 65.385 sec
    Running org.apache.hadoop.hbase.regionserver.TestMXBean
    Tests run: 1, Failures: 0, Errors: 0, Skipped: 0, Time elapsed: 11.217 sec
    Running org.apache.hadoop.hbase.regionserver.TestRpcMetrics
    Tests run: 1, Failures: 0, Errors: 0, Skipped: 0, Time elapsed: 1.779 sec
    Running org.apache.hadoop.hbase.regionserver.TestCompaction
    Tests run: 15, Failures: 0, Errors: 0, Skipped: 0, Time elapsed: 38.536 sec
    Running org.apache.hadoop.hbase.regionserver.wal.TestHLogSplit
    Tests run: 30, Failures: 0, Errors: 0, Skipped: 1, Time elapsed: 255.881 sec
    Running org.apache.hadoop.hbase.regionserver.TestMultiColumnScanner
    Tests run: 12, Failures: 0, Errors: 0, Skipped: 0, Time elapsed: 41.365 sec
    Running org.apache.hadoop.hbase.mapred.TestTableInputFormat
    Tests run: 10, Failures: 0, Errors: 0, Skipped: 0, Time elapsed: 29.936 sec
    Running org.apache.hadoop.hbase.TestClusterBootOrder
    Tests run: 2, Failures: 0, Errors: 0, Skipped: 0, Time elapsed: 29.253 sec
    Running org.apache.hadoop.hbase.TestDrainingServer
    Tests run: 2, Failures: 0, Errors: 0, Skipped: 0, Time elapsed: 25.838 sec
    Running org.apache.hadoop.hbase.mapreduce.TestTimeRangeMapRed
    Tests run: 1, Failures: 0, Errors: 0, Skipped: 0, Time elapsed: 44.44 sec
    Running org.apache.hadoop.hbase.mapred.TestTableMapReduce
    Tests run: 1, Failures: 0, Errors: 0, Skipped: 0, Time elapsed: 158.739 sec
    Running org.apache.hadoop.hbase.mapreduce.TestImportExport
    Tests run: 2, Failures: 0, Errors: 0, Skipped: 0, Time elapsed: 53.204 sec
    Running org.apache.hadoop.hbase.mapreduce.TestImportTsv
    Tests run: 13, Failures: 0, Errors: 0, Skipped: 0, Time elapsed: 188.397 sec
    Running org.apache.hadoop.hbase.mapreduce.TestWALPlayer
    Tests run: 1, Failures: 0, Errors: 0, Skipped: 0, Time elapsed: 52.358 sec
    Running org.apache.hadoop.hbase.mapreduce.TestHFileOutputFormat
    Tests run: 9, Failures: 0, Errors: 0, Skipped: 0, Time elapsed: 234.867 sec
    Running org.apache.hadoop.hbase.mapreduce.TestMultithreadedTableMapper
    Tests run: 1, Failures: 0, Errors: 0, Skipped: 0, Time elapsed: 136.343 sec
    Running org.apache.hadoop.hbase.mapreduce.TestLoadIncrementalHFilesSplitRecovery
    Tests run: 4, Failures: 0, Errors: 0, Skipped: 0, Time elapsed: 123.538 sec
    Running org.apache.hadoop.hbase.mapreduce.TestHLogRecordReader
    Tests run: 2, Failures: 0, Errors: 0, Skipped: 0, Time elapsed: 4.236 sec
    Running org.apache.hadoop.hbase.mapreduce.TestLoadIncrementalHFiles
    Tests run: 6, Failures: 0, Errors: 0, Skipped: 0, Time elapsed: 34.507 sec
    Running org.apache.hadoop.hbase.mapreduce.TestTableMapReduce
    Tests run: 1, Failures: 0, Errors: 0, Skipped: 0, Time elapsed: 138.785 sec
    Running org.apache.hadoop.hbase.mapreduce.TestTableInputFormatScan
    Tests run: 12, Failures: 0, Errors: 0, Skipped: 0, Time elapsed: 591.961 sec

    Results :

    Failed tests: testPermissionsWatcher(org.apache.hadoop.hbase.security.access.TestZKPermissionsWatcher)

    Tests in error:
    testLogCleaning(org.apache.hadoop.hbase.regionserver.wal.TestHLog): org.apache.hadoop.hdfs.server.namenode.LeaseExpiredException: No lease on /user/jenkins/hbase/TestHLog/hlog.1342673806237 File is not open for writing. Holder DFSClient_726148883 does not have any open files.(..)

    Tests run: 1042, Failures: 1, Errors: 1, Skipped: 9

    [INFO]
    [INFO] ------------------------------------------------------------------------
    [INFO] Skipping HBase
    [INFO] This project has been banned from the build due to previous failures.
    [INFO] ------------------------------------------------------------------------
    [INFO]
    [INFO] ------------------------------------------------------------------------
    [INFO] Skipping HBase
    [INFO] This project has been banned from the build due to previous failures.
    [INFO] ------------------------------------------------------------------------
    [INFO] ------------------------------------------------------------------------
    [INFO] Reactor Summary:
    [INFO]
    [INFO] HBase ............................................. SUCCESS [4.714s]
    [INFO] HBase - Common .................................... SUCCESS [6.644s]
    [INFO] HBase - Hadoop Compatibility ...................... SUCCESS [1.219s]
    [INFO] HBase - Hadoop One Compatibility .................. SUCCESS [1.620s]
    [INFO] HBase - Server .................................... FAILURE [39:01.451s]
    [INFO] HBase - Hadoop Two Compatibility .................. SKIPPED
    [INFO] HBase - Integration Tests ......................... SKIPPED
    [INFO] ------------------------------------------------------------------------
    [INFO] BUILD FAILURE
    [INFO] ------------------------------------------------------------------------
    [INFO] Total time: 39:16.370s
    [INFO] Finished at: Thu Jul 19 05:12:00 UTC 2012
    [INFO] Final Memory: 73M/630M
    [INFO] ------------------------------------------------------------------------
    [ERROR] Failed to execute goal org.apache.maven.plugins:maven-surefire-plugin:2.12-TRUNK-HBASE-2:test (secondPartTestsExecution) on project hbase-server: There are test failures.
    [ERROR]
    [ERROR] Please refer to <https://builds.apache.org/job/HBase-TRUNK/ws/trunk/hbase-server/target/surefire-reports> for the individual test results.
    [ERROR] -> [Help 1]
    [ERROR]
    [ERROR] To see the full stack trace of the errors, re-run Maven with the -e switch.
    [ERROR] Re-run Maven using the -X switch to enable full debug logging.
    [ERROR]
    [ERROR] For more information about the errors and possible solutions, please read the following articles:
    [ERROR] [Help 1] http://cwiki.apache.org/confluence/display/MAVEN/MojoFailureException
    [ERROR]
    [ERROR] After correcting the problems, you can resume the build with the command
    [ERROR] mvn <goals> -rf :hbase-server
    Build step 'Invoke top-level Maven targets' marked build as failure
    Archiving artifacts
    Recording test results
    Updating HBASE-6406
    Updating HBASE-6421
  • Apache Jenkins Server at Jul 19, 2012 at 10:56 am
    See <https://builds.apache.org/job/HBase-TRUNK/3149/>

    ------------------------------------------
    [...truncated 2464 lines...]
    Running org.apache.hadoop.hbase.master.TestAssignmentManager
    Tests run: 12, Failures: 0, Errors: 0, Skipped: 0, Time elapsed: 2.395 sec
    Running org.apache.hadoop.hbase.master.TestLogsCleaner
    Tests run: 1, Failures: 0, Errors: 0, Skipped: 0, Time elapsed: 3.066 sec
    Running org.apache.hadoop.hbase.client.TestFromClientSide
    Tests run: 56, Failures: 0, Errors: 0, Skipped: 3, Time elapsed: 174.92 sec
    Running org.apache.hadoop.hbase.master.TestOpenedRegionHandler
    Tests run: 2, Failures: 0, Errors: 0, Skipped: 0, Time elapsed: 15.007 sec
    Running org.apache.hadoop.hbase.master.TestMasterTransitions
    Tests run: 3, Failures: 0, Errors: 0, Skipped: 3, Time elapsed: 19.072 sec
    Running org.apache.hadoop.hbase.master.TestRollingRestart
    Tests run: 1, Failures: 0, Errors: 0, Skipped: 0, Time elapsed: 38.607 sec
    Running org.apache.hadoop.hbase.master.TestZKBasedOpenCloseRegion
    Tests run: 4, Failures: 0, Errors: 0, Skipped: 0, Time elapsed: 20.546 sec
    Running org.apache.hadoop.hbase.master.TestMaster
    Tests run: 1, Failures: 0, Errors: 0, Skipped: 0, Time elapsed: 16.002 sec
    Running org.apache.hadoop.hbase.master.TestRestartCluster
    Tests run: 2, Failures: 0, Errors: 0, Skipped: 0, Time elapsed: 29.613 sec
    Running org.apache.hadoop.hbase.master.TestMasterNoCluster
    Tests run: 3, Failures: 0, Errors: 0, Skipped: 0, Time elapsed: 5.69 sec
    Running org.apache.hadoop.hbase.master.TestSplitLogManager
    Tests run: 12, Failures: 0, Errors: 0, Skipped: 0, Time elapsed: 15.656 sec
    Running org.apache.hadoop.hbase.master.balancer.TestStochasticLoadBalancer
    Tests run: 4, Failures: 0, Errors: 0, Skipped: 0, Time elapsed: 95.264 sec
    Running org.apache.hadoop.hbase.master.TestMXBean
    Tests run: 1, Failures: 0, Errors: 0, Skipped: 0, Time elapsed: 12.317 sec
    Running org.apache.hadoop.hbase.master.TestMasterFailover
    Tests run: 4, Failures: 0, Errors: 0, Skipped: 0, Time elapsed: 62.226 sec
    Running org.apache.hadoop.hbase.master.TestMasterRestartAfterDisablingTable
    Tests run: 1, Failures: 0, Errors: 0, Skipped: 0, Time elapsed: 16.324 sec
    Running org.apache.hadoop.hbase.TestGlobalMemStoreSize
    Tests run: 1, Failures: 0, Errors: 0, Skipped: 0, Time elapsed: 16.027 sec
    Running org.apache.hadoop.hbase.replication.TestReplicationZookeeper
    Tests run: 1, Failures: 0, Errors: 0, Skipped: 0, Time elapsed: 0.626 sec
    Running org.apache.hadoop.hbase.TestZooKeeper
    Tests run: 11, Failures: 0, Errors: 0, Skipped: 0, Time elapsed: 36.477 sec
    Running org.apache.hadoop.hbase.master.TestDistributedLogSplitting
    Tests run: 4, Failures: 0, Errors: 0, Skipped: 0, Time elapsed: 84.34 sec
    Running org.apache.hadoop.hbase.replication.TestReplicationSource
    Tests run: 1, Failures: 0, Errors: 0, Skipped: 0, Time elapsed: 2.748 sec
    Running org.apache.hadoop.hbase.TestFullLogReconstruction
    Tests run: 1, Failures: 0, Errors: 0, Skipped: 0, Time elapsed: 54.775 sec
    Running org.apache.hadoop.hbase.replication.regionserver.TestReplicationSourceManager
    Tests run: 1, Failures: 0, Errors: 0, Skipped: 0, Time elapsed: 1.07 sec
    Running org.apache.hadoop.hbase.replication.regionserver.TestReplicationSink
    Tests run: 5, Failures: 0, Errors: 0, Skipped: 0, Time elapsed: 15.247 sec
    Running org.apache.hadoop.hbase.replication.TestMasterReplication
    Tests run: 2, Failures: 0, Errors: 0, Skipped: 0, Time elapsed: 64.35 sec
    Running org.apache.hadoop.hbase.replication.TestMultiSlaveReplication
    Tests run: 1, Failures: 0, Errors: 0, Skipped: 0, Time elapsed: 41.992 sec
    Running org.apache.hadoop.hbase.catalog.TestMetaReaderEditorNoCluster
    Tests run: 1, Failures: 0, Errors: 0, Skipped: 0, Time elapsed: 4.119 sec
    Running org.apache.hadoop.hbase.TestMultiVersions
    Tests run: 3, Failures: 0, Errors: 0, Skipped: 0, Time elapsed: 22.327 sec
    Running org.apache.hadoop.hbase.catalog.TestCatalogTracker
    Tests run: 9, Failures: 0, Errors: 0, Skipped: 1, Time elapsed: 5.407 sec
    Running org.apache.hadoop.hbase.TestHBaseTestingUtility
    Tests run: 7, Failures: 0, Errors: 0, Skipped: 0, Time elapsed: 58.2 sec
    Running org.apache.hadoop.hbase.catalog.TestMetaReaderEditor
    Tests run: 5, Failures: 0, Errors: 0, Skipped: 0, Time elapsed: 22.522 sec
    Running org.apache.hadoop.hbase.coprocessor.TestAggregateProtocol
    Tests run: 45, Failures: 0, Errors: 0, Skipped: 0, Time elapsed: 17.39 sec
    Running org.apache.hadoop.hbase.coprocessor.TestRowProcessorEndpoint
    Tests run: 4, Failures: 0, Errors: 0, Skipped: 0, Time elapsed: 33.475 sec
    Running org.apache.hadoop.hbase.coprocessor.TestMasterObserver
    Tests run: 3, Failures: 0, Errors: 0, Skipped: 0, Time elapsed: 32.069 sec
    Running org.apache.hadoop.hbase.catalog.TestCatalogTrackerOnCluster
    Tests run: 1, Failures: 0, Errors: 0, Skipped: 0, Time elapsed: 77.063 sec
    Running org.apache.hadoop.hbase.coprocessor.TestCoprocessorEndpoint
    Tests run: 3, Failures: 0, Errors: 0, Skipped: 1, Time elapsed: 30.352 sec
    Running org.apache.hadoop.hbase.coprocessor.TestClassLoading
    Tests run: 6, Failures: 0, Errors: 0, Skipped: 0, Time elapsed: 31.157 sec
    Running org.apache.hadoop.hbase.replication.TestReplication
    Tests run: 10, Failures: 0, Errors: 0, Skipped: 0, Time elapsed: 160.376 sec
    Running org.apache.hadoop.hbase.coprocessor.TestMasterCoprocessorExceptionWithRemove
    Tests run: 1, Failures: 0, Errors: 0, Skipped: 0, Time elapsed: 15.313 sec
    Running org.apache.hadoop.hbase.coprocessor.TestRegionServerCoprocessorExceptionWithRemove
    Tests run: 1, Failures: 0, Errors: 0, Skipped: 0, Time elapsed: 17.441 sec
    Running org.apache.hadoop.hbase.coprocessor.TestWALObserver
    Tests run: 3, Failures: 0, Errors: 0, Skipped: 0, Time elapsed: 14.422 sec
    Running org.apache.hadoop.hbase.coprocessor.TestMasterCoprocessorExceptionWithAbort
    Tests run: 1, Failures: 0, Errors: 0, Skipped: 0, Time elapsed: 24.286 sec
    Running org.apache.hadoop.hbase.coprocessor.TestRegionObserverInterface
    Tests run: 7, Failures: 0, Errors: 0, Skipped: 0, Time elapsed: 38.586 sec
    Running org.apache.hadoop.hbase.coprocessor.TestRegionServerCoprocessorExceptionWithAbort
    Tests run: 1, Failures: 0, Errors: 0, Skipped: 0, Time elapsed: 15.74 sec
    Running org.apache.hadoop.hbase.coprocessor.TestRegionObserverBypass
    Tests run: 2, Failures: 0, Errors: 0, Skipped: 0, Time elapsed: 13.26 sec
    Running org.apache.hadoop.hbase.thrift2.TestThriftHBaseServiceHandler
    Tests run: 12, Failures: 0, Errors: 0, Skipped: 0, Time elapsed: 13.011 sec
    Running org.apache.hadoop.hbase.avro.TestAvroServer
    Tests run: 3, Failures: 0, Errors: 0, Skipped: 0, Time elapsed: 26.065 sec
    Running org.apache.hadoop.hbase.regionserver.TestHRegionOnCluster
    Tests run: 1, Failures: 0, Errors: 0, Skipped: 0, Time elapsed: 20.69 sec
    Running org.apache.hadoop.hbase.regionserver.TestMemStore
    Tests run: 21, Failures: 0, Errors: 0, Skipped: 0, Time elapsed: 29.824 sec
    Running org.apache.hadoop.hbase.regionserver.TestMasterAddressManager
    Tests run: 1, Failures: 0, Errors: 0, Skipped: 0, Time elapsed: 0.817 sec
    Running org.apache.hadoop.hbase.regionserver.TestHRegion
    Tests run: 66, Failures: 0, Errors: 0, Skipped: 0, Time elapsed: 44.789 sec
    Running org.apache.hadoop.hbase.thrift.TestThriftServer
    Tests run: 1, Failures: 0, Errors: 0, Skipped: 0, Time elapsed: 84.134 sec
    Running org.apache.hadoop.hbase.regionserver.TestSplitLogWorker
    Tests run: 5, Failures: 0, Errors: 0, Skipped: 0, Time elapsed: 2.195 sec
    Running org.apache.hadoop.hbase.regionserver.TestCompoundBloomFilter
    Tests run: 3, Failures: 0, Errors: 0, Skipped: 0, Time elapsed: 26.297 sec
    Running org.apache.hadoop.hbase.regionserver.TestServerCustomProtocol
    Tests run: 7, Failures: 1, Errors: 0, Skipped: 0, Time elapsed: 16.5 sec <<< FAILURE!
    Running org.apache.hadoop.hbase.regionserver.TestStoreFileBlockCacheSummary
    Tests run: 1, Failures: 0, Errors: 0, Skipped: 0, Time elapsed: 14.325 sec
    Running org.apache.hadoop.hbase.regionserver.TestRegionServerMetrics
    Tests run: 4, Failures: 0, Errors: 0, Skipped: 0, Time elapsed: 65.113 sec
    Running org.apache.hadoop.hbase.regionserver.TestStore
    Tests run: 12, Failures: 0, Errors: 0, Skipped: 0, Time elapsed: 9.483 sec
    Running org.apache.hadoop.hbase.regionserver.TestBlocksRead
    Tests run: 4, Failures: 0, Errors: 0, Skipped: 0, Time elapsed: 2.303 sec
    Running org.apache.hadoop.hbase.regionserver.TestAtomicOperation
    Tests run: 5, Failures: 0, Errors: 0, Skipped: 0, Time elapsed: 28.169 sec
    Running org.apache.hadoop.hbase.regionserver.TestCompactionState
    Tests run: 2, Failures: 0, Errors: 0, Skipped: 0, Time elapsed: 33.896 sec
    Running org.apache.hadoop.hbase.regionserver.TestSeekOptimizations
    Tests run: 6, Failures: 0, Errors: 0, Skipped: 0, Time elapsed: 2.836 sec
    Running org.apache.hadoop.hbase.regionserver.TestRSKilledWhenMasterInitializing
    Tests run: 1, Failures: 0, Errors: 0, Skipped: 0, Time elapsed: 40.816 sec
    Running org.apache.hadoop.hbase.regionserver.handler.TestCloseRegionHandler
    Tests run: 3, Failures: 0, Errors: 0, Skipped: 0, Time elapsed: 1.33 sec
    Running org.apache.hadoop.hbase.regionserver.handler.TestOpenRegionHandler
    Tests run: 3, Failures: 0, Errors: 0, Skipped: 0, Time elapsed: 1.02 sec
    Running org.apache.hadoop.hbase.regionserver.metrics.TestSchemaMetrics
    Tests run: 6, Failures: 0, Errors: 0, Skipped: 0, Time elapsed: 15.128 sec
    Running org.apache.hadoop.hbase.regionserver.TestFSErrorsExposed
    Tests run: 3, Failures: 0, Errors: 0, Skipped: 0, Time elapsed: 29.425 sec
    Running org.apache.hadoop.hbase.regionserver.TestGetClosestAtOrBefore
    Tests run: 3, Failures: 0, Errors: 0, Skipped: 0, Time elapsed: 0.98 sec
    Running org.apache.hadoop.hbase.regionserver.TestParallelPut
    Tests run: 2, Failures: 0, Errors: 0, Skipped: 0, Time elapsed: 6.128 sec
    Running org.apache.hadoop.hbase.regionserver.TestCacheOnWriteInSchema
    Tests run: 3, Failures: 0, Errors: 0, Skipped: 0, Time elapsed: 1.589 sec
    Running org.apache.hadoop.hbase.regionserver.TestHRegionServerBulkLoad
    Tests run: 1, Failures: 0, Errors: 0, Skipped: 0, Time elapsed: 46.155 sec
    Running org.apache.hadoop.hbase.regionserver.TestSplitTransactionOnCluster
    Tests run: 7, Failures: 0, Errors: 0, Skipped: 0, Time elapsed: 59.37 sec
    Running org.apache.hadoop.hbase.regionserver.wal.TestHLog
    Tests run: 10, Failures: 0, Errors: 0, Skipped: 0, Time elapsed: 67.125 sec
    Running org.apache.hadoop.hbase.regionserver.wal.TestLogRollAbort
    Tests run: 1, Failures: 0, Errors: 0, Skipped: 0, Time elapsed: 163.079 sec
    Running org.apache.hadoop.hbase.regionserver.wal.TestWALReplay
    Tests run: 7, Failures: 0, Errors: 0, Skipped: 0, Time elapsed: 43.341 sec
    Running org.apache.hadoop.hbase.thrift.TestThriftServerCmdLine
    Tests run: 20, Failures: 0, Errors: 0, Skipped: 0, Time elapsed: 462.678 sec
    Running org.apache.hadoop.hbase.regionserver.wal.TestLogRolling
    Tests run: 2, Failures: 0, Errors: 0, Skipped: 0, Time elapsed: 259.99 sec
    Running org.apache.hadoop.hbase.regionserver.TestStoreScanner
    Tests run: 16, Failures: 0, Errors: 0, Skipped: 0, Time elapsed: 0.05 sec
    Running org.apache.hadoop.hbase.regionserver.wal.TestWALReplayCompressed
    Tests run: 7, Failures: 0, Errors: 0, Skipped: 0, Time elapsed: 44.834 sec
    Running org.apache.hadoop.hbase.regionserver.TestCompaction
    Tests run: 15, Failures: 0, Errors: 0, Skipped: 0, Time elapsed: 39.728 sec
    Running org.apache.hadoop.hbase.regionserver.wal.TestHLogSplit
    Tests run: 30, Failures: 0, Errors: 0, Skipped: 1, Time elapsed: 240.102 sec
    Running org.apache.hadoop.hbase.regionserver.TestRpcMetrics
    Tests run: 1, Failures: 0, Errors: 0, Skipped: 0, Time elapsed: 2.169 sec
    Running org.apache.hadoop.hbase.regionserver.TestMXBean
    Tests run: 1, Failures: 0, Errors: 0, Skipped: 0, Time elapsed: 10.128 sec
    Running org.apache.hadoop.hbase.regionserver.TestEndToEndSplitTransaction
    Tests run: 2, Failures: 0, Errors: 0, Skipped: 0, Time elapsed: 61.96 sec
    Running org.apache.hadoop.hbase.mapred.TestTableInputFormat
    Tests run: 10, Failures: 0, Errors: 0, Skipped: 0, Time elapsed: 34.436 sec
    Running org.apache.hadoop.hbase.regionserver.TestMultiColumnScanner
    Tests run: 12, Failures: 0, Errors: 0, Skipped: 0, Time elapsed: 43.266 sec
    Running org.apache.hadoop.hbase.TestClusterBootOrder
    Tests run: 2, Failures: 0, Errors: 0, Skipped: 0, Time elapsed: 31.837 sec
    Running org.apache.hadoop.hbase.TestDrainingServer
    Tests run: 2, Failures: 0, Errors: 0, Skipped: 0, Time elapsed: 29.535 sec
    Running org.apache.hadoop.hbase.mapred.TestTableMapReduce
    Tests run: 1, Failures: 0, Errors: 0, Skipped: 0, Time elapsed: 101.902 sec
    Running org.apache.hadoop.hbase.mapreduce.TestTimeRangeMapRed
    Tests run: 1, Failures: 0, Errors: 0, Skipped: 0, Time elapsed: 53.894 sec
    Running org.apache.hadoop.hbase.mapreduce.TestImportExport
    Tests run: 2, Failures: 0, Errors: 0, Skipped: 0, Time elapsed: 64.796 sec
    Running org.apache.hadoop.hbase.mapreduce.TestWALPlayer
    Tests run: 1, Failures: 0, Errors: 0, Skipped: 0, Time elapsed: 122.227 sec
    Running org.apache.hadoop.hbase.mapreduce.TestHFileOutputFormat
    Tests run: 9, Failures: 0, Errors: 0, Skipped: 0, Time elapsed: 277.357 sec
    Running org.apache.hadoop.hbase.mapreduce.TestImportTsv
    Tests run: 13, Failures: 0, Errors: 0, Skipped: 0, Time elapsed: 297.968 sec
    Running org.apache.hadoop.hbase.mapreduce.TestMultithreadedTableMapper
    Tests run: 1, Failures: 0, Errors: 0, Skipped: 0, Time elapsed: 144.838 sec
    Running org.apache.hadoop.hbase.mapreduce.TestLoadIncrementalHFilesSplitRecovery
    Tests run: 4, Failures: 0, Errors: 0, Skipped: 0, Time elapsed: 119.733 sec
    Running org.apache.hadoop.hbase.mapreduce.TestHLogRecordReader
    Tests run: 2, Failures: 0, Errors: 0, Skipped: 0, Time elapsed: 8.998 sec
    Running org.apache.hadoop.hbase.mapreduce.TestLoadIncrementalHFiles
    Tests run: 6, Failures: 0, Errors: 0, Skipped: 0, Time elapsed: 35.062 sec
    Running org.apache.hadoop.hbase.mapreduce.TestTableMapReduce
    Tests run: 1, Failures: 0, Errors: 0, Skipped: 0, Time elapsed: 123.69 sec
    Running org.apache.hadoop.hbase.mapreduce.TestTableInputFormatScan
    Tests run: 12, Failures: 0, Errors: 0, Skipped: 0, Time elapsed: 647.126 sec

    Results :

    Failed tests: testRebalanceOnRegionServerNumberChange[1](org.apache.hadoop.hbase.TestRegionRebalancing): After 5 attempts, region assignments were not balanced.
    testSingleMethod(org.apache.hadoop.hbase.regionserver.TestServerCustomProtocol): Results should contain region test,,1342694124967.b95353c26c12e571a977a113452068b1. for row 'aaa'

    Tests run: 1042, Failures: 2, Errors: 0, Skipped: 9

    [INFO]
    [INFO] ------------------------------------------------------------------------
    [INFO] Skipping HBase
    [INFO] This project has been banned from the build due to previous failures.
    [INFO] ------------------------------------------------------------------------
    [INFO]
    [INFO] ------------------------------------------------------------------------
    [INFO] Skipping HBase
    [INFO] This project has been banned from the build due to previous failures.
    [INFO] ------------------------------------------------------------------------
    [INFO] ------------------------------------------------------------------------
    [INFO] Reactor Summary:
    [INFO]
    [INFO] HBase ............................................. SUCCESS [8.238s]
    [INFO] HBase - Common .................................... SUCCESS [10.032s]
    [INFO] HBase - Hadoop Compatibility ...................... SUCCESS [1.324s]
    [INFO] HBase - Hadoop One Compatibility .................. SUCCESS [1.703s]
    [INFO] HBase - Server .................................... FAILURE [40:50.141s]
    [INFO] HBase - Hadoop Two Compatibility .................. SKIPPED
    [INFO] HBase - Integration Tests ......................... SKIPPED
    [INFO] ------------------------------------------------------------------------
    [INFO] BUILD FAILURE
    [INFO] ------------------------------------------------------------------------
    [INFO] Total time: 41:12.351s
    [INFO] Finished at: Thu Jul 19 10:55:14 UTC 2012
    [INFO] Final Memory: 65M/320M
    [INFO] ------------------------------------------------------------------------
    [ERROR] Failed to execute goal org.apache.maven.plugins:maven-surefire-plugin:2.12-TRUNK-HBASE-2:test (secondPartTestsExecution) on project hbase-server: There are test failures.
    [ERROR]
    [ERROR] Please refer to <https://builds.apache.org/job/HBase-TRUNK/ws/trunk/hbase-server/target/surefire-reports> for the individual test results.
    [ERROR] -> [Help 1]
    [ERROR]
    [ERROR] To see the full stack trace of the errors, re-run Maven with the -e switch.
    [ERROR] Re-run Maven using the -X switch to enable full debug logging.
    [ERROR]
    [ERROR] For more information about the errors and possible solutions, please read the following articles:
    [ERROR] [Help 1] http://cwiki.apache.org/confluence/display/MAVEN/MojoFailureException
    [ERROR]
    [ERROR] After correcting the problems, you can resume the build with the command
    [ERROR] mvn <goals> -rf :hbase-server
    Build step 'Invoke top-level Maven targets' marked build as failure
    Archiving artifacts
    Recording test results
  • Apache Jenkins Server at Jul 19, 2012 at 1:18 pm

Related Discussions

Discussion Navigation
viewthread | post
Discussion Overview
groupdev @
categorieshbase, hadoop
postedJul 19, '12 at 2:47a
activeJul 19, '12 at 1:18p
posts4
users1
websitehbase.apache.org

1 user in discussion

Apache Jenkins Server: 4 posts

People

Translate

site design / logo © 2022 Grokbase