Grokbase Groups HBase dev July 2012
FAQ
See <https://builds.apache.org/job/hbase-0.90/516/changes>

Changes:

[jmhsieh] HBASE-6382 Upgrade Jersey to 1.8 to match Hadoop 1 and 2 (David S. Wang)

------------------------------------------
[...truncated 1230 lines...]
Running org.apache.hadoop.hbase.regionserver.TestFSErrorsExposed
Tests run: 3, Failures: 0, Errors: 0, Skipped: 0, Time elapsed: 28.265 sec
Running org.apache.hadoop.hbase.client.replication.TestReplicationAdmin
Tests run: 1, Failures: 0, Errors: 0, Skipped: 0, Time elapsed: 0.288 sec
Running org.apache.hadoop.hbase.regionserver.TestScanDeleteTracker
Tests run: 6, Failures: 0, Errors: 0, Skipped: 0, Time elapsed: 0.089 sec
Running org.apache.hadoop.hbase.metrics.TestMetricsMBeanBase
Tests run: 2, Failures: 0, Errors: 0, Skipped: 0, Time elapsed: 0.032 sec
Running org.apache.hadoop.hbase.client.TestMetaScanner
Tests run: 1, Failures: 0, Errors: 0, Skipped: 0, Time elapsed: 13.37 sec
Running org.apache.hadoop.hbase.TestRegionRebalancing
Tests run: 1, Failures: 0, Errors: 0, Skipped: 0, Time elapsed: 70.611 sec
Running org.apache.hadoop.hbase.mapreduce.TestTableSplit
Tests run: 1, Failures: 0, Errors: 0, Skipped: 0, Time elapsed: 0.017 sec
Running org.apache.hadoop.hbase.rest.TestTableResource
Tests run: 8, Failures: 0, Errors: 0, Skipped: 0, Time elapsed: 44.148 sec
Running org.apache.hadoop.hbase.filter.TestInclusiveStopFilter
Tests run: 2, Failures: 0, Errors: 0, Skipped: 0, Time elapsed: 0.016 sec
Running org.apache.hadoop.hbase.filter.TestSingleColumnValueExcludeFilter
Tests run: 1, Failures: 0, Errors: 0, Skipped: 0, Time elapsed: 0.017 sec
Running org.apache.hadoop.hbase.mapreduce.TestLoadIncrementalHFiles
Tests run: 5, Failures: 0, Errors: 0, Skipped: 0, Time elapsed: 51.368 sec
Running org.apache.hadoop.hbase.TestHBaseTestingUtility
Tests run: 5, Failures: 0, Errors: 0, Skipped: 0, Time elapsed: 50.143 sec
Running org.apache.hadoop.hbase.regionserver.wal.TestWALReplay
Tests run: 4, Failures: 0, Errors: 0, Skipped: 0, Time elapsed: 27.254 sec
Running org.apache.hadoop.hbase.rest.TestSchemaResource
Tests run: 2, Failures: 0, Errors: 0, Skipped: 0, Time elapsed: 22.049 sec
Running org.apache.hadoop.hbase.regionserver.TestKeyValueScanFixture
Tests run: 1, Failures: 0, Errors: 0, Skipped: 0, Time elapsed: 0.016 sec
Running org.apache.hadoop.hbase.rest.model.TestTableListModel
Tests run: 3, Failures: 0, Errors: 0, Skipped: 0, Time elapsed: 0.129 sec
Running org.apache.hadoop.hbase.rest.model.TestColumnSchemaModel
Tests run: 2, Failures: 0, Errors: 0, Skipped: 0, Time elapsed: 0.031 sec
Running org.apache.hadoop.hbase.regionserver.TestStoreFile
Tests run: 7, Failures: 0, Errors: 0, Skipped: 0, Time elapsed: 28.788 sec
Running org.apache.hadoop.hbase.zookeeper.TestZooKeeperNodeTracker
Tests run: 2, Failures: 0, Errors: 0, Skipped: 0, Time elapsed: 0.248 sec
Running org.apache.hadoop.hbase.regionserver.wal.TestHLogMethods
Tests run: 3, Failures: 0, Errors: 0, Skipped: 0, Time elapsed: 0.301 sec
Running org.apache.hadoop.hbase.rest.model.TestScannerModel
Tests run: 3, Failures: 0, Errors: 0, Skipped: 0, Time elapsed: 0.129 sec
Running org.apache.hadoop.hbase.regionserver.TestHRegionServerBulkLoad
Tests run: 1, Failures: 0, Errors: 0, Skipped: 0, Time elapsed: 44.44 sec
Running org.apache.hadoop.hbase.rest.TestVersionResource
Tests run: 7, Failures: 0, Errors: 0, Skipped: 0, Time elapsed: 16.101 sec
Running org.apache.hadoop.hbase.filter.TestFilter
Tests run: 18, Failures: 0, Errors: 0, Skipped: 0, Time elapsed: 1.446 sec
Running org.apache.hadoop.hbase.regionserver.TestWideScanner
Tests run: 1, Failures: 0, Errors: 0, Skipped: 0, Time elapsed: 15.375 sec
Running org.apache.hadoop.hbase.regionserver.TestSplitTransaction
Tests run: 6, Failures: 0, Errors: 0, Skipped: 0, Time elapsed: 2.71 sec
Running org.apache.hadoop.hbase.replication.regionserver.TestReplicationSink
Tests run: 5, Failures: 0, Errors: 0, Skipped: 0, Time elapsed: 20.125 sec
Running org.apache.hadoop.hbase.regionserver.TestGetClosestAtOrBefore
Tests run: 3, Failures: 0, Errors: 0, Skipped: 0, Time elapsed: 6.414 sec
Running org.apache.hadoop.hbase.regionserver.TestReadWriteConsistencyControl
Tests run: 1, Failures: 0, Errors: 0, Skipped: 0, Time elapsed: 10.022 sec
Running org.apache.hadoop.hbase.util.TestMergeTable
Tests run: 1, Failures: 0, Errors: 0, Skipped: 0, Time elapsed: 36.365 sec
Running org.apache.hadoop.hbase.rest.model.TestVersionModel
Tests run: 3, Failures: 0, Errors: 0, Skipped: 0, Time elapsed: 0.127 sec
Running org.apache.hadoop.hbase.rest.model.TestCellSetModel
Tests run: 3, Failures: 0, Errors: 0, Skipped: 0, Time elapsed: 0.134 sec
Running org.apache.hadoop.hbase.rest.model.TestStorageClusterStatusModel
Tests run: 3, Failures: 0, Errors: 0, Skipped: 0, Time elapsed: 0.133 sec
Running org.apache.hadoop.hbase.rest.client.TestRemoteTable
Tests run: 3, Failures: 0, Errors: 0, Skipped: 0, Time elapsed: 15.994 sec
Running org.apache.hadoop.hbase.avro.TestAvroServer
Tests run: 3, Failures: 0, Errors: 3, Skipped: 0, Time elapsed: 14.064 sec <<< FAILURE!
Running org.apache.hadoop.hbase.TestFullLogReconstruction
Tests run: 1, Failures: 0, Errors: 0, Skipped: 0, Time elapsed: 52.751 sec
Running org.apache.hadoop.hbase.TestSerialization
Tests run: 19, Failures: 0, Errors: 0, Skipped: 0, Time elapsed: 0.059 sec
Running org.apache.hadoop.hbase.regionserver.TestKeyValueHeap
Tests run: 3, Failures: 0, Errors: 0, Skipped: 0, Time elapsed: 0.066 sec
Running org.apache.hadoop.hbase.regionserver.TestStoreScanner
Tests run: 14, Failures: 0, Errors: 0, Skipped: 0, Time elapsed: 0.032 sec
Running org.apache.hadoop.hbase.TestHMsg
Tests run: 2, Failures: 0, Errors: 0, Skipped: 0, Time elapsed: 0.023 sec
Running org.apache.hadoop.hbase.io.hfile.TestReseekTo
Tests run: 1, Failures: 0, Errors: 0, Skipped: 0, Time elapsed: 0.173 sec
Running org.apache.hadoop.hbase.mapreduce.TestLoadIncrementalHFilesSplitRecovery
Tests run: 4, Failures: 0, Errors: 0, Skipped: 0, Time elapsed: 26.077 sec
Running org.apache.hadoop.hbase.regionserver.TestScanner
Tests run: 6, Failures: 0, Errors: 0, Skipped: 0, Time elapsed: 46.109 sec
Running org.apache.hadoop.hbase.regionserver.TestHRegionInfo
Tests run: 3, Failures: 0, Errors: 0, Skipped: 0, Time elapsed: 0.018 sec
Running org.apache.hadoop.hbase.util.TestKeying
Tests run: 1, Failures: 0, Errors: 0, Skipped: 0, Time elapsed: 0.016 sec
Running org.apache.hadoop.hbase.util.TestIncrementingEnvironmentEdge
Tests run: 1, Failures: 0, Errors: 0, Skipped: 0, Time elapsed: 0.017 sec
Running org.apache.hadoop.hbase.util.TestHBaseFsck
Tests run: 20, Failures: 0, Errors: 0, Skipped: 0, Time elapsed: 149.147 sec
Running org.apache.hadoop.hbase.client.TestShell
Tests run: 1, Failures: 0, Errors: 0, Skipped: 0, Time elapsed: 33.213 sec
Running org.apache.hadoop.hbase.master.TestRestartCluster
Tests run: 2, Failures: 0, Errors: 0, Skipped: 0, Time elapsed: 38.816 sec
Running org.apache.hadoop.hbase.rest.model.TestTableInfoModel
Tests run: 3, Failures: 0, Errors: 0, Skipped: 0, Time elapsed: 0.129 sec
Running org.apache.hadoop.hbase.TestInfoServers
Tests run: 1, Failures: 0, Errors: 0, Skipped: 0, Time elapsed: 16.431 sec
Running org.apache.hadoop.hbase.regionserver.TestMasterAddressManager
Tests run: 1, Failures: 0, Errors: 0, Skipped: 0, Time elapsed: 0.206 sec
Running org.apache.hadoop.hbase.master.TestLogsCleaner
Tests run: 1, Failures: 0, Errors: 0, Skipped: 0, Time elapsed: 0.549 sec
Running org.apache.hadoop.hbase.catalog.TestCatalogTrackerOnCluster
Tests run: 1, Failures: 0, Errors: 0, Skipped: 0, Time elapsed: 204.795 sec
Running org.apache.hadoop.hbase.regionserver.TestQueryMatcher
Tests run: 4, Failures: 0, Errors: 0, Skipped: 0, Time elapsed: 0.074 sec
Running org.apache.hadoop.hbase.zookeeper.TestZKTable
Tests run: 1, Failures: 0, Errors: 0, Skipped: 0, Time elapsed: 0.216 sec
Running org.apache.hadoop.hbase.client.TestAdmin
Tests run: 24, Failures: 0, Errors: 0, Skipped: 0, Time elapsed: 206.899 sec
Running org.apache.hadoop.hbase.regionserver.TestPriorityCompactionQueue
Tests run: 1, Failures: 0, Errors: 0, Skipped: 0, Time elapsed: 1.117 sec
Running org.apache.hadoop.hbase.util.TestMergeTool
Tests run: 1, Failures: 0, Errors: 0, Skipped: 0, Time elapsed: 14.283 sec
Running org.apache.hadoop.hbase.TestAcidGuarantees
Tests run: 3, Failures: 0, Errors: 0, Skipped: 3, Time elapsed: 0.015 sec
Running org.apache.hadoop.hbase.util.TestBase64
Tests run: 1, Failures: 0, Errors: 0, Skipped: 0, Time elapsed: 0.018 sec
Running org.apache.hadoop.hbase.regionserver.TestMemStore
Tests run: 21, Failures: 0, Errors: 0, Skipped: 0, Time elapsed: 58.56 sec
Running org.apache.hadoop.hbase.rest.TestScannerResource
Tests run: 5, Failures: 0, Errors: 0, Skipped: 0, Time elapsed: 37.235 sec
Running org.apache.hadoop.hbase.io.hfile.TestLruBlockCache
Tests run: 7, Failures: 0, Errors: 0, Skipped: 0, Time elapsed: 1.056 sec
Running org.apache.hadoop.hbase.master.TestDeadServer
Tests run: 1, Failures: 0, Errors: 0, Skipped: 0, Time elapsed: 0.019 sec
Running org.apache.hadoop.hbase.rest.TestGzipFilter
Tests run: 3, Failures: 0, Errors: 0, Skipped: 0, Time elapsed: 19.162 sec
Running org.apache.hadoop.hbase.mapreduce.TestTableMapReduce
Tests run: 2, Failures: 0, Errors: 0, Skipped: 0, Time elapsed: 110.986 sec
Running org.apache.hadoop.hbase.TestKeyValue
Tests run: 14, Failures: 0, Errors: 0, Skipped: 0, Time elapsed: 0.029 sec
Running org.apache.hadoop.hbase.client.TestMultiParallel
Tests run: 10, Failures: 0, Errors: 0, Skipped: 0, Time elapsed: 23.151 sec
Running org.apache.hadoop.hbase.master.TestMaster
Tests run: 1, Failures: 0, Errors: 0, Skipped: 0, Time elapsed: 75.87 sec
Running org.apache.hadoop.hbase.client.TestResult
Tests run: 3, Failures: 0, Errors: 0, Skipped: 0, Time elapsed: 0.04 sec
Running org.apache.hadoop.hbase.master.TestRollingRestart
Tests run: 1, Failures: 0, Errors: 0, Skipped: 0, Time elapsed: 53.132 sec
Running org.apache.hadoop.hbase.client.TestHTablePool
Tests run: 5, Failures: 0, Errors: 0, Skipped: 0, Time elapsed: 18.751 sec
Running org.apache.hadoop.hbase.master.TestOpenedRegionHandler
Tests run: 2, Failures: 0, Errors: 0, Skipped: 0, Time elapsed: 18.785 sec
Running org.apache.hadoop.hbase.util.TestByteBloomFilter
Tests run: 3, Failures: 0, Errors: 0, Skipped: 0, Time elapsed: 1.586 sec
Running org.apache.hadoop.hbase.rest.model.TestTableSchemaModel
Tests run: 3, Failures: 0, Errors: 0, Skipped: 0, Time elapsed: 0.135 sec
Running org.apache.hadoop.hbase.mapreduce.TestTableInputFormatScan
Tests run: 11, Failures: 0, Errors: 0, Skipped: 0, Time elapsed: 313.93 sec
Running org.apache.hadoop.hbase.filter.TestFilterList
Tests run: 4, Failures: 0, Errors: 0, Skipped: 0, Time elapsed: 0.044 sec
Running org.apache.hadoop.hbase.regionserver.TestHRegion
Tests run: 54, Failures: 0, Errors: 0, Skipped: 0, Time elapsed: 19.708 sec
Running org.apache.hadoop.hbase.master.TestMasterFailover
Tests run: 4, Failures: 0, Errors: 0, Skipped: 0, Time elapsed: 71.412 sec
Running org.apache.hadoop.hbase.rest.model.TestTableRegionModel
Tests run: 4, Failures: 0, Errors: 0, Skipped: 0, Time elapsed: 0.034 sec
Running org.apache.hadoop.hbase.client.TestTimestampsFilter
Tests run: 3, Failures: 0, Errors: 0, Skipped: 0, Time elapsed: 28.206 sec
Running org.apache.hadoop.hbase.master.TestLoadBalancer
Tests run: 7, Failures: 0, Errors: 0, Skipped: 0, Time elapsed: 2.201 sec
Running org.apache.hadoop.hbase.util.TestRootPath
Tests run: 1, Failures: 0, Errors: 0, Skipped: 0, Time elapsed: 0.021 sec
Running org.apache.hadoop.hbase.mapred.TestTableMapReduce
Tests run: 1, Failures: 0, Errors: 0, Skipped: 0, Time elapsed: 30.864 sec
Running org.apache.hadoop.hbase.regionserver.wal.TestWALObserver
Tests run: 1, Failures: 0, Errors: 0, Skipped: 0, Time elapsed: 0.154 sec
Running org.apache.hadoop.hbase.client.TestScannerTimeout
Tests run: 4, Failures: 0, Errors: 0, Skipped: 0, Time elapsed: 50.831 sec
Running org.apache.hadoop.hbase.replication.regionserver.TestReplicationSourceManager
Tests run: 1, Failures: 0, Errors: 0, Skipped: 0, Time elapsed: 0.399 sec
Running org.apache.hadoop.hbase.util.TestBytes
Tests run: 10, Failures: 0, Errors: 0, Skipped: 0, Time elapsed: 0.023 sec
Running org.apache.hadoop.hbase.master.TestActiveMasterManager
Tests run: 2, Failures: 0, Errors: 0, Skipped: 0, Time elapsed: 0.278 sec
Running org.apache.hadoop.hbase.util.TestCompressionTest
Tests run: 1, Failures: 0, Errors: 0, Skipped: 0, Time elapsed: 0.025 sec
Running org.apache.hadoop.hbase.filter.TestDependentColumnFilter
Tests run: 2, Failures: 0, Errors: 0, Skipped: 0, Time elapsed: 0.233 sec
Running org.apache.hadoop.hbase.client.TestGetRowVersions
Tests run: 1, Failures: 0, Errors: 0, Skipped: 0, Time elapsed: 23.427 sec
Running org.apache.hadoop.hbase.rest.model.TestCellModel
Tests run: 3, Failures: 0, Errors: 0, Skipped: 0, Time elapsed: 0.127 sec
Running org.apache.hadoop.hbase.catalog.TestCatalogTracker
Tests run: 8, Failures: 0, Errors: 0, Skipped: 0, Time elapsed: 2.75 sec
Running org.apache.hadoop.hbase.replication.TestReplicationSource
Tests run: 1, Failures: 0, Errors: 0, Skipped: 0, Time elapsed: 3.298 sec
Running org.apache.hadoop.hbase.master.TestCatalogJanitor
Tests run: 2, Failures: 0, Errors: 0, Skipped: 0, Time elapsed: 0.351 sec
Running org.apache.hadoop.hbase.util.TestRegionSplitCalculator
Tests run: 15, Failures: 0, Errors: 0, Skipped: 0, Time elapsed: 0.056 sec
Running org.apache.hadoop.hbase.rest.TestRowResource
Tests run: 11, Failures: 0, Errors: 0, Skipped: 0, Time elapsed: 17.056 sec
Running org.apache.hadoop.hbase.io.hfile.TestHFile
Tests run: 7, Failures: 0, Errors: 0, Skipped: 0, Time elapsed: 0.206 sec
Running org.apache.hadoop.hbase.catalog.TestMetaReaderEditor
Tests run: 4, Failures: 0, Errors: 0, Skipped: 0, Time elapsed: 18.399 sec
Running org.apache.hadoop.hbase.mapreduce.TestImportTsv
Tests run: 7, Failures: 0, Errors: 0, Skipped: 0, Time elapsed: 15.681 sec
Running org.apache.hadoop.hbase.util.TestStrings
Tests run: 1, Failures: 0, Errors: 0, Skipped: 0, Time elapsed: 0.016 sec
Running org.apache.hadoop.hbase.util.TestHBaseFsckComparator
Tests run: 7, Failures: 0, Errors: 0, Skipped: 0, Time elapsed: 0.164 sec
Running org.apache.hadoop.hbase.rest.client.TestRemoteAdmin
Tests run: 2, Failures: 0, Errors: 0, Skipped: 0, Time elapsed: 21.875 sec
Running org.apache.hadoop.hbase.regionserver.wal.TestHLog
Tests run: 8, Failures: 0, Errors: 0, Skipped: 0, Time elapsed: 83.492 sec
Running org.apache.hadoop.hbase.client.TestTimestamp
Tests run: 1, Failures: 0, Errors: 0, Skipped: 0, Time elapsed: 13.353 sec
Running org.apache.hadoop.hbase.TestScanMultipleVersions
Tests run: 1, Failures: 0, Errors: 0, Skipped: 0, Time elapsed: 16.103 sec
Running org.apache.hadoop.hbase.rest.model.TestStorageClusterVersionModel
Tests run: 2, Failures: 0, Errors: 0, Skipped: 0, Time elapsed: 0.031 sec
Running org.apache.hadoop.hbase.client.TestHCM
Tests run: 4, Failures: 0, Errors: 0, Skipped: 0, Time elapsed: 27.407 sec

Results :

Tests in error:

Tests run: 732, Failures: 0, Errors: 3, Skipped: 9

[INFO] ------------------------------------------------------------------------
[INFO] BUILD FAILURE
[INFO] ------------------------------------------------------------------------
[INFO] Total time: 1:17:04.738s
[INFO] Finished at: Tue Jul 17 22:34:46 UTC 2012
[INFO] Final Memory: 31M/253M
[INFO] ------------------------------------------------------------------------
[ERROR] Failed to execute goal org.apache.maven.plugins:maven-surefire-plugin:2.4.3:test (default-test) on project hbase: There are test failures.
[ERROR]
[ERROR] Please refer to <https://builds.apache.org/job/hbase-0.90/ws/trunk/target/surefire-reports> for the individual test results.
[ERROR] -> [Help 1]
[ERROR]
[ERROR] To see the full stack trace of the errors, re-run Maven with the -e switch.
[ERROR] Re-run Maven using the -X switch to enable full debug logging.
[ERROR]
[ERROR] For more information about the errors and possible solutions, please read the following articles:
[ERROR] [Help 1] http://cwiki.apache.org/confluence/display/MAVEN/MojoFailureException
Build step 'Invoke top-level Maven targets' marked build as failure
[locks-and-latches] Releasing all the locks
[locks-and-latches] All the locks released
Archiving artifacts
Recording test results

Search Discussions

  • Apache Jenkins Server at Jul 17, 2012 at 10:52 pm
    See <https://builds.apache.org/job/hbase-0.90/517/changes>

    Changes:

    [jmhsieh] HBASE-6379 [0.90 branch] Backport HBASE-6334 to 0.90 (TestImprovement for TestHRegion.testWritesWhileGetting) (Gregory Chanan)

    [jmhsieh] HBASE-6385 [0.90 branch] Backport HBASE-4195 (possible inconsistency in a memstore read after a reseek, possible performacne improvement) to 0.90 (Gregory Chanan)

    ------------------------------------------
    [...truncated 888 lines...]
    A src/main/resources/org/apache/hadoop/hbase/rest/protobuf/CellSetMessage.proto
    A src/main/resources/org/apache/hadoop/hbase/rest/protobuf/ColumnSchemaMessage.proto
    A src/main/resources/org/apache/hadoop/hbase/rest/protobuf/CellMessage.proto
    A src/main/resources/org/apache/hadoop/hbase/rest/protobuf/TableInfoMessage.proto
    A src/main/resources/org/apache/hadoop/hbase/rest/protobuf/TableListMessage.proto
    A src/main/resources/org/apache/hadoop/hbase/rest/protobuf/VersionMessage.proto
    A src/main/resources/org/apache/hadoop/hbase/rest/XMLSchema.xsd
    A src/main/xslt
    A src/main/xslt/configuration_to_docbook_section.xsl
    A src/site
    A src/site/site.xml
    A src/site/site.vm
    A src/site/resources
    A src/site/resources/images
    AU src/site/resources/images/replication_overview.png
    AU src/site/resources/images/asf_logo_wide.png
    AU src/site/resources/images/architecture.gif
    AU src/site/resources/images/hadoop-logo.jpg
    AU src/site/resources/images/hbase_logo_med.gif
    AU src/site/resources/images/favicon.ico
    AU src/site/resources/images/hbase_small.gif
    A src/site/resources/css
    A src/site/resources/css/freebsd_docbook.css
    A src/site/resources/css/site.css
    A src/site/xdoc
    A src/site/xdoc/cygwin.xml
    A src/site/xdoc/acid-semantics.xml
    A src/site/xdoc/metrics.xml
    A src/site/xdoc/index.xml
    A src/site/xdoc/replication.xml
    A src/site/xdoc/old_news.xml
    A src/site/xdoc/bulk-loads.xml
    A src/site/xdoc/pseudo-distributed.xml
    A src/docbkx
    A src/docbkx/upgrading.xml
    A src/docbkx/performance.xml
    A src/docbkx/developer.xml
    A src/docbkx/preface.xml
    A src/docbkx/configuration.xml
    A src/docbkx/getting_started.xml
    A src/docbkx/shell.xml
    A src/docbkx/troubleshooting.xml
    A src/docbkx/book.xml
    A src/docbkx/build.xml
    AU src/saveVersion.sh
    A src/examples
    A src/examples/thrift
    A src/examples/thrift/DemoClient.java
    A src/examples/thrift/DemoClient.cpp
    A src/examples/thrift/DemoClient.rb
    A src/examples/thrift/DemoClient.php
    AU src/examples/thrift/DemoClient.py
    A src/examples/thrift/README.txt
    A src/examples/thrift/Makefile
    A src/examples/mapreduce
    A src/examples/mapreduce/org
    A src/examples/mapreduce/org/apache
    A src/examples/mapreduce/org/apache/hadoop
    A src/examples/mapreduce/org/apache/hadoop/hbase
    A src/examples/mapreduce/org/apache/hadoop/hbase/mapreduce
    A src/examples/mapreduce/org/apache/hadoop/hbase/mapreduce/SampleUploader.java
    A src/examples/mapreduce/org/apache/hadoop/hbase/mapreduce/IndexBuilder.java
    A src/examples/mapreduce/index-builder-setup.rb
    A src/examples/README.txt
    A bin
    AU bin/hbase-daemons.sh
    A bin/rename_table.rb
    AU bin/hbase
    A bin/copy_table.rb
    A bin/check_meta.rb
    AU bin/start-hbase.sh
    A bin/hirb.rb
    A bin/set_meta_block_caching.rb
    A bin/loadtable.rb
    AU bin/hbase-daemon.sh
    A bin/region_mover.rb
    A bin/hbase-config.sh
    A bin/local-regionservers.sh
    AU bin/zookeepers.sh
    A bin/local-master-backup.sh
    A bin/add_table.rb
    AU bin/rolling-restart.sh
    AU bin/regionservers.sh
    A bin/graceful_stop.sh
    AU bin/master-backup.sh
    A bin/set_meta_memstore_size.rb
    A bin/replication
    A bin/replication/copy_tables_desc.rb
    AU bin/stop-hbase.sh
    A pom.xml
    A README.txt
    U .
    At revision 1362692
    [locks-and-latches] Checking to see if we really have the locks
    [locks-and-latches] Have all the locks, build can start
    [hbase-0.90] $ /bin/bash -xe /tmp/hudson7216776377539614997.sh
    + hostname
    juno
    + ulimit -a
    core file size (blocks, -c) 0
    data seg size (kbytes, -d) unlimited
    scheduling priority (-e) 0
    file size (blocks, -f) unlimited
    pending signals (-i) 128588
    max locked memory (kbytes, -l) 64
    max memory size (kbytes, -m) unlimited
    open files (-n) 40000
    pipe size (512 bytes, -p) 8
    POSIX message queues (bytes, -q) 819200
    real-time priority (-r) 0
    stack size (kbytes, -s) 10240
    cpu time (seconds, -t) unlimited
    max user processes (-u) 128588
    virtual memory (kbytes, -v) unlimited
    file locks (-x) unlimited
    + jps
    1896 MRAppMaster
    2463 Jps
    20825 jar
    [trunk] $ /home/hudson/tools/maven/latest3/bin/mvn clean -Dmaven.test.redirectTestOutputToFile=true site assembly:assembly
    [INFO] Scanning for projects...
    [INFO]
    [INFO] ------------------------------------------------------------------------
    [INFO] Building HBase 0.90.7
    [INFO] ------------------------------------------------------------------------
    [INFO]
    [INFO] --- maven-clean-plugin:2.4.1:clean (default-clean) @ hbase ---
    [INFO]
    [INFO] --- xml-maven-plugin:1.0-beta-3:transform (default) @ hbase ---
    [INFO] Transforming file: <https://builds.apache.org/job/hbase-0.90/ws/trunk/src/main/resources/hbase-default.xml>
    [INFO] Transformed 1 file(s).
    [INFO]
    [INFO] --- docbkx-maven-plugin:2.0.11:generate-html (default) @ hbase ---
    [INFO] Processing input file: troubleshooting.xml
    [INFO] <https://builds.apache.org/job/hbase-0.90/517/artifact/trunk/target/site/troubleshooting.html> has been generated.
    [INFO] Processing input file: upgrading.xml
    [INFO] <https://builds.apache.org/job/hbase-0.90/517/artifact/trunk/target/site/upgrading.html> has been generated.
    [INFO] Processing input file: getting_started.xml
    [INFO] <https://builds.apache.org/job/hbase-0.90/517/artifact/trunk/target/site/getting_started.html> has been generated.
    [INFO] Processing input file: configuration.xml
    [INFO] <https://builds.apache.org/job/hbase-0.90/517/artifact/trunk/target/site/configuration.html> has been generated.
    [INFO] Processing input file: build.xml
    [INFO] <https://builds.apache.org/job/hbase-0.90/517/artifact/trunk/target/site/build.html> has been generated.
    [INFO] Processing input file: performance.xml
    [INFO] <https://builds.apache.org/job/hbase-0.90/517/artifact/trunk/target/site/performance.html> has been generated.
    [INFO] Processing input file: shell.xml
    [INFO] <https://builds.apache.org/job/hbase-0.90/517/artifact/trunk/target/site/shell.html> has been generated.
    [INFO] Processing input file: developer.xml
    [INFO] <https://builds.apache.org/job/hbase-0.90/517/artifact/trunk/target/site/developer.html> has been generated.
    [INFO] Processing input file: preface.xml
    [INFO] <https://builds.apache.org/job/hbase-0.90/517/artifact/trunk/target/site/preface.html> has been generated.
    [INFO] Processing input file: book.xml
    [INFO] <https://builds.apache.org/job/hbase-0.90/517/artifact/trunk/target/site/book.html> has been generated.
    [INFO]
    [INFO] --- maven-site-plugin:2.0.1:site (default-site) @ hbase ---
    [INFO] Unable to load parent project from a relative path: 1 problem was encountered while building the effective model
    [FATAL] Non-readable POM <https://builds.apache.org/job/hbase-0.90/ws/pom.xml>: <https://builds.apache.org/job/hbase-0.90/ws/pom.xml> (No such file or directory) @
    for project at <https://builds.apache.org/job/hbase-0.90/ws/pom.xml> for project at <https://builds.apache.org/job/hbase-0.90/ws/pom.xml>
    [INFO] Parent project loaded from repository.
    [INFO] Unable to load parent project from a relative path: 1 problem was encountered while building the effective model
    [FATAL] Non-readable POM <https://builds.apache.org/job/hbase-0.90/ws/pom.xml>: <https://builds.apache.org/job/hbase-0.90/ws/pom.xml> (No such file or directory) @
    for project at <https://builds.apache.org/job/hbase-0.90/ws/pom.xml> for project at <https://builds.apache.org/job/hbase-0.90/ws/pom.xml>
    [INFO] Parent project loaded from repository.
    [INFO]
    [INFO] ------------------------------------------------------------------------
    [INFO] Building HBase 0.90.7
    [INFO] ------------------------------------------------------------------------
    [INFO]
    [INFO] >>> maven-assembly-plugin:2.2-beta-5:assembly (default-cli) @ hbase >>>
    [INFO]
    [INFO] --- maven-antrun-plugin:1.3:run (generate) @ hbase ---
    [INFO] Executing tasks
    [mkdir] Created dir: <https://builds.apache.org/job/hbase-0.90/ws/trunk/target/hbase-webapps>
    [copy] Copying 4 files to <https://builds.apache.org/job/hbase-0.90/ws/trunk/target/hbase-webapps>
    SLF4J: Failed to load class "org.slf4j.impl.StaticLoggerBinder".
    SLF4J: See http://www.slf4j.org/codes.html#StaticLoggerBinder for further details.
    2012-07-17 22:35:34.701:INFO::Logging to STDERR via org.mortbay.log.StdErrLog
    [mkdir] Created dir: <https://builds.apache.org/job/hbase-0.90/ws/trunk/target/hbase-webapps/master/WEB-INF>
    [mkdir] Created dir: <https://builds.apache.org/job/hbase-0.90/ws/trunk/target/hbase-webapps/regionserver/WEB-INF>
    [INFO] Executed tasks
    [INFO]
    [INFO] --- build-helper-maven-plugin:1.5:add-source (add-jspc-source) @ hbase ---
    [INFO] Source directory: <https://builds.apache.org/job/hbase-0.90/ws/trunk/target/jspc> added.
    [INFO]
    [INFO] --- build-helper-maven-plugin:1.5:add-source (add-package-info) @ hbase ---
    [INFO] Source directory: <https://builds.apache.org/job/hbase-0.90/ws/trunk/target/generated-sources> added.
    [INFO]
    [INFO] --- maven-remote-resources-plugin:1.1:process (default) @ hbase ---
    [INFO] Setting property: classpath.resource.loader.class => 'org.codehaus.plexus.velocity.ContextClassLoaderResourceLoader'.
    [INFO] Setting property: velocimacro.messages.on => 'false'.
    [INFO] Setting property: resource.loader => 'classpath'.
    [INFO] Setting property: resource.manager.logwhenfound => 'false'.
    [INFO]
    [INFO] --- maven-resources-plugin:2.4:resources (default-resources) @ hbase ---
    [INFO] Using 'UTF-8' encoding to copy filtered resources.
    [INFO] Copying 1 resource
    [INFO] Copying 6 resources
    [INFO] Copying 3 resources
    [INFO]
    [INFO] --- maven-antrun-plugin:1.3:run (default) @ hbase ---
    [INFO] Executing tasks
    [INFO] Executed tasks
    [INFO]
    [INFO] --- maven-compiler-plugin:2.0.2:compile (default-compile) @ hbase ---
    [INFO] Compiling 470 source files to <https://builds.apache.org/job/hbase-0.90/ws/trunk/target/classes>
    [INFO]
    [INFO] --- maven-resources-plugin:2.4:testResources (default-testResources) @ hbase ---
    [INFO] Using 'UTF-8' encoding to copy filtered resources.
    [INFO] Copying 4 resources
    [INFO] Copying 3 resources
    [INFO]
    [INFO] --- maven-compiler-plugin:2.0.2:testCompile (default-testCompile) @ hbase ---
    [INFO] Compiling 203 source files to <https://builds.apache.org/job/hbase-0.90/ws/trunk/target/test-classes>
    [INFO]
    [INFO] --- maven-surefire-plugin:2.4.3:test (default-test) @ hbase ---
    [INFO] Surefire report directory: <https://builds.apache.org/job/hbase-0.90/ws/trunk/target/surefire-reports>

    -------------------------------------------------------
    T E S T S
    -------------------------------------------------------
    Running org.apache.hadoop.hbase.regionserver.TestColumnSeeking
    Tests run: 2, Failures: 0, Errors: 0, Skipped: 0, Time elapsed: 7.832 sec
    Running org.apache.hadoop.hbase.master.TestHMasterRPCException
    Tests run: 1, Failures: 0, Errors: 0, Skipped: 0, Time elapsed: 0.291 sec
    Running org.apache.hadoop.hbase.regionserver.TestMemStoreLAB
    Tests run: 3, Failures: 0, Errors: 0, Skipped: 0, Time elapsed: 1.166 sec
    Running org.apache.hadoop.hbase.client.TestMultipleTimestamps
    Tests run: 8, Failures: 0, Errors: 0, Skipped: 0, Time elapsed: 52.449 sec
    Running org.apache.hadoop.hbase.regionserver.wal.TestLogRolling
    killed.
    [INFO] ------------------------------------------------------------------------
    [INFO] BUILD FAILURE
    [INFO] ------------------------------------------------------------------------
    [INFO] Total time: 16:48.835s
    [INFO] Finished at: Tue Jul 17 22:52:03 UTC 2012
    [INFO] Final Memory: 47M/757M
    [INFO] ------------------------------------------------------------------------
    [ERROR] Failed to execute goal org.apache.maven.plugins:maven-surefire-plugin:2.4.3:test (default-test) on project hbase: Error while executing forked tests.; nested exception is org.apache.maven.surefire.booter.shade.org.codehaus.plexus.util.cli.CommandLineException: Error while executing external command, process killed. Process timeout out after 900 seconds -> [Help 1]
    [ERROR]
    [ERROR] To see the full stack trace of the errors, re-run Maven with the -e switch.
    [ERROR] Re-run Maven using the -X switch to enable full debug logging.
    [ERROR]
    [ERROR] For more information about the errors and possible solutions, please read the following articles:
    [ERROR] [Help 1] http://cwiki.apache.org/confluence/display/MAVEN/MojoExecutionException
    Build step 'Invoke top-level Maven targets' marked build as failure
    [locks-and-latches] Releasing all the locks
    [locks-and-latches] All the locks released
    Archiving artifacts
    Recording test results
  • Apache Jenkins Server at Jul 19, 2012 at 2:36 am
    See <https://builds.apache.org/job/hbase-0.90/518/changes>

    Changes:

    [jxiang] HBASE-6392 UnknownRegionException blocks hbck from sideline big overlap regions

    ------------------------------------------
    [...truncated 900 lines...]
    A src/site/site.xml
    A src/site/site.vm
    A src/site/resources
    A src/site/resources/images
    AU src/site/resources/images/replication_overview.png
    AU src/site/resources/images/asf_logo_wide.png
    AU src/site/resources/images/architecture.gif
    AU src/site/resources/images/hadoop-logo.jpg
    AU src/site/resources/images/hbase_logo_med.gif
    AU src/site/resources/images/favicon.ico
    AU src/site/resources/images/hbase_small.gif
    A src/site/resources/css
    A src/site/resources/css/freebsd_docbook.css
    A src/site/resources/css/site.css
    A src/site/xdoc
    A src/site/xdoc/cygwin.xml
    A src/site/xdoc/acid-semantics.xml
    A src/site/xdoc/metrics.xml
    A src/site/xdoc/index.xml
    A src/site/xdoc/replication.xml
    A src/site/xdoc/old_news.xml
    A src/site/xdoc/bulk-loads.xml
    A src/site/xdoc/pseudo-distributed.xml
    A src/docbkx
    A src/docbkx/upgrading.xml
    A src/docbkx/performance.xml
    A src/docbkx/developer.xml
    A src/docbkx/preface.xml
    A src/docbkx/configuration.xml
    A src/docbkx/getting_started.xml
    A src/docbkx/shell.xml
    A src/docbkx/troubleshooting.xml
    A src/docbkx/book.xml
    A src/docbkx/build.xml
    AU src/saveVersion.sh
    A src/examples
    A src/examples/thrift
    A src/examples/thrift/DemoClient.java
    A src/examples/thrift/DemoClient.cpp
    A src/examples/thrift/DemoClient.rb
    A src/examples/thrift/DemoClient.php
    AU src/examples/thrift/DemoClient.py
    A src/examples/thrift/README.txt
    A src/examples/thrift/Makefile
    A src/examples/mapreduce
    A src/examples/mapreduce/org
    A src/examples/mapreduce/org/apache
    A src/examples/mapreduce/org/apache/hadoop
    A src/examples/mapreduce/org/apache/hadoop/hbase
    A src/examples/mapreduce/org/apache/hadoop/hbase/mapreduce
    A src/examples/mapreduce/org/apache/hadoop/hbase/mapreduce/SampleUploader.java
    A src/examples/mapreduce/org/apache/hadoop/hbase/mapreduce/IndexBuilder.java
    A src/examples/mapreduce/index-builder-setup.rb
    A src/examples/README.txt
    A bin
    AU bin/hbase-daemons.sh
    A bin/rename_table.rb
    AU bin/hbase
    A bin/copy_table.rb
    A bin/check_meta.rb
    AU bin/start-hbase.sh
    A bin/hirb.rb
    A bin/set_meta_block_caching.rb
    A bin/loadtable.rb
    AU bin/hbase-daemon.sh
    A bin/region_mover.rb
    A bin/hbase-config.sh
    A bin/local-regionservers.sh
    AU bin/zookeepers.sh
    A bin/local-master-backup.sh
    A bin/add_table.rb
    AU bin/rolling-restart.sh
    AU bin/regionservers.sh
    A bin/graceful_stop.sh
    AU bin/master-backup.sh
    A bin/set_meta_memstore_size.rb
    A bin/replication
    A bin/replication/copy_tables_desc.rb
    AU bin/stop-hbase.sh
    A pom.xml
    A README.txt
    U .
    At revision 1363206
    [hbase-0.90] $ /bin/bash -xe /tmp/hudson4384385961022870145.sh
    + hostname
    hemera
    + ulimit -a
    core file size (blocks, -c) 0
    data seg size (kbytes, -d) unlimited
    scheduling priority (-e) 0
    file size (blocks, -f) unlimited
    pending signals (-i) 193125
    max locked memory (kbytes, -l) 64
    max memory size (kbytes, -m) unlimited
    open files (-n) 40000
    pipe size (512 bytes, -p) 8
    POSIX message queues (bytes, -q) 819200
    real-time priority (-r) 0
    stack size (kbytes, -s) 10240
    cpu time (seconds, -t) unlimited
    max user processes (-u) 193125
    virtual memory (kbytes, -v) unlimited
    file locks (-x) unlimited
    + jps
    31452 jar
    18502 Main
    13962 Jps
    13826 ForkedBooter
    [trunk] $ /home/hudson/tools/maven/latest3/bin/mvn clean -Dmaven.test.redirectTestOutputToFile=true site assembly:assembly
    [INFO] Scanning for projects...
    [INFO]
    [INFO] ------------------------------------------------------------------------
    [INFO] Building HBase 0.90.7
    [INFO] ------------------------------------------------------------------------
    [INFO]
    [INFO] --- maven-clean-plugin:2.4.1:clean (default-clean) @ hbase ---
    [INFO]
    [INFO] --- xml-maven-plugin:1.0-beta-3:transform (default) @ hbase ---
    [INFO] Transforming file: /x1/jenkins/jenkins-slave/workspace/hbase-0.90/trunk/src/main/resources/hbase-default.xml
    [INFO] Transformed 1 file(s).
    [INFO]
    [INFO] --- docbkx-maven-plugin:2.0.11:generate-html (default) @ hbase ---
    [INFO] Processing input file: upgrading.xml
    [INFO] /x1/jenkins/jenkins-slave/workspace/hbase-0.90/trunk/target/site/upgrading.html has been generated.
    [INFO] Processing input file: shell.xml
    [INFO] /x1/jenkins/jenkins-slave/workspace/hbase-0.90/trunk/target/site/shell.html has been generated.
    [INFO] Processing input file: configuration.xml
    [INFO] /x1/jenkins/jenkins-slave/workspace/hbase-0.90/trunk/target/site/configuration.html has been generated.
    [INFO] Processing input file: getting_started.xml
    [INFO] /x1/jenkins/jenkins-slave/workspace/hbase-0.90/trunk/target/site/getting_started.html has been generated.
    [INFO] Processing input file: troubleshooting.xml
    [INFO] /x1/jenkins/jenkins-slave/workspace/hbase-0.90/trunk/target/site/troubleshooting.html has been generated.
    [INFO] Processing input file: build.xml
    [INFO] /x1/jenkins/jenkins-slave/workspace/hbase-0.90/trunk/target/site/build.html has been generated.
    [INFO] Processing input file: performance.xml
    [INFO] /x1/jenkins/jenkins-slave/workspace/hbase-0.90/trunk/target/site/performance.html has been generated.
    [INFO] Processing input file: developer.xml
    [INFO] /x1/jenkins/jenkins-slave/workspace/hbase-0.90/trunk/target/site/developer.html has been generated.
    [INFO] Processing input file: book.xml
    [INFO] /x1/jenkins/jenkins-slave/workspace/hbase-0.90/trunk/target/site/book.html has been generated.
    [INFO] /x1/jenkins/jenkins-slave/workspace/hbase-0.90/trunk/target/site/preface.html is up to date.
    [INFO]
    [INFO] --- maven-site-plugin:2.0.1:site (default-site) @ hbase ---
    [INFO] Unable to load parent project from a relative path: 1 problem was encountered while building the effective model
    [FATAL] Non-readable POM /x1/jenkins/jenkins-slave/workspace/hbase-0.90/pom.xml: /x1/jenkins/jenkins-slave/workspace/hbase-0.90/pom.xml (No such file or directory) @
    for project at /x1/jenkins/jenkins-slave/workspace/hbase-0.90/pom.xml for project at /x1/jenkins/jenkins-slave/workspace/hbase-0.90/pom.xml
    [INFO] Parent project loaded from repository.
    [INFO] Unable to load parent project from a relative path: 1 problem was encountered while building the effective model
    [FATAL] Non-readable POM /x1/jenkins/jenkins-slave/workspace/hbase-0.90/pom.xml: /x1/jenkins/jenkins-slave/workspace/hbase-0.90/pom.xml (No such file or directory) @
    for project at /x1/jenkins/jenkins-slave/workspace/hbase-0.90/pom.xml for project at /x1/jenkins/jenkins-slave/workspace/hbase-0.90/pom.xml
    [INFO] Parent project loaded from repository.
    Downloading: http://repository.codehaus.org/org/apache/maven/skins/maven-stylus-skin/maven-metadata.xml
    Downloading: http://repo1.maven.org/maven2/org/apache/maven/skins/maven-stylus-skin/maven-metadata.xml
    Downloading: http://download.java.net/maven/2/org/apache/maven/skins/maven-stylus-skin/maven-metadata.xml
    Downloading: http://people.apache.org/~rawson/repo/org/apache/maven/skins/maven-stylus-skin/maven-metadata.xml

    487 B



    Downloaded: http://repo1.maven.org/maven2/org/apache/maven/skins/maven-stylus-skin/maven-metadata.xml (487 B at 0.8 KB/sec)
    [INFO]
    [INFO] ------------------------------------------------------------------------
    [INFO] Building HBase 0.90.7
    [INFO] ------------------------------------------------------------------------
    [INFO]
    [INFO] >>> maven-assembly-plugin:2.2-beta-5:assembly (default-cli) @ hbase >>>
    [INFO]
    [INFO] --- maven-antrun-plugin:1.3:run (generate) @ hbase ---
    [INFO] Executing tasks
    [mkdir] Created dir: /x1/jenkins/jenkins-slave/workspace/hbase-0.90/trunk/target/hbase-webapps
    [copy] Copying 4 files to /x1/jenkins/jenkins-slave/workspace/hbase-0.90/trunk/target/hbase-webapps
    SLF4J: Failed to load class "org.slf4j.impl.StaticLoggerBinder".
    SLF4J: See http://www.slf4j.org/codes.html#StaticLoggerBinder for further details.
    2012-07-19 02:17:04.404:INFO::Logging to STDERR via org.mortbay.log.StdErrLog
    [mkdir] Created dir: /x1/jenkins/jenkins-slave/workspace/hbase-0.90/trunk/target/hbase-webapps/master/WEB-INF
    [mkdir] Created dir: /x1/jenkins/jenkins-slave/workspace/hbase-0.90/trunk/target/hbase-webapps/regionserver/WEB-INF
    [INFO] Executed tasks
    [INFO]
    [INFO] --- build-helper-maven-plugin:1.5:add-source (add-jspc-source) @ hbase ---
    [INFO] Source directory: /x1/jenkins/jenkins-slave/workspace/hbase-0.90/trunk/target/jspc added.
    [INFO]
    [INFO] --- build-helper-maven-plugin:1.5:add-source (add-package-info) @ hbase ---
    [INFO] Source directory: /x1/jenkins/jenkins-slave/workspace/hbase-0.90/trunk/target/generated-sources added.
    [INFO]
    [INFO] --- maven-remote-resources-plugin:1.1:process (default) @ hbase ---
    [INFO] Setting property: classpath.resource.loader.class => 'org.codehaus.plexus.velocity.ContextClassLoaderResourceLoader'.
    [INFO] Setting property: velocimacro.messages.on => 'false'.
    [INFO] Setting property: resource.loader => 'classpath'.
    [INFO] Setting property: resource.manager.logwhenfound => 'false'.
    [INFO]
    [INFO] --- maven-resources-plugin:2.4:resources (default-resources) @ hbase ---
    [INFO] Using 'UTF-8' encoding to copy filtered resources.
    [INFO] Copying 1 resource
    [INFO] Copying 6 resources
    [INFO] Copying 3 resources
    [INFO]
    [INFO] --- maven-antrun-plugin:1.3:run (default) @ hbase ---
    [INFO] Executing tasks
    [INFO] Executed tasks
    [INFO]
    [INFO] --- maven-compiler-plugin:2.0.2:compile (default-compile) @ hbase ---
    [INFO] Compiling 470 source files to /x1/jenkins/jenkins-slave/workspace/hbase-0.90/trunk/target/classes
    [INFO]
    [INFO] --- maven-resources-plugin:2.4:testResources (default-testResources) @ hbase ---
    [INFO] Using 'UTF-8' encoding to copy filtered resources.
    [INFO] Copying 4 resources
    [INFO] Copying 3 resources
    [INFO]
    [INFO] --- maven-compiler-plugin:2.0.2:testCompile (default-testCompile) @ hbase ---
    [INFO] Compiling 203 source files to /x1/jenkins/jenkins-slave/workspace/hbase-0.90/trunk/target/test-classes
    [INFO]
    [INFO] --- maven-surefire-plugin:2.4.3:test (default-test) @ hbase ---
    [INFO] Surefire report directory: /x1/jenkins/jenkins-slave/workspace/hbase-0.90/trunk/target/surefire-reports

    -------------------------------------------------------
    T E S T S
    -------------------------------------------------------
    Running org.apache.hadoop.hbase.master.TestHMasterRPCException
    Tests run: 1, Failures: 0, Errors: 0, Skipped: 0, Time elapsed: 0.291 sec
    Running org.apache.hadoop.hbase.regionserver.TestColumnSeeking
    Tests run: 2, Failures: 0, Errors: 0, Skipped: 0, Time elapsed: 3.633 sec
    Running org.apache.hadoop.hbase.client.TestMultipleTimestamps
    Tests run: 8, Failures: 0, Errors: 0, Skipped: 0, Time elapsed: 52.305 sec
    Running org.apache.hadoop.hbase.regionserver.TestMemStoreLAB
    Tests run: 3, Failures: 0, Errors: 0, Skipped: 0, Time elapsed: 1.031 sec
    Running org.apache.hadoop.hbase.TestZooKeeper
    Tests run: 5, Failures: 0, Errors: 0, Skipped: 0, Time elapsed: 58.305 sec
    Running org.apache.hadoop.hbase.regionserver.wal.TestLogRolling
    killed.
    [INFO] ------------------------------------------------------------------------
    [INFO] BUILD FAILURE
    [INFO] ------------------------------------------------------------------------
    [INFO] Total time: 17:32.979s
    [INFO] Finished at: Thu Jul 19 02:34:22 UTC 2012
    [INFO] Final Memory: 43M/616M
    [INFO] ------------------------------------------------------------------------
    [ERROR] Failed to execute goal org.apache.maven.plugins:maven-surefire-plugin:2.4.3:test (default-test) on project hbase: Error while executing forked tests.; nested exception is org.apache.maven.surefire.booter.shade.org.codehaus.plexus.util.cli.CommandLineException: Error while executing external command, process killed. Process timeout out after 900 seconds -> [Help 1]
    [ERROR]
    [ERROR] To see the full stack trace of the errors, re-run Maven with the -e switch.
    [ERROR] Re-run Maven using the -X switch to enable full debug logging.
    [ERROR]
    [ERROR] For more information about the errors and possible solutions, please read the following articles:
    [ERROR] [Help 1] http://cwiki.apache.org/confluence/display/MAVEN/MojoExecutionException
    Build step 'Invoke top-level Maven targets' marked build as failure
    [locks-and-latches] Releasing all the locks
    [locks-and-latches] All the locks released
    Archiving artifacts
    Recording test results
  • Apache Jenkins Server at Jul 23, 2012 at 9:47 am
    See <https://builds.apache.org/job/hbase-0.90/519/changes>

    Changes:

    [jmhsieh] HBASE-4470 ServerNotRunningException coming out of assignRootAndMeta kills the Master (Gregory Chanan)

    ------------------------------------------
    [...truncated 1220 lines...]
    Running org.apache.hadoop.hbase.regionserver.TestFSErrorsExposed
    Tests run: 3, Failures: 0, Errors: 0, Skipped: 0, Time elapsed: 29.468 sec
    Running org.apache.hadoop.hbase.client.replication.TestReplicationAdmin
    Tests run: 1, Failures: 0, Errors: 0, Skipped: 0, Time elapsed: 0.479 sec
    Running org.apache.hadoop.hbase.regionserver.TestScanDeleteTracker
    Tests run: 6, Failures: 0, Errors: 0, Skipped: 0, Time elapsed: 0.085 sec
    Running org.apache.hadoop.hbase.client.TestMetaScanner
    Tests run: 1, Failures: 0, Errors: 0, Skipped: 0, Time elapsed: 22.869 sec
    Running org.apache.hadoop.hbase.metrics.TestMetricsMBeanBase
    Tests run: 2, Failures: 0, Errors: 0, Skipped: 0, Time elapsed: 0.033 sec
    Running org.apache.hadoop.hbase.TestRegionRebalancing
    Tests run: 1, Failures: 0, Errors: 0, Skipped: 0, Time elapsed: 101.334 sec
    Running org.apache.hadoop.hbase.filter.TestSingleColumnValueExcludeFilter
    Tests run: 1, Failures: 0, Errors: 0, Skipped: 0, Time elapsed: 0.016 sec
    Running org.apache.hadoop.hbase.filter.TestInclusiveStopFilter
    Tests run: 2, Failures: 0, Errors: 0, Skipped: 0, Time elapsed: 0.017 sec
    Running org.apache.hadoop.hbase.rest.TestTableResource
    Tests run: 8, Failures: 0, Errors: 0, Skipped: 0, Time elapsed: 48.723 sec
    Running org.apache.hadoop.hbase.mapreduce.TestTableSplit
    Tests run: 1, Failures: 0, Errors: 0, Skipped: 0, Time elapsed: 0.017 sec
    Running org.apache.hadoop.hbase.TestHBaseTestingUtility
    Tests run: 5, Failures: 0, Errors: 0, Skipped: 0, Time elapsed: 54.125 sec
    Running org.apache.hadoop.hbase.mapreduce.TestLoadIncrementalHFiles
    Tests run: 5, Failures: 0, Errors: 0, Skipped: 0, Time elapsed: 74.591 sec
    Running org.apache.hadoop.hbase.regionserver.wal.TestWALReplay
    Tests run: 4, Failures: 0, Errors: 0, Skipped: 0, Time elapsed: 30.355 sec
    Running org.apache.hadoop.hbase.rest.TestSchemaResource
    Tests run: 2, Failures: 0, Errors: 0, Skipped: 0, Time elapsed: 25.234 sec
    Running org.apache.hadoop.hbase.regionserver.TestKeyValueScanFixture
    Tests run: 1, Failures: 0, Errors: 0, Skipped: 0, Time elapsed: 0.016 sec
    Running org.apache.hadoop.hbase.rest.model.TestTableListModel
    Tests run: 3, Failures: 0, Errors: 0, Skipped: 0, Time elapsed: 0.127 sec
    Running org.apache.hadoop.hbase.rest.model.TestColumnSchemaModel
    Tests run: 2, Failures: 0, Errors: 0, Skipped: 0, Time elapsed: 0.031 sec
    Running org.apache.hadoop.hbase.regionserver.TestStoreFile
    Tests run: 7, Failures: 0, Errors: 0, Skipped: 0, Time elapsed: 35.881 sec
    Running org.apache.hadoop.hbase.zookeeper.TestZooKeeperNodeTracker
    Tests run: 2, Failures: 0, Errors: 0, Skipped: 0, Time elapsed: 0.49 sec
    Running org.apache.hadoop.hbase.regionserver.wal.TestHLogMethods
    Tests run: 3, Failures: 0, Errors: 0, Skipped: 0, Time elapsed: 0.282 sec
    Running org.apache.hadoop.hbase.rest.model.TestScannerModel
    Tests run: 3, Failures: 0, Errors: 0, Skipped: 0, Time elapsed: 0.132 sec
    Running org.apache.hadoop.hbase.regionserver.TestHRegionServerBulkLoad
    Tests run: 1, Failures: 0, Errors: 0, Skipped: 0, Time elapsed: 45.118 sec
    Running org.apache.hadoop.hbase.rest.TestVersionResource
    Tests run: 7, Failures: 0, Errors: 0, Skipped: 0, Time elapsed: 17.512 sec
    Running org.apache.hadoop.hbase.filter.TestFilter
    Tests run: 18, Failures: 0, Errors: 0, Skipped: 0, Time elapsed: 1.439 sec
    Running org.apache.hadoop.hbase.regionserver.TestWideScanner
    Tests run: 1, Failures: 0, Errors: 0, Skipped: 0, Time elapsed: 17.794 sec
    Running org.apache.hadoop.hbase.regionserver.TestSplitTransaction
    Tests run: 6, Failures: 0, Errors: 0, Skipped: 0, Time elapsed: 2.569 sec
    Running org.apache.hadoop.hbase.replication.regionserver.TestReplicationSink
    Tests run: 5, Failures: 0, Errors: 0, Skipped: 0, Time elapsed: 22.354 sec
    Running org.apache.hadoop.hbase.regionserver.TestGetClosestAtOrBefore
    Tests run: 3, Failures: 0, Errors: 0, Skipped: 0, Time elapsed: 10.88 sec
    Running org.apache.hadoop.hbase.regionserver.TestReadWriteConsistencyControl
    Tests run: 1, Failures: 0, Errors: 0, Skipped: 0, Time elapsed: 10.02 sec
    Running org.apache.hadoop.hbase.util.TestMergeTable
    Tests run: 1, Failures: 0, Errors: 0, Skipped: 0, Time elapsed: 49.948 sec
    Running org.apache.hadoop.hbase.rest.model.TestVersionModel
    Tests run: 3, Failures: 0, Errors: 0, Skipped: 0, Time elapsed: 0.131 sec
    Running org.apache.hadoop.hbase.rest.model.TestCellSetModel
    Tests run: 3, Failures: 0, Errors: 0, Skipped: 0, Time elapsed: 0.134 sec
    Running org.apache.hadoop.hbase.rest.client.TestRemoteTable
    Tests run: 3, Failures: 0, Errors: 0, Skipped: 0, Time elapsed: 21.5 sec
    Running org.apache.hadoop.hbase.rest.model.TestStorageClusterStatusModel
    Tests run: 3, Failures: 0, Errors: 0, Skipped: 0, Time elapsed: 0.134 sec
    Running org.apache.hadoop.hbase.avro.TestAvroServer
    Tests run: 3, Failures: 0, Errors: 3, Skipped: 0, Time elapsed: 17.947 sec <<< FAILURE!
    Running org.apache.hadoop.hbase.TestFullLogReconstruction
    Tests run: 1, Failures: 0, Errors: 0, Skipped: 0, Time elapsed: 72.307 sec
    Running org.apache.hadoop.hbase.TestSerialization
    Tests run: 19, Failures: 0, Errors: 0, Skipped: 0, Time elapsed: 0.06 sec
    Running org.apache.hadoop.hbase.regionserver.TestKeyValueHeap
    Tests run: 3, Failures: 0, Errors: 0, Skipped: 0, Time elapsed: 0.065 sec
    Running org.apache.hadoop.hbase.regionserver.TestStoreScanner
    Tests run: 14, Failures: 0, Errors: 0, Skipped: 0, Time elapsed: 0.032 sec
    Running org.apache.hadoop.hbase.TestHMsg
    Tests run: 2, Failures: 0, Errors: 0, Skipped: 0, Time elapsed: 0.021 sec
    Running org.apache.hadoop.hbase.io.hfile.TestReseekTo
    Tests run: 1, Failures: 0, Errors: 0, Skipped: 0, Time elapsed: 0.171 sec
    Running org.apache.hadoop.hbase.mapreduce.TestLoadIncrementalHFilesSplitRecovery
    Tests run: 4, Failures: 0, Errors: 0, Skipped: 0, Time elapsed: 41.33 sec
    Running org.apache.hadoop.hbase.regionserver.TestHRegionInfo
    Tests run: 3, Failures: 0, Errors: 0, Skipped: 0, Time elapsed: 0.018 sec
    Running org.apache.hadoop.hbase.util.TestIncrementingEnvironmentEdge
    Tests run: 1, Failures: 0, Errors: 0, Skipped: 0, Time elapsed: 0.016 sec
    Running org.apache.hadoop.hbase.util.TestKeying
    Tests run: 1, Failures: 0, Errors: 0, Skipped: 0, Time elapsed: 0.017 sec
    Running org.apache.hadoop.hbase.regionserver.TestScanner
    Tests run: 6, Failures: 0, Errors: 0, Skipped: 0, Time elapsed: 68.964 sec
    Running org.apache.hadoop.hbase.util.TestHBaseFsck
    Tests run: 21, Failures: 0, Errors: 0, Skipped: 0, Time elapsed: 220.898 sec
    Running org.apache.hadoop.hbase.master.TestRestartCluster
    Tests run: 2, Failures: 0, Errors: 0, Skipped: 0, Time elapsed: 55.162 sec
    Running org.apache.hadoop.hbase.client.TestShell
    Tests run: 1, Failures: 0, Errors: 0, Skipped: 0, Time elapsed: 51.196 sec
    Running org.apache.hadoop.hbase.rest.model.TestTableInfoModel
    Tests run: 3, Failures: 0, Errors: 0, Skipped: 0, Time elapsed: 0.342 sec
    Running org.apache.hadoop.hbase.TestInfoServers
    Tests run: 1, Failures: 0, Errors: 0, Skipped: 0, Time elapsed: 15.227 sec
    Running org.apache.hadoop.hbase.master.TestLogsCleaner
    Tests run: 1, Failures: 0, Errors: 0, Skipped: 0, Time elapsed: 0.857 sec
    Running org.apache.hadoop.hbase.regionserver.TestMasterAddressManager
    Tests run: 1, Failures: 0, Errors: 0, Skipped: 0, Time elapsed: 0.59 sec
    Running org.apache.hadoop.hbase.catalog.TestCatalogTrackerOnCluster
    Tests run: 1, Failures: 0, Errors: 0, Skipped: 0, Time elapsed: 207.643 sec
    Running org.apache.hadoop.hbase.regionserver.TestQueryMatcher
    Tests run: 4, Failures: 0, Errors: 0, Skipped: 0, Time elapsed: 0.078 sec
    Running org.apache.hadoop.hbase.zookeeper.TestZKTable
    Tests run: 1, Failures: 0, Errors: 0, Skipped: 0, Time elapsed: 0.301 sec
    Running org.apache.hadoop.hbase.client.TestAdmin
    Tests run: 24, Failures: 0, Errors: 0, Skipped: 0, Time elapsed: 402.356 sec
    Running org.apache.hadoop.hbase.regionserver.TestPriorityCompactionQueue
    Tests run: 1, Failures: 0, Errors: 0, Skipped: 0, Time elapsed: 1.114 sec
    Running org.apache.hadoop.hbase.util.TestMergeTool
    Tests run: 1, Failures: 0, Errors: 0, Skipped: 0, Time elapsed: 35.326 sec
    Running org.apache.hadoop.hbase.TestAcidGuarantees
    Tests run: 3, Failures: 0, Errors: 0, Skipped: 3, Time elapsed: 0.015 sec
    Running org.apache.hadoop.hbase.util.TestBase64
    Tests run: 1, Failures: 0, Errors: 0, Skipped: 0, Time elapsed: 0.018 sec
    Running org.apache.hadoop.hbase.regionserver.TestMemStore
    Tests run: 21, Failures: 0, Errors: 0, Skipped: 0, Time elapsed: 58.138 sec
    Running org.apache.hadoop.hbase.rest.TestScannerResource
    Tests run: 5, Failures: 0, Errors: 0, Skipped: 0, Time elapsed: 43.242 sec
    Running org.apache.hadoop.hbase.io.hfile.TestLruBlockCache
    Tests run: 7, Failures: 0, Errors: 0, Skipped: 0, Time elapsed: 1.061 sec
    Running org.apache.hadoop.hbase.master.TestDeadServer
    Tests run: 1, Failures: 0, Errors: 0, Skipped: 0, Time elapsed: 0.022 sec
    Running org.apache.hadoop.hbase.rest.TestGzipFilter
    Tests run: 3, Failures: 0, Errors: 0, Skipped: 0, Time elapsed: 21.668 sec
    Running org.apache.hadoop.hbase.mapreduce.TestTableMapReduce
    Tests run: 2, Failures: 0, Errors: 0, Skipped: 0, Time elapsed: 110.286 sec
    Running org.apache.hadoop.hbase.TestKeyValue
    Tests run: 14, Failures: 0, Errors: 0, Skipped: 0, Time elapsed: 0.03 sec
    Running org.apache.hadoop.hbase.client.TestMultiParallel
    Tests run: 10, Failures: 0, Errors: 0, Skipped: 0, Time elapsed: 39.671 sec
    Running org.apache.hadoop.hbase.master.TestMaster
    Tests run: 1, Failures: 0, Errors: 0, Skipped: 0, Time elapsed: 76.795 sec
    Running org.apache.hadoop.hbase.master.TestRollingRestart
    Tests run: 1, Failures: 0, Errors: 0, Skipped: 0, Time elapsed: 79.322 sec
    Running org.apache.hadoop.hbase.client.TestResult
    Tests run: 3, Failures: 0, Errors: 0, Skipped: 0, Time elapsed: 0.04 sec
    Running org.apache.hadoop.hbase.client.TestHTablePool
    Tests run: 5, Failures: 0, Errors: 0, Skipped: 0, Time elapsed: 24.786 sec
    Running org.apache.hadoop.hbase.master.TestOpenedRegionHandler
    Tests run: 2, Failures: 0, Errors: 0, Skipped: 0, Time elapsed: 31.634 sec
    Running org.apache.hadoop.hbase.rest.model.TestTableSchemaModel
    Tests run: 3, Failures: 0, Errors: 0, Skipped: 0, Time elapsed: 0.154 sec
    Running org.apache.hadoop.hbase.util.TestByteBloomFilter
    Tests run: 3, Failures: 0, Errors: 0, Skipped: 0, Time elapsed: 1.689 sec
    Running org.apache.hadoop.hbase.filter.TestFilterList
    Tests run: 4, Failures: 0, Errors: 0, Skipped: 0, Time elapsed: 0.043 sec
    Running org.apache.hadoop.hbase.mapreduce.TestTableInputFormatScan
    Tests run: 11, Failures: 0, Errors: 0, Skipped: 0, Time elapsed: 367.434 sec
    Running org.apache.hadoop.hbase.regionserver.TestHRegion
    Tests run: 54, Failures: 0, Errors: 0, Skipped: 0, Time elapsed: 14.638 sec
    Running org.apache.hadoop.hbase.master.TestMasterFailover
    Tests run: 4, Failures: 0, Errors: 0, Skipped: 0, Time elapsed: 88.295 sec
    Running org.apache.hadoop.hbase.rest.model.TestTableRegionModel
    Tests run: 4, Failures: 0, Errors: 0, Skipped: 0, Time elapsed: 0.034 sec
    Running org.apache.hadoop.hbase.client.TestTimestampsFilter
    Tests run: 3, Failures: 0, Errors: 0, Skipped: 0, Time elapsed: 34.399 sec
    Running org.apache.hadoop.hbase.master.TestLoadBalancer
    Tests run: 7, Failures: 0, Errors: 0, Skipped: 0, Time elapsed: 2.166 sec
    Running org.apache.hadoop.hbase.util.TestRootPath
    Tests run: 1, Failures: 0, Errors: 0, Skipped: 0, Time elapsed: 0.021 sec
    Running org.apache.hadoop.hbase.client.TestScannerTimeout
    Tests run: 4, Failures: 0, Errors: 0, Skipped: 0, Time elapsed: 47.899 sec
    Running org.apache.hadoop.hbase.regionserver.wal.TestWALObserver
    Tests run: 1, Failures: 0, Errors: 0, Skipped: 0, Time elapsed: 0.188 sec
    Running org.apache.hadoop.hbase.mapred.TestTableMapReduce
    Tests run: 1, Failures: 0, Errors: 0, Skipped: 0, Time elapsed: 47.959 sec
    Running org.apache.hadoop.hbase.master.TestActiveMasterManager
    Tests run: 2, Failures: 0, Errors: 0, Skipped: 0, Time elapsed: 0.45 sec
    Running org.apache.hadoop.hbase.replication.regionserver.TestReplicationSourceManager
    Tests run: 1, Failures: 0, Errors: 0, Skipped: 0, Time elapsed: 0.759 sec
    Running org.apache.hadoop.hbase.util.TestBytes
    Tests run: 10, Failures: 0, Errors: 0, Skipped: 0, Time elapsed: 0.023 sec
    Running org.apache.hadoop.hbase.util.TestCompressionTest
    Tests run: 1, Failures: 0, Errors: 0, Skipped: 0, Time elapsed: 0.028 sec
    Running org.apache.hadoop.hbase.client.TestGetRowVersions
    Tests run: 1, Failures: 0, Errors: 0, Skipped: 0, Time elapsed: 26.096 sec
    Running org.apache.hadoop.hbase.filter.TestDependentColumnFilter
    Tests run: 2, Failures: 0, Errors: 0, Skipped: 0, Time elapsed: 0.221 sec
    Running org.apache.hadoop.hbase.rest.model.TestCellModel
    Tests run: 3, Failures: 0, Errors: 0, Skipped: 0, Time elapsed: 0.134 sec
    Running org.apache.hadoop.hbase.master.TestCatalogJanitor
    Tests run: 2, Failures: 0, Errors: 0, Skipped: 0, Time elapsed: 0.395 sec
    Running org.apache.hadoop.hbase.catalog.TestCatalogTracker
    Tests run: 9, Failures: 0, Errors: 0, Skipped: 0, Time elapsed: 3.058 sec
    Running org.apache.hadoop.hbase.replication.TestReplicationSource
    Tests run: 1, Failures: 0, Errors: 0, Skipped: 0, Time elapsed: 2.211 sec
    Running org.apache.hadoop.hbase.rest.TestRowResource
    Tests run: 11, Failures: 0, Errors: 0, Skipped: 0, Time elapsed: 40.263 sec
    Running org.apache.hadoop.hbase.util.TestRegionSplitCalculator
    Tests run: 15, Failures: 0, Errors: 0, Skipped: 0, Time elapsed: 0.08 sec
    Running org.apache.hadoop.hbase.io.hfile.TestHFile
    Tests run: 7, Failures: 0, Errors: 0, Skipped: 0, Time elapsed: 0.219 sec
    Running org.apache.hadoop.hbase.catalog.TestMetaReaderEditor
    Tests run: 4, Failures: 0, Errors: 0, Skipped: 0, Time elapsed: 42.842 sec
    Running org.apache.hadoop.hbase.mapreduce.TestImportTsv
    Tests run: 7, Failures: 0, Errors: 0, Skipped: 0, Time elapsed: 18.777 sec
    Running org.apache.hadoop.hbase.util.TestHBaseFsckComparator
    Tests run: 7, Failures: 0, Errors: 0, Skipped: 0, Time elapsed: 2.848 sec
    Running org.apache.hadoop.hbase.util.TestStrings
    Tests run: 1, Failures: 0, Errors: 0, Skipped: 0, Time elapsed: 0.016 sec
    Running org.apache.hadoop.hbase.rest.client.TestRemoteAdmin
    Tests run: 2, Failures: 0, Errors: 0, Skipped: 0, Time elapsed: 24.596 sec
    Running org.apache.hadoop.hbase.regionserver.wal.TestHLog
    Tests run: 8, Failures: 0, Errors: 0, Skipped: 0, Time elapsed: 80.506 sec
    Running org.apache.hadoop.hbase.client.TestTimestamp
    Tests run: 1, Failures: 0, Errors: 0, Skipped: 0, Time elapsed: 26.496 sec
    Running org.apache.hadoop.hbase.TestScanMultipleVersions
    Tests run: 1, Failures: 0, Errors: 0, Skipped: 0, Time elapsed: 18.574 sec
    Running org.apache.hadoop.hbase.rest.model.TestStorageClusterVersionModel
    Tests run: 2, Failures: 0, Errors: 0, Skipped: 0, Time elapsed: 0.031 sec
    Running org.apache.hadoop.hbase.client.TestHCM
    Tests run: 4, Failures: 0, Errors: 0, Skipped: 0, Time elapsed: 33.212 sec

    Results :

    Tests in error:

    Tests run: 734, Failures: 0, Errors: 3, Skipped: 9

    [INFO] ------------------------------------------------------------------------
    [INFO] BUILD FAILURE
    [INFO] ------------------------------------------------------------------------
    [INFO] Total time: 1:29:37.625s
    [INFO] Finished at: Mon Jul 23 09:45:59 UTC 2012
    [INFO] Final Memory: 35M/382M
    [INFO] ------------------------------------------------------------------------
    [ERROR] Failed to execute goal org.apache.maven.plugins:maven-surefire-plugin:2.4.3:test (default-test) on project hbase: There are test failures.
    [ERROR]
    [ERROR] Please refer to <https://builds.apache.org/job/hbase-0.90/ws/trunk/target/surefire-reports> for the individual test results.
    [ERROR] -> [Help 1]
    [ERROR]
    [ERROR] To see the full stack trace of the errors, re-run Maven with the -e switch.
    [ERROR] Re-run Maven using the -X switch to enable full debug logging.
    [ERROR]
    [ERROR] For more information about the errors and possible solutions, please read the following articles:
    [ERROR] [Help 1] http://cwiki.apache.org/confluence/display/MAVEN/MojoFailureException
    Build step 'Invoke top-level Maven targets' marked build as failure
    [locks-and-latches] Releasing all the locks
    [locks-and-latches] All the locks released
    Archiving artifacts
    Recording test results
  • Apache Jenkins Server at Aug 2, 2012 at 10:31 pm
    See <https://builds.apache.org/job/hbase-0.90/520/changes>

    Changes:

    [jmhsieh] HBASE-6460 hbck "-repairHoles" usage inconsistent with "-fixHdfsOrphans" (Jie Huang)

    ------------------------------------------
    [...truncated 1221 lines...]
    Running org.apache.hadoop.hbase.regionserver.TestFSErrorsExposed
    Tests run: 3, Failures: 0, Errors: 0, Skipped: 0, Time elapsed: 27.26 sec
    Running org.apache.hadoop.hbase.client.replication.TestReplicationAdmin
    Tests run: 1, Failures: 0, Errors: 0, Skipped: 0, Time elapsed: 0.235 sec
    Running org.apache.hadoop.hbase.regionserver.TestScanDeleteTracker
    Tests run: 6, Failures: 0, Errors: 0, Skipped: 0, Time elapsed: 0.067 sec
    Running org.apache.hadoop.hbase.metrics.TestMetricsMBeanBase
    Tests run: 2, Failures: 0, Errors: 0, Skipped: 0, Time elapsed: 0.027 sec
    Running org.apache.hadoop.hbase.client.TestMetaScanner
    Tests run: 1, Failures: 0, Errors: 0, Skipped: 0, Time elapsed: 13.383 sec
    Running org.apache.hadoop.hbase.TestRegionRebalancing
    Tests run: 1, Failures: 0, Errors: 0, Skipped: 0, Time elapsed: 60.289 sec
    Running org.apache.hadoop.hbase.rest.TestTableResource
    Tests run: 8, Failures: 0, Errors: 0, Skipped: 0, Time elapsed: 45.952 sec
    Running org.apache.hadoop.hbase.filter.TestSingleColumnValueExcludeFilter
    Tests run: 1, Failures: 0, Errors: 0, Skipped: 0, Time elapsed: 0.013 sec
    Running org.apache.hadoop.hbase.filter.TestInclusiveStopFilter
    Tests run: 2, Failures: 0, Errors: 0, Skipped: 0, Time elapsed: 0.013 sec
    Running org.apache.hadoop.hbase.mapreduce.TestTableSplit
    Tests run: 1, Failures: 0, Errors: 0, Skipped: 0, Time elapsed: 0.014 sec
    Running org.apache.hadoop.hbase.TestHBaseTestingUtility
    Tests run: 5, Failures: 0, Errors: 0, Skipped: 0, Time elapsed: 45.863 sec
    Running org.apache.hadoop.hbase.mapreduce.TestLoadIncrementalHFiles
    Tests run: 5, Failures: 0, Errors: 0, Skipped: 0, Time elapsed: 50.885 sec
    Running org.apache.hadoop.hbase.rest.TestSchemaResource
    Tests run: 2, Failures: 0, Errors: 0, Skipped: 0, Time elapsed: 22.027 sec
    Running org.apache.hadoop.hbase.regionserver.wal.TestWALReplay
    Tests run: 4, Failures: 0, Errors: 0, Skipped: 0, Time elapsed: 24.664 sec
    Running org.apache.hadoop.hbase.regionserver.TestKeyValueScanFixture
    Tests run: 1, Failures: 0, Errors: 0, Skipped: 0, Time elapsed: 0.013 sec
    Running org.apache.hadoop.hbase.rest.model.TestTableListModel
    Tests run: 3, Failures: 0, Errors: 0, Skipped: 0, Time elapsed: 0.099 sec
    Running org.apache.hadoop.hbase.rest.model.TestColumnSchemaModel
    Tests run: 2, Failures: 0, Errors: 0, Skipped: 0, Time elapsed: 0.024 sec
    Running org.apache.hadoop.hbase.regionserver.TestStoreFile
    Tests run: 7, Failures: 0, Errors: 0, Skipped: 0, Time elapsed: 24.379 sec
    Running org.apache.hadoop.hbase.zookeeper.TestZooKeeperNodeTracker
    Tests run: 2, Failures: 0, Errors: 0, Skipped: 0, Time elapsed: 0.215 sec
    Running org.apache.hadoop.hbase.rest.model.TestScannerModel
    Tests run: 3, Failures: 0, Errors: 0, Skipped: 0, Time elapsed: 0.099 sec
    Running org.apache.hadoop.hbase.regionserver.wal.TestHLogMethods
    Tests run: 3, Failures: 0, Errors: 0, Skipped: 0, Time elapsed: 0.229 sec
    Running org.apache.hadoop.hbase.rest.TestVersionResource
    Tests run: 7, Failures: 0, Errors: 0, Skipped: 0, Time elapsed: 14.812 sec
    Running org.apache.hadoop.hbase.regionserver.TestHRegionServerBulkLoad
    Tests run: 1, Failures: 0, Errors: 0, Skipped: 0, Time elapsed: 58.053 sec
    Running org.apache.hadoop.hbase.filter.TestFilter
    Tests run: 18, Failures: 0, Errors: 0, Skipped: 0, Time elapsed: 1.387 sec
    Running org.apache.hadoop.hbase.regionserver.TestWideScanner
    Tests run: 1, Failures: 0, Errors: 0, Skipped: 0, Time elapsed: 14.509 sec
    Running org.apache.hadoop.hbase.regionserver.TestSplitTransaction
    Tests run: 6, Failures: 0, Errors: 0, Skipped: 0, Time elapsed: 1.793 sec
    Running org.apache.hadoop.hbase.replication.regionserver.TestReplicationSink
    Tests run: 5, Failures: 0, Errors: 0, Skipped: 0, Time elapsed: 19.252 sec
    Running org.apache.hadoop.hbase.util.TestMergeTable
    Tests run: 1, Failures: 0, Errors: 0, Skipped: 0, Time elapsed: 36.558 sec
    Running org.apache.hadoop.hbase.regionserver.TestReadWriteConsistencyControl
    Tests run: 1, Failures: 0, Errors: 0, Skipped: 0, Time elapsed: 10.017 sec
    Running org.apache.hadoop.hbase.regionserver.TestGetClosestAtOrBefore
    Tests run: 3, Failures: 0, Errors: 0, Skipped: 0, Time elapsed: 25.214 sec
    Running org.apache.hadoop.hbase.rest.model.TestVersionModel
    Tests run: 3, Failures: 0, Errors: 0, Skipped: 0, Time elapsed: 0.103 sec
    Running org.apache.hadoop.hbase.rest.model.TestCellSetModel
    Tests run: 3, Failures: 0, Errors: 0, Skipped: 0, Time elapsed: 0.104 sec
    Running org.apache.hadoop.hbase.rest.model.TestStorageClusterStatusModel
    Tests run: 3, Failures: 0, Errors: 0, Skipped: 0, Time elapsed: 0.106 sec
    Running org.apache.hadoop.hbase.rest.client.TestRemoteTable
    Tests run: 3, Failures: 0, Errors: 0, Skipped: 0, Time elapsed: 17.129 sec
    Running org.apache.hadoop.hbase.avro.TestAvroServer
    Tests run: 3, Failures: 0, Errors: 3, Skipped: 0, Time elapsed: 14.064 sec <<< FAILURE!
    Running org.apache.hadoop.hbase.TestFullLogReconstruction
    Tests run: 1, Failures: 0, Errors: 0, Skipped: 0, Time elapsed: 50.731 sec
    Running org.apache.hadoop.hbase.TestSerialization
    Tests run: 19, Failures: 0, Errors: 0, Skipped: 0, Time elapsed: 0.048 sec
    Running org.apache.hadoop.hbase.regionserver.TestKeyValueHeap
    Tests run: 3, Failures: 0, Errors: 0, Skipped: 0, Time elapsed: 0.056 sec
    Running org.apache.hadoop.hbase.regionserver.TestStoreScanner
    Tests run: 14, Failures: 0, Errors: 0, Skipped: 0, Time elapsed: 0.026 sec
    Running org.apache.hadoop.hbase.TestHMsg
    Tests run: 2, Failures: 0, Errors: 0, Skipped: 0, Time elapsed: 0.018 sec
    Running org.apache.hadoop.hbase.io.hfile.TestReseekTo
    Tests run: 1, Failures: 0, Errors: 0, Skipped: 0, Time elapsed: 0.142 sec
    Running org.apache.hadoop.hbase.mapreduce.TestLoadIncrementalHFilesSplitRecovery
    Tests run: 4, Failures: 0, Errors: 0, Skipped: 0, Time elapsed: 24.399 sec
    Running org.apache.hadoop.hbase.util.TestIncrementingEnvironmentEdge
    Tests run: 1, Failures: 0, Errors: 0, Skipped: 0, Time elapsed: 0.012 sec
    Running org.apache.hadoop.hbase.util.TestKeying
    Tests run: 1, Failures: 0, Errors: 0, Skipped: 0, Time elapsed: 0.013 sec
    Running org.apache.hadoop.hbase.regionserver.TestHRegionInfo
    Tests run: 3, Failures: 0, Errors: 0, Skipped: 0, Time elapsed: 0.014 sec
    Running org.apache.hadoop.hbase.regionserver.TestScanner
    Tests run: 6, Failures: 0, Errors: 0, Skipped: 0, Time elapsed: 48.003 sec
    Running org.apache.hadoop.hbase.util.TestHBaseFsck
    Tests run: 21, Failures: 0, Errors: 0, Skipped: 0, Time elapsed: 153.998 sec
    Running org.apache.hadoop.hbase.master.TestRestartCluster
    Tests run: 2, Failures: 0, Errors: 0, Skipped: 0, Time elapsed: 43.276 sec
    Running org.apache.hadoop.hbase.client.TestShell
    Tests run: 1, Failures: 0, Errors: 0, Skipped: 0, Time elapsed: 54.541 sec
    Running org.apache.hadoop.hbase.rest.model.TestTableInfoModel
    Tests run: 3, Failures: 0, Errors: 0, Skipped: 0, Time elapsed: 0.119 sec
    Running org.apache.hadoop.hbase.TestInfoServers
    Tests run: 1, Failures: 0, Errors: 0, Skipped: 0, Time elapsed: 12.461 sec
    Running org.apache.hadoop.hbase.master.TestLogsCleaner
    Tests run: 1, Failures: 0, Errors: 0, Skipped: 0, Time elapsed: 0.584 sec
    Running org.apache.hadoop.hbase.regionserver.TestMasterAddressManager
    Tests run: 1, Failures: 0, Errors: 0, Skipped: 0, Time elapsed: 0.182 sec
    Running org.apache.hadoop.hbase.catalog.TestCatalogTrackerOnCluster
    Tests run: 1, Failures: 0, Errors: 0, Skipped: 0, Time elapsed: 205.072 sec
    Running org.apache.hadoop.hbase.regionserver.TestQueryMatcher
    Tests run: 4, Failures: 0, Errors: 0, Skipped: 0, Time elapsed: 0.066 sec
    Running org.apache.hadoop.hbase.zookeeper.TestZKTable
    Tests run: 1, Failures: 0, Errors: 0, Skipped: 0, Time elapsed: 0.197 sec
    Running org.apache.hadoop.hbase.client.TestAdmin
    Tests run: 24, Failures: 0, Errors: 0, Skipped: 0, Time elapsed: 215.123 sec
    Running org.apache.hadoop.hbase.util.TestMergeTool
    Tests run: 1, Failures: 0, Errors: 0, Skipped: 0, Time elapsed: 16.709 sec
    Running org.apache.hadoop.hbase.regionserver.TestPriorityCompactionQueue
    Tests run: 1, Failures: 0, Errors: 0, Skipped: 0, Time elapsed: 1.11 sec
    Running org.apache.hadoop.hbase.TestAcidGuarantees
    Tests run: 3, Failures: 0, Errors: 0, Skipped: 3, Time elapsed: 0.012 sec
    Running org.apache.hadoop.hbase.util.TestBase64
    Tests run: 1, Failures: 0, Errors: 0, Skipped: 0, Time elapsed: 0.014 sec
    Running org.apache.hadoop.hbase.regionserver.TestMemStore
    Tests run: 21, Failures: 0, Errors: 0, Skipped: 0, Time elapsed: 38.928 sec
    Running org.apache.hadoop.hbase.rest.TestScannerResource
    Tests run: 5, Failures: 0, Errors: 0, Skipped: 0, Time elapsed: 42.181 sec
    Running org.apache.hadoop.hbase.io.hfile.TestLruBlockCache
    Tests run: 7, Failures: 0, Errors: 0, Skipped: 0, Time elapsed: 1.064 sec
    Running org.apache.hadoop.hbase.master.TestDeadServer
    Tests run: 1, Failures: 0, Errors: 0, Skipped: 0, Time elapsed: 0.015 sec
    Running org.apache.hadoop.hbase.rest.TestGzipFilter
    Tests run: 3, Failures: 0, Errors: 0, Skipped: 0, Time elapsed: 16.888 sec
    Running org.apache.hadoop.hbase.TestKeyValue
    Tests run: 14, Failures: 0, Errors: 0, Skipped: 0, Time elapsed: 0.023 sec
    Running org.apache.hadoop.hbase.mapreduce.TestTableMapReduce
    Tests run: 2, Failures: 0, Errors: 0, Skipped: 0, Time elapsed: 52.641 sec
    Running org.apache.hadoop.hbase.client.TestMultiParallel
    Tests run: 10, Failures: 0, Errors: 0, Skipped: 0, Time elapsed: 22.753 sec
    Running org.apache.hadoop.hbase.master.TestMaster
    Tests run: 1, Failures: 0, Errors: 0, Skipped: 0, Time elapsed: 89.241 sec
    Running org.apache.hadoop.hbase.master.TestRollingRestart
    Tests run: 1, Failures: 0, Errors: 0, Skipped: 0, Time elapsed: 51.603 sec
    Running org.apache.hadoop.hbase.client.TestResult
    Tests run: 3, Failures: 0, Errors: 0, Skipped: 0, Time elapsed: 0.056 sec
    Running org.apache.hadoop.hbase.client.TestHTablePool
    Tests run: 5, Failures: 0, Errors: 0, Skipped: 0, Time elapsed: 16.342 sec
    Running org.apache.hadoop.hbase.master.TestOpenedRegionHandler
    Tests run: 2, Failures: 0, Errors: 0, Skipped: 0, Time elapsed: 18.227 sec
    Running org.apache.hadoop.hbase.util.TestByteBloomFilter
    Tests run: 3, Failures: 0, Errors: 0, Skipped: 0, Time elapsed: 1.092 sec
    Running org.apache.hadoop.hbase.rest.model.TestTableSchemaModel
    Tests run: 3, Failures: 0, Errors: 0, Skipped: 0, Time elapsed: 0.104 sec
    Running org.apache.hadoop.hbase.filter.TestFilterList
    Tests run: 4, Failures: 0, Errors: 0, Skipped: 0, Time elapsed: 0.032 sec
    Running org.apache.hadoop.hbase.mapreduce.TestTableInputFormatScan
    Tests run: 11, Failures: 0, Errors: 0, Skipped: 0, Time elapsed: 336.425 sec
    Running org.apache.hadoop.hbase.regionserver.TestHRegion
    Tests run: 54, Failures: 0, Errors: 0, Skipped: 0, Time elapsed: 10.534 sec
    Running org.apache.hadoop.hbase.rest.model.TestTableRegionModel
    Tests run: 4, Failures: 0, Errors: 0, Skipped: 0, Time elapsed: 0.025 sec
    Running org.apache.hadoop.hbase.master.TestMasterFailover
    Tests run: 4, Failures: 0, Errors: 0, Skipped: 0, Time elapsed: 69.088 sec
    Running org.apache.hadoop.hbase.client.TestTimestampsFilter
    Tests run: 3, Failures: 0, Errors: 0, Skipped: 0, Time elapsed: 48.473 sec
    Running org.apache.hadoop.hbase.util.TestRootPath
    Tests run: 1, Failures: 0, Errors: 0, Skipped: 0, Time elapsed: 0.016 sec
    Running org.apache.hadoop.hbase.master.TestLoadBalancer
    Tests run: 7, Failures: 0, Errors: 0, Skipped: 0, Time elapsed: 1.515 sec
    Running org.apache.hadoop.hbase.mapred.TestTableMapReduce
    Tests run: 1, Failures: 0, Errors: 0, Skipped: 0, Time elapsed: 33.883 sec
    Running org.apache.hadoop.hbase.client.TestScannerTimeout
    Tests run: 4, Failures: 0, Errors: 0, Skipped: 0, Time elapsed: 46.643 sec
    Running org.apache.hadoop.hbase.regionserver.wal.TestWALObserver
    Tests run: 1, Failures: 0, Errors: 0, Skipped: 0, Time elapsed: 0.13 sec
    Running org.apache.hadoop.hbase.util.TestBytes
    Tests run: 10, Failures: 0, Errors: 0, Skipped: 0, Time elapsed: 0.018 sec
    Running org.apache.hadoop.hbase.replication.regionserver.TestReplicationSourceManager
    Tests run: 1, Failures: 0, Errors: 0, Skipped: 0, Time elapsed: 0.466 sec
    Running org.apache.hadoop.hbase.master.TestActiveMasterManager
    Tests run: 2, Failures: 0, Errors: 0, Skipped: 0, Time elapsed: 0.246 sec
    Running org.apache.hadoop.hbase.util.TestCompressionTest
    Tests run: 1, Failures: 0, Errors: 0, Skipped: 0, Time elapsed: 0.02 sec
    Running org.apache.hadoop.hbase.filter.TestDependentColumnFilter
    Tests run: 2, Failures: 0, Errors: 0, Skipped: 0, Time elapsed: 0.174 sec
    Running org.apache.hadoop.hbase.client.TestGetRowVersions
    Tests run: 1, Failures: 0, Errors: 0, Skipped: 0, Time elapsed: 23.53 sec
    Running org.apache.hadoop.hbase.rest.model.TestCellModel
    Tests run: 3, Failures: 0, Errors: 0, Skipped: 0, Time elapsed: 0.101 sec
    Running org.apache.hadoop.hbase.replication.TestReplicationSource
    Tests run: 1, Failures: 0, Errors: 0, Skipped: 0, Time elapsed: 1.038 sec
    Running org.apache.hadoop.hbase.master.TestCatalogJanitor
    Tests run: 2, Failures: 0, Errors: 0, Skipped: 0, Time elapsed: 0.354 sec
    Running org.apache.hadoop.hbase.catalog.TestCatalogTracker
    Tests run: 9, Failures: 0, Errors: 0, Skipped: 0, Time elapsed: 3.435 sec
    Running org.apache.hadoop.hbase.util.TestRegionSplitCalculator
    Tests run: 15, Failures: 0, Errors: 0, Skipped: 0, Time elapsed: 0.056 sec
    Running org.apache.hadoop.hbase.rest.TestRowResource
    Tests run: 11, Failures: 0, Errors: 0, Skipped: 0, Time elapsed: 17.017 sec
    Running org.apache.hadoop.hbase.io.hfile.TestHFile
    Tests run: 7, Failures: 0, Errors: 0, Skipped: 0, Time elapsed: 0.169 sec
    Running org.apache.hadoop.hbase.catalog.TestMetaReaderEditor
    Tests run: 4, Failures: 0, Errors: 0, Skipped: 0, Time elapsed: 18.312 sec
    Running org.apache.hadoop.hbase.util.TestStrings
    Tests run: 1, Failures: 0, Errors: 0, Skipped: 0, Time elapsed: 0.013 sec
    Running org.apache.hadoop.hbase.util.TestHBaseFsckComparator
    Tests run: 7, Failures: 0, Errors: 0, Skipped: 0, Time elapsed: 0.133 sec
    Running org.apache.hadoop.hbase.mapreduce.TestImportTsv
    Tests run: 7, Failures: 0, Errors: 0, Skipped: 0, Time elapsed: 15.651 sec
    Running org.apache.hadoop.hbase.rest.client.TestRemoteAdmin
    Tests run: 2, Failures: 0, Errors: 0, Skipped: 0, Time elapsed: 21.009 sec
    Running org.apache.hadoop.hbase.regionserver.wal.TestHLog
    Tests run: 8, Failures: 0, Errors: 0, Skipped: 0, Time elapsed: 76.202 sec
    Running org.apache.hadoop.hbase.client.TestTimestamp
    Tests run: 1, Failures: 0, Errors: 0, Skipped: 0, Time elapsed: 30.143 sec
    Running org.apache.hadoop.hbase.TestScanMultipleVersions
    Tests run: 1, Failures: 0, Errors: 0, Skipped: 0, Time elapsed: 12.48 sec
    Running org.apache.hadoop.hbase.rest.model.TestStorageClusterVersionModel
    Tests run: 2, Failures: 0, Errors: 0, Skipped: 0, Time elapsed: 0.024 sec
    Running org.apache.hadoop.hbase.client.TestHCM
    Tests run: 4, Failures: 0, Errors: 0, Skipped: 0, Time elapsed: 46.208 sec

    Results :

    Tests in error:

    Tests run: 734, Failures: 0, Errors: 3, Skipped: 9

    [INFO] ------------------------------------------------------------------------
    [INFO] BUILD FAILURE
    [INFO] ------------------------------------------------------------------------
    [INFO] Total time: 1:13:46.417s
    [INFO] Finished at: Thu Aug 02 22:30:47 UTC 2012
    [INFO] Final Memory: 35M/684M
    [INFO] ------------------------------------------------------------------------
    [ERROR] Failed to execute goal org.apache.maven.plugins:maven-surefire-plugin:2.4.3:test (default-test) on project hbase: There are test failures.
    [ERROR]
    [ERROR] Please refer to /x1/jenkins/jenkins-slave/workspace/hbase-0.90/trunk/target/surefire-reports for the individual test results.
    [ERROR] -> [Help 1]
    [ERROR]
    [ERROR] To see the full stack trace of the errors, re-run Maven with the -e switch.
    [ERROR] Re-run Maven using the -X switch to enable full debug logging.
    [ERROR]
    [ERROR] For more information about the errors and possible solutions, please read the following articles:
    [ERROR] [Help 1] http://cwiki.apache.org/confluence/display/MAVEN/MojoFailureException
    Build step 'Invoke top-level Maven targets' marked build as failure
    [locks-and-latches] Releasing all the locks
    [locks-and-latches] All the locks released
    Archiving artifacts
    Recording test results
  • Apache Jenkins Server at Aug 4, 2012 at 6:29 pm
    See <https://builds.apache.org/job/hbase-0.90/521/changes>

    Changes:

    [jxiang] [hbck] TestHBaseFsck ran into TableNotEnabledException

    ------------------------------------------
    [...truncated 1232 lines...]
    Running org.apache.hadoop.hbase.regionserver.TestFSErrorsExposed
    Tests run: 3, Failures: 0, Errors: 0, Skipped: 0, Time elapsed: 26.292 sec
    Running org.apache.hadoop.hbase.client.replication.TestReplicationAdmin
    Tests run: 1, Failures: 0, Errors: 0, Skipped: 0, Time elapsed: 0.228 sec
    Running org.apache.hadoop.hbase.regionserver.TestScanDeleteTracker
    Tests run: 6, Failures: 0, Errors: 0, Skipped: 0, Time elapsed: 0.065 sec
    Running org.apache.hadoop.hbase.metrics.TestMetricsMBeanBase
    Tests run: 2, Failures: 0, Errors: 0, Skipped: 0, Time elapsed: 0.026 sec
    Running org.apache.hadoop.hbase.client.TestMetaScanner
    Tests run: 1, Failures: 0, Errors: 0, Skipped: 0, Time elapsed: 13.101 sec
    Running org.apache.hadoop.hbase.TestRegionRebalancing
    Tests run: 1, Failures: 0, Errors: 0, Skipped: 0, Time elapsed: 33.156 sec
    Running org.apache.hadoop.hbase.rest.TestTableResource
    Tests run: 8, Failures: 0, Errors: 0, Skipped: 0, Time elapsed: 56.388 sec
    Running org.apache.hadoop.hbase.filter.TestSingleColumnValueExcludeFilter
    Tests run: 1, Failures: 0, Errors: 0, Skipped: 0, Time elapsed: 0.014 sec
    Running org.apache.hadoop.hbase.filter.TestInclusiveStopFilter
    Tests run: 2, Failures: 0, Errors: 0, Skipped: 0, Time elapsed: 0.013 sec
    Running org.apache.hadoop.hbase.mapreduce.TestTableSplit
    Tests run: 1, Failures: 0, Errors: 0, Skipped: 0, Time elapsed: 0.013 sec
    Running org.apache.hadoop.hbase.TestHBaseTestingUtility
    Tests run: 5, Failures: 0, Errors: 0, Skipped: 0, Time elapsed: 45.038 sec
    Running org.apache.hadoop.hbase.mapreduce.TestLoadIncrementalHFiles
    Tests run: 5, Failures: 0, Errors: 0, Skipped: 0, Time elapsed: 50.39 sec
    Running org.apache.hadoop.hbase.rest.TestSchemaResource
    Tests run: 2, Failures: 0, Errors: 0, Skipped: 0, Time elapsed: 20.772 sec
    Running org.apache.hadoop.hbase.regionserver.wal.TestWALReplay
    Tests run: 4, Failures: 0, Errors: 0, Skipped: 0, Time elapsed: 32.153 sec
    Running org.apache.hadoop.hbase.regionserver.TestKeyValueScanFixture
    Tests run: 1, Failures: 0, Errors: 0, Skipped: 0, Time elapsed: 0.019 sec
    Running org.apache.hadoop.hbase.rest.model.TestTableListModel
    Tests run: 3, Failures: 0, Errors: 0, Skipped: 0, Time elapsed: 0.098 sec
    Running org.apache.hadoop.hbase.rest.model.TestColumnSchemaModel
    Tests run: 2, Failures: 0, Errors: 0, Skipped: 0, Time elapsed: 0.031 sec
    Running org.apache.hadoop.hbase.regionserver.TestStoreFile
    Tests run: 7, Failures: 0, Errors: 0, Skipped: 0, Time elapsed: 24.601 sec
    Running org.apache.hadoop.hbase.zookeeper.TestZooKeeperNodeTracker
    Tests run: 2, Failures: 0, Errors: 0, Skipped: 0, Time elapsed: 0.297 sec
    Running org.apache.hadoop.hbase.rest.model.TestScannerModel
    Tests run: 3, Failures: 0, Errors: 0, Skipped: 0, Time elapsed: 0.115 sec
    Running org.apache.hadoop.hbase.regionserver.wal.TestHLogMethods
    Tests run: 3, Failures: 0, Errors: 0, Skipped: 0, Time elapsed: 0.299 sec
    Running org.apache.hadoop.hbase.rest.TestVersionResource
    Tests run: 7, Failures: 0, Errors: 0, Skipped: 0, Time elapsed: 14.719 sec
    Running org.apache.hadoop.hbase.regionserver.TestHRegionServerBulkLoad
    Tests run: 1, Failures: 0, Errors: 0, Skipped: 0, Time elapsed: 46.504 sec
    Running org.apache.hadoop.hbase.filter.TestFilter
    Tests run: 18, Failures: 0, Errors: 0, Skipped: 0, Time elapsed: 1.697 sec
    Running org.apache.hadoop.hbase.regionserver.TestWideScanner
    Tests run: 1, Failures: 0, Errors: 0, Skipped: 0, Time elapsed: 14.609 sec
    Running org.apache.hadoop.hbase.regionserver.TestSplitTransaction
    Tests run: 6, Failures: 0, Errors: 0, Skipped: 0, Time elapsed: 2.216 sec
    Running org.apache.hadoop.hbase.replication.regionserver.TestReplicationSink
    Tests run: 5, Failures: 0, Errors: 0, Skipped: 0, Time elapsed: 20.194 sec
    Running org.apache.hadoop.hbase.util.TestMergeTable
    Tests run: 1, Failures: 0, Errors: 0, Skipped: 0, Time elapsed: 35.256 sec
    Running org.apache.hadoop.hbase.regionserver.TestReadWriteConsistencyControl
    Tests run: 1, Failures: 0, Errors: 0, Skipped: 0, Time elapsed: 10.035 sec
    Running org.apache.hadoop.hbase.regionserver.TestGetClosestAtOrBefore
    Tests run: 3, Failures: 0, Errors: 0, Skipped: 0, Time elapsed: 6.325 sec
    Running org.apache.hadoop.hbase.rest.model.TestVersionModel
    Tests run: 3, Failures: 0, Errors: 0, Skipped: 0, Time elapsed: 0.098 sec
    Running org.apache.hadoop.hbase.rest.model.TestCellSetModel
    Tests run: 3, Failures: 0, Errors: 0, Skipped: 0, Time elapsed: 0.105 sec
    Running org.apache.hadoop.hbase.rest.model.TestStorageClusterStatusModel
    Tests run: 3, Failures: 0, Errors: 0, Skipped: 0, Time elapsed: 0.104 sec
    Running org.apache.hadoop.hbase.rest.client.TestRemoteTable
    Tests run: 3, Failures: 0, Errors: 0, Skipped: 0, Time elapsed: 21.89 sec
    Running org.apache.hadoop.hbase.avro.TestAvroServer
    Tests run: 3, Failures: 0, Errors: 3, Skipped: 0, Time elapsed: 15.156 sec <<< FAILURE!
    Running org.apache.hadoop.hbase.TestFullLogReconstruction
    Tests run: 1, Failures: 0, Errors: 0, Skipped: 0, Time elapsed: 51.592 sec
    Running org.apache.hadoop.hbase.TestSerialization
    Tests run: 19, Failures: 0, Errors: 0, Skipped: 0, Time elapsed: 0.047 sec
    Running org.apache.hadoop.hbase.regionserver.TestKeyValueHeap
    Tests run: 3, Failures: 0, Errors: 0, Skipped: 0, Time elapsed: 0.061 sec
    Running org.apache.hadoop.hbase.regionserver.TestStoreScanner
    Tests run: 14, Failures: 0, Errors: 0, Skipped: 0, Time elapsed: 0.024 sec
    Running org.apache.hadoop.hbase.TestHMsg
    Tests run: 2, Failures: 0, Errors: 0, Skipped: 0, Time elapsed: 0.017 sec
    Running org.apache.hadoop.hbase.io.hfile.TestReseekTo
    Tests run: 1, Failures: 0, Errors: 0, Skipped: 0, Time elapsed: 0.129 sec
    Running org.apache.hadoop.hbase.mapreduce.TestLoadIncrementalHFilesSplitRecovery
    Tests run: 4, Failures: 0, Errors: 0, Skipped: 0, Time elapsed: 24.358 sec
    Running org.apache.hadoop.hbase.util.TestIncrementingEnvironmentEdge
    Tests run: 1, Failures: 0, Errors: 0, Skipped: 0, Time elapsed: 0.012 sec
    Running org.apache.hadoop.hbase.util.TestKeying
    Tests run: 1, Failures: 0, Errors: 0, Skipped: 0, Time elapsed: 0.012 sec
    Running org.apache.hadoop.hbase.regionserver.TestHRegionInfo
    Tests run: 3, Failures: 0, Errors: 0, Skipped: 0, Time elapsed: 0.014 sec
    Running org.apache.hadoop.hbase.regionserver.TestScanner
    Tests run: 6, Failures: 0, Errors: 0, Skipped: 0, Time elapsed: 44.225 sec
    Running org.apache.hadoop.hbase.util.TestHBaseFsck
    Tests run: 21, Failures: 0, Errors: 0, Skipped: 0, Time elapsed: 160.666 sec
    Running org.apache.hadoop.hbase.master.TestRestartCluster
    Tests run: 2, Failures: 0, Errors: 0, Skipped: 0, Time elapsed: 47.566 sec
    Running org.apache.hadoop.hbase.client.TestShell
    Tests run: 1, Failures: 0, Errors: 0, Skipped: 0, Time elapsed: 32.178 sec
    Running org.apache.hadoop.hbase.rest.model.TestTableInfoModel
    Tests run: 3, Failures: 0, Errors: 0, Skipped: 0, Time elapsed: 0.103 sec
    Running org.apache.hadoop.hbase.TestInfoServers
    Tests run: 1, Failures: 0, Errors: 0, Skipped: 0, Time elapsed: 12.189 sec
    Running org.apache.hadoop.hbase.master.TestLogsCleaner
    Tests run: 1, Failures: 0, Errors: 0, Skipped: 0, Time elapsed: 0.567 sec
    Running org.apache.hadoop.hbase.regionserver.TestMasterAddressManager
    Tests run: 1, Failures: 0, Errors: 0, Skipped: 0, Time elapsed: 0.159 sec
    Running org.apache.hadoop.hbase.catalog.TestCatalogTrackerOnCluster
    Tests run: 1, Failures: 0, Errors: 0, Skipped: 0, Time elapsed: 204.794 sec
    Running org.apache.hadoop.hbase.regionserver.TestQueryMatcher
    Tests run: 4, Failures: 0, Errors: 0, Skipped: 0, Time elapsed: 0.057 sec
    Running org.apache.hadoop.hbase.zookeeper.TestZKTable
    Tests run: 1, Failures: 0, Errors: 0, Skipped: 0, Time elapsed: 0.174 sec
    Running org.apache.hadoop.hbase.client.TestAdmin
    Tests run: 24, Failures: 0, Errors: 0, Skipped: 0, Time elapsed: 210.901 sec
    Running org.apache.hadoop.hbase.util.TestMergeTool
    Tests run: 1, Failures: 0, Errors: 0, Skipped: 0, Time elapsed: 16.875 sec
    Running org.apache.hadoop.hbase.regionserver.TestPriorityCompactionQueue
    Tests run: 1, Failures: 0, Errors: 0, Skipped: 0, Time elapsed: 1.099 sec
    Running org.apache.hadoop.hbase.TestAcidGuarantees
    Tests run: 3, Failures: 0, Errors: 0, Skipped: 3, Time elapsed: 0.012 sec
    Running org.apache.hadoop.hbase.util.TestBase64
    Tests run: 1, Failures: 0, Errors: 0, Skipped: 0, Time elapsed: 0.014 sec
    Running org.apache.hadoop.hbase.regionserver.TestMemStore
    Tests run: 21, Failures: 0, Errors: 0, Skipped: 0, Time elapsed: 39.051 sec
    Running org.apache.hadoop.hbase.rest.TestScannerResource
    Tests run: 5, Failures: 0, Errors: 0, Skipped: 0, Time elapsed: 41.06 sec
    Running org.apache.hadoop.hbase.io.hfile.TestLruBlockCache
    Tests run: 7, Failures: 0, Errors: 0, Skipped: 0, Time elapsed: 1.065 sec
    Running org.apache.hadoop.hbase.master.TestDeadServer
    Tests run: 1, Failures: 0, Errors: 0, Skipped: 0, Time elapsed: 0.015 sec
    Running org.apache.hadoop.hbase.rest.TestGzipFilter
    Tests run: 3, Failures: 0, Errors: 0, Skipped: 0, Time elapsed: 17.026 sec
    Running org.apache.hadoop.hbase.TestKeyValue
    Tests run: 14, Failures: 0, Errors: 0, Skipped: 0, Time elapsed: 0.022 sec
    Running org.apache.hadoop.hbase.mapreduce.TestTableMapReduce
    Tests run: 2, Failures: 0, Errors: 0, Skipped: 0, Time elapsed: 112.313 sec
    Running org.apache.hadoop.hbase.client.TestMultiParallel
    Tests run: 10, Failures: 0, Errors: 0, Skipped: 0, Time elapsed: 22.851 sec
    Running org.apache.hadoop.hbase.master.TestMaster
    Tests run: 1, Failures: 0, Errors: 0, Skipped: 0, Time elapsed: 73.464 sec
    Running org.apache.hadoop.hbase.master.TestRollingRestart
    Tests run: 1, Failures: 0, Errors: 0, Skipped: 0, Time elapsed: 50.638 sec
    Running org.apache.hadoop.hbase.client.TestResult
    Tests run: 3, Failures: 0, Errors: 0, Skipped: 0, Time elapsed: 0.056 sec
    Running org.apache.hadoop.hbase.client.TestHTablePool
    Tests run: 5, Failures: 0, Errors: 0, Skipped: 0, Time elapsed: 16.463 sec
    Running org.apache.hadoop.hbase.master.TestOpenedRegionHandler
    Tests run: 2, Failures: 0, Errors: 0, Skipped: 0, Time elapsed: 18.246 sec
    Running org.apache.hadoop.hbase.util.TestByteBloomFilter
    Tests run: 3, Failures: 0, Errors: 0, Skipped: 0, Time elapsed: 1.048 sec
    Running org.apache.hadoop.hbase.rest.model.TestTableSchemaModel
    Tests run: 3, Failures: 0, Errors: 0, Skipped: 0, Time elapsed: 0.105 sec
    Running org.apache.hadoop.hbase.filter.TestFilterList
    Tests run: 4, Failures: 0, Errors: 0, Skipped: 0, Time elapsed: 0.033 sec
    Running org.apache.hadoop.hbase.mapreduce.TestTableInputFormatScan
    Tests run: 11, Failures: 0, Errors: 0, Skipped: 0, Time elapsed: 331.789 sec
    Running org.apache.hadoop.hbase.regionserver.TestHRegion
    Tests run: 54, Failures: 0, Errors: 0, Skipped: 0, Time elapsed: 10.839 sec
    Running org.apache.hadoop.hbase.rest.model.TestTableRegionModel
    Tests run: 4, Failures: 0, Errors: 0, Skipped: 0, Time elapsed: 0.025 sec
    Running org.apache.hadoop.hbase.master.TestMasterFailover
    Tests run: 4, Failures: 0, Errors: 0, Skipped: 0, Time elapsed: 69.714 sec
    Running org.apache.hadoop.hbase.client.TestTimestampsFilter
    Tests run: 3, Failures: 0, Errors: 0, Skipped: 0, Time elapsed: 28.086 sec
    Running org.apache.hadoop.hbase.util.TestRootPath
    Tests run: 1, Failures: 0, Errors: 0, Skipped: 0, Time elapsed: 0.016 sec
    Running org.apache.hadoop.hbase.master.TestLoadBalancer
    Tests run: 7, Failures: 0, Errors: 0, Skipped: 0, Time elapsed: 1.594 sec
    Running org.apache.hadoop.hbase.mapred.TestTableMapReduce
    Tests run: 1, Failures: 0, Errors: 0, Skipped: 0, Time elapsed: 53.821 sec
    Running org.apache.hadoop.hbase.client.TestScannerTimeout
    Tests run: 4, Failures: 0, Errors: 0, Skipped: 0, Time elapsed: 45.467 sec
    Running org.apache.hadoop.hbase.regionserver.wal.TestWALObserver
    Tests run: 1, Failures: 0, Errors: 0, Skipped: 0, Time elapsed: 0.149 sec
    Running org.apache.hadoop.hbase.util.TestBytes
    Tests run: 10, Failures: 0, Errors: 0, Skipped: 0, Time elapsed: 0.017 sec
    Running org.apache.hadoop.hbase.replication.regionserver.TestReplicationSourceManager
    Tests run: 1, Failures: 0, Errors: 0, Skipped: 0, Time elapsed: 0.411 sec
    Running org.apache.hadoop.hbase.master.TestActiveMasterManager
    Tests run: 2, Failures: 0, Errors: 0, Skipped: 0, Time elapsed: 0.22 sec
    Running org.apache.hadoop.hbase.util.TestCompressionTest
    Tests run: 1, Failures: 0, Errors: 0, Skipped: 0, Time elapsed: 0.028 sec
    Running org.apache.hadoop.hbase.filter.TestDependentColumnFilter
    Tests run: 2, Failures: 0, Errors: 0, Skipped: 0, Time elapsed: 0.173 sec
    Running org.apache.hadoop.hbase.client.TestGetRowVersions
    Tests run: 1, Failures: 0, Errors: 0, Skipped: 0, Time elapsed: 30.423 sec
    Running org.apache.hadoop.hbase.rest.model.TestCellModel
    Tests run: 3, Failures: 0, Errors: 0, Skipped: 0, Time elapsed: 0.098 sec
    Running org.apache.hadoop.hbase.replication.TestReplicationSource
    Tests run: 1, Failures: 0, Errors: 0, Skipped: 0, Time elapsed: 11.063 sec
    Running org.apache.hadoop.hbase.master.TestCatalogJanitor
    Tests run: 2, Failures: 0, Errors: 0, Skipped: 0, Time elapsed: 0.343 sec
    Running org.apache.hadoop.hbase.catalog.TestCatalogTracker
    Tests run: 9, Failures: 0, Errors: 0, Skipped: 0, Time elapsed: 3.211 sec
    Running org.apache.hadoop.hbase.util.TestRegionSplitCalculator
    Tests run: 15, Failures: 0, Errors: 0, Skipped: 0, Time elapsed: 0.061 sec
    Running org.apache.hadoop.hbase.rest.TestRowResource
    Tests run: 11, Failures: 0, Errors: 0, Skipped: 0, Time elapsed: 16.557 sec
    Running org.apache.hadoop.hbase.io.hfile.TestHFile
    Tests run: 7, Failures: 0, Errors: 0, Skipped: 0, Time elapsed: 0.195 sec
    Running org.apache.hadoop.hbase.catalog.TestMetaReaderEditor
    Tests run: 4, Failures: 0, Errors: 0, Skipped: 0, Time elapsed: 18.08 sec
    Running org.apache.hadoop.hbase.util.TestStrings
    Tests run: 1, Failures: 0, Errors: 0, Skipped: 0, Time elapsed: 0.013 sec
    Running org.apache.hadoop.hbase.util.TestHBaseFsckComparator
    Tests run: 7, Failures: 0, Errors: 0, Skipped: 0, Time elapsed: 0.131 sec
    Running org.apache.hadoop.hbase.mapreduce.TestImportTsv
    Tests run: 7, Failures: 0, Errors: 0, Skipped: 0, Time elapsed: 60.553 sec
    Running org.apache.hadoop.hbase.rest.client.TestRemoteAdmin
    Tests run: 2, Failures: 0, Errors: 0, Skipped: 0, Time elapsed: 48.928 sec
    Running org.apache.hadoop.hbase.regionserver.wal.TestHLog
    Tests run: 8, Failures: 0, Errors: 0, Skipped: 0, Time elapsed: 73.246 sec
    Running org.apache.hadoop.hbase.client.TestTimestamp
    Tests run: 1, Failures: 0, Errors: 0, Skipped: 0, Time elapsed: 12.903 sec
    Running org.apache.hadoop.hbase.TestScanMultipleVersions
    Tests run: 1, Failures: 0, Errors: 0, Skipped: 0, Time elapsed: 12.118 sec
    Running org.apache.hadoop.hbase.rest.model.TestStorageClusterVersionModel
    Tests run: 2, Failures: 0, Errors: 0, Skipped: 0, Time elapsed: 0.024 sec
    Running org.apache.hadoop.hbase.client.TestHCM
    Tests run: 4, Failures: 0, Errors: 0, Skipped: 0, Time elapsed: 26.44 sec

    Results :

    Tests in error:

    Tests run: 734, Failures: 0, Errors: 3, Skipped: 9

    [INFO] ------------------------------------------------------------------------
    [INFO] BUILD FAILURE
    [INFO] ------------------------------------------------------------------------
    [INFO] Total time: 1:12:40.124s
    [INFO] Finished at: Sat Aug 04 18:29:20 UTC 2012
    [INFO] Final Memory: 35M/728M
    [INFO] ------------------------------------------------------------------------
    [ERROR] Failed to execute goal org.apache.maven.plugins:maven-surefire-plugin:2.4.3:test (default-test) on project hbase: There are test failures.
    [ERROR]
    [ERROR] Please refer to /x1/jenkins/jenkins-slave/workspace/hbase-0.90/trunk/target/surefire-reports for the individual test results.
    [ERROR] -> [Help 1]
    [ERROR]
    [ERROR] To see the full stack trace of the errors, re-run Maven with the -e switch.
    [ERROR] Re-run Maven using the -X switch to enable full debug logging.
    [ERROR]
    [ERROR] For more information about the errors and possible solutions, please read the following articles:
    [ERROR] [Help 1] http://cwiki.apache.org/confluence/display/MAVEN/MojoFailureException
    Build step 'Invoke top-level Maven targets' marked build as failure
    [locks-and-latches] Releasing all the locks
    [locks-and-latches] All the locks released
    Archiving artifacts
    Recording test results
  • Apache Jenkins Server at Aug 20, 2012 at 11:37 pm
    See <https://builds.apache.org/job/hbase-0.90/522/changes>

    Changes:

    [jmhsieh] HBASE-5714 Add write permissions check before any hbck run that modifies hdfs (Liang Xie)

    ------------------------------------------
    [...truncated 1289 lines...]
    Tests run: 3, Failures: 0, Errors: 0, Skipped: 0, Time elapsed: 6.488 sec
    Running org.apache.hadoop.hbase.rest.model.TestVersionModel
    Tests run: 3, Failures: 0, Errors: 0, Skipped: 0, Time elapsed: 0.1 sec
    Running org.apache.hadoop.hbase.rest.model.TestCellSetModel
    Tests run: 3, Failures: 0, Errors: 0, Skipped: 0, Time elapsed: 0.103 sec
    Running org.apache.hadoop.hbase.rest.model.TestStorageClusterStatusModel
    Tests run: 3, Failures: 0, Errors: 0, Skipped: 0, Time elapsed: 0.105 sec
    Running org.apache.hadoop.hbase.rest.client.TestRemoteTable
    Tests run: 3, Failures: 0, Errors: 0, Skipped: 0, Time elapsed: 25.336 sec
    Running org.apache.hadoop.hbase.avro.TestAvroServer
    Tests run: 3, Failures: 0, Errors: 3, Skipped: 0, Time elapsed: 14.978 sec <<< FAILURE!
    Running org.apache.hadoop.hbase.TestFullLogReconstruction
    Tests run: 1, Failures: 0, Errors: 0, Skipped: 0, Time elapsed: 52.677 sec
    Running org.apache.hadoop.hbase.TestSerialization
    Tests run: 19, Failures: 0, Errors: 0, Skipped: 0, Time elapsed: 0.058 sec
    Running org.apache.hadoop.hbase.regionserver.TestKeyValueHeap
    Tests run: 3, Failures: 0, Errors: 0, Skipped: 0, Time elapsed: 0.067 sec
    Running org.apache.hadoop.hbase.regionserver.TestStoreScanner
    Tests run: 14, Failures: 0, Errors: 0, Skipped: 0, Time elapsed: 0.025 sec
    Running org.apache.hadoop.hbase.TestHMsg
    Tests run: 2, Failures: 0, Errors: 0, Skipped: 0, Time elapsed: 0.018 sec
    Running org.apache.hadoop.hbase.io.hfile.TestReseekTo
    Tests run: 1, Failures: 0, Errors: 0, Skipped: 0, Time elapsed: 0.168 sec
    Running org.apache.hadoop.hbase.mapreduce.TestLoadIncrementalHFilesSplitRecovery
    Tests run: 4, Failures: 0, Errors: 0, Skipped: 0, Time elapsed: 24.367 sec
    Running org.apache.hadoop.hbase.util.TestIncrementingEnvironmentEdge
    Tests run: 1, Failures: 0, Errors: 0, Skipped: 0, Time elapsed: 0.013 sec
    Running org.apache.hadoop.hbase.util.TestKeying
    Tests run: 1, Failures: 0, Errors: 0, Skipped: 0, Time elapsed: 0.019 sec
    Running org.apache.hadoop.hbase.regionserver.TestHRegionInfo
    Tests run: 3, Failures: 0, Errors: 0, Skipped: 0, Time elapsed: 0.013 sec
    Running org.apache.hadoop.hbase.regionserver.TestScanner
    Tests run: 6, Failures: 0, Errors: 0, Skipped: 0, Time elapsed: 62.719 sec
    Running org.apache.hadoop.hbase.util.TestHBaseFsck
    Tests run: 21, Failures: 0, Errors: 0, Skipped: 0, Time elapsed: 154.87 sec
    Running org.apache.hadoop.hbase.master.TestRestartCluster
    Tests run: 2, Failures: 0, Errors: 0, Skipped: 0, Time elapsed: 39.503 sec
    Running org.apache.hadoop.hbase.client.TestShell
    Tests run: 1, Failures: 0, Errors: 0, Skipped: 0, Time elapsed: 33.757 sec
    Running org.apache.hadoop.hbase.rest.model.TestTableInfoModel
    Tests run: 3, Failures: 0, Errors: 0, Skipped: 0, Time elapsed: 0.102 sec
    Running org.apache.hadoop.hbase.TestInfoServers
    Tests run: 1, Failures: 0, Errors: 0, Skipped: 0, Time elapsed: 12.207 sec
    Running org.apache.hadoop.hbase.master.TestLogsCleaner
    Tests run: 1, Failures: 0, Errors: 0, Skipped: 0, Time elapsed: 0.567 sec
    Running org.apache.hadoop.hbase.regionserver.TestMasterAddressManager
    Tests run: 1, Failures: 0, Errors: 0, Skipped: 0, Time elapsed: 0.166 sec
    Running org.apache.hadoop.hbase.catalog.TestCatalogTrackerOnCluster
    Tests run: 1, Failures: 0, Errors: 0, Skipped: 0, Time elapsed: 205.299 sec
    Running org.apache.hadoop.hbase.regionserver.TestQueryMatcher
    Tests run: 4, Failures: 0, Errors: 0, Skipped: 0, Time elapsed: 0.06 sec
    Running org.apache.hadoop.hbase.zookeeper.TestZKTable
    Tests run: 1, Failures: 0, Errors: 0, Skipped: 0, Time elapsed: 0.161 sec
    Running org.apache.hadoop.hbase.client.TestAdmin
    Tests run: 24, Failures: 0, Errors: 0, Skipped: 0, Time elapsed: 206.904 sec
    Running org.apache.hadoop.hbase.util.TestMergeTool
    Tests run: 1, Failures: 0, Errors: 0, Skipped: 0, Time elapsed: 17.25 sec
    Running org.apache.hadoop.hbase.regionserver.TestPriorityCompactionQueue
    Tests run: 1, Failures: 0, Errors: 0, Skipped: 0, Time elapsed: 1.104 sec
    Running org.apache.hadoop.hbase.TestAcidGuarantees
    Tests run: 3, Failures: 0, Errors: 0, Skipped: 3, Time elapsed: 0.012 sec
    Running org.apache.hadoop.hbase.util.TestBase64
    Tests run: 1, Failures: 0, Errors: 0, Skipped: 0, Time elapsed: 0.014 sec
    Running org.apache.hadoop.hbase.regionserver.TestMemStore
    Tests run: 21, Failures: 0, Errors: 0, Skipped: 0, Time elapsed: 40.393 sec
    Running org.apache.hadoop.hbase.rest.TestScannerResource
    Tests run: 5, Failures: 0, Errors: 0, Skipped: 0, Time elapsed: 38.911 sec
    Running org.apache.hadoop.hbase.io.hfile.TestLruBlockCache
    Tests run: 7, Failures: 0, Errors: 0, Skipped: 0, Time elapsed: 1.065 sec
    Running org.apache.hadoop.hbase.master.TestDeadServer
    Tests run: 1, Failures: 0, Errors: 0, Skipped: 0, Time elapsed: 0.015 sec
    Running org.apache.hadoop.hbase.rest.TestGzipFilter
    Tests run: 3, Failures: 0, Errors: 0, Skipped: 0, Time elapsed: 16.593 sec
    Running org.apache.hadoop.hbase.TestKeyValue
    Tests run: 14, Failures: 0, Errors: 0, Skipped: 0, Time elapsed: 0.023 sec
    Running org.apache.hadoop.hbase.mapreduce.TestTableMapReduce
    Tests run: 2, Failures: 0, Errors: 0, Skipped: 0, Time elapsed: 49.088 sec
    Running org.apache.hadoop.hbase.client.TestMultiParallel
    Tests run: 10, Failures: 0, Errors: 0, Skipped: 0, Time elapsed: 24.873 sec
    Running org.apache.hadoop.hbase.master.TestMaster
    Tests run: 1, Failures: 0, Errors: 0, Skipped: 0, Time elapsed: 73.056 sec
    Running org.apache.hadoop.hbase.master.TestRollingRestart
    Running org.apache.hadoop.hbase.client.TestResult
    Tests run: 3, Failures: 0, Errors: 0, Skipped: 0, Time elapsed: 0.056 sec
    Running org.apache.hadoop.hbase.client.TestHTablePool
    Tests run: 5, Failures: 0, Errors: 0, Skipped: 0, Time elapsed: 16.316 sec
    Running org.apache.hadoop.hbase.master.TestOpenedRegionHandler
    Tests run: 2, Failures: 0, Errors: 0, Skipped: 0, Time elapsed: 18.174 sec
    Running org.apache.hadoop.hbase.util.TestByteBloomFilter
    Tests run: 3, Failures: 0, Errors: 0, Skipped: 0, Time elapsed: 1.099 sec
    Running org.apache.hadoop.hbase.rest.model.TestTableSchemaModel
    Tests run: 3, Failures: 0, Errors: 0, Skipped: 0, Time elapsed: 0.124 sec
    Running org.apache.hadoop.hbase.filter.TestFilterList
    Tests run: 4, Failures: 0, Errors: 0, Skipped: 0, Time elapsed: 0.031 sec
    Running org.apache.hadoop.hbase.mapreduce.TestTableInputFormatScan
    Tests run: 11, Failures: 0, Errors: 0, Skipped: 0, Time elapsed: 310.608 sec
    Running org.apache.hadoop.hbase.regionserver.TestHRegion
    Tests run: 54, Failures: 0, Errors: 0, Skipped: 0, Time elapsed: 11.074 sec
    Running org.apache.hadoop.hbase.rest.model.TestTableRegionModel
    Tests run: 4, Failures: 0, Errors: 0, Skipped: 0, Time elapsed: 0.033 sec
    Running org.apache.hadoop.hbase.master.TestMasterFailover
    Tests run: 4, Failures: 0, Errors: 0, Skipped: 0, Time elapsed: 69.045 sec
    Running org.apache.hadoop.hbase.client.TestTimestampsFilter
    Tests run: 3, Failures: 0, Errors: 0, Skipped: 0, Time elapsed: 27.049 sec
    Running org.apache.hadoop.hbase.util.TestRootPath
    Tests run: 1, Failures: 0, Errors: 0, Skipped: 0, Time elapsed: 0.017 sec
    Running org.apache.hadoop.hbase.master.TestLoadBalancer
    Tests run: 7, Failures: 0, Errors: 0, Skipped: 0, Time elapsed: 1.614 sec
    Running org.apache.hadoop.hbase.mapred.TestTableMapReduce
    Tests run: 1, Failures: 0, Errors: 0, Skipped: 0, Time elapsed: 31.538 sec
    Running org.apache.hadoop.hbase.client.TestScannerTimeout
    Tests run: 4, Failures: 0, Errors: 0, Skipped: 0, Time elapsed: 44.647 sec
    Running org.apache.hadoop.hbase.regionserver.wal.TestWALObserver
    Tests run: 1, Failures: 0, Errors: 0, Skipped: 0, Time elapsed: 0.139 sec
    Running org.apache.hadoop.hbase.util.TestBytes
    Tests run: 10, Failures: 0, Errors: 0, Skipped: 0, Time elapsed: 0.017 sec
    Running org.apache.hadoop.hbase.replication.regionserver.TestReplicationSourceManager
    Tests run: 1, Failures: 0, Errors: 0, Skipped: 0, Time elapsed: 0.485 sec
    Running org.apache.hadoop.hbase.master.TestActiveMasterManager
    Tests run: 2, Failures: 0, Errors: 0, Skipped: 0, Time elapsed: 0.225 sec
    Running org.apache.hadoop.hbase.util.TestCompressionTest
    Tests run: 1, Failures: 0, Errors: 0, Skipped: 0, Time elapsed: 0.019 sec
    Running org.apache.hadoop.hbase.filter.TestDependentColumnFilter
    Tests run: 2, Failures: 0, Errors: 0, Skipped: 0, Time elapsed: 0.176 sec
    Running org.apache.hadoop.hbase.client.TestGetRowVersions
    Tests run: 1, Failures: 0, Errors: 0, Skipped: 0, Time elapsed: 34.915 sec
    Running org.apache.hadoop.hbase.rest.model.TestCellModel
    Tests run: 3, Failures: 0, Errors: 0, Skipped: 0, Time elapsed: 0.1 sec
    Running org.apache.hadoop.hbase.replication.TestReplicationSource
    Tests run: 1, Failures: 0, Errors: 0, Skipped: 0, Time elapsed: 1.091 sec
    Running org.apache.hadoop.hbase.master.TestCatalogJanitor
    Tests run: 2, Failures: 0, Errors: 0, Skipped: 0, Time elapsed: 0.379 sec
    Running org.apache.hadoop.hbase.catalog.TestCatalogTracker
    Tests run: 9, Failures: 0, Errors: 0, Skipped: 0, Time elapsed: 3.391 sec
    Running org.apache.hadoop.hbase.util.TestRegionSplitCalculator
    Tests run: 15, Failures: 0, Errors: 0, Skipped: 0, Time elapsed: 0.055 sec
    Running org.apache.hadoop.hbase.rest.TestRowResource
    Tests run: 11, Failures: 0, Errors: 0, Skipped: 0, Time elapsed: 18.275 sec
    Running org.apache.hadoop.hbase.io.hfile.TestHFile
    Tests run: 7, Failures: 0, Errors: 0, Skipped: 0, Time elapsed: 0.179 sec
    Running org.apache.hadoop.hbase.catalog.TestMetaReaderEditor
    Tests run: 4, Failures: 0, Errors: 0, Skipped: 0, Time elapsed: 18.558 sec
    Running org.apache.hadoop.hbase.util.TestStrings
    Tests run: 1, Failures: 0, Errors: 0, Skipped: 0, Time elapsed: 0.013 sec
    Running org.apache.hadoop.hbase.util.TestHBaseFsckComparator
    Tests run: 7, Failures: 0, Errors: 0, Skipped: 0, Time elapsed: 0.133 sec
    Running org.apache.hadoop.hbase.mapreduce.TestImportTsv
    Tests run: 7, Failures: 0, Errors: 0, Skipped: 0, Time elapsed: 15.622 sec
    Running org.apache.hadoop.hbase.rest.client.TestRemoteAdmin
    Tests run: 2, Failures: 0, Errors: 0, Skipped: 0, Time elapsed: 20.004 sec
    Running org.apache.hadoop.hbase.regionserver.wal.TestHLog
    Tests run: 8, Failures: 0, Errors: 0, Skipped: 0, Time elapsed: 83.298 sec
    Running org.apache.hadoop.hbase.client.TestTimestamp
    Tests run: 1, Failures: 0, Errors: 0, Skipped: 0, Time elapsed: 13.098 sec
    Running org.apache.hadoop.hbase.TestScanMultipleVersions
    Tests run: 1, Failures: 0, Errors: 0, Skipped: 0, Time elapsed: 12.532 sec
    Running org.apache.hadoop.hbase.rest.model.TestStorageClusterVersionModel
    Tests run: 2, Failures: 0, Errors: 0, Skipped: 0, Time elapsed: 0.024 sec
    Running org.apache.hadoop.hbase.client.TestHCM
    Tests run: 4, Failures: 0, Errors: 0, Skipped: 0, Time elapsed: 45.577 sec

    Results :

    Tests in error:

    Tests run: 733, Failures: 0, Errors: 3, Skipped: 9

    [INFO] ------------------------------------------------------------------------
    [INFO] BUILD FAILURE
    [INFO] ------------------------------------------------------------------------
    [INFO] Total time: 1:21:10.604s
    [INFO] Finished at: Mon Aug 20 23:37:06 UTC 2012
    [INFO] Final Memory: 36M/533M
    [INFO] ------------------------------------------------------------------------
    [ERROR] Failed to execute goal org.apache.maven.plugins:maven-surefire-plugin:2.4.3:test (default-test) on project hbase: There are test failures.
    [ERROR]
    [ERROR] Please refer to /x1/jenkins/jenkins-slave/workspace/hbase-0.90/trunk/target/surefire-reports for the individual test results.
    [ERROR] -> [Help 1]
    [ERROR]
    [ERROR] To see the full stack trace of the errors, re-run Maven with the -e switch.
    [ERROR] Re-run Maven using the -X switch to enable full debug logging.
    [ERROR]
    [ERROR] For more information about the errors and possible solutions, please read the following articles:
    [ERROR] [Help 1] http://cwiki.apache.org/confluence/display/MAVEN/MojoFailureException
    Build step 'Invoke top-level Maven targets' marked build as failure
    [locks-and-latches] Releasing all the locks
    [locks-and-latches] All the locks released
    Archiving artifacts
    Recording test results
    ERROR: Failed to archive test reports
    hudson.util.IOException2: remote file operation failed: <https://builds.apache.org/job/hbase-0.90/ws/> at hudson.remoting.Channel@41196ce4:ubuntu3
    at hudson.FilePath.act(FilePath.java:838)
    at hudson.FilePath.act(FilePath.java:824)
    at hudson.tasks.junit.JUnitParser.parse(JUnitParser.java:87)
    at hudson.tasks.junit.JUnitResultArchiver.parse(JUnitResultArchiver.java:122)
    at hudson.tasks.junit.JUnitResultArchiver.perform(JUnitResultArchiver.java:134)
    at hudson.tasks.BuildStepMonitor$1.perform(BuildStepMonitor.java:19)
    at hudson.model.AbstractBuild$AbstractBuildExecution.perform(AbstractBuild.java:717)
    at hudson.model.AbstractBuild$AbstractBuildExecution.performAllBuildSteps(AbstractBuild.java:692)
    at hudson.model.Build$BuildExecution.post2(Build.java:183)
    at hudson.model.AbstractBuild$AbstractBuildExecution.post(AbstractBuild.java:639)
    at hudson.model.Run.execute(Run.java:1513)
    at hudson.model.FreeStyleBuild.run(FreeStyleBuild.java:46)
    at hudson.model.ResourceController.execute(ResourceController.java:88)
    at hudson.model.Executor.run(Executor.java:236)
    Caused by: hudson.util.IOException2: Failed to read (TestResult.java:244)
    at hudson.tasks.junit.TestResult.parse(TestResult.java:163)
    at hudson.tasks.junit.TestResult.parse(TestResult.java:140)
    at hudson.tasks.junit.TestResult.(JUnitParser.java:117)
    at hudson.tasks.junit.JUnitParser$ParseResultCallable.invoke(JUnitParser.java:90)
    at hudson.FilePath$FileCallableWrapper.call(FilePath.java:2196)
    at hudson.remoting.UserRequest.perform(UserRequest.java:118)
    at hudson.remoting.UserRequest.perform(UserRequest.java:48)
    at hudson.remoting.Request$2.run(Request.java:326)
    at hudson.remoting.InterceptingExecutorService$1.call(InterceptingExecutorService.java:72)
    at java.util.concurrent.FutureTask$Sync.innerRun(FutureTask.java:303)
    at java.util.concurrent.FutureTask.run(FutureTask.java:138)
    at java.util.concurrent.ThreadPoolExecutor$Worker.runTask(ThreadPoolExecutor.java:886)
    at java.util.concurrent.ThreadPoolExecutor$Worker.run(ThreadPoolExecutor.java:908)
    at java.lang.Thread.run(Thread.java:662)
    Caused by: org.dom4j.DocumentException: Error on line 101 of document file://<https://builds.apache.org/job/hbase-0.90/522/artifact/trunk/target/surefire-reports/TEST-org.apache.hadoop.hbase.master.TestRollingRestart.xml> : XML document structures must start and end within the same entity. Nested exception: XML document structures must start and end within the same entity.
    at org.dom4j.io.SAXReader.read(SAXReader.java:482)
    at org.dom4j.io.SAXReader.read(SAXReader.java:264)
    at hudson.tasks.junit.SuiteResult.parse(SuiteResult.java:112)
    at hudson.tasks.junit.TestResult.parse(TestResult.java:227)
    ... 15 more
    Caused by: org.xml.sax.SAXParseException; systemId: file://<https://builds.apache.org/job/hbase-0.90/522/artifact/trunk/target/surefire-reports/TEST-org.apache.hadoop.hbase.master.TestRollingRestart.xml;> lineNumber: 101; columnNumber: 17; XML document structures must start and end within the same entity.
    at com.sun.org.apache.xerces.internal.util.ErrorHandlerWrapper.createSAXParseException(ErrorHandlerWrapper.java:195)
    at com.sun.org.apache.xerces.internal.util.ErrorHandlerWrapper.fatalError(ErrorHandlerWrapper.java:174)
    at com.sun.org.apache.xerces.internal.impl.XMLErrorReporter.reportError(XMLErrorReporter.java:388)
    at com.sun.org.apache.xerces.internal.impl.XMLScanner.reportFatalError(XMLScanner.java:1414)
    at com.sun.org.apache.xerces.internal.impl.XMLDocumentFragmentScannerImpl.endEntity(XMLDocumentFragmentScannerImpl.java:905)
    at com.sun.org.apache.xerces.internal.impl.XMLDocumentScannerImpl.endEntity(XMLDocumentScannerImpl.java:605)
    at com.sun.org.apache.xerces.internal.impl.XMLEntityManager.endEntity(XMLEntityManager.java:1393)
    at com.sun.org.apache.xerces.internal.impl.XMLEntityScanner.load(XMLEntityScanner.java:1763)
    at com.sun.org.apache.xerces.internal.impl.XMLEntityScanner.peekChar(XMLEntityScanner.java:487)
    at com.sun.org.apache.xerces.internal.impl.XMLDocumentFragmentScannerImpl$FragmentContentDriver.next(XMLDocumentFragmentScannerImpl.java:2687)
    at com.sun.org.apache.xerces.internal.impl.XMLDocumentScannerImpl.next(XMLDocumentScannerImpl.java:648)
    at com.sun.org.apache.xerces.internal.impl.XMLNSDocumentScannerImpl.next(XMLNSDocumentScannerImpl.java:140)
    at com.sun.org.apache.xerces.internal.impl.XMLDocumentFragmentScannerImpl.scanDocument(XMLDocumentFragmentScannerImpl.java:511)
    at com.sun.org.apache.xerces.internal.parsers.XML11Configuration.parse(XML11Configuration.java:808)
    at com.sun.org.apache.xerces.internal.parsers.XML11Configuration.parse(XML11Configuration.java:737)
    at com.sun.org.apache.xerces.internal.parsers.XMLParser.parse(XMLParser.java:119)
    at com.sun.org.apache.xerces.internal.parsers.AbstractSAXParser.parse(AbstractSAXParser.java:1205)
    at com.sun.org.apache.xerces.internal.jaxp.SAXParserImpl$JAXPSAXParser.parse(SAXParserImpl.java:522)
    at org.dom4j.io.SAXReader.read(SAXReader.java:465)
    ... 18 more
  • Apache Jenkins Server at Aug 27, 2012 at 5:42 pm
    See <https://builds.apache.org/job/hbase-0.90/523/changes>

    Changes:

    [Tedyu] HBASE-6661 Mark single parameter HTable constructors as deprecated in 0.90 and 0.92

    ------------------------------------------
    [...truncated 908 lines...]
    AU src/site/resources/images/hbase_small.gif
    A src/site/resources/css
    A src/site/resources/css/freebsd_docbook.css
    A src/site/resources/css/site.css
    A src/site/xdoc
    A src/site/xdoc/cygwin.xml
    A src/site/xdoc/acid-semantics.xml
    A src/site/xdoc/metrics.xml
    A src/site/xdoc/index.xml
    A src/site/xdoc/replication.xml
    A src/site/xdoc/old_news.xml
    A src/site/xdoc/bulk-loads.xml
    A src/site/xdoc/pseudo-distributed.xml
    A src/docbkx
    A src/docbkx/upgrading.xml
    A src/docbkx/performance.xml
    A src/docbkx/developer.xml
    A src/docbkx/preface.xml
    A src/docbkx/configuration.xml
    A src/docbkx/getting_started.xml
    A src/docbkx/shell.xml
    A src/docbkx/troubleshooting.xml
    A src/docbkx/book.xml
    A src/docbkx/build.xml
    AU src/saveVersion.sh
    A src/examples
    A src/examples/thrift
    A src/examples/thrift/DemoClient.java
    A src/examples/thrift/DemoClient.cpp
    A src/examples/thrift/DemoClient.rb
    A src/examples/thrift/DemoClient.php
    AU src/examples/thrift/DemoClient.py
    A src/examples/thrift/README.txt
    A src/examples/thrift/Makefile
    A src/examples/mapreduce
    A src/examples/mapreduce/org
    A src/examples/mapreduce/org/apache
    A src/examples/mapreduce/org/apache/hadoop
    A src/examples/mapreduce/org/apache/hadoop/hbase
    A src/examples/mapreduce/org/apache/hadoop/hbase/mapreduce
    A src/examples/mapreduce/org/apache/hadoop/hbase/mapreduce/SampleUploader.java
    A src/examples/mapreduce/org/apache/hadoop/hbase/mapreduce/IndexBuilder.java
    A src/examples/mapreduce/index-builder-setup.rb
    A src/examples/README.txt
    A bin
    AU bin/hbase-daemons.sh
    A bin/rename_table.rb
    AU bin/hbase
    A bin/copy_table.rb
    A bin/check_meta.rb
    AU bin/start-hbase.sh
    A bin/hirb.rb
    A bin/set_meta_block_caching.rb
    A bin/loadtable.rb
    AU bin/hbase-daemon.sh
    A bin/region_mover.rb
    A bin/hbase-config.sh
    A bin/local-regionservers.sh
    AU bin/zookeepers.sh
    A bin/local-master-backup.sh
    A bin/add_table.rb
    AU bin/rolling-restart.sh
    AU bin/regionservers.sh
    A bin/graceful_stop.sh
    AU bin/master-backup.sh
    A bin/set_meta_memstore_size.rb
    A bin/replication
    A bin/replication/copy_tables_desc.rb
    AU bin/stop-hbase.sh
    A pom.xml
    A README.txt
    U .
    At revision 1377756
    [locks-and-latches] Checking to see if we really have the locks
    [locks-and-latches] Have all the locks, build can start
    [hbase-0.90] $ /bin/bash -xe /tmp/hudson5689012931933690577.sh
    + hostname
    hemera
    + ulimit -a
    core file size (blocks, -c) 0
    data seg size (kbytes, -d) unlimited
    scheduling priority (-e) 0
    file size (blocks, -f) unlimited
    pending signals (-i) 193125
    max locked memory (kbytes, -l) 64
    max memory size (kbytes, -m) unlimited
    open files (-n) 40000
    pipe size (512 bytes, -p) 8
    POSIX message queues (bytes, -q) 819200
    real-time priority (-r) 0
    stack size (kbytes, -s) 10240
    cpu time (seconds, -t) unlimited
    max user processes (-u) 193125
    virtual memory (kbytes, -v) unlimited
    file locks (-x) unlimited
    + jps
    9650 Launcher
    850 Jps
    21026 JUnitTestRunner
    20436 jar
    16890 MRAppMaster
    18087 MRAppMaster
    16274 MRAppMaster
    11888 MRAppMaster
    16459 MRAppMaster
    19304 MRAppMaster
    12531 MRAppMaster
    18959 MRAppMaster
    [trunk] $ /home/hudson/tools/maven/latest3/bin/mvn clean -Dmaven.test.redirectTestOutputToFile=true site assembly:assembly
    [INFO] Scanning for projects...
    [INFO]
    [INFO] ------------------------------------------------------------------------
    [INFO] Building HBase 0.90.7
    [INFO] ------------------------------------------------------------------------
    [INFO]
    [INFO] --- maven-clean-plugin:2.4.1:clean (default-clean) @ hbase ---
    [INFO]
    [INFO] --- xml-maven-plugin:1.0-beta-3:transform (default) @ hbase ---
    [INFO] Transforming file: /x1/jenkins/jenkins-slave/workspace/hbase-0.90/trunk/src/main/resources/hbase-default.xml
    [INFO] Transformed 1 file(s).
    [INFO]
    [INFO] --- docbkx-maven-plugin:2.0.11:generate-html (default) @ hbase ---
    [INFO] Processing input file: upgrading.xml
    [INFO] /x1/jenkins/jenkins-slave/workspace/hbase-0.90/trunk/target/site/upgrading.html has been generated.
    [INFO] Processing input file: shell.xml
    [INFO] /x1/jenkins/jenkins-slave/workspace/hbase-0.90/trunk/target/site/shell.html has been generated.
    [INFO] Processing input file: configuration.xml
    [INFO] /x1/jenkins/jenkins-slave/workspace/hbase-0.90/trunk/target/site/configuration.html has been generated.
    [INFO] Processing input file: getting_started.xml
    [INFO] /x1/jenkins/jenkins-slave/workspace/hbase-0.90/trunk/target/site/getting_started.html has been generated.
    [INFO] Processing input file: troubleshooting.xml
    [INFO] /x1/jenkins/jenkins-slave/workspace/hbase-0.90/trunk/target/site/troubleshooting.html has been generated.
    [INFO] Processing input file: build.xml
    [INFO] /x1/jenkins/jenkins-slave/workspace/hbase-0.90/trunk/target/site/build.html has been generated.
    [INFO] Processing input file: performance.xml
    [INFO] /x1/jenkins/jenkins-slave/workspace/hbase-0.90/trunk/target/site/performance.html has been generated.
    [INFO] Processing input file: developer.xml
    [INFO] /x1/jenkins/jenkins-slave/workspace/hbase-0.90/trunk/target/site/developer.html has been generated.
    [INFO] Processing input file: book.xml
    [INFO] /x1/jenkins/jenkins-slave/workspace/hbase-0.90/trunk/target/site/book.html has been generated.
    [INFO] /x1/jenkins/jenkins-slave/workspace/hbase-0.90/trunk/target/site/preface.html is up to date.
    [INFO]
    [INFO] --- maven-site-plugin:2.0.1:site (default-site) @ hbase ---
    [INFO] Unable to load parent project from a relative path: 1 problem was encountered while building the effective model
    [FATAL] Non-readable POM /x1/jenkins/jenkins-slave/workspace/hbase-0.90/pom.xml: /x1/jenkins/jenkins-slave/workspace/hbase-0.90/pom.xml (No such file or directory) @
    for project at /x1/jenkins/jenkins-slave/workspace/hbase-0.90/pom.xml for project at /x1/jenkins/jenkins-slave/workspace/hbase-0.90/pom.xml
    [INFO] Parent project loaded from repository.
    [INFO] Unable to load parent project from a relative path: 1 problem was encountered while building the effective model
    [FATAL] Non-readable POM /x1/jenkins/jenkins-slave/workspace/hbase-0.90/pom.xml: /x1/jenkins/jenkins-slave/workspace/hbase-0.90/pom.xml (No such file or directory) @
    for project at /x1/jenkins/jenkins-slave/workspace/hbase-0.90/pom.xml for project at /x1/jenkins/jenkins-slave/workspace/hbase-0.90/pom.xml
    [INFO] Parent project loaded from repository.
    Downloading: http://repository.codehaus.org/org/apache/maven/skins/maven-stylus-skin/maven-metadata.xml
    Downloading: http://people.apache.org/~rawson/repo/org/apache/maven/skins/maven-stylus-skin/maven-metadata.xml
    Downloading: http://repo1.maven.org/maven2/org/apache/maven/skins/maven-stylus-skin/maven-metadata.xml
    Downloading: http://download.java.net/maven/2/org/apache/maven/skins/maven-stylus-skin/maven-metadata.xml
    516 B



    Downloaded: http://repo1.maven.org/maven2/org/apache/maven/skins/maven-stylus-skin/maven-metadata.xml (516 B at 1.1 KB/sec)

    [INFO]
    [INFO] ------------------------------------------------------------------------
    [INFO] Building HBase 0.90.7
    [INFO] ------------------------------------------------------------------------
    [INFO]
    [INFO] >>> maven-assembly-plugin:2.2-beta-5:assembly (default-cli) @ hbase >>>
    [INFO]
    [INFO] --- maven-antrun-plugin:1.3:run (generate) @ hbase ---
    [INFO] Executing tasks
    [mkdir] Created dir: /x1/jenkins/jenkins-slave/workspace/hbase-0.90/trunk/target/hbase-webapps
    [copy] Copying 4 files to /x1/jenkins/jenkins-slave/workspace/hbase-0.90/trunk/target/hbase-webapps
    SLF4J: Failed to load class "org.slf4j.impl.StaticLoggerBinder".
    SLF4J: See http://www.slf4j.org/codes.html#StaticLoggerBinder for further details.
    2012-08-27 17:24:47.084:INFO::Logging to STDERR via org.mortbay.log.StdErrLog
    [mkdir] Created dir: /x1/jenkins/jenkins-slave/workspace/hbase-0.90/trunk/target/hbase-webapps/master/WEB-INF
    [mkdir] Created dir: /x1/jenkins/jenkins-slave/workspace/hbase-0.90/trunk/target/hbase-webapps/regionserver/WEB-INF
    [INFO] Executed tasks
    [INFO]
    [INFO] --- build-helper-maven-plugin:1.5:add-source (add-jspc-source) @ hbase ---
    [INFO] Source directory: /x1/jenkins/jenkins-slave/workspace/hbase-0.90/trunk/target/jspc added.
    [INFO]
    [INFO] --- build-helper-maven-plugin:1.5:add-source (add-package-info) @ hbase ---
    [INFO] Source directory: /x1/jenkins/jenkins-slave/workspace/hbase-0.90/trunk/target/generated-sources added.
    [INFO]
    [INFO] --- maven-remote-resources-plugin:1.1:process (default) @ hbase ---
    [INFO] Setting property: classpath.resource.loader.class => 'org.codehaus.plexus.velocity.ContextClassLoaderResourceLoader'.
    [INFO] Setting property: velocimacro.messages.on => 'false'.
    [INFO] Setting property: resource.loader => 'classpath'.
    [INFO] Setting property: resource.manager.logwhenfound => 'false'.
    [INFO]
    [INFO] --- maven-resources-plugin:2.4:resources (default-resources) @ hbase ---
    [INFO] Using 'UTF-8' encoding to copy filtered resources.
    [INFO] Copying 1 resource
    [INFO] Copying 6 resources
    [INFO] Copying 3 resources
    [INFO]
    [INFO] --- maven-antrun-plugin:1.3:run (default) @ hbase ---
    [INFO] Executing tasks
    [INFO] Executed tasks
    [INFO]
    [INFO] --- maven-compiler-plugin:2.0.2:compile (default-compile) @ hbase ---
    [INFO] Compiling 470 source files to /x1/jenkins/jenkins-slave/workspace/hbase-0.90/trunk/target/classes
    [INFO]
    [INFO] --- maven-resources-plugin:2.4:testResources (default-testResources) @ hbase ---
    [INFO] Using 'UTF-8' encoding to copy filtered resources.
    [INFO] Copying 4 resources
    [INFO] Copying 3 resources
    [INFO]
    [INFO] --- maven-compiler-plugin:2.0.2:testCompile (default-testCompile) @ hbase ---
    [INFO] Compiling 203 source files to /x1/jenkins/jenkins-slave/workspace/hbase-0.90/trunk/target/test-classes
    [INFO]
    [INFO] --- maven-surefire-plugin:2.4.3:test (default-test) @ hbase ---
    [INFO] Surefire report directory: /x1/jenkins/jenkins-slave/workspace/hbase-0.90/trunk/target/surefire-reports

    -------------------------------------------------------
    T E S T S
    -------------------------------------------------------
    Running org.apache.hadoop.hbase.master.TestHMasterRPCException
    Tests run: 1, Failures: 0, Errors: 0, Skipped: 0, Time elapsed: 0.354 sec
    Running org.apache.hadoop.hbase.regionserver.TestColumnSeeking
    Tests run: 2, Failures: 0, Errors: 0, Skipped: 0, Time elapsed: 2.818 sec
    Running org.apache.hadoop.hbase.client.TestMultipleTimestamps
    Tests run: 8, Failures: 0, Errors: 0, Skipped: 0, Time elapsed: 52.064 sec
    Running org.apache.hadoop.hbase.regionserver.TestMemStoreLAB
    Tests run: 3, Failures: 0, Errors: 0, Skipped: 0, Time elapsed: 0.805 sec
    Running org.apache.hadoop.hbase.TestZooKeeper
    Tests run: 5, Failures: 0, Errors: 0, Skipped: 0, Time elapsed: 54.625 sec
    Running org.apache.hadoop.hbase.regionserver.wal.TestLogRolling
    killed.
    [INFO] ------------------------------------------------------------------------
    [INFO] BUILD FAILURE
    [INFO] ------------------------------------------------------------------------
    [INFO] Total time: 17:31.318s
    [INFO] Finished at: Mon Aug 27 17:42:02 UTC 2012
    [INFO] Final Memory: 47M/671M
    [INFO] ------------------------------------------------------------------------
    [ERROR] Failed to execute goal org.apache.maven.plugins:maven-surefire-plugin:2.4.3:test (default-test) on project hbase: Error while executing forked tests.; nested exception is org.apache.maven.surefire.booter.shade.org.codehaus.plexus.util.cli.CommandLineException: Error while executing external command, process killed. Process timeout out after 900 seconds -> [Help 1]
    [ERROR]
    [ERROR] To see the full stack trace of the errors, re-run Maven with the -e switch.
    [ERROR] Re-run Maven using the -X switch to enable full debug logging.
    [ERROR]
    [ERROR] For more information about the errors and possible solutions, please read the following articles:
    [ERROR] [Help 1] http://cwiki.apache.org/confluence/display/MAVEN/MojoExecutionException
    Build step 'Invoke top-level Maven targets' marked build as failure
    [locks-and-latches] Releasing all the locks
    [locks-and-latches] All the locks released
    Archiving artifacts
    Recording test results
  • Apache Jenkins Server at Sep 19, 2012 at 9:50 pm
    See <https://builds.apache.org/job/hbase-0.90/524/changes>

    Changes:

    [stack] HBASE-3834 Store ignores checksum errors when opening files

    ------------------------------------------
    [...truncated 12295 lines...]
    Running org.apache.hadoop.hbase.regionserver.TestFSErrorsExposed
    Tests run: 3, Failures: 0, Errors: 0, Skipped: 0, Time elapsed: 26.296 sec
    Running org.apache.hadoop.hbase.client.replication.TestReplicationAdmin
    Tests run: 1, Failures: 0, Errors: 0, Skipped: 0, Time elapsed: 0.273 sec
    Running org.apache.hadoop.hbase.regionserver.TestScanDeleteTracker
    Tests run: 6, Failures: 0, Errors: 0, Skipped: 0, Time elapsed: 0.089 sec
    Running org.apache.hadoop.hbase.client.TestMetaScanner
    Tests run: 1, Failures: 0, Errors: 0, Skipped: 0, Time elapsed: 13.344 sec
    Running org.apache.hadoop.hbase.metrics.TestMetricsMBeanBase
    Tests run: 2, Failures: 0, Errors: 0, Skipped: 0, Time elapsed: 0.037 sec
    Running org.apache.hadoop.hbase.TestRegionRebalancing
    Tests run: 1, Failures: 0, Errors: 0, Skipped: 0, Time elapsed: 51.731 sec
    Running org.apache.hadoop.hbase.filter.TestSingleColumnValueExcludeFilter
    Tests run: 1, Failures: 0, Errors: 0, Skipped: 0, Time elapsed: 0.018 sec
    Running org.apache.hadoop.hbase.filter.TestInclusiveStopFilter
    Tests run: 2, Failures: 0, Errors: 0, Skipped: 0, Time elapsed: 0.019 sec
    Running org.apache.hadoop.hbase.mapreduce.TestTableSplit
    Tests run: 1, Failures: 0, Errors: 0, Skipped: 0, Time elapsed: 0.018 sec
    Running org.apache.hadoop.hbase.rest.TestTableResource
    Tests run: 8, Failures: 0, Errors: 0, Skipped: 0, Time elapsed: 44.695 sec
    Running org.apache.hadoop.hbase.TestHBaseTestingUtility
    Tests run: 5, Failures: 0, Errors: 0, Skipped: 0, Time elapsed: 44.661 sec
    Running org.apache.hadoop.hbase.mapreduce.TestLoadIncrementalHFiles
    Tests run: 5, Failures: 0, Errors: 0, Skipped: 0, Time elapsed: 49.516 sec
    Running org.apache.hadoop.hbase.regionserver.wal.TestWALReplay
    Tests run: 4, Failures: 0, Errors: 0, Skipped: 0, Time elapsed: 24.293 sec
    Running org.apache.hadoop.hbase.rest.TestSchemaResource
    Tests run: 2, Failures: 0, Errors: 0, Skipped: 0, Time elapsed: 28.075 sec
    Running org.apache.hadoop.hbase.regionserver.TestKeyValueScanFixture
    Tests run: 1, Failures: 0, Errors: 0, Skipped: 0, Time elapsed: 0.028 sec
    Running org.apache.hadoop.hbase.rest.model.TestTableListModel
    Tests run: 3, Failures: 0, Errors: 0, Skipped: 0, Time elapsed: 0.132 sec
    Running org.apache.hadoop.hbase.rest.model.TestColumnSchemaModel
    Tests run: 2, Failures: 0, Errors: 0, Skipped: 0, Time elapsed: 0.035 sec
    Running org.apache.hadoop.hbase.regionserver.TestStoreFile
    Tests run: 7, Failures: 0, Errors: 0, Skipped: 0, Time elapsed: 24.282 sec
    Running org.apache.hadoop.hbase.zookeeper.TestZooKeeperNodeTracker
    Tests run: 2, Failures: 0, Errors: 0, Skipped: 0, Time elapsed: 0.264 sec
    Running org.apache.hadoop.hbase.regionserver.wal.TestHLogMethods
    Tests run: 3, Failures: 0, Errors: 0, Skipped: 0, Time elapsed: 0.297 sec
    Running org.apache.hadoop.hbase.rest.model.TestScannerModel
    Tests run: 3, Failures: 0, Errors: 0, Skipped: 0, Time elapsed: 0.139 sec
    Running org.apache.hadoop.hbase.regionserver.TestHRegionServerBulkLoad
    Tests run: 1, Failures: 0, Errors: 0, Skipped: 0, Time elapsed: 42.368 sec
    Running org.apache.hadoop.hbase.rest.TestVersionResource
    Tests run: 7, Failures: 0, Errors: 0, Skipped: 0, Time elapsed: 15.899 sec
    Running org.apache.hadoop.hbase.filter.TestFilter
    Tests run: 18, Failures: 0, Errors: 0, Skipped: 0, Time elapsed: 1.46 sec
    Running org.apache.hadoop.hbase.regionserver.TestWideScanner
    Tests run: 1, Failures: 0, Errors: 0, Skipped: 0, Time elapsed: 15.108 sec
    Running org.apache.hadoop.hbase.regionserver.TestSplitTransaction
    Tests run: 6, Failures: 0, Errors: 0, Skipped: 0, Time elapsed: 2.754 sec
    Running org.apache.hadoop.hbase.replication.regionserver.TestReplicationSink
    Tests run: 5, Failures: 0, Errors: 0, Skipped: 0, Time elapsed: 19.823 sec
    Running org.apache.hadoop.hbase.regionserver.TestGetClosestAtOrBefore
    Tests run: 3, Failures: 0, Errors: 0, Skipped: 0, Time elapsed: 5.127 sec
    Running org.apache.hadoop.hbase.regionserver.TestReadWriteConsistencyControl
    Tests run: 1, Failures: 0, Errors: 0, Skipped: 0, Time elapsed: 10.033 sec
    Running org.apache.hadoop.hbase.util.TestMergeTable
    Tests run: 1, Failures: 0, Errors: 0, Skipped: 0, Time elapsed: 35.407 sec
    Running org.apache.hadoop.hbase.rest.model.TestVersionModel
    Tests run: 3, Failures: 0, Errors: 0, Skipped: 0, Time elapsed: 0.133 sec
    Running org.apache.hadoop.hbase.rest.model.TestCellSetModel
    Tests run: 3, Failures: 0, Errors: 0, Skipped: 0, Time elapsed: 0.146 sec
    Running org.apache.hadoop.hbase.rest.client.TestRemoteTable
    Tests run: 3, Failures: 0, Errors: 0, Skipped: 0, Time elapsed: 23.107 sec
    Running org.apache.hadoop.hbase.rest.model.TestStorageClusterStatusModel
    Tests run: 3, Failures: 0, Errors: 0, Skipped: 0, Time elapsed: 0.141 sec
    Running org.apache.hadoop.hbase.avro.TestAvroServer
    Tests run: 3, Failures: 0, Errors: 3, Skipped: 0, Time elapsed: 14.863 sec <<< FAILURE!
    Running org.apache.hadoop.hbase.TestFullLogReconstruction
    Tests run: 1, Failures: 0, Errors: 0, Skipped: 0, Time elapsed: 58.552 sec
    Running org.apache.hadoop.hbase.TestSerialization
    Tests run: 19, Failures: 0, Errors: 0, Skipped: 0, Time elapsed: 0.077 sec
    Running org.apache.hadoop.hbase.regionserver.TestKeyValueHeap
    Tests run: 3, Failures: 0, Errors: 0, Skipped: 0, Time elapsed: 0.074 sec
    Running org.apache.hadoop.hbase.regionserver.TestStoreScanner
    Tests run: 14, Failures: 0, Errors: 0, Skipped: 0, Time elapsed: 0.033 sec
    Running org.apache.hadoop.hbase.TestHMsg
    Tests run: 2, Failures: 0, Errors: 0, Skipped: 0, Time elapsed: 0.023 sec
    Running org.apache.hadoop.hbase.io.hfile.TestReseekTo
    Tests run: 1, Failures: 0, Errors: 0, Skipped: 0, Time elapsed: 0.179 sec
    Running org.apache.hadoop.hbase.mapreduce.TestLoadIncrementalHFilesSplitRecovery
    Tests run: 4, Failures: 0, Errors: 0, Skipped: 0, Time elapsed: 23.27 sec
    Running org.apache.hadoop.hbase.regionserver.TestHRegionInfo
    Tests run: 3, Failures: 0, Errors: 0, Skipped: 0, Time elapsed: 0.019 sec
    Running org.apache.hadoop.hbase.regionserver.TestScanner
    Tests run: 6, Failures: 0, Errors: 0, Skipped: 0, Time elapsed: 48.752 sec
    Running org.apache.hadoop.hbase.util.TestIncrementingEnvironmentEdge
    Tests run: 1, Failures: 0, Errors: 0, Skipped: 0, Time elapsed: 0.019 sec
    Running org.apache.hadoop.hbase.util.TestKeying
    Tests run: 1, Failures: 0, Errors: 0, Skipped: 0, Time elapsed: 0.018 sec
    Running org.apache.hadoop.hbase.util.TestHBaseFsck
    Tests run: 21, Failures: 0, Errors: 0, Skipped: 0, Time elapsed: 148.907 sec
    Running org.apache.hadoop.hbase.master.TestRestartCluster
    Tests run: 2, Failures: 0, Errors: 0, Skipped: 0, Time elapsed: 51.121 sec
    Running org.apache.hadoop.hbase.client.TestShell
    Tests run: 1, Failures: 0, Errors: 0, Skipped: 0, Time elapsed: 32.523 sec
    Running org.apache.hadoop.hbase.rest.model.TestTableInfoModel
    Tests run: 3, Failures: 0, Errors: 0, Skipped: 0, Time elapsed: 0.137 sec
    Running org.apache.hadoop.hbase.TestInfoServers
    Tests run: 1, Failures: 0, Errors: 0, Skipped: 0, Time elapsed: 12.246 sec
    Running org.apache.hadoop.hbase.master.TestLogsCleaner
    Tests run: 1, Failures: 0, Errors: 0, Skipped: 0, Time elapsed: 0.514 sec
    Running org.apache.hadoop.hbase.regionserver.TestMasterAddressManager
    Tests run: 1, Failures: 0, Errors: 0, Skipped: 0, Time elapsed: 0.205 sec
    Running org.apache.hadoop.hbase.catalog.TestCatalogTrackerOnCluster
    Tests run: 1, Failures: 0, Errors: 0, Skipped: 0, Time elapsed: 204.509 sec
    Running org.apache.hadoop.hbase.regionserver.TestQueryMatcher
    Tests run: 4, Failures: 0, Errors: 0, Skipped: 0, Time elapsed: 0.078 sec
    Running org.apache.hadoop.hbase.zookeeper.TestZKTable
    Tests run: 1, Failures: 0, Errors: 0, Skipped: 0, Time elapsed: 0.204 sec
    Running org.apache.hadoop.hbase.client.TestAdmin
    Tests run: 24, Failures: 0, Errors: 0, Skipped: 0, Time elapsed: 206.946 sec
    Running org.apache.hadoop.hbase.util.TestMergeTool
    Tests run: 1, Failures: 0, Errors: 0, Skipped: 0, Time elapsed: 16.43 sec
    Running org.apache.hadoop.hbase.regionserver.TestPriorityCompactionQueue
    Tests run: 1, Failures: 0, Errors: 0, Skipped: 0, Time elapsed: 1.117 sec
    Running org.apache.hadoop.hbase.TestAcidGuarantees
    Tests run: 3, Failures: 0, Errors: 0, Skipped: 3, Time elapsed: 0.016 sec
    Running org.apache.hadoop.hbase.util.TestBase64
    Tests run: 1, Failures: 0, Errors: 0, Skipped: 0, Time elapsed: 0.019 sec
    Running org.apache.hadoop.hbase.regionserver.TestMemStore
    Tests run: 21, Failures: 0, Errors: 0, Skipped: 0, Time elapsed: 61.854 sec
    Running org.apache.hadoop.hbase.rest.TestScannerResource
    Tests run: 5, Failures: 0, Errors: 0, Skipped: 0, Time elapsed: 37.903 sec
    Running org.apache.hadoop.hbase.io.hfile.TestLruBlockCache
    Tests run: 7, Failures: 0, Errors: 0, Skipped: 0, Time elapsed: 1.053 sec
    Running org.apache.hadoop.hbase.master.TestDeadServer
    Tests run: 1, Failures: 0, Errors: 0, Skipped: 0, Time elapsed: 0.02 sec
    Running org.apache.hadoop.hbase.rest.TestGzipFilter
    Tests run: 3, Failures: 0, Errors: 0, Skipped: 0, Time elapsed: 17.828 sec
    Running org.apache.hadoop.hbase.TestKeyValue
    Tests run: 14, Failures: 0, Errors: 0, Skipped: 0, Time elapsed: 0.031 sec
    Running org.apache.hadoop.hbase.mapreduce.TestTableMapReduce
    Tests run: 2, Failures: 0, Errors: 0, Skipped: 0, Time elapsed: 56.901 sec
    Running org.apache.hadoop.hbase.client.TestMultiParallel
    Tests run: 10, Failures: 0, Errors: 0, Skipped: 0, Time elapsed: 22.237 sec
    Running org.apache.hadoop.hbase.master.TestMaster
    Tests run: 1, Failures: 0, Errors: 0, Skipped: 0, Time elapsed: 73.264 sec
    Running org.apache.hadoop.hbase.master.TestRollingRestart
    Tests run: 1, Failures: 0, Errors: 0, Skipped: 0, Time elapsed: 51.486 sec
    Running org.apache.hadoop.hbase.client.TestResult
    Tests run: 3, Failures: 0, Errors: 0, Skipped: 0, Time elapsed: 0.048 sec
    Running org.apache.hadoop.hbase.client.TestHTablePool
    Tests run: 5, Failures: 0, Errors: 0, Skipped: 0, Time elapsed: 16.242 sec
    Running org.apache.hadoop.hbase.master.TestOpenedRegionHandler
    Tests run: 2, Failures: 0, Errors: 0, Skipped: 0, Time elapsed: 25.522 sec
    Running org.apache.hadoop.hbase.util.TestByteBloomFilter
    Tests run: 3, Failures: 0, Errors: 0, Skipped: 0, Time elapsed: 1.617 sec
    Running org.apache.hadoop.hbase.rest.model.TestTableSchemaModel
    Tests run: 3, Failures: 0, Errors: 0, Skipped: 0, Time elapsed: 0.142 sec
    Running org.apache.hadoop.hbase.filter.TestFilterList
    Tests run: 4, Failures: 0, Errors: 0, Skipped: 0, Time elapsed: 0.044 sec
    Running org.apache.hadoop.hbase.mapreduce.TestTableInputFormatScan
    Tests run: 11, Failures: 0, Errors: 0, Skipped: 0, Time elapsed: 311.97 sec
    Running org.apache.hadoop.hbase.regionserver.TestHRegion
    Tests run: 54, Failures: 0, Errors: 0, Skipped: 0, Time elapsed: 13.425 sec
    Running org.apache.hadoop.hbase.master.TestMasterFailover
    Tests run: 4, Failures: 0, Errors: 0, Skipped: 0, Time elapsed: 70.129 sec
    Running org.apache.hadoop.hbase.rest.model.TestTableRegionModel
    Tests run: 4, Failures: 0, Errors: 0, Skipped: 0, Time elapsed: 0.036 sec
    Running org.apache.hadoop.hbase.client.TestTimestampsFilter
    Tests run: 3, Failures: 0, Errors: 0, Skipped: 0, Time elapsed: 26.848 sec
    Running org.apache.hadoop.hbase.master.TestLoadBalancer
    Tests run: 7, Failures: 0, Errors: 0, Skipped: 0, Time elapsed: 2.373 sec
    Running org.apache.hadoop.hbase.util.TestRootPath
    Tests run: 1, Failures: 0, Errors: 0, Skipped: 0, Time elapsed: 0.023 sec
    Running org.apache.hadoop.hbase.mapred.TestTableMapReduce
    Tests run: 1, Failures: 0, Errors: 0, Skipped: 0, Time elapsed: 31.574 sec
    Running org.apache.hadoop.hbase.regionserver.wal.TestWALObserver
    Tests run: 1, Failures: 0, Errors: 0, Skipped: 0, Time elapsed: 0.17 sec
    Running org.apache.hadoop.hbase.client.TestScannerTimeout
    Tests run: 4, Failures: 0, Errors: 0, Skipped: 0, Time elapsed: 44.592 sec
    Running org.apache.hadoop.hbase.master.TestActiveMasterManager
    Tests run: 2, Failures: 0, Errors: 0, Skipped: 0, Time elapsed: 0.274 sec
    Running org.apache.hadoop.hbase.replication.regionserver.TestReplicationSourceManager
    Tests run: 1, Failures: 0, Errors: 0, Skipped: 0, Time elapsed: 0.393 sec
    Running org.apache.hadoop.hbase.util.TestBytes
    Tests run: 10, Failures: 0, Errors: 0, Skipped: 0, Time elapsed: 0.023 sec
    Running org.apache.hadoop.hbase.util.TestCompressionTest
    Tests run: 1, Failures: 0, Errors: 0, Skipped: 0, Time elapsed: 0.027 sec
    Running org.apache.hadoop.hbase.filter.TestDependentColumnFilter
    Tests run: 2, Failures: 0, Errors: 0, Skipped: 0, Time elapsed: 0.234 sec
    Running org.apache.hadoop.hbase.client.TestGetRowVersions
    Tests run: 1, Failures: 0, Errors: 0, Skipped: 0, Time elapsed: 23.133 sec
    Running org.apache.hadoop.hbase.rest.model.TestCellModel
    Tests run: 3, Failures: 0, Errors: 0, Skipped: 0, Time elapsed: 0.135 sec
    Running org.apache.hadoop.hbase.master.TestCatalogJanitor
    Tests run: 2, Failures: 0, Errors: 0, Skipped: 0, Time elapsed: 0.393 sec
    Running org.apache.hadoop.hbase.replication.TestReplicationSource
    Tests run: 1, Failures: 0, Errors: 0, Skipped: 0, Time elapsed: 1.084 sec
    Running org.apache.hadoop.hbase.catalog.TestCatalogTracker
    Tests run: 9, Failures: 0, Errors: 0, Skipped: 0, Time elapsed: 2.66 sec
    Running org.apache.hadoop.hbase.util.TestRegionSplitCalculator
    Tests run: 15, Failures: 0, Errors: 0, Skipped: 0, Time elapsed: 0.072 sec
    Running org.apache.hadoop.hbase.rest.TestRowResource
    Tests run: 11, Failures: 0, Errors: 0, Skipped: 0, Time elapsed: 18.815 sec
    Running org.apache.hadoop.hbase.io.hfile.TestHFile
    Tests run: 7, Failures: 0, Errors: 0, Skipped: 0, Time elapsed: 0.214 sec
    Running org.apache.hadoop.hbase.catalog.TestMetaReaderEditor
    Tests run: 4, Failures: 0, Errors: 0, Skipped: 0, Time elapsed: 18.267 sec
    Running org.apache.hadoop.hbase.util.TestStrings
    Tests run: 1, Failures: 0, Errors: 0, Skipped: 0, Time elapsed: 0.018 sec
    Running org.apache.hadoop.hbase.mapreduce.TestImportTsv
    Tests run: 7, Failures: 0, Errors: 0, Skipped: 0, Time elapsed: 15.574 sec
    Running org.apache.hadoop.hbase.util.TestHBaseFsckComparator
    Tests run: 7, Failures: 0, Errors: 0, Skipped: 0, Time elapsed: 0.173 sec
    Running org.apache.hadoop.hbase.rest.client.TestRemoteAdmin
    Tests run: 2, Failures: 0, Errors: 0, Skipped: 0, Time elapsed: 19.978 sec
    Running org.apache.hadoop.hbase.regionserver.wal.TestHLog
    Tests run: 8, Failures: 0, Errors: 0, Skipped: 0, Time elapsed: 67.852 sec
    Running org.apache.hadoop.hbase.client.TestTimestamp
    Tests run: 1, Failures: 0, Errors: 0, Skipped: 0, Time elapsed: 13.134 sec
    Running org.apache.hadoop.hbase.TestScanMultipleVersions
    Tests run: 1, Failures: 0, Errors: 0, Skipped: 0, Time elapsed: 11.275 sec
    Running org.apache.hadoop.hbase.rest.model.TestStorageClusterVersionModel
    Tests run: 2, Failures: 0, Errors: 0, Skipped: 0, Time elapsed: 0.034 sec
    Running org.apache.hadoop.hbase.client.TestHCM
    Tests run: 4, Failures: 0, Errors: 0, Skipped: 0, Time elapsed: 26.284 sec

    Results :

    Tests in error:

    Tests run: 734, Failures: 0, Errors: 3, Skipped: 9

    [INFO] ------------------------------------------------------------------------
    [INFO] BUILD FAILURE
    [INFO] ------------------------------------------------------------------------
    [INFO] Total time: 1:17:10.579s
    [INFO] Finished at: Wed Sep 19 21:49:42 UTC 2012
    [INFO] Final Memory: 37M/643M
    [INFO] ------------------------------------------------------------------------
    [ERROR] Failed to execute goal org.apache.maven.plugins:maven-surefire-plugin:2.4.3:test (default-test) on project hbase: There are test failures.
    [ERROR]
    [ERROR] Please refer to <https://builds.apache.org/job/hbase-0.90/ws/trunk/target/surefire-reports> for the individual test results.
    [ERROR] -> [Help 1]
    [ERROR]
    [ERROR] To see the full stack trace of the errors, re-run Maven with the -e switch.
    [ERROR] Re-run Maven using the -X switch to enable full debug logging.
    [ERROR]
    [ERROR] For more information about the errors and possible solutions, please read the following articles:
    [ERROR] [Help 1] http://cwiki.apache.org/confluence/display/MAVEN/MojoFailureException
    Build step 'Invoke top-level Maven targets' marked build as failure
    [locks-and-latches] Releasing all the locks
    [locks-and-latches] All the locks released
    Archiving artifacts
    Recording test results
  • Apache Jenkins Server at Sep 20, 2012 at 12:41 am
    See <https://builds.apache.org/job/hbase-0.90/525/>

    ------------------------------------------
    [...truncated 1220 lines...]
    Running org.apache.hadoop.hbase.regionserver.TestFSErrorsExposed
    Tests run: 3, Failures: 0, Errors: 0, Skipped: 0, Time elapsed: 27.237 sec
    Running org.apache.hadoop.hbase.client.replication.TestReplicationAdmin
    Tests run: 1, Failures: 0, Errors: 0, Skipped: 0, Time elapsed: 0.262 sec
    Running org.apache.hadoop.hbase.regionserver.TestScanDeleteTracker
    Tests run: 6, Failures: 0, Errors: 0, Skipped: 0, Time elapsed: 0.095 sec
    Running org.apache.hadoop.hbase.client.TestMetaScanner
    Tests run: 1, Failures: 0, Errors: 0, Skipped: 0, Time elapsed: 13.245 sec
    Running org.apache.hadoop.hbase.metrics.TestMetricsMBeanBase
    Tests run: 2, Failures: 0, Errors: 0, Skipped: 0, Time elapsed: 0.036 sec
    Running org.apache.hadoop.hbase.TestRegionRebalancing
    Tests run: 1, Failures: 0, Errors: 0, Skipped: 0, Time elapsed: 32.283 sec
    Running org.apache.hadoop.hbase.filter.TestSingleColumnValueExcludeFilter
    Tests run: 1, Failures: 0, Errors: 0, Skipped: 0, Time elapsed: 0.017 sec
    Running org.apache.hadoop.hbase.filter.TestInclusiveStopFilter
    Tests run: 2, Failures: 0, Errors: 0, Skipped: 0, Time elapsed: 0.018 sec
    Running org.apache.hadoop.hbase.mapreduce.TestTableSplit
    Tests run: 1, Failures: 0, Errors: 0, Skipped: 0, Time elapsed: 0.018 sec
    Running org.apache.hadoop.hbase.rest.TestTableResource
    Tests run: 8, Failures: 0, Errors: 0, Skipped: 0, Time elapsed: 52.933 sec
    Running org.apache.hadoop.hbase.TestHBaseTestingUtility
    Tests run: 5, Failures: 0, Errors: 0, Skipped: 0, Time elapsed: 44.593 sec
    Running org.apache.hadoop.hbase.mapreduce.TestLoadIncrementalHFiles
    Tests run: 5, Failures: 0, Errors: 0, Skipped: 0, Time elapsed: 50.464 sec
    Running org.apache.hadoop.hbase.regionserver.wal.TestWALReplay
    Tests run: 4, Failures: 0, Errors: 0, Skipped: 0, Time elapsed: 27.044 sec
    Running org.apache.hadoop.hbase.rest.TestSchemaResource
    Tests run: 2, Failures: 0, Errors: 0, Skipped: 0, Time elapsed: 21.887 sec
    Running org.apache.hadoop.hbase.regionserver.TestKeyValueScanFixture
    Tests run: 1, Failures: 0, Errors: 0, Skipped: 0, Time elapsed: 0.016 sec
    Running org.apache.hadoop.hbase.rest.model.TestTableListModel
    Tests run: 3, Failures: 0, Errors: 0, Skipped: 0, Time elapsed: 0.137 sec
    Running org.apache.hadoop.hbase.rest.model.TestColumnSchemaModel
    Tests run: 2, Failures: 0, Errors: 0, Skipped: 0, Time elapsed: 0.033 sec
    Running org.apache.hadoop.hbase.regionserver.TestStoreFile
    Tests run: 7, Failures: 0, Errors: 0, Skipped: 0, Time elapsed: 24.578 sec
    Running org.apache.hadoop.hbase.zookeeper.TestZooKeeperNodeTracker
    Tests run: 2, Failures: 0, Errors: 0, Skipped: 0, Time elapsed: 0.234 sec
    Running org.apache.hadoop.hbase.regionserver.wal.TestHLogMethods
    Tests run: 3, Failures: 0, Errors: 0, Skipped: 0, Time elapsed: 0.295 sec
    Running org.apache.hadoop.hbase.rest.model.TestScannerModel
    Tests run: 3, Failures: 0, Errors: 0, Skipped: 0, Time elapsed: 0.139 sec
    Running org.apache.hadoop.hbase.regionserver.TestHRegionServerBulkLoad
    Tests run: 1, Failures: 0, Errors: 0, Skipped: 0, Time elapsed: 45.639 sec
    Running org.apache.hadoop.hbase.rest.TestVersionResource
    Tests run: 7, Failures: 0, Errors: 0, Skipped: 0, Time elapsed: 15.009 sec
    Running org.apache.hadoop.hbase.filter.TestFilter
    Tests run: 18, Failures: 0, Errors: 0, Skipped: 0, Time elapsed: 1.467 sec
    Running org.apache.hadoop.hbase.regionserver.TestWideScanner
    Tests run: 1, Failures: 0, Errors: 0, Skipped: 0, Time elapsed: 22.518 sec
    Running org.apache.hadoop.hbase.regionserver.TestSplitTransaction
    Tests run: 6, Failures: 0, Errors: 0, Skipped: 0, Time elapsed: 2.943 sec
    Running org.apache.hadoop.hbase.replication.regionserver.TestReplicationSink
    Tests run: 5, Failures: 0, Errors: 0, Skipped: 0, Time elapsed: 20.946 sec
    Running org.apache.hadoop.hbase.regionserver.TestGetClosestAtOrBefore
    Tests run: 3, Failures: 0, Errors: 0, Skipped: 0, Time elapsed: 6.256 sec
    Running org.apache.hadoop.hbase.regionserver.TestReadWriteConsistencyControl
    Tests run: 1, Failures: 0, Errors: 0, Skipped: 0, Time elapsed: 10.023 sec
    Running org.apache.hadoop.hbase.util.TestMergeTable
    Tests run: 1, Failures: 0, Errors: 0, Skipped: 0, Time elapsed: 35.953 sec
    Running org.apache.hadoop.hbase.rest.model.TestVersionModel
    Tests run: 3, Failures: 0, Errors: 0, Skipped: 0, Time elapsed: 0.139 sec
    Running org.apache.hadoop.hbase.rest.model.TestCellSetModel
    Tests run: 3, Failures: 0, Errors: 0, Skipped: 0, Time elapsed: 0.139 sec
    Running org.apache.hadoop.hbase.rest.client.TestRemoteTable
    Tests run: 3, Failures: 0, Errors: 0, Skipped: 0, Time elapsed: 16.881 sec
    Running org.apache.hadoop.hbase.rest.model.TestStorageClusterStatusModel
    Tests run: 3, Failures: 0, Errors: 0, Skipped: 0, Time elapsed: 0.145 sec
    Running org.apache.hadoop.hbase.avro.TestAvroServer
    Tests run: 3, Failures: 0, Errors: 3, Skipped: 0, Time elapsed: 14.912 sec <<< FAILURE!
    Running org.apache.hadoop.hbase.TestFullLogReconstruction
    Tests run: 1, Failures: 0, Errors: 0, Skipped: 0, Time elapsed: 52.545 sec
    Running org.apache.hadoop.hbase.TestSerialization
    Tests run: 19, Failures: 0, Errors: 0, Skipped: 0, Time elapsed: 0.063 sec
    Running org.apache.hadoop.hbase.regionserver.TestKeyValueHeap
    Tests run: 3, Failures: 0, Errors: 0, Skipped: 0, Time elapsed: 0.069 sec
    Running org.apache.hadoop.hbase.regionserver.TestStoreScanner
    Tests run: 14, Failures: 0, Errors: 0, Skipped: 0, Time elapsed: 0.034 sec
    Running org.apache.hadoop.hbase.TestHMsg
    Tests run: 2, Failures: 0, Errors: 0, Skipped: 0, Time elapsed: 0.023 sec
    Running org.apache.hadoop.hbase.io.hfile.TestReseekTo
    Tests run: 1, Failures: 0, Errors: 0, Skipped: 0, Time elapsed: 0.179 sec
    Running org.apache.hadoop.hbase.mapreduce.TestLoadIncrementalHFilesSplitRecovery
    Tests run: 4, Failures: 0, Errors: 0, Skipped: 0, Time elapsed: 23.289 sec
    Running org.apache.hadoop.hbase.regionserver.TestHRegionInfo
    Tests run: 3, Failures: 0, Errors: 0, Skipped: 0, Time elapsed: 0.02 sec
    Running org.apache.hadoop.hbase.regionserver.TestScanner
    Tests run: 6, Failures: 0, Errors: 0, Skipped: 0, Time elapsed: 47.447 sec
    Running org.apache.hadoop.hbase.util.TestIncrementingEnvironmentEdge
    Tests run: 1, Failures: 0, Errors: 0, Skipped: 0, Time elapsed: 0.017 sec
    Running org.apache.hadoop.hbase.util.TestKeying
    Tests run: 1, Failures: 0, Errors: 0, Skipped: 0, Time elapsed: 0.017 sec
    Running org.apache.hadoop.hbase.util.TestHBaseFsck
    Tests run: 21, Failures: 0, Errors: 0, Skipped: 0, Time elapsed: 148.79 sec
    Running org.apache.hadoop.hbase.master.TestRestartCluster
    Tests run: 2, Failures: 0, Errors: 0, Skipped: 0, Time elapsed: 42.36 sec
    Running org.apache.hadoop.hbase.client.TestShell
    Tests run: 1, Failures: 0, Errors: 0, Skipped: 0, Time elapsed: 33.569 sec
    Running org.apache.hadoop.hbase.rest.model.TestTableInfoModel
    Tests run: 3, Failures: 0, Errors: 0, Skipped: 0, Time elapsed: 0.135 sec
    Running org.apache.hadoop.hbase.TestInfoServers
    Tests run: 1, Failures: 0, Errors: 0, Skipped: 0, Time elapsed: 12.296 sec
    Running org.apache.hadoop.hbase.master.TestLogsCleaner
    Tests run: 1, Failures: 0, Errors: 0, Skipped: 0, Time elapsed: 0.492 sec
    Running org.apache.hadoop.hbase.regionserver.TestMasterAddressManager
    Tests run: 1, Failures: 0, Errors: 0, Skipped: 0, Time elapsed: 0.205 sec
    Running org.apache.hadoop.hbase.catalog.TestCatalogTrackerOnCluster
    Tests run: 1, Failures: 0, Errors: 0, Skipped: 0, Time elapsed: 204.614 sec
    Running org.apache.hadoop.hbase.regionserver.TestQueryMatcher
    Tests run: 4, Failures: 0, Errors: 0, Skipped: 0, Time elapsed: 0.085 sec
    Running org.apache.hadoop.hbase.zookeeper.TestZKTable
    Tests run: 1, Failures: 0, Errors: 0, Skipped: 0, Time elapsed: 0.222 sec
    Running org.apache.hadoop.hbase.client.TestAdmin
    Tests run: 24, Failures: 0, Errors: 0, Skipped: 0, Time elapsed: 204.047 sec
    Running org.apache.hadoop.hbase.util.TestMergeTool
    Tests run: 1, Failures: 0, Errors: 0, Skipped: 0, Time elapsed: 16.386 sec
    Running org.apache.hadoop.hbase.regionserver.TestPriorityCompactionQueue
    Tests run: 1, Failures: 0, Errors: 0, Skipped: 0, Time elapsed: 1.119 sec
    Running org.apache.hadoop.hbase.TestAcidGuarantees
    Tests run: 3, Failures: 0, Errors: 0, Skipped: 3, Time elapsed: 0.016 sec
    Running org.apache.hadoop.hbase.util.TestBase64
    Tests run: 1, Failures: 0, Errors: 0, Skipped: 0, Time elapsed: 0.019 sec
    Running org.apache.hadoop.hbase.regionserver.TestMemStore
    Tests run: 21, Failures: 0, Errors: 0, Skipped: 0, Time elapsed: 71.154 sec
    Running org.apache.hadoop.hbase.rest.TestScannerResource
    Tests run: 5, Failures: 0, Errors: 0, Skipped: 0, Time elapsed: 35.786 sec
    Running org.apache.hadoop.hbase.io.hfile.TestLruBlockCache
    Tests run: 7, Failures: 0, Errors: 0, Skipped: 0, Time elapsed: 1.082 sec
    Running org.apache.hadoop.hbase.master.TestDeadServer
    Tests run: 1, Failures: 0, Errors: 0, Skipped: 0, Time elapsed: 0.019 sec
    Running org.apache.hadoop.hbase.rest.TestGzipFilter
    Tests run: 3, Failures: 0, Errors: 0, Skipped: 0, Time elapsed: 17.873 sec
    Running org.apache.hadoop.hbase.TestKeyValue
    Tests run: 14, Failures: 0, Errors: 0, Skipped: 0, Time elapsed: 0.03 sec
    Running org.apache.hadoop.hbase.mapreduce.TestTableMapReduce
    Tests run: 2, Failures: 0, Errors: 0, Skipped: 0, Time elapsed: 50.332 sec
    Running org.apache.hadoop.hbase.client.TestMultiParallel
    Tests run: 10, Failures: 0, Errors: 0, Skipped: 0, Time elapsed: 23.281 sec
    Running org.apache.hadoop.hbase.master.TestMaster
    Tests run: 1, Failures: 0, Errors: 0, Skipped: 0, Time elapsed: 73.288 sec
    Running org.apache.hadoop.hbase.master.TestRollingRestart
    Tests run: 1, Failures: 0, Errors: 0, Skipped: 0, Time elapsed: 51.641 sec
    Running org.apache.hadoop.hbase.client.TestResult
    Tests run: 3, Failures: 0, Errors: 0, Skipped: 0, Time elapsed: 0.047 sec
    Running org.apache.hadoop.hbase.client.TestHTablePool
    Tests run: 5, Failures: 0, Errors: 0, Skipped: 0, Time elapsed: 16.253 sec
    Running org.apache.hadoop.hbase.master.TestOpenedRegionHandler
    Tests run: 2, Failures: 0, Errors: 0, Skipped: 0, Time elapsed: 17.129 sec
    Running org.apache.hadoop.hbase.util.TestByteBloomFilter
    Tests run: 3, Failures: 0, Errors: 0, Skipped: 0, Time elapsed: 1.68 sec
    Running org.apache.hadoop.hbase.rest.model.TestTableSchemaModel
    Tests run: 3, Failures: 0, Errors: 0, Skipped: 0, Time elapsed: 0.141 sec
    Running org.apache.hadoop.hbase.filter.TestFilterList
    Tests run: 4, Failures: 0, Errors: 0, Skipped: 0, Time elapsed: 0.042 sec
    Running org.apache.hadoop.hbase.mapreduce.TestTableInputFormatScan
    Tests run: 11, Failures: 0, Errors: 0, Skipped: 0, Time elapsed: 311.818 sec
    Running org.apache.hadoop.hbase.regionserver.TestHRegion
    Tests run: 54, Failures: 0, Errors: 0, Skipped: 0, Time elapsed: 14.233 sec
    Running org.apache.hadoop.hbase.master.TestMasterFailover
    Tests run: 4, Failures: 0, Errors: 0, Skipped: 0, Time elapsed: 69.19 sec
    Running org.apache.hadoop.hbase.rest.model.TestTableRegionModel
    Tests run: 4, Failures: 0, Errors: 0, Skipped: 0, Time elapsed: 0.036 sec
    Running org.apache.hadoop.hbase.client.TestTimestampsFilter
    Tests run: 3, Failures: 0, Errors: 0, Skipped: 0, Time elapsed: 25.869 sec
    Running org.apache.hadoop.hbase.master.TestLoadBalancer
    Tests run: 7, Failures: 0, Errors: 0, Skipped: 0, Time elapsed: 2.228 sec
    Running org.apache.hadoop.hbase.util.TestRootPath
    Tests run: 1, Failures: 0, Errors: 0, Skipped: 0, Time elapsed: 0.025 sec
    Running org.apache.hadoop.hbase.mapred.TestTableMapReduce
    Tests run: 1, Failures: 0, Errors: 0, Skipped: 0, Time elapsed: 34.101 sec
    Running org.apache.hadoop.hbase.regionserver.wal.TestWALObserver
    Tests run: 1, Failures: 0, Errors: 0, Skipped: 0, Time elapsed: 0.176 sec
    Running org.apache.hadoop.hbase.client.TestScannerTimeout
    Tests run: 4, Failures: 0, Errors: 0, Skipped: 0, Time elapsed: 45.536 sec
    Running org.apache.hadoop.hbase.master.TestActiveMasterManager
    Tests run: 2, Failures: 0, Errors: 0, Skipped: 0, Time elapsed: 0.265 sec
    Running org.apache.hadoop.hbase.replication.regionserver.TestReplicationSourceManager
    Tests run: 1, Failures: 0, Errors: 0, Skipped: 0, Time elapsed: 0.381 sec
    Running org.apache.hadoop.hbase.util.TestBytes
    Tests run: 10, Failures: 0, Errors: 0, Skipped: 0, Time elapsed: 0.024 sec
    Running org.apache.hadoop.hbase.util.TestCompressionTest
    Tests run: 1, Failures: 0, Errors: 0, Skipped: 0, Time elapsed: 0.027 sec
    Running org.apache.hadoop.hbase.filter.TestDependentColumnFilter
    Tests run: 2, Failures: 0, Errors: 0, Skipped: 0, Time elapsed: 0.228 sec
    Running org.apache.hadoop.hbase.client.TestGetRowVersions
    Tests run: 1, Failures: 0, Errors: 0, Skipped: 0, Time elapsed: 23.384 sec
    Running org.apache.hadoop.hbase.rest.model.TestCellModel
    Tests run: 3, Failures: 0, Errors: 0, Skipped: 0, Time elapsed: 0.132 sec
    Running org.apache.hadoop.hbase.master.TestCatalogJanitor
    Tests run: 2, Failures: 0, Errors: 0, Skipped: 0, Time elapsed: 0.371 sec
    Running org.apache.hadoop.hbase.replication.TestReplicationSource
    Tests run: 1, Failures: 0, Errors: 0, Skipped: 0, Time elapsed: 1.08 sec
    Running org.apache.hadoop.hbase.catalog.TestCatalogTracker
    Tests run: 9, Failures: 0, Errors: 0, Skipped: 0, Time elapsed: 2.7 sec
    Running org.apache.hadoop.hbase.util.TestRegionSplitCalculator
    Tests run: 15, Failures: 0, Errors: 0, Skipped: 0, Time elapsed: 0.069 sec
    Running org.apache.hadoop.hbase.rest.TestRowResource
    Tests run: 11, Failures: 0, Errors: 0, Skipped: 0, Time elapsed: 15.98 sec
    Running org.apache.hadoop.hbase.io.hfile.TestHFile
    Tests run: 7, Failures: 0, Errors: 0, Skipped: 0, Time elapsed: 0.212 sec
    Running org.apache.hadoop.hbase.catalog.TestMetaReaderEditor
    Tests run: 4, Failures: 0, Errors: 0, Skipped: 0, Time elapsed: 18.242 sec
    Running org.apache.hadoop.hbase.util.TestStrings
    Tests run: 1, Failures: 0, Errors: 0, Skipped: 0, Time elapsed: 0.018 sec
    Running org.apache.hadoop.hbase.mapreduce.TestImportTsv
    Tests run: 7, Failures: 0, Errors: 0, Skipped: 0, Time elapsed: 15.574 sec
    Running org.apache.hadoop.hbase.util.TestHBaseFsckComparator
    Tests run: 7, Failures: 0, Errors: 0, Skipped: 0, Time elapsed: 0.173 sec
    Running org.apache.hadoop.hbase.rest.client.TestRemoteAdmin
    Tests run: 2, Failures: 0, Errors: 0, Skipped: 0, Time elapsed: 20.907 sec
    Running org.apache.hadoop.hbase.regionserver.wal.TestHLog
    Tests run: 8, Failures: 0, Errors: 0, Skipped: 0, Time elapsed: 72.683 sec
    Running org.apache.hadoop.hbase.client.TestTimestamp
    Tests run: 1, Failures: 0, Errors: 0, Skipped: 0, Time elapsed: 13.11 sec
    Running org.apache.hadoop.hbase.TestScanMultipleVersions
    Tests run: 1, Failures: 0, Errors: 0, Skipped: 0, Time elapsed: 12.235 sec
    Running org.apache.hadoop.hbase.rest.model.TestStorageClusterVersionModel
    Tests run: 2, Failures: 0, Errors: 0, Skipped: 0, Time elapsed: 0.033 sec
    Running org.apache.hadoop.hbase.client.TestHCM
    Tests run: 4, Failures: 0, Errors: 0, Skipped: 0, Time elapsed: 26.233 sec

    Results :

    Tests in error:

    Tests run: 734, Failures: 0, Errors: 3, Skipped: 9

    [INFO] ------------------------------------------------------------------------
    [INFO] BUILD FAILURE
    [INFO] ------------------------------------------------------------------------
    [INFO] Total time: 1:16:02.492s
    [INFO] Finished at: Thu Sep 20 00:40:47 UTC 2012
    [INFO] Final Memory: 35M/358M
    [INFO] ------------------------------------------------------------------------
    [ERROR] Failed to execute goal org.apache.maven.plugins:maven-surefire-plugin:2.4.3:test (default-test) on project hbase: There are test failures.
    [ERROR]
    [ERROR] Please refer to <https://builds.apache.org/job/hbase-0.90/ws/trunk/target/surefire-reports> for the individual test results.
    [ERROR] -> [Help 1]
    [ERROR]
    [ERROR] To see the full stack trace of the errors, re-run Maven with the -e switch.
    [ERROR] Re-run Maven using the -X switch to enable full debug logging.
    [ERROR]
    [ERROR] For more information about the errors and possible solutions, please read the following articles:
    [ERROR] [Help 1] http://cwiki.apache.org/confluence/display/MAVEN/MojoFailureException
    Build step 'Invoke top-level Maven targets' marked build as failure
    [locks-and-latches] Releasing all the locks
    [locks-and-latches] All the locks released
    Archiving artifacts
    Recording test results
  • Apache Jenkins Server at Oct 2, 2012 at 4:04 am
    See <https://builds.apache.org/job/hbase-0.90/526/>

    ------------------------------------------
    [...truncated 900 lines...]
    A src/site/resources
    A src/site/resources/images
    AU src/site/resources/images/replication_overview.png
    AU src/site/resources/images/asf_logo_wide.png
    AU src/site/resources/images/architecture.gif
    AU src/site/resources/images/hadoop-logo.jpg
    AU src/site/resources/images/hbase_logo_med.gif
    AU src/site/resources/images/favicon.ico
    AU src/site/resources/images/hbase_small.gif
    A src/site/resources/css
    A src/site/resources/css/freebsd_docbook.css
    A src/site/resources/css/site.css
    A src/site/xdoc
    A src/site/xdoc/cygwin.xml
    A src/site/xdoc/acid-semantics.xml
    A src/site/xdoc/metrics.xml
    A src/site/xdoc/index.xml
    A src/site/xdoc/replication.xml
    A src/site/xdoc/old_news.xml
    A src/site/xdoc/bulk-loads.xml
    A src/site/xdoc/pseudo-distributed.xml
    A src/docbkx
    A src/docbkx/upgrading.xml
    A src/docbkx/performance.xml
    A src/docbkx/developer.xml
    A src/docbkx/preface.xml
    A src/docbkx/configuration.xml
    A src/docbkx/getting_started.xml
    A src/docbkx/shell.xml
    A src/docbkx/troubleshooting.xml
    A src/docbkx/book.xml
    A src/docbkx/build.xml
    AU src/saveVersion.sh
    A src/examples
    A src/examples/thrift
    A src/examples/thrift/DemoClient.java
    A src/examples/thrift/DemoClient.cpp
    A src/examples/thrift/DemoClient.rb
    A src/examples/thrift/DemoClient.php
    AU src/examples/thrift/DemoClient.py
    A src/examples/thrift/README.txt
    A src/examples/thrift/Makefile
    A src/examples/mapreduce
    A src/examples/mapreduce/org
    A src/examples/mapreduce/org/apache
    A src/examples/mapreduce/org/apache/hadoop
    A src/examples/mapreduce/org/apache/hadoop/hbase
    A src/examples/mapreduce/org/apache/hadoop/hbase/mapreduce
    A src/examples/mapreduce/org/apache/hadoop/hbase/mapreduce/SampleUploader.java
    A src/examples/mapreduce/org/apache/hadoop/hbase/mapreduce/IndexBuilder.java
    A src/examples/mapreduce/index-builder-setup.rb
    A src/examples/README.txt
    A bin
    AU bin/hbase-daemons.sh
    A bin/rename_table.rb
    AU bin/hbase
    A bin/copy_table.rb
    A bin/check_meta.rb
    AU bin/start-hbase.sh
    A bin/hirb.rb
    A bin/set_meta_block_caching.rb
    A bin/loadtable.rb
    AU bin/hbase-daemon.sh
    A bin/region_mover.rb
    A bin/hbase-config.sh
    A bin/local-regionservers.sh
    AU bin/zookeepers.sh
    A bin/local-master-backup.sh
    A bin/add_table.rb
    AU bin/rolling-restart.sh
    AU bin/regionservers.sh
    A bin/graceful_stop.sh
    AU bin/master-backup.sh
    A bin/set_meta_memstore_size.rb
    A bin/replication
    A bin/replication/copy_tables_desc.rb
    AU bin/stop-hbase.sh
    A pom.xml
    A README.txt
    U .
    At revision 1392723
    no change for https://svn.apache.org/repos/asf/hbase/branches/0.90 since the previous build
    [locks-and-latches] Checking to see if we really have the locks
    [locks-and-latches] Have all the locks, build can start
    [hbase-0.90] $ /bin/bash -xe /tmp/hudson3911368457583149005.sh
    + hostname
    hemera
    + ulimit -a
    core file size (blocks, -c) 0
    data seg size (kbytes, -d) unlimited
    scheduling priority (-e) 0
    file size (blocks, -f) unlimited
    pending signals (-i) 193125
    max locked memory (kbytes, -l) 64
    max memory size (kbytes, -m) unlimited
    open files (-n) 40000
    pipe size (512 bytes, -p) 8
    POSIX message queues (bytes, -q) 819200
    real-time priority (-r) 0
    stack size (kbytes, -s) 10240
    cpu time (seconds, -t) unlimited
    max user processes (-u) 193125
    virtual memory (kbytes, -v) unlimited
    file locks (-x) unlimited
    + jps
    25256 EclipseStarter
    13783 jar
    21305 Jps
    [trunk] $ /home/hudson/tools/maven/latest3/bin/mvn clean -Dmaven.test.redirectTestOutputToFile=true site assembly:assembly
    [INFO] Scanning for projects...
    [INFO]
    [INFO] ------------------------------------------------------------------------
    [INFO] Building HBase 0.90.7
    [INFO] ------------------------------------------------------------------------
    [INFO]
    [INFO] --- maven-clean-plugin:2.4.1:clean (default-clean) @ hbase ---
    [INFO]
    [INFO] --- xml-maven-plugin:1.0-beta-3:transform (default) @ hbase ---
    [INFO] Transforming file: /x1/jenkins/jenkins-slave/workspace/hbase-0.90/trunk/src/main/resources/hbase-default.xml
    [INFO] Transformed 1 file(s).
    [INFO]
    [INFO] --- docbkx-maven-plugin:2.0.11:generate-html (default) @ hbase ---
    [INFO] Processing input file: upgrading.xml
    [INFO] /x1/jenkins/jenkins-slave/workspace/hbase-0.90/trunk/target/site/upgrading.html has been generated.
    [INFO] Processing input file: shell.xml
    [INFO] /x1/jenkins/jenkins-slave/workspace/hbase-0.90/trunk/target/site/shell.html has been generated.
    [INFO] Processing input file: configuration.xml
    [INFO] /x1/jenkins/jenkins-slave/workspace/hbase-0.90/trunk/target/site/configuration.html has been generated.
    [INFO] Processing input file: getting_started.xml
    [INFO] /x1/jenkins/jenkins-slave/workspace/hbase-0.90/trunk/target/site/getting_started.html has been generated.
    [INFO] Processing input file: troubleshooting.xml
    [INFO] /x1/jenkins/jenkins-slave/workspace/hbase-0.90/trunk/target/site/troubleshooting.html has been generated.
    [INFO] Processing input file: build.xml
    [INFO] /x1/jenkins/jenkins-slave/workspace/hbase-0.90/trunk/target/site/build.html has been generated.
    [INFO] Processing input file: performance.xml
    [INFO] /x1/jenkins/jenkins-slave/workspace/hbase-0.90/trunk/target/site/performance.html has been generated.
    [INFO] Processing input file: developer.xml
    [INFO] /x1/jenkins/jenkins-slave/workspace/hbase-0.90/trunk/target/site/developer.html has been generated.
    [INFO] Processing input file: book.xml
    [INFO] /x1/jenkins/jenkins-slave/workspace/hbase-0.90/trunk/target/site/book.html has been generated.
    [INFO] /x1/jenkins/jenkins-slave/workspace/hbase-0.90/trunk/target/site/preface.html is up to date.
    [INFO]
    [INFO] --- maven-site-plugin:2.0.1:site (default-site) @ hbase ---
    [INFO] Unable to load parent project from a relative path: 1 problem was encountered while building the effective model
    [FATAL] Non-readable POM /x1/jenkins/jenkins-slave/workspace/hbase-0.90/pom.xml: /x1/jenkins/jenkins-slave/workspace/hbase-0.90/pom.xml (No such file or directory) @
    for project at /x1/jenkins/jenkins-slave/workspace/hbase-0.90/pom.xml for project at /x1/jenkins/jenkins-slave/workspace/hbase-0.90/pom.xml
    [INFO] Parent project loaded from repository.
    [INFO] Unable to load parent project from a relative path: 1 problem was encountered while building the effective model
    [FATAL] Non-readable POM /x1/jenkins/jenkins-slave/workspace/hbase-0.90/pom.xml: /x1/jenkins/jenkins-slave/workspace/hbase-0.90/pom.xml (No such file or directory) @
    for project at /x1/jenkins/jenkins-slave/workspace/hbase-0.90/pom.xml for project at /x1/jenkins/jenkins-slave/workspace/hbase-0.90/pom.xml
    [INFO] Parent project loaded from repository.
    Downloading: http://download.java.net/maven/2/org/apache/maven/skins/maven-stylus-skin/maven-metadata.xml
    Downloading: http://repo1.maven.org/maven2/org/apache/maven/skins/maven-stylus-skin/maven-metadata.xml
    Downloading: http://people.apache.org/~rawson/repo/org/apache/maven/skins/maven-stylus-skin/maven-metadata.xml
    Downloading: http://repository.codehaus.org/org/apache/maven/skins/maven-stylus-skin/maven-metadata.xml


    516 B

    Downloaded: http://repo1.maven.org/maven2/org/apache/maven/skins/maven-stylus-skin/maven-metadata.xml (516 B at 0.8 KB/sec)

    [INFO]
    [INFO] ------------------------------------------------------------------------
    [INFO] Building HBase 0.90.7
    [INFO] ------------------------------------------------------------------------
    [INFO]
    [INFO] >>> maven-assembly-plugin:2.2-beta-5:assembly (default-cli) @ hbase >>>
    [INFO]
    [INFO] --- maven-antrun-plugin:1.3:run (generate) @ hbase ---
    [INFO] Executing tasks
    [mkdir] Created dir: /x1/jenkins/jenkins-slave/workspace/hbase-0.90/trunk/target/hbase-webapps
    [copy] Copying 4 files to /x1/jenkins/jenkins-slave/workspace/hbase-0.90/trunk/target/hbase-webapps
    SLF4J: Failed to load class "org.slf4j.impl.StaticLoggerBinder".
    SLF4J: See http://www.slf4j.org/codes.html#StaticLoggerBinder for further details.
    2012-10-02 03:46:37.039:INFO::Logging to STDERR via org.mortbay.log.StdErrLog
    [mkdir] Created dir: /x1/jenkins/jenkins-slave/workspace/hbase-0.90/trunk/target/hbase-webapps/master/WEB-INF
    [mkdir] Created dir: /x1/jenkins/jenkins-slave/workspace/hbase-0.90/trunk/target/hbase-webapps/regionserver/WEB-INF
    [INFO] Executed tasks
    [INFO]
    [INFO] --- build-helper-maven-plugin:1.5:add-source (add-jspc-source) @ hbase ---
    [INFO] Source directory: /x1/jenkins/jenkins-slave/workspace/hbase-0.90/trunk/target/jspc added.
    [INFO]
    [INFO] --- build-helper-maven-plugin:1.5:add-source (add-package-info) @ hbase ---
    [INFO] Source directory: /x1/jenkins/jenkins-slave/workspace/hbase-0.90/trunk/target/generated-sources added.
    [INFO]
    [INFO] --- maven-remote-resources-plugin:1.1:process (default) @ hbase ---
    [INFO] Setting property: classpath.resource.loader.class => 'org.codehaus.plexus.velocity.ContextClassLoaderResourceLoader'.
    [INFO] Setting property: velocimacro.messages.on => 'false'.
    [INFO] Setting property: resource.loader => 'classpath'.
    [INFO] Setting property: resource.manager.logwhenfound => 'false'.
    [INFO]
    [INFO] --- maven-resources-plugin:2.4:resources (default-resources) @ hbase ---
    [INFO] Using 'UTF-8' encoding to copy filtered resources.
    [INFO] Copying 1 resource
    [INFO] Copying 6 resources
    [INFO] Copying 3 resources
    [INFO]
    [INFO] --- maven-antrun-plugin:1.3:run (default) @ hbase ---
    [INFO] Executing tasks
    [INFO] Executed tasks
    [INFO]
    [INFO] --- maven-compiler-plugin:2.0.2:compile (default-compile) @ hbase ---
    [INFO] Compiling 470 source files to /x1/jenkins/jenkins-slave/workspace/hbase-0.90/trunk/target/classes
    [INFO]
    [INFO] --- maven-resources-plugin:2.4:testResources (default-testResources) @ hbase ---
    [INFO] Using 'UTF-8' encoding to copy filtered resources.
    [INFO] Copying 4 resources
    [INFO] Copying 3 resources
    [INFO]
    [INFO] --- maven-compiler-plugin:2.0.2:testCompile (default-testCompile) @ hbase ---
    [INFO] Compiling 203 source files to /x1/jenkins/jenkins-slave/workspace/hbase-0.90/trunk/target/test-classes
    [INFO]
    [INFO] --- maven-surefire-plugin:2.4.3:test (default-test) @ hbase ---
    [INFO] Surefire report directory: /x1/jenkins/jenkins-slave/workspace/hbase-0.90/trunk/target/surefire-reports

    -------------------------------------------------------
    T E S T S
    -------------------------------------------------------
    Running org.apache.hadoop.hbase.master.TestHMasterRPCException
    Tests run: 1, Failures: 0, Errors: 0, Skipped: 0, Time elapsed: 0.394 sec
    Running org.apache.hadoop.hbase.regionserver.TestColumnSeeking
    Tests run: 2, Failures: 0, Errors: 0, Skipped: 0, Time elapsed: 3.576 sec
    Running org.apache.hadoop.hbase.client.TestMultipleTimestamps
    Tests run: 8, Failures: 0, Errors: 0, Skipped: 0, Time elapsed: 69.179 sec
    Running org.apache.hadoop.hbase.regionserver.TestMemStoreLAB
    Tests run: 3, Failures: 0, Errors: 0, Skipped: 0, Time elapsed: 1.014 sec
    Running org.apache.hadoop.hbase.TestZooKeeper
    Tests run: 5, Failures: 0, Errors: 0, Skipped: 0, Time elapsed: 54.688 sec
    Running org.apache.hadoop.hbase.regionserver.wal.TestLogRolling
    killed.
    [INFO] ------------------------------------------------------------------------
    [INFO] BUILD FAILURE
    [INFO] ------------------------------------------------------------------------
    [INFO] Total time: 17:45.445s
    [INFO] Finished at: Tue Oct 02 04:04:09 UTC 2012
    [INFO] Final Memory: 45M/548M
    [INFO] ------------------------------------------------------------------------
    [ERROR] Failed to execute goal org.apache.maven.plugins:maven-surefire-plugin:2.4.3:test (default-test) on project hbase: Error while executing forked tests.; nested exception is org.apache.maven.surefire.booter.shade.org.codehaus.plexus.util.cli.CommandLineException: Error while executing external command, process killed. Process timeout out after 900 seconds -> [Help 1]
    [ERROR]
    [ERROR] To see the full stack trace of the errors, re-run Maven with the -e switch.
    [ERROR] Re-run Maven using the -X switch to enable full debug logging.
    [ERROR]
    [ERROR] For more information about the errors and possible solutions, please read the following articles:
    [ERROR] [Help 1] http://cwiki.apache.org/confluence/display/MAVEN/MojoExecutionException
    Build step 'Invoke top-level Maven targets' marked build as failure
    [locks-and-latches] Releasing all the locks
    [locks-and-latches] All the locks released
    Archiving artifacts
    Recording test results
  • Apache Jenkins Server at Oct 2, 2012 at 5:34 am
    See <https://builds.apache.org/job/hbase-0.90/527/>

    ------------------------------------------
    [...truncated 1233 lines...]
    Running org.apache.hadoop.hbase.regionserver.TestFSErrorsExposed
    Tests run: 3, Failures: 0, Errors: 0, Skipped: 0, Time elapsed: 26.375 sec
    Running org.apache.hadoop.hbase.client.replication.TestReplicationAdmin
    Tests run: 1, Failures: 0, Errors: 0, Skipped: 0, Time elapsed: 0.285 sec
    Running org.apache.hadoop.hbase.regionserver.TestScanDeleteTracker
    Tests run: 6, Failures: 0, Errors: 0, Skipped: 0, Time elapsed: 0.091 sec
    Running org.apache.hadoop.hbase.metrics.TestMetricsMBeanBase
    Tests run: 2, Failures: 0, Errors: 0, Skipped: 0, Time elapsed: 0.034 sec
    Running org.apache.hadoop.hbase.client.TestMetaScanner
    Tests run: 1, Failures: 0, Errors: 0, Skipped: 0, Time elapsed: 13.351 sec
    Running org.apache.hadoop.hbase.TestRegionRebalancing
    Tests run: 1, Failures: 0, Errors: 0, Skipped: 0, Time elapsed: 74.437 sec
    Running org.apache.hadoop.hbase.rest.TestTableResource
    Tests run: 8, Failures: 0, Errors: 0, Skipped: 0, Time elapsed: 45.186 sec
    Running org.apache.hadoop.hbase.filter.TestInclusiveStopFilter
    Tests run: 2, Failures: 0, Errors: 0, Skipped: 0, Time elapsed: 0.019 sec
    Running org.apache.hadoop.hbase.filter.TestSingleColumnValueExcludeFilter
    Tests run: 1, Failures: 0, Errors: 0, Skipped: 0, Time elapsed: 0.016 sec
    Running org.apache.hadoop.hbase.mapreduce.TestTableSplit
    Tests run: 1, Failures: 0, Errors: 0, Skipped: 0, Time elapsed: 0.018 sec
    Running org.apache.hadoop.hbase.TestHBaseTestingUtility
    Tests run: 5, Failures: 0, Errors: 0, Skipped: 0, Time elapsed: 46.046 sec
    Running org.apache.hadoop.hbase.mapreduce.TestLoadIncrementalHFiles
    Tests run: 5, Failures: 0, Errors: 0, Skipped: 0, Time elapsed: 54.807 sec
    Running org.apache.hadoop.hbase.rest.TestSchemaResource
    Tests run: 2, Failures: 0, Errors: 0, Skipped: 0, Time elapsed: 22.062 sec
    Running org.apache.hadoop.hbase.regionserver.wal.TestWALReplay
    Tests run: 4, Failures: 0, Errors: 0, Skipped: 0, Time elapsed: 24.332 sec
    Running org.apache.hadoop.hbase.regionserver.TestKeyValueScanFixture
    Tests run: 1, Failures: 0, Errors: 0, Skipped: 0, Time elapsed: 0.016 sec
    Running org.apache.hadoop.hbase.rest.model.TestTableListModel
    Tests run: 3, Failures: 0, Errors: 0, Skipped: 0, Time elapsed: 0.133 sec
    Running org.apache.hadoop.hbase.rest.model.TestColumnSchemaModel
    Tests run: 2, Failures: 0, Errors: 0, Skipped: 0, Time elapsed: 0.032 sec
    Running org.apache.hadoop.hbase.regionserver.TestStoreFile
    Tests run: 7, Failures: 0, Errors: 0, Skipped: 0, Time elapsed: 25.073 sec
    Running org.apache.hadoop.hbase.zookeeper.TestZooKeeperNodeTracker
    Tests run: 2, Failures: 0, Errors: 0, Skipped: 0, Time elapsed: 0.245 sec
    Running org.apache.hadoop.hbase.rest.model.TestScannerModel
    Tests run: 3, Failures: 0, Errors: 0, Skipped: 0, Time elapsed: 0.129 sec
    Running org.apache.hadoop.hbase.regionserver.wal.TestHLogMethods
    Tests run: 3, Failures: 0, Errors: 0, Skipped: 0, Time elapsed: 0.294 sec
    Running org.apache.hadoop.hbase.rest.TestVersionResource
    Tests run: 7, Failures: 0, Errors: 0, Skipped: 0, Time elapsed: 15.037 sec
    Running org.apache.hadoop.hbase.regionserver.TestHRegionServerBulkLoad
    Tests run: 1, Failures: 0, Errors: 0, Skipped: 0, Time elapsed: 47.469 sec
    Running org.apache.hadoop.hbase.filter.TestFilter
    Tests run: 18, Failures: 0, Errors: 0, Skipped: 0, Time elapsed: 1.447 sec
    Running org.apache.hadoop.hbase.regionserver.TestWideScanner
    Tests run: 1, Failures: 0, Errors: 0, Skipped: 0, Time elapsed: 13.262 sec
    Running org.apache.hadoop.hbase.regionserver.TestSplitTransaction
    Tests run: 6, Failures: 0, Errors: 0, Skipped: 0, Time elapsed: 2.531 sec
    Running org.apache.hadoop.hbase.replication.regionserver.TestReplicationSink
    Tests run: 5, Failures: 0, Errors: 0, Skipped: 0, Time elapsed: 20.152 sec
    Running org.apache.hadoop.hbase.regionserver.TestReadWriteConsistencyControl
    Tests run: 1, Failures: 0, Errors: 0, Skipped: 0, Time elapsed: 10.022 sec
    Running org.apache.hadoop.hbase.util.TestMergeTable
    Tests run: 1, Failures: 0, Errors: 0, Skipped: 0, Time elapsed: 39.669 sec
    Running org.apache.hadoop.hbase.regionserver.TestGetClosestAtOrBefore
    Tests run: 3, Failures: 0, Errors: 0, Skipped: 0, Time elapsed: 5.423 sec
    Running org.apache.hadoop.hbase.rest.model.TestVersionModel
    Tests run: 3, Failures: 0, Errors: 0, Skipped: 0, Time elapsed: 0.13 sec
    Running org.apache.hadoop.hbase.rest.model.TestCellSetModel
    Tests run: 3, Failures: 0, Errors: 0, Skipped: 0, Time elapsed: 0.142 sec
    Running org.apache.hadoop.hbase.rest.client.TestRemoteTable
    Tests run: 3, Failures: 0, Errors: 0, Skipped: 0, Time elapsed: 21.03 sec
    Running org.apache.hadoop.hbase.rest.model.TestStorageClusterStatusModel
    Tests run: 3, Failures: 0, Errors: 0, Skipped: 0, Time elapsed: 0.139 sec
    Running org.apache.hadoop.hbase.avro.TestAvroServer
    Tests run: 3, Failures: 0, Errors: 3, Skipped: 0, Time elapsed: 14.041 sec <<< FAILURE!
    Running org.apache.hadoop.hbase.TestFullLogReconstruction
    Tests run: 1, Failures: 0, Errors: 0, Skipped: 0, Time elapsed: 52.74 sec
    Running org.apache.hadoop.hbase.TestSerialization
    Tests run: 19, Failures: 0, Errors: 0, Skipped: 0, Time elapsed: 0.064 sec
    Running org.apache.hadoop.hbase.regionserver.TestKeyValueHeap
    Tests run: 3, Failures: 0, Errors: 0, Skipped: 0, Time elapsed: 0.073 sec
    Running org.apache.hadoop.hbase.regionserver.TestStoreScanner
    Tests run: 14, Failures: 0, Errors: 0, Skipped: 0, Time elapsed: 0.032 sec
    Running org.apache.hadoop.hbase.io.hfile.TestReseekTo
    Tests run: 1, Failures: 0, Errors: 0, Skipped: 0, Time elapsed: 0.199 sec
    Running org.apache.hadoop.hbase.TestHMsg
    Tests run: 2, Failures: 0, Errors: 0, Skipped: 0, Time elapsed: 0.022 sec
    Running org.apache.hadoop.hbase.mapreduce.TestLoadIncrementalHFilesSplitRecovery
    Tests run: 4, Failures: 0, Errors: 0, Skipped: 0, Time elapsed: 23.367 sec
    Running org.apache.hadoop.hbase.util.TestKeying
    Tests run: 1, Failures: 0, Errors: 0, Skipped: 0, Time elapsed: 0.017 sec
    Running org.apache.hadoop.hbase.util.TestIncrementingEnvironmentEdge
    Tests run: 1, Failures: 0, Errors: 0, Skipped: 0, Time elapsed: 0.018 sec
    Running org.apache.hadoop.hbase.regionserver.TestScanner
    Tests run: 6, Failures: 0, Errors: 0, Skipped: 0, Time elapsed: 46.039 sec
    Running org.apache.hadoop.hbase.regionserver.TestHRegionInfo
    Tests run: 3, Failures: 0, Errors: 0, Skipped: 0, Time elapsed: 0.02 sec
    Running org.apache.hadoop.hbase.util.TestHBaseFsck
    Tests run: 21, Failures: 0, Errors: 1, Skipped: 0, Time elapsed: 197.455 sec <<< FAILURE!
    Running org.apache.hadoop.hbase.client.TestShell
    Tests run: 1, Failures: 0, Errors: 0, Skipped: 0, Time elapsed: 40.636 sec
    Running org.apache.hadoop.hbase.master.TestRestartCluster
    Tests run: 2, Failures: 0, Errors: 0, Skipped: 0, Time elapsed: 43.379 sec
    Running org.apache.hadoop.hbase.rest.model.TestTableInfoModel
    Tests run: 3, Failures: 0, Errors: 0, Skipped: 0, Time elapsed: 0.13 sec
    Running org.apache.hadoop.hbase.TestInfoServers
    Tests run: 1, Failures: 0, Errors: 0, Skipped: 0, Time elapsed: 12.582 sec
    Running org.apache.hadoop.hbase.regionserver.TestMasterAddressManager
    Tests run: 1, Failures: 0, Errors: 0, Skipped: 0, Time elapsed: 0.232 sec
    Running org.apache.hadoop.hbase.master.TestLogsCleaner
    Tests run: 1, Failures: 0, Errors: 0, Skipped: 0, Time elapsed: 0.562 sec
    Running org.apache.hadoop.hbase.catalog.TestCatalogTrackerOnCluster
    Tests run: 1, Failures: 0, Errors: 0, Skipped: 0, Time elapsed: 204.97 sec
    Running org.apache.hadoop.hbase.regionserver.TestQueryMatcher
    Tests run: 4, Failures: 0, Errors: 0, Skipped: 0, Time elapsed: 0.081 sec
    Running org.apache.hadoop.hbase.zookeeper.TestZKTable
    Tests run: 1, Failures: 0, Errors: 0, Skipped: 0, Time elapsed: 0.246 sec
    Running org.apache.hadoop.hbase.client.TestAdmin
    Tests run: 24, Failures: 0, Errors: 0, Skipped: 0, Time elapsed: 213.07 sec
    Running org.apache.hadoop.hbase.util.TestMergeTool
    Tests run: 1, Failures: 0, Errors: 0, Skipped: 0, Time elapsed: 18.389 sec
    Running org.apache.hadoop.hbase.regionserver.TestPriorityCompactionQueue
    Tests run: 1, Failures: 0, Errors: 0, Skipped: 0, Time elapsed: 1.118 sec
    Running org.apache.hadoop.hbase.TestAcidGuarantees
    Tests run: 3, Failures: 0, Errors: 0, Skipped: 3, Time elapsed: 0.015 sec
    Running org.apache.hadoop.hbase.util.TestBase64
    Tests run: 1, Failures: 0, Errors: 0, Skipped: 0, Time elapsed: 0.018 sec
    Running org.apache.hadoop.hbase.regionserver.TestMemStore
    Tests run: 21, Failures: 0, Errors: 0, Skipped: 0, Time elapsed: 58.748 sec
    Running org.apache.hadoop.hbase.rest.TestScannerResource
    Tests run: 5, Failures: 0, Errors: 0, Skipped: 0, Time elapsed: 40.274 sec
    Running org.apache.hadoop.hbase.io.hfile.TestLruBlockCache
    Tests run: 7, Failures: 0, Errors: 0, Skipped: 0, Time elapsed: 1.056 sec
    Running org.apache.hadoop.hbase.master.TestDeadServer
    Tests run: 1, Failures: 0, Errors: 0, Skipped: 0, Time elapsed: 0.019 sec
    Running org.apache.hadoop.hbase.rest.TestGzipFilter
    Tests run: 3, Failures: 0, Errors: 0, Skipped: 0, Time elapsed: 18.046 sec
    Running org.apache.hadoop.hbase.TestKeyValue
    Tests run: 14, Failures: 0, Errors: 0, Skipped: 0, Time elapsed: 0.03 sec
    Running org.apache.hadoop.hbase.mapreduce.TestTableMapReduce
    Tests run: 2, Failures: 0, Errors: 0, Skipped: 0, Time elapsed: 50.72 sec
    Running org.apache.hadoop.hbase.client.TestMultiParallel
    Tests run: 10, Failures: 0, Errors: 0, Skipped: 0, Time elapsed: 27.19 sec
    Running org.apache.hadoop.hbase.master.TestMaster
    Tests run: 1, Failures: 0, Errors: 0, Skipped: 0, Time elapsed: 73.501 sec
    Running org.apache.hadoop.hbase.client.TestResult
    Tests run: 3, Failures: 0, Errors: 0, Skipped: 0, Time elapsed: 0.05 sec
    Running org.apache.hadoop.hbase.master.TestRollingRestart
    Tests run: 1, Failures: 0, Errors: 0, Skipped: 0, Time elapsed: 53.756 sec
    Running org.apache.hadoop.hbase.client.TestHTablePool
    Tests run: 5, Failures: 0, Errors: 0, Skipped: 0, Time elapsed: 15.39 sec
    Running org.apache.hadoop.hbase.master.TestOpenedRegionHandler
    Tests run: 2, Failures: 0, Errors: 0, Skipped: 0, Time elapsed: 18.328 sec
    Running org.apache.hadoop.hbase.rest.model.TestTableSchemaModel
    Tests run: 3, Failures: 0, Errors: 0, Skipped: 0, Time elapsed: 0.141 sec
    Running org.apache.hadoop.hbase.util.TestByteBloomFilter
    Tests run: 3, Failures: 0, Errors: 0, Skipped: 0, Time elapsed: 1.596 sec
    Running org.apache.hadoop.hbase.mapreduce.TestTableInputFormatScan
    Tests run: 11, Failures: 0, Errors: 0, Skipped: 0, Time elapsed: 316.283 sec
    Running org.apache.hadoop.hbase.filter.TestFilterList
    Tests run: 4, Failures: 0, Errors: 0, Skipped: 0, Time elapsed: 0.042 sec
    Running org.apache.hadoop.hbase.regionserver.TestHRegion
    Tests run: 54, Failures: 0, Errors: 0, Skipped: 0, Time elapsed: 14.089 sec
    Running org.apache.hadoop.hbase.rest.model.TestTableRegionModel
    Tests run: 4, Failures: 0, Errors: 0, Skipped: 0, Time elapsed: 0.033 sec
    Running org.apache.hadoop.hbase.master.TestMasterFailover
    Tests run: 4, Failures: 0, Errors: 0, Skipped: 0, Time elapsed: 70.307 sec
    Running org.apache.hadoop.hbase.client.TestTimestampsFilter
    Tests run: 3, Failures: 0, Errors: 0, Skipped: 0, Time elapsed: 26.073 sec
    Running org.apache.hadoop.hbase.util.TestRootPath
    Tests run: 1, Failures: 0, Errors: 0, Skipped: 0, Time elapsed: 0.026 sec
    Running org.apache.hadoop.hbase.master.TestLoadBalancer
    Tests run: 7, Failures: 0, Errors: 0, Skipped: 0, Time elapsed: 2.586 sec
    Running org.apache.hadoop.hbase.client.TestScannerTimeout
    Tests run: 4, Failures: 0, Errors: 0, Skipped: 0, Time elapsed: 46.305 sec
    Running org.apache.hadoop.hbase.regionserver.wal.TestWALObserver
    Tests run: 1, Failures: 0, Errors: 0, Skipped: 0, Time elapsed: 0.193 sec
    Running org.apache.hadoop.hbase.mapred.TestTableMapReduce
    Tests run: 1, Failures: 0, Errors: 0, Skipped: 0, Time elapsed: 32.545 sec
    Running org.apache.hadoop.hbase.replication.regionserver.TestReplicationSourceManager
    Tests run: 1, Failures: 0, Errors: 0, Skipped: 0, Time elapsed: 0.442 sec
    Running org.apache.hadoop.hbase.util.TestBytes
    Tests run: 10, Failures: 0, Errors: 0, Skipped: 0, Time elapsed: 0.023 sec
    Running org.apache.hadoop.hbase.master.TestActiveMasterManager
    Tests run: 2, Failures: 0, Errors: 0, Skipped: 0, Time elapsed: 0.351 sec
    Running org.apache.hadoop.hbase.util.TestCompressionTest
    Tests run: 1, Failures: 0, Errors: 0, Skipped: 0, Time elapsed: 0.026 sec
    Running org.apache.hadoop.hbase.client.TestGetRowVersions
    Tests run: 1, Failures: 0, Errors: 0, Skipped: 0, Time elapsed: 24.269 sec
    Running org.apache.hadoop.hbase.filter.TestDependentColumnFilter
    Tests run: 2, Failures: 0, Errors: 0, Skipped: 0, Time elapsed: 0.227 sec
    Running org.apache.hadoop.hbase.rest.model.TestCellModel
    Tests run: 3, Failures: 0, Errors: 0, Skipped: 0, Time elapsed: 0.137 sec
    Running org.apache.hadoop.hbase.replication.TestReplicationSource
    Tests run: 1, Failures: 0, Errors: 0, Skipped: 0, Time elapsed: 1.21 sec
    Running org.apache.hadoop.hbase.catalog.TestCatalogTracker
    Tests run: 9, Failures: 0, Errors: 0, Skipped: 0, Time elapsed: 3.194 sec
    Running org.apache.hadoop.hbase.master.TestCatalogJanitor
    Tests run: 2, Failures: 0, Errors: 0, Skipped: 0, Time elapsed: 0.459 sec
    Running org.apache.hadoop.hbase.rest.TestRowResource
    Tests run: 11, Failures: 0, Errors: 0, Skipped: 0, Time elapsed: 19.161 sec
    Running org.apache.hadoop.hbase.util.TestRegionSplitCalculator
    Tests run: 15, Failures: 0, Errors: 0, Skipped: 0, Time elapsed: 0.058 sec
    Running org.apache.hadoop.hbase.io.hfile.TestHFile
    Tests run: 7, Failures: 0, Errors: 0, Skipped: 0, Time elapsed: 0.222 sec
    Running org.apache.hadoop.hbase.catalog.TestMetaReaderEditor
    Tests run: 4, Failures: 0, Errors: 0, Skipped: 0, Time elapsed: 18.56 sec
    Running org.apache.hadoop.hbase.mapreduce.TestImportTsv
    Tests run: 7, Failures: 0, Errors: 0, Skipped: 0, Time elapsed: 16.905 sec
    Running org.apache.hadoop.hbase.util.TestStrings
    Tests run: 1, Failures: 0, Errors: 0, Skipped: 0, Time elapsed: 0.016 sec
    Running org.apache.hadoop.hbase.util.TestHBaseFsckComparator
    Tests run: 7, Failures: 0, Errors: 0, Skipped: 0, Time elapsed: 0.166 sec
    Running org.apache.hadoop.hbase.rest.client.TestRemoteAdmin
    Tests run: 2, Failures: 0, Errors: 0, Skipped: 0, Time elapsed: 21.206 sec
    Running org.apache.hadoop.hbase.regionserver.wal.TestHLog
    Tests run: 8, Failures: 0, Errors: 0, Skipped: 0, Time elapsed: 63.425 sec
    Running org.apache.hadoop.hbase.client.TestTimestamp
    Tests run: 1, Failures: 0, Errors: 0, Skipped: 0, Time elapsed: 14.55 sec
    Running org.apache.hadoop.hbase.TestScanMultipleVersions
    Tests run: 1, Failures: 0, Errors: 0, Skipped: 0, Time elapsed: 14.481 sec
    Running org.apache.hadoop.hbase.rest.model.TestStorageClusterVersionModel
    Tests run: 2, Failures: 0, Errors: 0, Skipped: 0, Time elapsed: 0.031 sec
    Running org.apache.hadoop.hbase.client.TestHCM
    Tests run: 4, Failures: 0, Errors: 0, Skipped: 0, Time elapsed: 35.861 sec

    Results :

    Tests in error:

    Tests run: 734, Failures: 0, Errors: 4, Skipped: 9

    [INFO] ------------------------------------------------------------------------
    [INFO] BUILD FAILURE
    [INFO] ------------------------------------------------------------------------
    [INFO] Total time: 1:13:43.110s
    [INFO] Finished at: Tue Oct 02 05:33:16 UTC 2012
    [INFO] Final Memory: 36M/873M
    [INFO] ------------------------------------------------------------------------
    [ERROR] Failed to execute goal org.apache.maven.plugins:maven-surefire-plugin:2.4.3:test (default-test) on project hbase: There are test failures.
    [ERROR]
    [ERROR] Please refer to <https://builds.apache.org/job/hbase-0.90/ws/trunk/target/surefire-reports> for the individual test results.
    [ERROR] -> [Help 1]
    [ERROR]
    [ERROR] To see the full stack trace of the errors, re-run Maven with the -e switch.
    [ERROR] Re-run Maven using the -X switch to enable full debug logging.
    [ERROR]
    [ERROR] For more information about the errors and possible solutions, please read the following articles:
    [ERROR] [Help 1] http://cwiki.apache.org/confluence/display/MAVEN/MojoFailureException
    Build step 'Invoke top-level Maven targets' marked build as failure
    [locks-and-latches] Releasing all the locks
    [locks-and-latches] All the locks released
    Archiving artifacts
    Recording test results
  • Apache Jenkins Server at Oct 2, 2012 at 7:01 am
    See <https://builds.apache.org/job/hbase-0.90/528/>

    ------------------------------------------
    [...truncated 1233 lines...]
    Running org.apache.hadoop.hbase.regionserver.TestFSErrorsExposed
    Tests run: 3, Failures: 0, Errors: 0, Skipped: 0, Time elapsed: 26.581 sec
    Running org.apache.hadoop.hbase.client.replication.TestReplicationAdmin
    Tests run: 1, Failures: 0, Errors: 0, Skipped: 0, Time elapsed: 0.292 sec
    Running org.apache.hadoop.hbase.regionserver.TestScanDeleteTracker
    Tests run: 6, Failures: 0, Errors: 0, Skipped: 0, Time elapsed: 0.087 sec
    Running org.apache.hadoop.hbase.metrics.TestMetricsMBeanBase
    Tests run: 2, Failures: 0, Errors: 0, Skipped: 0, Time elapsed: 0.033 sec
    Running org.apache.hadoop.hbase.client.TestMetaScanner
    Tests run: 1, Failures: 0, Errors: 0, Skipped: 0, Time elapsed: 13.494 sec
    Running org.apache.hadoop.hbase.TestRegionRebalancing
    Tests run: 1, Failures: 0, Errors: 0, Skipped: 0, Time elapsed: 60.375 sec
    Running org.apache.hadoop.hbase.mapreduce.TestTableSplit
    Tests run: 1, Failures: 0, Errors: 0, Skipped: 0, Time elapsed: 0.016 sec
    Running org.apache.hadoop.hbase.rest.TestTableResource
    Tests run: 8, Failures: 0, Errors: 0, Skipped: 0, Time elapsed: 46.203 sec
    Running org.apache.hadoop.hbase.filter.TestInclusiveStopFilter
    Tests run: 2, Failures: 0, Errors: 0, Skipped: 0, Time elapsed: 0.017 sec
    Running org.apache.hadoop.hbase.filter.TestSingleColumnValueExcludeFilter
    Tests run: 1, Failures: 0, Errors: 0, Skipped: 0, Time elapsed: 0.016 sec
    Running org.apache.hadoop.hbase.mapreduce.TestLoadIncrementalHFiles
    Tests run: 5, Failures: 0, Errors: 0, Skipped: 0, Time elapsed: 52.183 sec
    Running org.apache.hadoop.hbase.TestHBaseTestingUtility
    Tests run: 5, Failures: 0, Errors: 0, Skipped: 0, Time elapsed: 46.282 sec
    Running org.apache.hadoop.hbase.regionserver.wal.TestWALReplay
    Tests run: 4, Failures: 0, Errors: 0, Skipped: 0, Time elapsed: 24.656 sec
    Running org.apache.hadoop.hbase.rest.TestSchemaResource
    Tests run: 2, Failures: 0, Errors: 0, Skipped: 0, Time elapsed: 23.149 sec
    Running org.apache.hadoop.hbase.regionserver.TestKeyValueScanFixture
    Tests run: 1, Failures: 0, Errors: 0, Skipped: 0, Time elapsed: 0.043 sec
    Running org.apache.hadoop.hbase.rest.model.TestTableListModel
    Tests run: 3, Failures: 0, Errors: 0, Skipped: 0, Time elapsed: 0.126 sec
    Running org.apache.hadoop.hbase.rest.model.TestColumnSchemaModel
    Tests run: 2, Failures: 0, Errors: 0, Skipped: 0, Time elapsed: 0.032 sec
    Running org.apache.hadoop.hbase.regionserver.TestStoreFile
    Tests run: 7, Failures: 0, Errors: 0, Skipped: 0, Time elapsed: 25.807 sec
    Running org.apache.hadoop.hbase.zookeeper.TestZooKeeperNodeTracker
    Tests run: 2, Failures: 0, Errors: 0, Skipped: 0, Time elapsed: 0.248 sec
    Running org.apache.hadoop.hbase.regionserver.wal.TestHLogMethods
    Tests run: 3, Failures: 0, Errors: 0, Skipped: 0, Time elapsed: 0.329 sec
    Running org.apache.hadoop.hbase.rest.model.TestScannerModel
    Tests run: 3, Failures: 0, Errors: 0, Skipped: 0, Time elapsed: 0.128 sec
    Running org.apache.hadoop.hbase.regionserver.TestHRegionServerBulkLoad
    Tests run: 1, Failures: 0, Errors: 0, Skipped: 0, Time elapsed: 44.52 sec
    Running org.apache.hadoop.hbase.rest.TestVersionResource
    Tests run: 7, Failures: 0, Errors: 0, Skipped: 0, Time elapsed: 17.021 sec
    Running org.apache.hadoop.hbase.filter.TestFilter
    Tests run: 18, Failures: 0, Errors: 0, Skipped: 0, Time elapsed: 1.615 sec
    Running org.apache.hadoop.hbase.regionserver.TestWideScanner
    Tests run: 1, Failures: 0, Errors: 0, Skipped: 0, Time elapsed: 14.025 sec
    Running org.apache.hadoop.hbase.regionserver.TestSplitTransaction
    Tests run: 6, Failures: 0, Errors: 0, Skipped: 0, Time elapsed: 2.64 sec
    Running org.apache.hadoop.hbase.replication.regionserver.TestReplicationSink
    Tests run: 5, Failures: 0, Errors: 0, Skipped: 0, Time elapsed: 20.971 sec
    Running org.apache.hadoop.hbase.regionserver.TestGetClosestAtOrBefore
    Tests run: 3, Failures: 0, Errors: 0, Skipped: 0, Time elapsed: 6.8 sec
    Running org.apache.hadoop.hbase.regionserver.TestReadWriteConsistencyControl
    Tests run: 1, Failures: 0, Errors: 0, Skipped: 0, Time elapsed: 10.021 sec
    Running org.apache.hadoop.hbase.util.TestMergeTable
    Tests run: 1, Failures: 0, Errors: 0, Skipped: 0, Time elapsed: 37.01 sec
    Running org.apache.hadoop.hbase.rest.model.TestVersionModel
    Tests run: 3, Failures: 0, Errors: 0, Skipped: 0, Time elapsed: 0.131 sec
    Running org.apache.hadoop.hbase.rest.model.TestCellSetModel
    Tests run: 3, Failures: 0, Errors: 0, Skipped: 0, Time elapsed: 0.135 sec
    Running org.apache.hadoop.hbase.rest.model.TestStorageClusterStatusModel
    Tests run: 3, Failures: 0, Errors: 0, Skipped: 0, Time elapsed: 0.135 sec
    Running org.apache.hadoop.hbase.rest.client.TestRemoteTable
    Tests run: 3, Failures: 0, Errors: 0, Skipped: 0, Time elapsed: 18.474 sec
    Running org.apache.hadoop.hbase.avro.TestAvroServer
    Tests run: 3, Failures: 0, Errors: 3, Skipped: 0, Time elapsed: 15.076 sec <<< FAILURE!
    Running org.apache.hadoop.hbase.TestFullLogReconstruction
    Tests run: 1, Failures: 0, Errors: 0, Skipped: 0, Time elapsed: 49.893 sec
    Running org.apache.hadoop.hbase.TestSerialization
    Tests run: 19, Failures: 0, Errors: 0, Skipped: 0, Time elapsed: 0.059 sec
    Running org.apache.hadoop.hbase.regionserver.TestKeyValueHeap
    Tests run: 3, Failures: 0, Errors: 0, Skipped: 0, Time elapsed: 0.07 sec
    Running org.apache.hadoop.hbase.regionserver.TestStoreScanner
    Tests run: 14, Failures: 0, Errors: 0, Skipped: 0, Time elapsed: 0.032 sec
    Running org.apache.hadoop.hbase.TestHMsg
    Tests run: 2, Failures: 0, Errors: 0, Skipped: 0, Time elapsed: 0.022 sec
    Running org.apache.hadoop.hbase.io.hfile.TestReseekTo
    Tests run: 1, Failures: 0, Errors: 0, Skipped: 0, Time elapsed: 0.258 sec
    Running org.apache.hadoop.hbase.mapreduce.TestLoadIncrementalHFilesSplitRecovery
    Tests run: 4, Failures: 0, Errors: 0, Skipped: 0, Time elapsed: 25.773 sec
    Running org.apache.hadoop.hbase.regionserver.TestScanner
    Tests run: 6, Failures: 0, Errors: 0, Skipped: 0, Time elapsed: 46.357 sec
    Running org.apache.hadoop.hbase.regionserver.TestHRegionInfo
    Tests run: 3, Failures: 0, Errors: 0, Skipped: 0, Time elapsed: 0.018 sec
    Running org.apache.hadoop.hbase.util.TestKeying
    Tests run: 1, Failures: 0, Errors: 0, Skipped: 0, Time elapsed: 0.016 sec
    Running org.apache.hadoop.hbase.util.TestIncrementingEnvironmentEdge
    Tests run: 1, Failures: 0, Errors: 0, Skipped: 0, Time elapsed: 0.016 sec
    Running org.apache.hadoop.hbase.util.TestHBaseFsck
    Tests run: 21, Failures: 0, Errors: 0, Skipped: 0, Time elapsed: 156.257 sec
    Running org.apache.hadoop.hbase.client.TestShell
    Tests run: 1, Failures: 0, Errors: 0, Skipped: 0, Time elapsed: 34.203 sec
    Running org.apache.hadoop.hbase.master.TestRestartCluster
    Tests run: 2, Failures: 0, Errors: 0, Skipped: 0, Time elapsed: 41.984 sec
    Running org.apache.hadoop.hbase.rest.model.TestTableInfoModel
    Tests run: 3, Failures: 0, Errors: 0, Skipped: 0, Time elapsed: 0.129 sec
    Running org.apache.hadoop.hbase.TestInfoServers
    Tests run: 1, Failures: 0, Errors: 0, Skipped: 0, Time elapsed: 12.5 sec
    Running org.apache.hadoop.hbase.regionserver.TestMasterAddressManager
    Tests run: 1, Failures: 0, Errors: 0, Skipped: 0, Time elapsed: 0.227 sec
    Running org.apache.hadoop.hbase.master.TestLogsCleaner
    Tests run: 1, Failures: 0, Errors: 0, Skipped: 0, Time elapsed: 0.554 sec
    Running org.apache.hadoop.hbase.catalog.TestCatalogTrackerOnCluster
    Tests run: 1, Failures: 0, Errors: 0, Skipped: 0, Time elapsed: 205.896 sec
    Running org.apache.hadoop.hbase.regionserver.TestQueryMatcher
    Tests run: 4, Failures: 0, Errors: 0, Skipped: 0, Time elapsed: 0.076 sec
    Running org.apache.hadoop.hbase.zookeeper.TestZKTable
    Tests run: 1, Failures: 0, Errors: 0, Skipped: 0, Time elapsed: 0.245 sec
    Running org.apache.hadoop.hbase.client.TestAdmin
    Tests run: 24, Failures: 0, Errors: 0, Skipped: 0, Time elapsed: 209.271 sec
    Running org.apache.hadoop.hbase.regionserver.TestPriorityCompactionQueue
    Tests run: 1, Failures: 0, Errors: 0, Skipped: 0, Time elapsed: 1.12 sec
    Running org.apache.hadoop.hbase.util.TestMergeTool
    Tests run: 1, Failures: 0, Errors: 0, Skipped: 0, Time elapsed: 16.106 sec
    Running org.apache.hadoop.hbase.TestAcidGuarantees
    Tests run: 3, Failures: 0, Errors: 0, Skipped: 3, Time elapsed: 0.015 sec
    Running org.apache.hadoop.hbase.util.TestBase64
    Tests run: 1, Failures: 0, Errors: 0, Skipped: 0, Time elapsed: 0.018 sec
    Running org.apache.hadoop.hbase.regionserver.TestMemStore
    Tests run: 21, Failures: 0, Errors: 0, Skipped: 0, Time elapsed: 36.627 sec
    Running org.apache.hadoop.hbase.rest.TestScannerResource
    Tests run: 5, Failures: 0, Errors: 0, Skipped: 0, Time elapsed: 38.869 sec
    Running org.apache.hadoop.hbase.io.hfile.TestLruBlockCache
    Tests run: 7, Failures: 0, Errors: 0, Skipped: 0, Time elapsed: 1.055 sec
    Running org.apache.hadoop.hbase.master.TestDeadServer
    Tests run: 1, Failures: 0, Errors: 0, Skipped: 0, Time elapsed: 0.018 sec
    Running org.apache.hadoop.hbase.rest.TestGzipFilter
    Tests run: 3, Failures: 0, Errors: 0, Skipped: 0, Time elapsed: 17.277 sec
    Running org.apache.hadoop.hbase.mapreduce.TestTableMapReduce
    Tests run: 2, Failures: 0, Errors: 0, Skipped: 0, Time elapsed: 51.279 sec
    Running org.apache.hadoop.hbase.TestKeyValue
    Tests run: 14, Failures: 0, Errors: 0, Skipped: 0, Time elapsed: 0.029 sec
    Running org.apache.hadoop.hbase.client.TestMultiParallel
    Tests run: 10, Failures: 0, Errors: 0, Skipped: 0, Time elapsed: 23.16 sec
    Running org.apache.hadoop.hbase.master.TestMaster
    Tests run: 1, Failures: 0, Errors: 0, Skipped: 0, Time elapsed: 74.693 sec
    Running org.apache.hadoop.hbase.client.TestResult
    Tests run: 3, Failures: 0, Errors: 0, Skipped: 0, Time elapsed: 0.04 sec
    Running org.apache.hadoop.hbase.master.TestRollingRestart
    Tests run: 1, Failures: 0, Errors: 0, Skipped: 0, Time elapsed: 53.257 sec
    Running org.apache.hadoop.hbase.client.TestHTablePool
    Tests run: 5, Failures: 0, Errors: 0, Skipped: 0, Time elapsed: 16.612 sec
    Running org.apache.hadoop.hbase.master.TestOpenedRegionHandler
    Tests run: 2, Failures: 0, Errors: 0, Skipped: 0, Time elapsed: 18.437 sec
    Running org.apache.hadoop.hbase.util.TestByteBloomFilter
    Tests run: 3, Failures: 0, Errors: 0, Skipped: 0, Time elapsed: 1.558 sec
    Running org.apache.hadoop.hbase.rest.model.TestTableSchemaModel
    Tests run: 3, Failures: 0, Errors: 0, Skipped: 0, Time elapsed: 0.134 sec
    Running org.apache.hadoop.hbase.mapreduce.TestTableInputFormatScan
    Tests run: 11, Failures: 0, Errors: 0, Skipped: 0, Time elapsed: 313.936 sec
    Running org.apache.hadoop.hbase.filter.TestFilterList
    Tests run: 4, Failures: 0, Errors: 0, Skipped: 0, Time elapsed: 0.039 sec
    Running org.apache.hadoop.hbase.regionserver.TestHRegion
    Tests run: 54, Failures: 0, Errors: 0, Skipped: 0, Time elapsed: 12.827 sec
    Running org.apache.hadoop.hbase.master.TestMasterFailover
    Tests run: 4, Failures: 0, Errors: 0, Skipped: 0, Time elapsed: 71.947 sec
    Running org.apache.hadoop.hbase.rest.model.TestTableRegionModel
    Tests run: 4, Failures: 0, Errors: 0, Skipped: 0, Time elapsed: 0.033 sec
    Running org.apache.hadoop.hbase.client.TestTimestampsFilter
    Tests run: 3, Failures: 0, Errors: 0, Skipped: 0, Time elapsed: 28.523 sec
    Running org.apache.hadoop.hbase.master.TestLoadBalancer
    Tests run: 7, Failures: 0, Errors: 0, Skipped: 0, Time elapsed: 2.227 sec
    Running org.apache.hadoop.hbase.util.TestRootPath
    Tests run: 1, Failures: 0, Errors: 0, Skipped: 0, Time elapsed: 0.021 sec
    Running org.apache.hadoop.hbase.mapred.TestTableMapReduce
    Tests run: 1, Failures: 0, Errors: 0, Skipped: 0, Time elapsed: 90.951 sec
    Running org.apache.hadoop.hbase.regionserver.wal.TestWALObserver
    Tests run: 1, Failures: 0, Errors: 0, Skipped: 0, Time elapsed: 0.178 sec
    Running org.apache.hadoop.hbase.client.TestScannerTimeout
    Tests run: 4, Failures: 0, Errors: 0, Skipped: 0, Time elapsed: 46.171 sec
    Running org.apache.hadoop.hbase.replication.regionserver.TestReplicationSourceManager
    Tests run: 1, Failures: 0, Errors: 0, Skipped: 0, Time elapsed: 0.433 sec
    Running org.apache.hadoop.hbase.util.TestBytes
    Tests run: 10, Failures: 0, Errors: 0, Skipped: 0, Time elapsed: 0.022 sec
    Running org.apache.hadoop.hbase.master.TestActiveMasterManager
    Tests run: 2, Failures: 0, Errors: 0, Skipped: 0, Time elapsed: 0.296 sec
    Running org.apache.hadoop.hbase.util.TestCompressionTest
    Tests run: 1, Failures: 0, Errors: 0, Skipped: 0, Time elapsed: 0.025 sec
    Running org.apache.hadoop.hbase.filter.TestDependentColumnFilter
    Tests run: 2, Failures: 0, Errors: 0, Skipped: 0, Time elapsed: 0.223 sec
    Running org.apache.hadoop.hbase.client.TestGetRowVersions
    Tests run: 1, Failures: 0, Errors: 0, Skipped: 0, Time elapsed: 23.661 sec
    Running org.apache.hadoop.hbase.rest.model.TestCellModel
    Tests run: 3, Failures: 0, Errors: 0, Skipped: 0, Time elapsed: 0.129 sec
    Running org.apache.hadoop.hbase.catalog.TestCatalogTracker
    Tests run: 9, Failures: 0, Errors: 0, Skipped: 0, Time elapsed: 2.823 sec
    Running org.apache.hadoop.hbase.replication.TestReplicationSource
    Tests run: 1, Failures: 0, Errors: 0, Skipped: 0, Time elapsed: 1.321 sec
    Running org.apache.hadoop.hbase.master.TestCatalogJanitor
    Tests run: 2, Failures: 0, Errors: 0, Skipped: 0, Time elapsed: 0.367 sec
    Running org.apache.hadoop.hbase.util.TestRegionSplitCalculator
    Tests run: 15, Failures: 0, Errors: 0, Skipped: 0, Time elapsed: 0.07 sec
    Running org.apache.hadoop.hbase.rest.TestRowResource
    Tests run: 11, Failures: 0, Errors: 0, Skipped: 0, Time elapsed: 18.308 sec
    Running org.apache.hadoop.hbase.io.hfile.TestHFile
    Tests run: 7, Failures: 0, Errors: 0, Skipped: 0, Time elapsed: 0.205 sec
    Running org.apache.hadoop.hbase.catalog.TestMetaReaderEditor
    Tests run: 4, Failures: 0, Errors: 0, Skipped: 0, Time elapsed: 19.977 sec
    Running org.apache.hadoop.hbase.mapreduce.TestImportTsv
    Tests run: 7, Failures: 0, Errors: 0, Skipped: 0, Time elapsed: 15.839 sec
    Running org.apache.hadoop.hbase.util.TestStrings
    Tests run: 1, Failures: 0, Errors: 0, Skipped: 0, Time elapsed: 0.016 sec
    Running org.apache.hadoop.hbase.util.TestHBaseFsckComparator
    Tests run: 7, Failures: 0, Errors: 0, Skipped: 0, Time elapsed: 0.181 sec
    Running org.apache.hadoop.hbase.rest.client.TestRemoteAdmin
    Tests run: 2, Failures: 0, Errors: 0, Skipped: 0, Time elapsed: 20.344 sec
    Running org.apache.hadoop.hbase.regionserver.wal.TestHLog
    Tests run: 8, Failures: 0, Errors: 0, Skipped: 0, Time elapsed: 70.693 sec
    Running org.apache.hadoop.hbase.client.TestTimestamp
    Tests run: 1, Failures: 0, Errors: 0, Skipped: 0, Time elapsed: 13.589 sec
    Running org.apache.hadoop.hbase.TestScanMultipleVersions
    Tests run: 1, Failures: 0, Errors: 0, Skipped: 0, Time elapsed: 12.717 sec
    Running org.apache.hadoop.hbase.rest.model.TestStorageClusterVersionModel
    Tests run: 2, Failures: 0, Errors: 0, Skipped: 0, Time elapsed: 0.03 sec
    Running org.apache.hadoop.hbase.client.TestHCM
    Tests run: 4, Failures: 0, Errors: 0, Skipped: 0, Time elapsed: 27.656 sec

    Results :

    Tests in error:

    Tests run: 734, Failures: 0, Errors: 3, Skipped: 9

    [INFO] ------------------------------------------------------------------------
    [INFO] BUILD FAILURE
    [INFO] ------------------------------------------------------------------------
    [INFO] Total time: 1:19:03.901s
    [INFO] Finished at: Tue Oct 02 07:00:31 UTC 2012
    [INFO] Final Memory: 35M/492M
    [INFO] ------------------------------------------------------------------------
    [ERROR] Failed to execute goal org.apache.maven.plugins:maven-surefire-plugin:2.4.3:test (default-test) on project hbase: There are test failures.
    [ERROR]
    [ERROR] Please refer to <https://builds.apache.org/job/hbase-0.90/ws/trunk/target/surefire-reports> for the individual test results.
    [ERROR] -> [Help 1]
    [ERROR]
    [ERROR] To see the full stack trace of the errors, re-run Maven with the -e switch.
    [ERROR] Re-run Maven using the -X switch to enable full debug logging.
    [ERROR]
    [ERROR] For more information about the errors and possible solutions, please read the following articles:
    [ERROR] [Help 1] http://cwiki.apache.org/confluence/display/MAVEN/MojoFailureException
    Build step 'Invoke top-level Maven targets' marked build as failure
    [locks-and-latches] Releasing all the locks
    [locks-and-latches] All the locks released
    Archiving artifacts
    Recording test results
  • Apache Jenkins Server at Jan 18, 2013 at 9:51 pm
    See <https://builds.apache.org/job/hbase-0.90/529/changes>

    Changes:

    [eclark] HBASE-5458 Thread safety issues with Compression.Algorithm.GZ and CompressionTest

    ------------------------------------------
    [...truncated 1224 lines...]
    Running org.apache.hadoop.hbase.regionserver.TestFSErrorsExposed
    Tests run: 3, Failures: 0, Errors: 0, Skipped: 0, Time elapsed: 28.429 sec
    Running org.apache.hadoop.hbase.client.replication.TestReplicationAdmin
    Tests run: 1, Failures: 0, Errors: 0, Skipped: 0, Time elapsed: 0.407 sec
    Running org.apache.hadoop.hbase.regionserver.TestScanDeleteTracker
    Tests run: 6, Failures: 0, Errors: 0, Skipped: 0, Time elapsed: 0.076 sec
    Running org.apache.hadoop.hbase.metrics.TestMetricsMBeanBase
    Tests run: 2, Failures: 0, Errors: 0, Skipped: 0, Time elapsed: 0.027 sec
    Running org.apache.hadoop.hbase.client.TestMetaScanner
    Tests run: 1, Failures: 0, Errors: 0, Skipped: 0, Time elapsed: 13.954 sec
    Running org.apache.hadoop.hbase.TestRegionRebalancing
    Tests run: 1, Failures: 0, Errors: 0, Skipped: 0, Time elapsed: 34.136 sec
    Running org.apache.hadoop.hbase.rest.TestTableResource
    Tests run: 8, Failures: 0, Errors: 0, Skipped: 0, Time elapsed: 56.766 sec
    Running org.apache.hadoop.hbase.filter.TestSingleColumnValueExcludeFilter
    Tests run: 1, Failures: 0, Errors: 0, Skipped: 0, Time elapsed: 0.014 sec
    Running org.apache.hadoop.hbase.filter.TestInclusiveStopFilter
    Tests run: 2, Failures: 0, Errors: 0, Skipped: 0, Time elapsed: 0.015 sec
    Running org.apache.hadoop.hbase.mapreduce.TestTableSplit
    Tests run: 1, Failures: 0, Errors: 0, Skipped: 0, Time elapsed: 0.014 sec
    Running org.apache.hadoop.hbase.TestHBaseTestingUtility
    Tests run: 5, Failures: 0, Errors: 0, Skipped: 0, Time elapsed: 45.247 sec
    Running org.apache.hadoop.hbase.mapreduce.TestLoadIncrementalHFiles
    Tests run: 5, Failures: 0, Errors: 0, Skipped: 0, Time elapsed: 52.232 sec
    Running org.apache.hadoop.hbase.rest.TestSchemaResource
    Tests run: 2, Failures: 0, Errors: 0, Skipped: 0, Time elapsed: 22.049 sec
    Running org.apache.hadoop.hbase.regionserver.wal.TestWALReplay
    Tests run: 4, Failures: 0, Errors: 0, Skipped: 0, Time elapsed: 30.075 sec
    Running org.apache.hadoop.hbase.regionserver.TestKeyValueScanFixture
    Tests run: 1, Failures: 0, Errors: 0, Skipped: 0, Time elapsed: 0.013 sec
    Running org.apache.hadoop.hbase.rest.model.TestTableListModel
    Tests run: 3, Failures: 0, Errors: 0, Skipped: 0, Time elapsed: 0.106 sec
    Running org.apache.hadoop.hbase.rest.model.TestColumnSchemaModel
    Tests run: 2, Failures: 0, Errors: 0, Skipped: 0, Time elapsed: 0.027 sec
    Running org.apache.hadoop.hbase.regionserver.TestStoreFile
    Tests run: 7, Failures: 0, Errors: 0, Skipped: 0, Time elapsed: 24.351 sec
    Running org.apache.hadoop.hbase.zookeeper.TestZooKeeperNodeTracker
    Tests run: 2, Failures: 0, Errors: 0, Skipped: 0, Time elapsed: 0.25 sec
    Running org.apache.hadoop.hbase.rest.model.TestScannerModel
    Tests run: 3, Failures: 0, Errors: 0, Skipped: 0, Time elapsed: 0.112 sec
    Running org.apache.hadoop.hbase.regionserver.wal.TestHLogMethods
    Tests run: 3, Failures: 0, Errors: 0, Skipped: 0, Time elapsed: 0.26 sec
    Running org.apache.hadoop.hbase.rest.TestVersionResource
    Tests run: 7, Failures: 0, Errors: 0, Skipped: 0, Time elapsed: 22.496 sec
    Running org.apache.hadoop.hbase.regionserver.TestHRegionServerBulkLoad
    Tests run: 1, Failures: 0, Errors: 0, Skipped: 0, Time elapsed: 43.675 sec
    Running org.apache.hadoop.hbase.filter.TestFilter
    Tests run: 18, Failures: 0, Errors: 0, Skipped: 0, Time elapsed: 1.707 sec
    Running org.apache.hadoop.hbase.regionserver.TestWideScanner
    Tests run: 1, Failures: 0, Errors: 0, Skipped: 0, Time elapsed: 18.328 sec
    Running org.apache.hadoop.hbase.regionserver.TestSplitTransaction
    Tests run: 6, Failures: 0, Errors: 0, Skipped: 0, Time elapsed: 2.075 sec
    Running org.apache.hadoop.hbase.replication.regionserver.TestReplicationSink
    Tests run: 5, Failures: 0, Errors: 0, Skipped: 0, Time elapsed: 20.367 sec
    Running org.apache.hadoop.hbase.util.TestMergeTable
    Tests run: 1, Failures: 0, Errors: 0, Skipped: 0, Time elapsed: 46.833 sec
    Running org.apache.hadoop.hbase.regionserver.TestReadWriteConsistencyControl
    Tests run: 1, Failures: 0, Errors: 0, Skipped: 0, Time elapsed: 10.025 sec
    Running org.apache.hadoop.hbase.regionserver.TestGetClosestAtOrBefore
    Tests run: 3, Failures: 0, Errors: 0, Skipped: 0, Time elapsed: 6.452 sec
    Running org.apache.hadoop.hbase.rest.model.TestVersionModel
    Tests run: 3, Failures: 0, Errors: 0, Skipped: 0, Time elapsed: 0.11 sec
    Running org.apache.hadoop.hbase.rest.model.TestCellSetModel
    Tests run: 3, Failures: 0, Errors: 0, Skipped: 0, Time elapsed: 0.112 sec
    Running org.apache.hadoop.hbase.rest.model.TestStorageClusterStatusModel
    Tests run: 3, Failures: 0, Errors: 0, Skipped: 0, Time elapsed: 0.112 sec
    Running org.apache.hadoop.hbase.rest.client.TestRemoteTable
    Tests run: 3, Failures: 0, Errors: 0, Skipped: 0, Time elapsed: 17.162 sec
    Running org.apache.hadoop.hbase.avro.TestAvroServer
    Tests run: 3, Failures: 0, Errors: 3, Skipped: 0, Time elapsed: 15.103 sec <<< FAILURE!
    Running org.apache.hadoop.hbase.TestFullLogReconstruction
    Tests run: 1, Failures: 0, Errors: 0, Skipped: 0, Time elapsed: 55.853 sec
    Running org.apache.hadoop.hbase.TestSerialization
    Tests run: 19, Failures: 0, Errors: 0, Skipped: 0, Time elapsed: 0.052 sec
    Running org.apache.hadoop.hbase.regionserver.TestKeyValueHeap
    Tests run: 3, Failures: 0, Errors: 0, Skipped: 0, Time elapsed: 0.06 sec
    Running org.apache.hadoop.hbase.regionserver.TestStoreScanner
    Tests run: 14, Failures: 0, Errors: 0, Skipped: 0, Time elapsed: 0.027 sec
    Running org.apache.hadoop.hbase.TestHMsg
    Tests run: 2, Failures: 0, Errors: 0, Skipped: 0, Time elapsed: 0.019 sec
    Running org.apache.hadoop.hbase.io.hfile.TestReseekTo
    Tests run: 1, Failures: 0, Errors: 0, Skipped: 0, Time elapsed: 0.191 sec
    Running org.apache.hadoop.hbase.mapreduce.TestLoadIncrementalHFilesSplitRecovery
    Tests run: 4, Failures: 0, Errors: 0, Skipped: 0, Time elapsed: 24.557 sec
    Running org.apache.hadoop.hbase.util.TestIncrementingEnvironmentEdge
    Tests run: 1, Failures: 0, Errors: 0, Skipped: 0, Time elapsed: 0.014 sec
    Running org.apache.hadoop.hbase.util.TestKeying
    Tests run: 1, Failures: 0, Errors: 0, Skipped: 0, Time elapsed: 0.014 sec
    Running org.apache.hadoop.hbase.regionserver.TestHRegionInfo
    Tests run: 3, Failures: 0, Errors: 0, Skipped: 0, Time elapsed: 0.016 sec
    Running org.apache.hadoop.hbase.regionserver.TestScanner
    Tests run: 6, Failures: 0, Errors: 0, Skipped: 0, Time elapsed: 62.114 sec
    Running org.apache.hadoop.hbase.util.TestHBaseFsck
    Tests run: 21, Failures: 0, Errors: 0, Skipped: 0, Time elapsed: 164.434 sec
    Running org.apache.hadoop.hbase.master.TestRestartCluster
    Tests run: 2, Failures: 0, Errors: 0, Skipped: 0, Time elapsed: 42.924 sec
    Running org.apache.hadoop.hbase.client.TestShell
    Tests run: 1, Failures: 0, Errors: 0, Skipped: 0, Time elapsed: 43.551 sec
    Running org.apache.hadoop.hbase.rest.model.TestTableInfoModel
    Tests run: 3, Failures: 0, Errors: 0, Skipped: 0, Time elapsed: 0.113 sec
    Running org.apache.hadoop.hbase.TestInfoServers
    Tests run: 1, Failures: 0, Errors: 0, Skipped: 0, Time elapsed: 12.541 sec
    Running org.apache.hadoop.hbase.master.TestLogsCleaner
    Tests run: 1, Failures: 0, Errors: 0, Skipped: 0, Time elapsed: 0.6 sec
    Running org.apache.hadoop.hbase.regionserver.TestMasterAddressManager
    Tests run: 1, Failures: 0, Errors: 0, Skipped: 0, Time elapsed: 0.193 sec
    Running org.apache.hadoop.hbase.catalog.TestCatalogTrackerOnCluster
    Tests run: 1, Failures: 0, Errors: 0, Skipped: 0, Time elapsed: 205.401 sec
    Running org.apache.hadoop.hbase.regionserver.TestQueryMatcher
    Tests run: 4, Failures: 0, Errors: 0, Skipped: 0, Time elapsed: 0.073 sec
    Running org.apache.hadoop.hbase.zookeeper.TestZKTable
    Tests run: 1, Failures: 0, Errors: 0, Skipped: 0, Time elapsed: 0.194 sec
    Running org.apache.hadoop.hbase.client.TestAdmin
    Tests run: 24, Failures: 0, Errors: 0, Skipped: 0, Time elapsed: 232.038 sec
    Running org.apache.hadoop.hbase.util.TestMergeTool
    Tests run: 1, Failures: 0, Errors: 0, Skipped: 0, Time elapsed: 17.442 sec
    Running org.apache.hadoop.hbase.regionserver.TestPriorityCompactionQueue
    Tests run: 1, Failures: 0, Errors: 0, Skipped: 0, Time elapsed: 1.11 sec
    Running org.apache.hadoop.hbase.TestAcidGuarantees
    Tests run: 3, Failures: 0, Errors: 0, Skipped: 3, Time elapsed: 0.013 sec
    Running org.apache.hadoop.hbase.util.TestBase64
    Tests run: 1, Failures: 0, Errors: 0, Skipped: 0, Time elapsed: 0.015 sec
    Running org.apache.hadoop.hbase.regionserver.TestMemStore
    Tests run: 21, Failures: 0, Errors: 0, Skipped: 0, Time elapsed: 44.087 sec
    Running org.apache.hadoop.hbase.rest.TestScannerResource
    Tests run: 5, Failures: 0, Errors: 0, Skipped: 0, Time elapsed: 54.14 sec
    Running org.apache.hadoop.hbase.io.hfile.TestLruBlockCache
    Tests run: 7, Failures: 0, Errors: 0, Skipped: 0, Time elapsed: 1.067 sec
    Running org.apache.hadoop.hbase.master.TestDeadServer
    Tests run: 1, Failures: 0, Errors: 0, Skipped: 0, Time elapsed: 0.016 sec
    Running org.apache.hadoop.hbase.rest.TestGzipFilter
    Tests run: 3, Failures: 0, Errors: 0, Skipped: 0, Time elapsed: 17.057 sec
    Running org.apache.hadoop.hbase.TestKeyValue
    Tests run: 14, Failures: 0, Errors: 0, Skipped: 0, Time elapsed: 0.027 sec
    Running org.apache.hadoop.hbase.mapreduce.TestTableMapReduce
    Tests run: 2, Failures: 0, Errors: 0, Skipped: 0, Time elapsed: 60.804 sec
    Running org.apache.hadoop.hbase.client.TestMultiParallel
    Tests run: 10, Failures: 0, Errors: 0, Skipped: 0, Time elapsed: 24.023 sec
    Running org.apache.hadoop.hbase.master.TestMaster
    Tests run: 1, Failures: 0, Errors: 0, Skipped: 0, Time elapsed: 80.368 sec
    Running org.apache.hadoop.hbase.master.TestRollingRestart
    Tests run: 1, Failures: 0, Errors: 0, Skipped: 0, Time elapsed: 50.714 sec
    Running org.apache.hadoop.hbase.client.TestResult
    Tests run: 3, Failures: 0, Errors: 0, Skipped: 0, Time elapsed: 0.063 sec
    Running org.apache.hadoop.hbase.client.TestHTablePool
    Tests run: 5, Failures: 0, Errors: 0, Skipped: 0, Time elapsed: 16.526 sec
    Running org.apache.hadoop.hbase.master.TestOpenedRegionHandler
    Tests run: 2, Failures: 0, Errors: 0, Skipped: 0, Time elapsed: 18.133 sec
    Running org.apache.hadoop.hbase.util.TestByteBloomFilter
    Tests run: 3, Failures: 0, Errors: 0, Skipped: 0, Time elapsed: 1.154 sec
    Running org.apache.hadoop.hbase.rest.model.TestTableSchemaModel
    Tests run: 3, Failures: 0, Errors: 0, Skipped: 0, Time elapsed: 0.113 sec
    Running org.apache.hadoop.hbase.filter.TestFilterList
    Tests run: 4, Failures: 0, Errors: 0, Skipped: 0, Time elapsed: 0.036 sec
    Running org.apache.hadoop.hbase.mapreduce.TestTableInputFormatScan
    Tests run: 11, Failures: 0, Errors: 0, Skipped: 0, Time elapsed: 313.132 sec
    Running org.apache.hadoop.hbase.regionserver.TestHRegion
    Tests run: 54, Failures: 0, Errors: 0, Skipped: 0, Time elapsed: 11.484 sec
    Running org.apache.hadoop.hbase.rest.model.TestTableRegionModel
    Tests run: 4, Failures: 0, Errors: 0, Skipped: 0, Time elapsed: 0.027 sec
    Running org.apache.hadoop.hbase.master.TestMasterFailover
    Tests run: 4, Failures: 0, Errors: 0, Skipped: 0, Time elapsed: 68.468 sec
    Running org.apache.hadoop.hbase.client.TestTimestampsFilter
    Tests run: 3, Failures: 0, Errors: 0, Skipped: 0, Time elapsed: 26.334 sec
    Running org.apache.hadoop.hbase.util.TestRootPath
    Tests run: 1, Failures: 0, Errors: 0, Skipped: 0, Time elapsed: 0.031 sec
    Running org.apache.hadoop.hbase.master.TestLoadBalancer
    Tests run: 7, Failures: 0, Errors: 0, Skipped: 0, Time elapsed: 1.662 sec
    Running org.apache.hadoop.hbase.mapred.TestTableMapReduce
    Tests run: 1, Failures: 0, Errors: 0, Skipped: 0, Time elapsed: 42.137 sec
    Running org.apache.hadoop.hbase.client.TestScannerTimeout
    Tests run: 4, Failures: 0, Errors: 0, Skipped: 0, Time elapsed: 45.948 sec
    Running org.apache.hadoop.hbase.regionserver.wal.TestWALObserver
    Tests run: 1, Failures: 0, Errors: 0, Skipped: 0, Time elapsed: 0.138 sec
    Running org.apache.hadoop.hbase.util.TestBytes
    Tests run: 10, Failures: 0, Errors: 0, Skipped: 0, Time elapsed: 0.019 sec
    Running org.apache.hadoop.hbase.replication.regionserver.TestReplicationSourceManager
    Tests run: 1, Failures: 0, Errors: 0, Skipped: 0, Time elapsed: 0.375 sec
    Running org.apache.hadoop.hbase.master.TestActiveMasterManager
    Tests run: 2, Failures: 0, Errors: 0, Skipped: 0, Time elapsed: 0.271 sec
    Running org.apache.hadoop.hbase.util.TestCompressionTest
    Tests run: 1, Failures: 0, Errors: 0, Skipped: 0, Time elapsed: 0.022 sec
    Running org.apache.hadoop.hbase.filter.TestDependentColumnFilter
    Tests run: 2, Failures: 0, Errors: 0, Skipped: 0, Time elapsed: 0.195 sec
    Running org.apache.hadoop.hbase.client.TestGetRowVersions
    Tests run: 1, Failures: 0, Errors: 0, Skipped: 0, Time elapsed: 23.479 sec
    Running org.apache.hadoop.hbase.rest.model.TestCellModel
    Tests run: 3, Failures: 0, Errors: 0, Skipped: 0, Time elapsed: 0.106 sec
    Running org.apache.hadoop.hbase.replication.TestReplicationSource
    Tests run: 1, Failures: 0, Errors: 0, Skipped: 0, Time elapsed: 1.105 sec
    Running org.apache.hadoop.hbase.master.TestCatalogJanitor
    Tests run: 2, Failures: 0, Errors: 0, Skipped: 0, Time elapsed: 0.3 sec
    Running org.apache.hadoop.hbase.catalog.TestCatalogTracker
    Tests run: 9, Failures: 0, Errors: 0, Skipped: 0, Time elapsed: 3.751 sec
    Running org.apache.hadoop.hbase.util.TestRegionSplitCalculator
    Tests run: 15, Failures: 0, Errors: 0, Skipped: 0, Time elapsed: 0.051 sec
    Running org.apache.hadoop.hbase.rest.TestRowResource
    Tests run: 11, Failures: 0, Errors: 0, Skipped: 0, Time elapsed: 18.072 sec
    Running org.apache.hadoop.hbase.io.hfile.TestHFile
    Tests run: 7, Failures: 0, Errors: 0, Skipped: 0, Time elapsed: 0.19 sec
    Running org.apache.hadoop.hbase.catalog.TestMetaReaderEditor
    Tests run: 4, Failures: 0, Errors: 0, Skipped: 0, Time elapsed: 18.528 sec
    Running org.apache.hadoop.hbase.util.TestStrings
    Tests run: 1, Failures: 0, Errors: 0, Skipped: 0, Time elapsed: 0.014 sec
    Running org.apache.hadoop.hbase.util.TestHBaseFsckComparator
    Tests run: 7, Failures: 0, Errors: 0, Skipped: 0, Time elapsed: 0.169 sec
    Running org.apache.hadoop.hbase.mapreduce.TestImportTsv
    Tests run: 7, Failures: 0, Errors: 0, Skipped: 0, Time elapsed: 21.273 sec
    Running org.apache.hadoop.hbase.rest.client.TestRemoteAdmin
    Tests run: 2, Failures: 0, Errors: 0, Skipped: 0, Time elapsed: 20.066 sec
    Running org.apache.hadoop.hbase.regionserver.wal.TestHLog
    Tests run: 8, Failures: 0, Errors: 0, Skipped: 0, Time elapsed: 74.397 sec
    Running org.apache.hadoop.hbase.client.TestTimestamp
    Tests run: 1, Failures: 0, Errors: 0, Skipped: 0, Time elapsed: 13.318 sec
    Running org.apache.hadoop.hbase.TestScanMultipleVersions
    Tests run: 1, Failures: 0, Errors: 0, Skipped: 0, Time elapsed: 12.623 sec
    Running org.apache.hadoop.hbase.rest.model.TestStorageClusterVersionModel
    Tests run: 2, Failures: 0, Errors: 0, Skipped: 0, Time elapsed: 0.026 sec
    Running org.apache.hadoop.hbase.client.TestHCM
    Tests run: 4, Failures: 0, Errors: 0, Skipped: 0, Time elapsed: 27.512 sec

    Results :

    Tests in error:

    Tests run: 734, Failures: 0, Errors: 3, Skipped: 9

    [INFO] ------------------------------------------------------------------------
    [INFO] BUILD FAILURE
    [INFO] ------------------------------------------------------------------------
    [INFO] Total time: 1:15:20.060s
    [INFO] Finished at: Fri Jan 18 21:50:49 UTC 2013
    [INFO] Final Memory: 37M/433M
    [INFO] ------------------------------------------------------------------------
    [ERROR] Failed to execute goal org.apache.maven.plugins:maven-surefire-plugin:2.4.3:test (default-test) on project hbase: There are test failures.
    [ERROR]
    [ERROR] Please refer to /x1/jenkins/jenkins-slave/workspace/hbase-0.90/trunk/target/surefire-reports for the individual test results.
    [ERROR] -> [Help 1]
    [ERROR]
    [ERROR] To see the full stack trace of the errors, re-run Maven with the -e switch.
    [ERROR] Re-run Maven using the -X switch to enable full debug logging.
    [ERROR]
    [ERROR] For more information about the errors and possible solutions, please read the following articles:
    [ERROR] [Help 1] http://cwiki.apache.org/confluence/display/MAVEN/MojoFailureException
    Build step 'Invoke top-level Maven targets' marked build as failure
    [locks-and-latches] Releasing all the locks
    [locks-and-latches] All the locks released
    Archiving artifacts
    Recording test results

Related Discussions

Discussion Navigation
viewthread | post
Discussion Overview
groupdev @
categorieshbase, hadoop
postedJul 17, '12 at 10:35p
activeJan 18, '13 at 9:51p
posts14
users1
websitehbase.apache.org

1 user in discussion

Apache Jenkins Server: 14 posts

People

Translate

site design / logo © 2022 Grokbase