Grokbase Groups HBase dev July 2012
FAQ
See <https://builds.apache.org/job/HBase-TRUNK/3140/>

------------------------------------------
[...truncated 2327 lines...]
Tests run: 56, Failures: 0, Errors: 0, Skipped: 3, Time elapsed: 184.354 sec
Running org.apache.hadoop.hbase.master.TestActiveMasterManager
Tests run: 2, Failures: 0, Errors: 0, Skipped: 0, Time elapsed: 0.922 sec
Running org.apache.hadoop.hbase.master.TestMasterShutdown
Tests run: 1, Failures: 0, Errors: 0, Skipped: 0, Time elapsed: 13.694 sec
Running org.apache.hadoop.hbase.master.TestMasterStatusServlet
Tests run: 5, Failures: 0, Errors: 0, Skipped: 0, Time elapsed: 1.119 sec
Running org.apache.hadoop.hbase.master.TestHMasterRPCException
Tests run: 1, Failures: 0, Errors: 0, Skipped: 0, Time elapsed: 0.989 sec
Running org.apache.hadoop.hbase.client.TestAdmin
Running org.apache.hadoop.hbase.master.TestAssignmentManager
Tests run: 12, Failures: 0, Errors: 0, Skipped: 0, Time elapsed: 2.355 sec
Tests run: 40, Failures: 0, Errors: 0, Skipped: 0, Time elapsed: 200.638 sec
Running org.apache.hadoop.hbase.master.TestLogsCleaner
Tests run: 1, Failures: 0, Errors: 0, Skipped: 0, Time elapsed: 3.153 sec
Running org.apache.hadoop.hbase.master.TestOpenedRegionHandler
Tests run: 2, Failures: 0, Errors: 0, Skipped: 0, Time elapsed: 14.718 sec
Running org.apache.hadoop.hbase.master.TestMasterTransitions
Tests run: 3, Failures: 0, Errors: 0, Skipped: 3, Time elapsed: 20.483 sec
Running org.apache.hadoop.hbase.master.TestZKBasedOpenCloseRegion
Tests run: 4, Failures: 0, Errors: 0, Skipped: 0, Time elapsed: 20.034 sec
Running org.apache.hadoop.hbase.master.TestRollingRestart
Tests run: 1, Failures: 0, Errors: 0, Skipped: 0, Time elapsed: 47.466 sec
Running org.apache.hadoop.hbase.master.TestRestartCluster
Tests run: 2, Failures: 0, Errors: 0, Skipped: 0, Time elapsed: 27.809 sec
Running org.apache.hadoop.hbase.master.TestMasterNoCluster
Tests run: 3, Failures: 0, Errors: 0, Skipped: 0, Time elapsed: 8.844 sec
Running org.apache.hadoop.hbase.master.TestMaster
Tests run: 1, Failures: 0, Errors: 0, Skipped: 0, Time elapsed: 16.298 sec
Running org.apache.hadoop.hbase.master.TestSplitLogManager
Tests run: 12, Failures: 0, Errors: 0, Skipped: 0, Time elapsed: 15.721 sec
Running org.apache.hadoop.hbase.master.balancer.TestStochasticLoadBalancer
Tests run: 4, Failures: 0, Errors: 0, Skipped: 0, Time elapsed: 94.978 sec
Running org.apache.hadoop.hbase.master.TestMXBean
Tests run: 1, Failures: 0, Errors: 0, Skipped: 0, Time elapsed: 14.252 sec
Running org.apache.hadoop.hbase.master.TestMasterFailover
Tests run: 4, Failures: 0, Errors: 0, Skipped: 0, Time elapsed: 64.718 sec
Running org.apache.hadoop.hbase.master.TestMasterRestartAfterDisablingTable
Tests run: 1, Failures: 0, Errors: 0, Skipped: 0, Time elapsed: 17.553 sec
Running org.apache.hadoop.hbase.TestGlobalMemStoreSize
Tests run: 1, Failures: 0, Errors: 0, Skipped: 0, Time elapsed: 15.735 sec
Running org.apache.hadoop.hbase.replication.TestReplicationZookeeper
Tests run: 1, Failures: 0, Errors: 0, Skipped: 0, Time elapsed: 0.68 sec
Running org.apache.hadoop.hbase.TestFullLogReconstruction
Tests run: 1, Failures: 0, Errors: 0, Skipped: 0, Time elapsed: 53.499 sec
Running org.apache.hadoop.hbase.replication.TestReplicationSource
Tests run: 1, Failures: 0, Errors: 0, Skipped: 0, Time elapsed: 2.798 sec
Running org.apache.hadoop.hbase.master.TestDistributedLogSplitting
Tests run: 4, Failures: 0, Errors: 0, Skipped: 0, Time elapsed: 93.251 sec
Running org.apache.hadoop.hbase.replication.TestReplicationPeer
Tests run: 1, Failures: 0, Errors: 0, Skipped: 0, Time elapsed: 1.541 sec
Running org.apache.hadoop.hbase.replication.regionserver.TestReplicationSink
Tests run: 5, Failures: 0, Errors: 0, Skipped: 0, Time elapsed: 14.745 sec
Running org.apache.hadoop.hbase.replication.regionserver.TestReplicationSourceManager
Tests run: 1, Failures: 0, Errors: 0, Skipped: 0, Time elapsed: 0.991 sec
Running org.apache.hadoop.hbase.replication.TestMasterReplication
Tests run: 2, Failures: 0, Errors: 0, Skipped: 0, Time elapsed: 67.092 sec
Running org.apache.hadoop.hbase.replication.TestMultiSlaveReplication
Tests run: 1, Failures: 0, Errors: 0, Skipped: 0, Time elapsed: 36.546 sec
Running org.apache.hadoop.hbase.TestMultiVersions
Tests run: 3, Failures: 0, Errors: 0, Skipped: 0, Time elapsed: 23.156 sec
Running org.apache.hadoop.hbase.catalog.TestMetaReaderEditorNoCluster
Tests run: 1, Failures: 0, Errors: 0, Skipped: 0, Time elapsed: 4.066 sec
Running org.apache.hadoop.hbase.TestHBaseTestingUtility
Tests run: 7, Failures: 0, Errors: 0, Skipped: 0, Time elapsed: 61.021 sec
Running org.apache.hadoop.hbase.catalog.TestCatalogTracker
Tests run: 9, Failures: 0, Errors: 0, Skipped: 1, Time elapsed: 5.363 sec
Running org.apache.hadoop.hbase.catalog.TestMetaReaderEditor
Tests run: 5, Failures: 0, Errors: 0, Skipped: 0, Time elapsed: 25.733 sec
Running org.apache.hadoop.hbase.coprocessor.TestAggregateProtocol
Tests run: 45, Failures: 0, Errors: 0, Skipped: 0, Time elapsed: 15.868 sec
Running org.apache.hadoop.hbase.coprocessor.TestRowProcessorEndpoint
Tests run: 4, Failures: 0, Errors: 0, Skipped: 0, Time elapsed: 35.388 sec
Running org.apache.hadoop.hbase.catalog.TestCatalogTrackerOnCluster
Tests run: 1, Failures: 0, Errors: 0, Skipped: 0, Time elapsed: 77.356 sec
Running org.apache.hadoop.hbase.coprocessor.TestMasterObserver
Tests run: 3, Failures: 0, Errors: 0, Skipped: 0, Time elapsed: 32.825 sec
Running org.apache.hadoop.hbase.coprocessor.TestCoprocessorEndpoint
Tests run: 3, Failures: 0, Errors: 0, Skipped: 1, Time elapsed: 31.022 sec
Running org.apache.hadoop.hbase.coprocessor.TestClassLoading
Tests run: 6, Failures: 0, Errors: 0, Skipped: 0, Time elapsed: 33.121 sec
Running org.apache.hadoop.hbase.coprocessor.TestMasterCoprocessorExceptionWithRemove
Tests run: 1, Failures: 0, Errors: 0, Skipped: 0, Time elapsed: 15.274 sec
Running org.apache.hadoop.hbase.coprocessor.TestRegionObserverInterface
Tests run: 7, Failures: 0, Errors: 0, Skipped: 0, Time elapsed: 37.483 sec
Running org.apache.hadoop.hbase.coprocessor.TestRegionServerCoprocessorExceptionWithRemove
Tests run: 1, Failures: 0, Errors: 0, Skipped: 0, Time elapsed: 17.51 sec
Running org.apache.hadoop.hbase.coprocessor.TestWALObserver
Tests run: 3, Failures: 0, Errors: 0, Skipped: 0, Time elapsed: 16.402 sec
Running org.apache.hadoop.hbase.coprocessor.TestMasterCoprocessorExceptionWithAbort
Tests run: 1, Failures: 0, Errors: 0, Skipped: 0, Time elapsed: 25.446 sec
Running org.apache.hadoop.hbase.coprocessor.TestRegionObserverBypass
Tests run: 2, Failures: 0, Errors: 0, Skipped: 0, Time elapsed: 15.204 sec
Running org.apache.hadoop.hbase.coprocessor.TestRegionServerCoprocessorExceptionWithAbort
Tests run: 1, Failures: 0, Errors: 0, Skipped: 0, Time elapsed: 17.302 sec
Running org.apache.hadoop.hbase.thrift2.TestThriftHBaseServiceHandler
Tests run: 12, Failures: 0, Errors: 0, Skipped: 0, Time elapsed: 24.333 sec
Running org.apache.hadoop.hbase.avro.TestAvroServer
Tests run: 3, Failures: 0, Errors: 0, Skipped: 0, Time elapsed: 36.202 sec
Running org.apache.hadoop.hbase.thrift.TestThriftServer
Tests run: 1, Failures: 0, Errors: 0, Skipped: 0, Time elapsed: 85.245 sec
Running org.apache.hadoop.hbase.regionserver.TestHRegionOnCluster
Tests run: 1, Failures: 0, Errors: 0, Skipped: 0, Time elapsed: 23.85 sec
Running org.apache.hadoop.hbase.regionserver.TestMemStore
Tests run: 21, Failures: 0, Errors: 0, Skipped: 0, Time elapsed: 29.555 sec
Running org.apache.hadoop.hbase.regionserver.TestHRegion
Tests run: 66, Failures: 0, Errors: 0, Skipped: 0, Time elapsed: 43.753 sec
Running org.apache.hadoop.hbase.regionserver.TestMasterAddressManager
Tests run: 1, Failures: 0, Errors: 0, Skipped: 0, Time elapsed: 0.624 sec
Running org.apache.hadoop.hbase.regionserver.TestRegionServerMetrics
Tests run: 4, Failures: 0, Errors: 0, Skipped: 0, Time elapsed: 71.091 sec
Running org.apache.hadoop.hbase.regionserver.TestCompoundBloomFilter
Tests run: 3, Failures: 0, Errors: 0, Skipped: 0, Time elapsed: 25.013 sec
Running org.apache.hadoop.hbase.regionserver.TestSplitLogWorker
Tests run: 5, Failures: 0, Errors: 0, Skipped: 0, Time elapsed: 2.252 sec
Running org.apache.hadoop.hbase.regionserver.TestServerCustomProtocol
Tests run: 7, Failures: 0, Errors: 0, Skipped: 0, Time elapsed: 17.649 sec
Running org.apache.hadoop.hbase.regionserver.TestStoreFileBlockCacheSummary
Tests run: 1, Failures: 0, Errors: 0, Skipped: 0, Time elapsed: 15.482 sec
Running org.apache.hadoop.hbase.regionserver.TestStore
Tests run: 12, Failures: 0, Errors: 0, Skipped: 0, Time elapsed: 9.4 sec
Running org.apache.hadoop.hbase.regionserver.TestAtomicOperation
Tests run: 5, Failures: 0, Errors: 0, Skipped: 0, Time elapsed: 26.317 sec
Running org.apache.hadoop.hbase.regionserver.TestCompactionState
Tests run: 2, Failures: 0, Errors: 0, Skipped: 0, Time elapsed: 31.677 sec
Running org.apache.hadoop.hbase.regionserver.TestBlocksRead
Tests run: 4, Failures: 0, Errors: 0, Skipped: 0, Time elapsed: 1.191 sec
Running org.apache.hadoop.hbase.regionserver.TestRSKilledWhenMasterInitializing
Tests run: 1, Failures: 0, Errors: 0, Skipped: 0, Time elapsed: 61.548 sec
Running org.apache.hadoop.hbase.thrift.TestThriftServerCmdLine
Tests run: 20, Failures: 0, Errors: 0, Skipped: 0, Time elapsed: 469.261 sec
Running org.apache.hadoop.hbase.regionserver.TestSeekOptimizations
Tests run: 6, Failures: 0, Errors: 0, Skipped: 0, Time elapsed: 3.111 sec
Running org.apache.hadoop.hbase.regionserver.metrics.TestSchemaMetrics
Tests run: 6, Failures: 0, Errors: 0, Skipped: 0, Time elapsed: 15.049 sec
Running org.apache.hadoop.hbase.regionserver.handler.TestCloseRegionHandler
Tests run: 3, Failures: 0, Errors: 0, Skipped: 0, Time elapsed: 1.303 sec
Running org.apache.hadoop.hbase.regionserver.handler.TestOpenRegionHandler
Tests run: 3, Failures: 0, Errors: 0, Skipped: 0, Time elapsed: 0.958 sec
Running org.apache.hadoop.hbase.regionserver.TestFSErrorsExposed
Tests run: 3, Failures: 0, Errors: 0, Skipped: 0, Time elapsed: 27.223 sec
Running org.apache.hadoop.hbase.regionserver.TestGetClosestAtOrBefore
Tests run: 3, Failures: 0, Errors: 0, Skipped: 0, Time elapsed: 1.14 sec
Running org.apache.hadoop.hbase.regionserver.TestParallelPut
Tests run: 2, Failures: 0, Errors: 0, Skipped: 0, Time elapsed: 5.973 sec
Running org.apache.hadoop.hbase.regionserver.TestCacheOnWriteInSchema
Tests run: 3, Failures: 0, Errors: 0, Skipped: 0, Time elapsed: 1.904 sec
Running org.apache.hadoop.hbase.regionserver.TestHRegionServerBulkLoad
Tests run: 1, Failures: 0, Errors: 0, Skipped: 0, Time elapsed: 47.829 sec
Running org.apache.hadoop.hbase.regionserver.TestSplitTransactionOnCluster
Tests run: 7, Failures: 0, Errors: 0, Skipped: 0, Time elapsed: 98.175 sec
Running org.apache.hadoop.hbase.regionserver.wal.TestHLog
Tests run: 10, Failures: 0, Errors: 0, Skipped: 0, Time elapsed: 66.99 sec
Running org.apache.hadoop.hbase.regionserver.wal.TestLogRolling
Tests run: 2, Failures: 0, Errors: 0, Skipped: 0, Time elapsed: 101.697 sec
Running org.apache.hadoop.hbase.regionserver.wal.TestWALReplay
Tests run: 7, Failures: 0, Errors: 0, Skipped: 0, Time elapsed: 45.496 sec
Running org.apache.hadoop.hbase.regionserver.wal.TestWALReplayCompressed
Tests run: 7, Failures: 0, Errors: 0, Skipped: 0, Time elapsed: 49.421 sec
Running org.apache.hadoop.hbase.regionserver.wal.TestLogRollAbort
Tests run: 1, Failures: 0, Errors: 0, Skipped: 0, Time elapsed: 163.424 sec
Running org.apache.hadoop.hbase.regionserver.TestStoreScanner
Tests run: 16, Failures: 0, Errors: 0, Skipped: 0, Time elapsed: 0.053 sec
Running org.apache.hadoop.hbase.regionserver.TestEndToEndSplitTransaction
Tests run: 2, Failures: 0, Errors: 0, Skipped: 0, Time elapsed: 64.236 sec
Running org.apache.hadoop.hbase.regionserver.TestRpcMetrics
Tests run: 1, Failures: 0, Errors: 0, Skipped: 0, Time elapsed: 1.749 sec
Running org.apache.hadoop.hbase.regionserver.TestMXBean
Tests run: 1, Failures: 0, Errors: 0, Skipped: 0, Time elapsed: 9.756 sec
Running org.apache.hadoop.hbase.regionserver.TestCompaction
Tests run: 15, Failures: 0, Errors: 0, Skipped: 0, Time elapsed: 40.38 sec
Running org.apache.hadoop.hbase.regionserver.TestMultiColumnScanner
Tests run: 12, Failures: 0, Errors: 0, Skipped: 0, Time elapsed: 42.318 sec
Running org.apache.hadoop.hbase.regionserver.wal.TestHLogSplit
Tests run: 30, Failures: 0, Errors: 0, Skipped: 1, Time elapsed: 248.72 sec
Running org.apache.hadoop.hbase.mapred.TestTableInputFormat
Tests run: 10, Failures: 0, Errors: 0, Skipped: 0, Time elapsed: 35.52 sec
Running org.apache.hadoop.hbase.TestClusterBootOrder
Tests run: 2, Failures: 0, Errors: 0, Skipped: 0, Time elapsed: 33.211 sec
Running org.apache.hadoop.hbase.TestDrainingServer
Tests run: 2, Failures: 0, Errors: 0, Skipped: 0, Time elapsed: 26.386 sec
Running org.apache.hadoop.hbase.mapred.TestTableMapReduce
Tests run: 1, Failures: 0, Errors: 0, Skipped: 0, Time elapsed: 101.512 sec
Running org.apache.hadoop.hbase.mapreduce.TestTimeRangeMapRed
Tests run: 1, Failures: 0, Errors: 0, Skipped: 0, Time elapsed: 45.652 sec
Running org.apache.hadoop.hbase.mapreduce.TestImportExport
Tests run: 2, Failures: 0, Errors: 0, Skipped: 0, Time elapsed: 53.782 sec
Running org.apache.hadoop.hbase.mapreduce.TestWALPlayer
Tests run: 1, Failures: 0, Errors: 0, Skipped: 0, Time elapsed: 49.185 sec
Running org.apache.hadoop.hbase.mapreduce.TestMultithreadedTableMapper
Tests run: 1, Failures: 0, Errors: 0, Skipped: 0, Time elapsed: 122.013 sec
Running org.apache.hadoop.hbase.mapreduce.TestImportTsv
Tests run: 13, Failures: 0, Errors: 0, Skipped: 0, Time elapsed: 265.539 sec
Running org.apache.hadoop.hbase.mapreduce.TestHFileOutputFormat
Tests run: 9, Failures: 0, Errors: 0, Skipped: 0, Time elapsed: 308.793 sec
Running org.apache.hadoop.hbase.mapreduce.TestLoadIncrementalHFiles
Tests run: 6, Failures: 0, Errors: 0, Skipped: 0, Time elapsed: 33.517 sec
Running org.apache.hadoop.hbase.mapreduce.TestHLogRecordReader
Tests run: 2, Failures: 0, Errors: 0, Skipped: 0, Time elapsed: 5.569 sec
Running org.apache.hadoop.hbase.mapreduce.TestLoadIncrementalHFilesSplitRecovery
Tests run: 4, Failures: 0, Errors: 0, Skipped: 0, Time elapsed: 108.538 sec
Running org.apache.hadoop.hbase.mapreduce.TestTableMapReduce
Tests run: 1, Failures: 0, Errors: 0, Skipped: 0, Time elapsed: 119.823 sec
Running org.apache.hadoop.hbase.mapreduce.TestTableInputFormatScan
Tests run: 12, Failures: 0, Errors: 0, Skipped: 0, Time elapsed: 587.381 sec

Results :

Failed tests: testRebalanceOnRegionServerNumberChange[0](org.apache.hadoop.hbase.TestRegionRebalancing): After 5 attempts, region assignments were not balanced.

Tests run: 1021, Failures: 1, Errors: 0, Skipped: 9

[INFO]
[INFO] ------------------------------------------------------------------------
[INFO] Skipping HBase
[INFO] This project has been banned from the build due to previous failures.
[INFO] ------------------------------------------------------------------------
[INFO]
[INFO] ------------------------------------------------------------------------
[INFO] Skipping HBase
[INFO] This project has been banned from the build due to previous failures.
[INFO] ------------------------------------------------------------------------
[INFO] ------------------------------------------------------------------------
[INFO] Reactor Summary:
[INFO]
[INFO] HBase ............................................. SUCCESS [19.598s]
[INFO] HBase - Common .................................... SUCCESS [11.134s]
[INFO] HBase - Server .................................... FAILURE [48:52.478s]
[INFO] HBase - Integration Tests ......................... SKIPPED
[INFO] ------------------------------------------------------------------------
[INFO] BUILD FAILURE
[INFO] ------------------------------------------------------------------------
[INFO] Total time: 49:24.555s
[INFO] Finished at: Tue Jul 17 05:14:17 UTC 2012
[INFO] Final Memory: 87M/245M
[INFO] ------------------------------------------------------------------------
[ERROR] Failed to execute goal org.apache.maven.plugins:maven-surefire-plugin:2.12-TRUNK-HBASE-2:test (secondPartTestsExecution) on project hbase-server: Failure or timeout -> [Help 1]
[ERROR]
[ERROR] To see the full stack trace of the errors, re-run Maven with the -e switch.
[ERROR] Re-run Maven using the -X switch to enable full debug logging.
[ERROR]
[ERROR] For more information about the errors and possible solutions, please read the following articles:
[ERROR] [Help 1] http://cwiki.apache.org/confluence/display/MAVEN/MojoExecutionException
[ERROR]
[ERROR] After correcting the problems, you can resume the build with the command
[ERROR] mvn <goals> -rf :hbase-server
Build step 'Invoke top-level Maven targets' marked build as failure
Archiving artifacts
Recording test results

Search Discussions

  • Apache Jenkins Server at Jul 17, 2012 at 10:13 pm
    See <https://builds.apache.org/job/HBase-TRUNK/3141/changes>

    Changes:

    [tedyu] HBASE-6405 Create Hadoop compatibilty modules and Metrics2 implementation of replication metrics (Elliot Clark)

    ------------------------------------------
    [...truncated 1746 lines...]
    [INFO]
    [INFO] --- maven-resources-plugin:2.5:resources (default-resources) @ hbase-common ---
    [debug] execute contextualize
    [INFO] Using 'UTF-8' encoding to copy filtered resources.
    [INFO] skip non existing resourceDirectory /x1/jenkins/jenkins-slave/workspace/HBase-TRUNK/trunk/hbase-common/src/main/resources
    [INFO] Copying 3 resources
    [INFO]
    [INFO] --- maven-compiler-plugin:2.0.2:compile (default-compile) @ hbase-common ---
    [INFO] Compiling 16 source files to /x1/jenkins/jenkins-slave/workspace/HBase-TRUNK/trunk/hbase-common/target/classes
    [WARNING] /x1/jenkins/jenkins-slave/workspace/HBase-TRUNK/trunk/hbase-common/src/main/java/org/apache/hadoop/hbase/util/Bytes.java:[44,15] sun.misc.Unsafe is Sun proprietary API and may be removed in a future release

    [WARNING] /x1/jenkins/jenkins-slave/workspace/HBase-TRUNK/trunk/hbase-common/src/main/java/org/apache/hadoop/hbase/util/Bytes.java:[1040,19] sun.misc.Unsafe is Sun proprietary API and may be removed in a future release

    [WARNING] /x1/jenkins/jenkins-slave/workspace/HBase-TRUNK/trunk/hbase-common/src/main/java/org/apache/hadoop/hbase/util/Bytes.java:[1046,21] sun.misc.Unsafe is Sun proprietary API and may be removed in a future release

    [WARNING] /x1/jenkins/jenkins-slave/workspace/HBase-TRUNK/trunk/hbase-common/src/main/java/org/apache/hadoop/hbase/util/Bytes.java:[1051,28] sun.misc.Unsafe is Sun proprietary API and may be removed in a future release

    [INFO]
    [INFO] --- maven-resources-plugin:2.5:testResources (default-testResources) @ hbase-common ---
    [debug] execute contextualize
    [INFO] Using 'UTF-8' encoding to copy filtered resources.
    [INFO] skip non existing resourceDirectory /x1/jenkins/jenkins-slave/workspace/HBase-TRUNK/trunk/hbase-common/src/test/resources
    [INFO] Copying 3 resources
    [INFO]
    [INFO] --- maven-compiler-plugin:2.0.2:testCompile (default-testCompile) @ hbase-common ---
    [INFO] Compiling 1 source file to /x1/jenkins/jenkins-slave/workspace/HBase-TRUNK/trunk/hbase-common/target/test-classes
    [INFO]
    [INFO] --- maven-surefire-plugin:2.12-TRUNK-HBASE-2:test (default-test) @ hbase-common ---
    [INFO] Surefire report directory: /x1/jenkins/jenkins-slave/workspace/HBase-TRUNK/trunk/hbase-common/target/surefire-reports
    [INFO] Using configured provider org.apache.maven.surefire.junitcore.JUnitCoreProvider

    -------------------------------------------------------
    T E S T S
    -------------------------------------------------------
    Running org.apache.hadoop.hbase.util.TestBytes
    Tests run: 13, Failures: 0, Errors: 0, Skipped: 0, Time elapsed: 0.05 sec

    Results :

    Tests run: 13, Failures: 0, Errors: 0, Skipped: 0

    [INFO]
    [INFO] --- maven-surefire-plugin:2.12-TRUNK-HBASE-2:test (secondPartTestsExecution) @ hbase-common ---
    [INFO] Tests are skipped.
    [INFO]
    [INFO] --- maven-jar-plugin:2.3:test-jar (default) @ hbase-common ---
    [INFO] Building jar: /x1/jenkins/jenkins-slave/workspace/HBase-TRUNK/trunk/hbase-common/target/hbase-common-0.95-SNAPSHOT-tests.jar
    [INFO]
    [INFO] --- maven-jar-plugin:2.3:jar (default-jar) @ hbase-common ---
    [INFO] Building jar: /x1/jenkins/jenkins-slave/workspace/HBase-TRUNK/trunk/hbase-common/target/hbase-common-0.95-SNAPSHOT.jar
    [INFO]
    [INFO] --- apache-rat-plugin:0.8:check (default) @ hbase-common ---
    [INFO] Exclude: **/.*
    [INFO] Exclude: **/*.tgz
    [INFO] Exclude: **/*.orig
    [INFO] Exclude: **/test/**
    [INFO] Exclude: **/8e8ab58dcf39412da19833fcd8f687ac
    [INFO] Exclude: **/.git/**
    [INFO] Exclude: **/.idea/**
    [INFO] Exclude: **/target/**
    [INFO] Exclude: **/CHANGES.txt
    [INFO] Exclude: **/generated/**
    [INFO] Exclude: **/conf/*
    [INFO] Exclude: **/*.avpr
    [INFO] Exclude: **/*.svg
    [INFO] Exclude: **/*.vm
    [INFO] Exclude: **/control
    [INFO] Exclude: **/conffile
    [INFO] Exclude: docs/*
    [INFO] Exclude: **/src/site/resources/css/freebsd_docbook.css
    [INFO]
    [INFO] ------------------------------------------------------------------------
    [INFO] Building HBase - Hadoop Compatibility 0.95-SNAPSHOT
    [INFO] ------------------------------------------------------------------------
    [INFO]
    [INFO] --- maven-remote-resources-plugin:1.1:process (default) @ hbase-hadoop-compat ---
    [INFO]
    [INFO] --- maven-resources-plugin:2.5:resources (default-resources) @ hbase-hadoop-compat ---
    [debug] execute contextualize
    [INFO] Using 'UTF-8' encoding to copy filtered resources.
    [INFO] skip non existing resourceDirectory /x1/jenkins/jenkins-slave/workspace/HBase-TRUNK/trunk/hbase-hadoop-compat/src/main/resources
    [INFO] Copying 3 resources
    [INFO]
    [INFO] --- maven-compiler-plugin:2.0.2:compile (default-compile) @ hbase-hadoop-compat ---
    [INFO] Compiling 3 source files to /x1/jenkins/jenkins-slave/workspace/HBase-TRUNK/trunk/hbase-hadoop-compat/target/classes
    [INFO]
    [INFO] --- maven-resources-plugin:2.5:testResources (default-testResources) @ hbase-hadoop-compat ---
    [debug] execute contextualize
    [INFO] Using 'UTF-8' encoding to copy filtered resources.
    [INFO] skip non existing resourceDirectory /x1/jenkins/jenkins-slave/workspace/HBase-TRUNK/trunk/hbase-hadoop-compat/src/test/resources
    [INFO] Copying 3 resources
    [INFO]
    [INFO] --- maven-compiler-plugin:2.0.2:testCompile (default-testCompile) @ hbase-hadoop-compat ---
    [INFO] Compiling 1 source file to /x1/jenkins/jenkins-slave/workspace/HBase-TRUNK/trunk/hbase-hadoop-compat/target/test-classes
    [INFO]
    [INFO] --- maven-surefire-plugin:2.12-TRUNK-HBASE-2:test (default-test) @ hbase-hadoop-compat ---
    [INFO] Surefire report directory: /x1/jenkins/jenkins-slave/workspace/HBase-TRUNK/trunk/hbase-hadoop-compat/target/surefire-reports
    [INFO] Using configured provider org.apache.maven.surefire.junitcore.JUnitCoreProvider

    -------------------------------------------------------
    T E S T S
    -------------------------------------------------------
    Running org.apache.hadoop.hbase.replication.regionserver.metrics.ReplicationMetricsSourceFactoryTest
    Tests run: 1, Failures: 0, Errors: 0, Skipped: 0, Time elapsed: 0.023 sec

    Results :

    Tests run: 1, Failures: 0, Errors: 0, Skipped: 0

    [INFO]
    [INFO] --- maven-surefire-plugin:2.12-TRUNK-HBASE-2:test (secondPartTestsExecution) @ hbase-hadoop-compat ---
    [INFO] Tests are skipped.
    [INFO]
    [INFO] --- maven-jar-plugin:2.3:test-jar (default) @ hbase-hadoop-compat ---
    [INFO] Building jar: /x1/jenkins/jenkins-slave/workspace/HBase-TRUNK/trunk/hbase-hadoop-compat/target/hbase-hadoop-compat-0.95-SNAPSHOT-tests.jar
    [INFO]
    [INFO] --- maven-jar-plugin:2.3:jar (default-jar) @ hbase-hadoop-compat ---
    [INFO] Building jar: /x1/jenkins/jenkins-slave/workspace/HBase-TRUNK/trunk/hbase-hadoop-compat/target/hbase-hadoop-compat-0.95-SNAPSHOT.jar
    [INFO]
    [INFO] --- apache-rat-plugin:0.8:check (default) @ hbase-hadoop-compat ---
    [INFO] Exclude: **/.*
    [INFO] Exclude: **/*.tgz
    [INFO] Exclude: **/*.orig
    [INFO] Exclude: **/test/**
    [INFO] Exclude: **/8e8ab58dcf39412da19833fcd8f687ac
    [INFO] Exclude: **/.git/**
    [INFO] Exclude: **/.idea/**
    [INFO] Exclude: **/target/**
    [INFO] Exclude: **/CHANGES.txt
    [INFO] Exclude: **/generated/**
    [INFO] Exclude: **/conf/*
    [INFO] Exclude: **/*.avpr
    [INFO] Exclude: **/*.svg
    [INFO] Exclude: **/*.vm
    [INFO] Exclude: **/control
    [INFO] Exclude: **/conffile
    [INFO] Exclude: docs/*
    [INFO] Exclude: **/src/site/resources/css/freebsd_docbook.css
    [INFO]
    [INFO] ------------------------------------------------------------------------
    [INFO] Building HBase - Hadoop One Compatibility 0.95-SNAPSHOT
    [INFO] ------------------------------------------------------------------------
    [INFO]
    [INFO] --- maven-remote-resources-plugin:1.1:process (default) @ hbase-hadoop1-compat ---
    [INFO]
    [INFO] --- maven-resources-plugin:2.5:resources (default-resources) @ hbase-hadoop1-compat ---
    [debug] execute contextualize
    [INFO] Using 'UTF-8' encoding to copy filtered resources.
    [INFO] Copying 1 resource
    [INFO] Copying 3 resources
    [INFO]
    [INFO] --- maven-compiler-plugin:2.0.2:compile (default-compile) @ hbase-hadoop1-compat ---
    [INFO] Compiling 2 source files to /x1/jenkins/jenkins-slave/workspace/HBase-TRUNK/trunk/hbase-hadoop1-compat/target/classes
    [INFO]
    [INFO] --- maven-resources-plugin:2.5:testResources (default-testResources) @ hbase-hadoop1-compat ---
    [debug] execute contextualize
    [INFO] Using 'UTF-8' encoding to copy filtered resources.
    [INFO] skip non existing resourceDirectory /x1/jenkins/jenkins-slave/workspace/HBase-TRUNK/trunk/hbase-hadoop1-compat/src/test/resources
    [INFO] Copying 3 resources
    [INFO]
    [INFO] --- maven-compiler-plugin:2.0.2:testCompile (default-testCompile) @ hbase-hadoop1-compat ---
    [INFO] Compiling 2 source files to /x1/jenkins/jenkins-slave/workspace/HBase-TRUNK/trunk/hbase-hadoop1-compat/target/test-classes
    [INFO]
    [INFO] --- maven-surefire-plugin:2.12-TRUNK-HBASE-2:test (default-test) @ hbase-hadoop1-compat ---
    [INFO] Surefire report directory: /x1/jenkins/jenkins-slave/workspace/HBase-TRUNK/trunk/hbase-hadoop1-compat/target/surefire-reports
    [INFO] Using configured provider org.apache.maven.surefire.junitcore.JUnitCoreProvider

    -------------------------------------------------------
    T E S T S
    -------------------------------------------------------
    Running org.apache.hadoop.hbase.metrics.BaseMetricsSourceImplTest
    Tests run: 6, Failures: 0, Errors: 0, Skipped: 0, Time elapsed: 0.003 sec
    Running org.apache.hadoop.hbase.replication.regionserver.metrics.ReplicationMetricsSourceImplTest
    Tests run: 1, Failures: 0, Errors: 0, Skipped: 0, Time elapsed: 0.266 sec

    Results :

    Tests run: 7, Failures: 0, Errors: 0, Skipped: 0

    [INFO]
    [INFO] --- maven-surefire-plugin:2.12-TRUNK-HBASE-2:test (secondPartTestsExecution) @ hbase-hadoop1-compat ---
    [INFO] Tests are skipped.
    [INFO]
    [INFO] --- maven-jar-plugin:2.3:test-jar (default) @ hbase-hadoop1-compat ---
    [INFO] Building jar: /x1/jenkins/jenkins-slave/workspace/HBase-TRUNK/trunk/hbase-hadoop1-compat/target/hbase-hadoop1-compat-0.95-SNAPSHOT-tests.jar
    [INFO]
    [INFO] --- maven-jar-plugin:2.3:jar (default-jar) @ hbase-hadoop1-compat ---
    [INFO] Building jar: /x1/jenkins/jenkins-slave/workspace/HBase-TRUNK/trunk/hbase-hadoop1-compat/target/hbase-hadoop1-compat-0.95-SNAPSHOT.jar
    [INFO]
    [INFO] --- apache-rat-plugin:0.8:check (default) @ hbase-hadoop1-compat ---
    [INFO] Exclude: **/.*
    [INFO] Exclude: **/*.tgz
    [INFO] Exclude: **/*.orig
    [INFO] Exclude: **/test/**
    [INFO] Exclude: **/8e8ab58dcf39412da19833fcd8f687ac
    [INFO] Exclude: **/.git/**
    [INFO] Exclude: **/.idea/**
    [INFO] Exclude: **/target/**
    [INFO] Exclude: **/CHANGES.txt
    [INFO] Exclude: **/generated/**
    [INFO] Exclude: **/conf/*
    [INFO] Exclude: **/*.avpr
    [INFO] Exclude: **/*.svg
    [INFO] Exclude: **/*.vm
    [INFO] Exclude: **/control
    [INFO] Exclude: **/conffile
    [INFO] Exclude: docs/*
    [INFO] Exclude: **/src/site/resources/css/freebsd_docbook.css
    [INFO]
    [INFO] ------------------------------------------------------------------------
    [INFO] Skipping HBase
    [INFO] This project has been banned from the build due to previous failures.
    [INFO] ------------------------------------------------------------------------
    [INFO]
    [INFO] ------------------------------------------------------------------------
    [INFO] Skipping HBase
    [INFO] This project has been banned from the build due to previous failures.
    [INFO] ------------------------------------------------------------------------
    [INFO] ------------------------------------------------------------------------
    [INFO] Reactor Summary:
    [INFO]
    [INFO] HBase ............................................. SUCCESS [5.485s]
    [INFO] HBase - Common .................................... SUCCESS [4.925s]
    [INFO] HBase - Hadoop Compatibility ...................... SUCCESS [0.995s]
    [INFO] HBase - Hadoop One Compatibility .................. FAILURE [1.634s]
    [INFO] HBase - Server .................................... SKIPPED
    [INFO] HBase - Hadoop Two Compatibility .................. SKIPPED
    [INFO] HBase - Integration Tests ......................... SKIPPED
    [INFO] ------------------------------------------------------------------------
    [INFO] BUILD FAILURE
    [INFO] ------------------------------------------------------------------------
    [INFO] Total time: 13.601s
    [INFO] Finished at: Tue Jul 17 22:12:48 UTC 2012
    [INFO] Final Memory: 40M/159M
    [INFO] ------------------------------------------------------------------------
    [ERROR] Failed to execute goal org.apache.rat:apache-rat-plugin:0.8:check (default) on project hbase-hadoop1-compat: Too many unapproved licenses: 1 -> [Help 1]
    [ERROR]
    [ERROR] To see the full stack trace of the errors, re-run Maven with the -e switch.
    [ERROR] Re-run Maven using the -X switch to enable full debug logging.
    [ERROR]
    [ERROR] For more information about the errors and possible solutions, please read the following articles:
    [ERROR] [Help 1] http://cwiki.apache.org/confluence/display/MAVEN/MojoFailureException
    [ERROR]
    [ERROR] After correcting the problems, you can resume the build with the command
    [ERROR] mvn <goals> -rf :hbase-hadoop1-compat
    Build step 'Invoke top-level Maven targets' marked build as failure
    Archiving artifacts
    Recording test results
    Updating HBASE-6405
  • Apache Jenkins Server at Jul 18, 2012 at 12:03 am
    See <https://builds.apache.org/job/HBase-TRUNK/3142/changes>

    Changes:

    [tedyu] HBASE-6405 Addendum fixes RAT checking (Elliot Clark)

    ------------------------------------------
    [...truncated 2457 lines...]
    Tests run: 9, Failures: 0, Errors: 0, Skipped: 0, Time elapsed: 20.968 sec
    Running org.apache.hadoop.hbase.master.TestActiveMasterManager
    Tests run: 2, Failures: 0, Errors: 0, Skipped: 0, Time elapsed: 0.902 sec
    Running org.apache.hadoop.hbase.master.TestMasterStatusServlet
    Tests run: 5, Failures: 0, Errors: 0, Skipped: 0, Time elapsed: 1.099 sec
    Running org.apache.hadoop.hbase.master.TestHMasterRPCException
    Tests run: 1, Failures: 0, Errors: 0, Skipped: 0, Time elapsed: 0.966 sec
    Running org.apache.hadoop.hbase.master.TestAssignmentManager
    Tests run: 12, Failures: 0, Errors: 0, Skipped: 0, Time elapsed: 2.291 sec
    Running org.apache.hadoop.hbase.master.TestLogsCleaner
    Tests run: 1, Failures: 0, Errors: 0, Skipped: 0, Time elapsed: 3.028 sec
    Running org.apache.hadoop.hbase.client.TestFromClientSide
    Tests run: 56, Failures: 0, Errors: 0, Skipped: 3, Time elapsed: 172.467 sec
    Running org.apache.hadoop.hbase.master.TestOpenedRegionHandler
    Tests run: 2, Failures: 0, Errors: 0, Skipped: 0, Time elapsed: 23.788 sec
    Running org.apache.hadoop.hbase.master.TestMasterTransitions
    Tests run: 3, Failures: 0, Errors: 0, Skipped: 3, Time elapsed: 29.797 sec
    Running org.apache.hadoop.hbase.master.TestRollingRestart
    Tests run: 1, Failures: 0, Errors: 0, Skipped: 0, Time elapsed: 49.791 sec
    Running org.apache.hadoop.hbase.master.TestZKBasedOpenCloseRegion
    Tests run: 4, Failures: 0, Errors: 0, Skipped: 0, Time elapsed: 22.431 sec
    Running org.apache.hadoop.hbase.master.TestMaster
    Tests run: 1, Failures: 0, Errors: 0, Skipped: 0, Time elapsed: 29.379 sec
    Running org.apache.hadoop.hbase.master.TestRestartCluster
    Tests run: 2, Failures: 0, Errors: 0, Skipped: 0, Time elapsed: 41.293 sec
    Running org.apache.hadoop.hbase.master.balancer.TestStochasticLoadBalancer
    Tests run: 4, Failures: 0, Errors: 0, Skipped: 0, Time elapsed: 95.438 sec
    Running org.apache.hadoop.hbase.master.TestMasterNoCluster
    Tests run: 3, Failures: 0, Errors: 0, Skipped: 0, Time elapsed: 8.716 sec
    Running org.apache.hadoop.hbase.master.TestMXBean
    Tests run: 1, Failures: 0, Errors: 0, Skipped: 0, Time elapsed: 17.256 sec
    Running org.apache.hadoop.hbase.master.TestSplitLogManager
    Tests run: 12, Failures: 0, Errors: 0, Skipped: 0, Time elapsed: 19.54 sec
    Running org.apache.hadoop.hbase.master.TestMasterRestartAfterDisablingTable
    Tests run: 1, Failures: 0, Errors: 0, Skipped: 0, Time elapsed: 17.331 sec
    Running org.apache.hadoop.hbase.master.TestMasterFailover
    Tests run: 4, Failures: 0, Errors: 0, Skipped: 0, Time elapsed: 78.895 sec
    Running org.apache.hadoop.hbase.TestGlobalMemStoreSize
    Tests run: 1, Failures: 0, Errors: 0, Skipped: 0, Time elapsed: 16.948 sec
    Running org.apache.hadoop.hbase.replication.TestReplicationZookeeper
    Tests run: 1, Failures: 0, Errors: 0, Skipped: 0, Time elapsed: 0.732 sec
    Running org.apache.hadoop.hbase.TestFullLogReconstruction
    Tests run: 1, Failures: 0, Errors: 0, Skipped: 0, Time elapsed: 42.718 sec
    Running org.apache.hadoop.hbase.replication.TestReplicationSource
    Tests run: 1, Failures: 0, Errors: 0, Skipped: 0, Time elapsed: 2.754 sec
    Running org.apache.hadoop.hbase.master.TestDistributedLogSplitting
    Tests run: 4, Failures: 0, Errors: 0, Skipped: 0, Time elapsed: 89.565 sec
    Running org.apache.hadoop.hbase.replication.TestReplicationPeer
    Tests run: 1, Failures: 0, Errors: 0, Skipped: 0, Time elapsed: 0.803 sec
    Running org.apache.hadoop.hbase.replication.regionserver.TestReplicationSink
    Tests run: 5, Failures: 0, Errors: 0, Skipped: 0, Time elapsed: 14.646 sec
    Running org.apache.hadoop.hbase.replication.regionserver.TestReplicationSourceManager
    Tests run: 1, Failures: 0, Errors: 0, Skipped: 0, Time elapsed: 1.06 sec
    Running org.apache.hadoop.hbase.replication.TestMasterReplication
    Tests run: 2, Failures: 0, Errors: 0, Skipped: 0, Time elapsed: 65.014 sec
    Running org.apache.hadoop.hbase.replication.TestMultiSlaveReplication
    Tests run: 1, Failures: 0, Errors: 0, Skipped: 0, Time elapsed: 40.844 sec
    Running org.apache.hadoop.hbase.TestMultiVersions
    Tests run: 3, Failures: 0, Errors: 0, Skipped: 0, Time elapsed: 20.594 sec
    Running org.apache.hadoop.hbase.catalog.TestMetaReaderEditorNoCluster
    Tests run: 1, Failures: 0, Errors: 0, Skipped: 0, Time elapsed: 4.109 sec
    Running org.apache.hadoop.hbase.TestHBaseTestingUtility
    Tests run: 7, Failures: 0, Errors: 0, Skipped: 0, Time elapsed: 59.432 sec
    Running org.apache.hadoop.hbase.catalog.TestMetaReaderEditor
    Tests run: 5, Failures: 0, Errors: 0, Skipped: 0, Time elapsed: 22.364 sec
    Running org.apache.hadoop.hbase.catalog.TestCatalogTracker
    Tests run: 9, Failures: 0, Errors: 0, Skipped: 1, Time elapsed: 5.383 sec
    Running org.apache.hadoop.hbase.coprocessor.TestAggregateProtocol
    Tests run: 45, Failures: 0, Errors: 0, Skipped: 0, Time elapsed: 16.757 sec
    Running org.apache.hadoop.hbase.coprocessor.TestRowProcessorEndpoint
    Tests run: 4, Failures: 0, Errors: 0, Skipped: 0, Time elapsed: 31.96 sec
    Running org.apache.hadoop.hbase.catalog.TestCatalogTrackerOnCluster
    Tests run: 1, Failures: 0, Errors: 0, Skipped: 0, Time elapsed: 77.02 sec
    Running org.apache.hadoop.hbase.coprocessor.TestMasterObserver
    Tests run: 3, Failures: 0, Errors: 0, Skipped: 0, Time elapsed: 30.701 sec
    Running org.apache.hadoop.hbase.coprocessor.TestCoprocessorEndpoint
    Tests run: 3, Failures: 0, Errors: 0, Skipped: 1, Time elapsed: 30.358 sec
    Running org.apache.hadoop.hbase.coprocessor.TestClassLoading
    Tests run: 6, Failures: 0, Errors: 0, Skipped: 0, Time elapsed: 32.448 sec
    Running org.apache.hadoop.hbase.coprocessor.TestMasterCoprocessorExceptionWithRemove
    Tests run: 1, Failures: 0, Errors: 0, Skipped: 0, Time elapsed: 16.991 sec
    Running org.apache.hadoop.hbase.coprocessor.TestRegionObserverInterface
    Tests run: 7, Failures: 0, Errors: 0, Skipped: 0, Time elapsed: 36.738 sec
    Running org.apache.hadoop.hbase.coprocessor.TestRegionServerCoprocessorExceptionWithRemove
    Tests run: 1, Failures: 0, Errors: 0, Skipped: 0, Time elapsed: 19.088 sec
    Running org.apache.hadoop.hbase.coprocessor.TestWALObserver
    Tests run: 3, Failures: 0, Errors: 0, Skipped: 0, Time elapsed: 14.455 sec
    Running org.apache.hadoop.hbase.coprocessor.TestMasterCoprocessorExceptionWithAbort
    Tests run: 1, Failures: 0, Errors: 0, Skipped: 0, Time elapsed: 25.507 sec
    Running org.apache.hadoop.hbase.coprocessor.TestRegionObserverBypass
    Tests run: 2, Failures: 0, Errors: 0, Skipped: 0, Time elapsed: 13.473 sec
    Running org.apache.hadoop.hbase.coprocessor.TestRegionServerCoprocessorExceptionWithAbort
    Tests run: 1, Failures: 0, Errors: 0, Skipped: 0, Time elapsed: 15.078 sec
    Running org.apache.hadoop.hbase.thrift2.TestThriftHBaseServiceHandler
    Tests run: 12, Failures: 0, Errors: 0, Skipped: 0, Time elapsed: 12.78 sec
    Running org.apache.hadoop.hbase.avro.TestAvroServer
    Tests run: 3, Failures: 0, Errors: 0, Skipped: 0, Time elapsed: 23.698 sec
    Running org.apache.hadoop.hbase.thrift.TestThriftServer
    Tests run: 1, Failures: 0, Errors: 0, Skipped: 0, Time elapsed: 78.118 sec
    Running org.apache.hadoop.hbase.regionserver.TestHRegionOnCluster
    Tests run: 1, Failures: 0, Errors: 0, Skipped: 0, Time elapsed: 21.299 sec
    Running org.apache.hadoop.hbase.regionserver.TestMemStore
    Tests run: 21, Failures: 0, Errors: 0, Skipped: 0, Time elapsed: 29.635 sec
    Running org.apache.hadoop.hbase.regionserver.TestHRegion
    Tests run: 66, Failures: 0, Errors: 0, Skipped: 0, Time elapsed: 45.925 sec
    Running org.apache.hadoop.hbase.regionserver.TestMasterAddressManager
    Tests run: 1, Failures: 0, Errors: 0, Skipped: 0, Time elapsed: 0.733 sec
    Running org.apache.hadoop.hbase.regionserver.TestRegionServerMetrics
    Tests run: 4, Failures: 0, Errors: 0, Skipped: 0, Time elapsed: 63.871 sec
    Running org.apache.hadoop.hbase.regionserver.TestCompoundBloomFilter
    Tests run: 3, Failures: 0, Errors: 0, Skipped: 0, Time elapsed: 24.918 sec
    Running org.apache.hadoop.hbase.regionserver.TestSplitLogWorker
    Tests run: 5, Failures: 0, Errors: 0, Skipped: 0, Time elapsed: 2.159 sec
    Running org.apache.hadoop.hbase.regionserver.TestServerCustomProtocol
    Tests run: 7, Failures: 0, Errors: 0, Skipped: 0, Time elapsed: 14.645 sec
    Running org.apache.hadoop.hbase.regionserver.TestStoreFileBlockCacheSummary
    Tests run: 1, Failures: 0, Errors: 0, Skipped: 0, Time elapsed: 14.763 sec
    Running org.apache.hadoop.hbase.regionserver.TestStore
    Tests run: 12, Failures: 0, Errors: 0, Skipped: 0, Time elapsed: 9.459 sec
    Running org.apache.hadoop.hbase.regionserver.TestAtomicOperation
    Tests run: 5, Failures: 0, Errors: 0, Skipped: 0, Time elapsed: 26.735 sec
    Running org.apache.hadoop.hbase.regionserver.TestCompactionState
    Tests run: 2, Failures: 0, Errors: 0, Skipped: 0, Time elapsed: 32.148 sec
    Running org.apache.hadoop.hbase.regionserver.TestBlocksRead
    Tests run: 4, Failures: 0, Errors: 0, Skipped: 0, Time elapsed: 1.138 sec
    Running org.apache.hadoop.hbase.regionserver.TestRSKilledWhenMasterInitializing
    Tests run: 1, Failures: 0, Errors: 0, Skipped: 0, Time elapsed: 37.181 sec
    Running org.apache.hadoop.hbase.regionserver.TestFSErrorsExposed
    Tests run: 3, Failures: 0, Errors: 0, Skipped: 0, Time elapsed: 27.924 sec
    Running org.apache.hadoop.hbase.thrift.TestThriftServerCmdLine
    Tests run: 20, Failures: 0, Errors: 0, Skipped: 0, Time elapsed: 455.249 sec
    Running org.apache.hadoop.hbase.regionserver.TestSeekOptimizations
    Tests run: 6, Failures: 0, Errors: 0, Skipped: 0, Time elapsed: 2.98 sec
    Running org.apache.hadoop.hbase.regionserver.handler.TestCloseRegionHandler
    Tests run: 3, Failures: 0, Errors: 0, Skipped: 0, Time elapsed: 1.305 sec
    Running org.apache.hadoop.hbase.regionserver.handler.TestOpenRegionHandler
    Tests run: 3, Failures: 0, Errors: 0, Skipped: 0, Time elapsed: 0.962 sec
    Running org.apache.hadoop.hbase.regionserver.metrics.TestSchemaMetrics
    Tests run: 6, Failures: 0, Errors: 0, Skipped: 0, Time elapsed: 15.06 sec
    Running org.apache.hadoop.hbase.regionserver.TestSplitTransactionOnCluster
    Tests run: 7, Failures: 0, Errors: 0, Skipped: 0, Time elapsed: 52.442 sec
    Running org.apache.hadoop.hbase.regionserver.TestGetClosestAtOrBefore
    Tests run: 3, Failures: 0, Errors: 0, Skipped: 0, Time elapsed: 0.989 sec
    Running org.apache.hadoop.hbase.regionserver.TestHRegionServerBulkLoad
    Tests run: 1, Failures: 0, Errors: 0, Skipped: 0, Time elapsed: 46.293 sec
    Running org.apache.hadoop.hbase.regionserver.TestParallelPut
    Tests run: 2, Failures: 0, Errors: 0, Skipped: 0, Time elapsed: 5.426 sec
    Running org.apache.hadoop.hbase.regionserver.TestCacheOnWriteInSchema
    Tests run: 3, Failures: 0, Errors: 0, Skipped: 0, Time elapsed: 1.675 sec
    Running org.apache.hadoop.hbase.regionserver.wal.TestHLog
    Tests run: 10, Failures: 0, Errors: 0, Skipped: 0, Time elapsed: 63.944 sec
    Running org.apache.hadoop.hbase.regionserver.wal.TestWALReplay
    Tests run: 7, Failures: 0, Errors: 0, Skipped: 0, Time elapsed: 47.205 sec
    Running org.apache.hadoop.hbase.regionserver.wal.TestLogRollAbort
    Tests run: 1, Failures: 0, Errors: 0, Skipped: 0, Time elapsed: 152.195 sec
    Running org.apache.hadoop.hbase.regionserver.wal.TestWALReplayCompressed
    Tests run: 7, Failures: 0, Errors: 0, Skipped: 0, Time elapsed: 48.465 sec
    Running org.apache.hadoop.hbase.regionserver.wal.TestLogRolling
    Tests run: 2, Failures: 0, Errors: 0, Skipped: 0, Time elapsed: 201.514 sec
    Running org.apache.hadoop.hbase.regionserver.TestStoreScanner
    Tests run: 16, Failures: 0, Errors: 0, Skipped: 0, Time elapsed: 0.048 sec
    Running org.apache.hadoop.hbase.regionserver.TestCompaction
    Tests run: 15, Failures: 0, Errors: 0, Skipped: 0, Time elapsed: 39.824 sec
    Running org.apache.hadoop.hbase.regionserver.TestEndToEndSplitTransaction
    Tests run: 2, Failures: 0, Errors: 0, Skipped: 0, Time elapsed: 68.318 sec
    Running org.apache.hadoop.hbase.regionserver.TestMXBean
    Tests run: 1, Failures: 0, Errors: 0, Skipped: 0, Time elapsed: 9.712 sec
    Running org.apache.hadoop.hbase.regionserver.TestRpcMetrics
    Tests run: 1, Failures: 0, Errors: 0, Skipped: 0, Time elapsed: 1.764 sec
    Running org.apache.hadoop.hbase.regionserver.wal.TestHLogSplit
    Tests run: 30, Failures: 0, Errors: 0, Skipped: 1, Time elapsed: 248.198 sec
    Running org.apache.hadoop.hbase.regionserver.TestMultiColumnScanner
    Tests run: 12, Failures: 0, Errors: 0, Skipped: 0, Time elapsed: 42.356 sec
    Running org.apache.hadoop.hbase.mapred.TestTableInputFormat
    Tests run: 10, Failures: 0, Errors: 0, Skipped: 0, Time elapsed: 30.319 sec
    Running org.apache.hadoop.hbase.TestClusterBootOrder
    Tests run: 2, Failures: 0, Errors: 0, Skipped: 0, Time elapsed: 32.829 sec
    Running org.apache.hadoop.hbase.TestDrainingServer
    Tests run: 2, Failures: 0, Errors: 0, Skipped: 0, Time elapsed: 21.095 sec
    Running org.apache.hadoop.hbase.mapreduce.TestTimeRangeMapRed
    Tests run: 1, Failures: 0, Errors: 0, Skipped: 0, Time elapsed: 40.406 sec
    Running org.apache.hadoop.hbase.mapred.TestTableMapReduce
    Tests run: 1, Failures: 0, Errors: 0, Skipped: 0, Time elapsed: 91.84 sec
    Running org.apache.hadoop.hbase.mapreduce.TestImportExport
    Tests run: 2, Failures: 0, Errors: 0, Skipped: 0, Time elapsed: 51.199 sec
    Running org.apache.hadoop.hbase.mapreduce.TestWALPlayer
    Tests run: 1, Failures: 0, Errors: 0, Skipped: 0, Time elapsed: 47.456 sec
    Running org.apache.hadoop.hbase.mapreduce.TestHFileOutputFormat
    Tests run: 9, Failures: 0, Errors: 0, Skipped: 0, Time elapsed: 236.469 sec
    Running org.apache.hadoop.hbase.mapreduce.TestMultithreadedTableMapper
    Tests run: 1, Failures: 0, Errors: 0, Skipped: 0, Time elapsed: 120.127 sec
    Running org.apache.hadoop.hbase.mapreduce.TestImportTsv
    Tests run: 13, Failures: 0, Errors: 0, Skipped: 0, Time elapsed: 258.717 sec
    Running org.apache.hadoop.hbase.mapreduce.TestLoadIncrementalHFiles
    Tests run: 6, Failures: 0, Errors: 0, Skipped: 0, Time elapsed: 33.323 sec
    Running org.apache.hadoop.hbase.mapreduce.TestHLogRecordReader
    Tests run: 2, Failures: 0, Errors: 0, Skipped: 0, Time elapsed: 7.701 sec
    Running org.apache.hadoop.hbase.mapreduce.TestLoadIncrementalHFilesSplitRecovery
    Tests run: 4, Failures: 0, Errors: 0, Skipped: 0, Time elapsed: 105.669 sec
    Running org.apache.hadoop.hbase.mapreduce.TestTableMapReduce
    Tests run: 1, Failures: 0, Errors: 0, Skipped: 0, Time elapsed: 124.101 sec
    Running org.apache.hadoop.hbase.mapreduce.TestTableInputFormatScan
    Tests run: 12, Failures: 0, Errors: 0, Skipped: 0, Time elapsed: 555.513 sec

    Results :

    Tests run: 1021, Failures: 0, Errors: 0, Skipped: 9

    [INFO]
    [INFO] ------------------------------------------------------------------------
    [INFO] Skipping HBase
    [INFO] This project has been banned from the build due to previous failures.
    [INFO] ------------------------------------------------------------------------
    [INFO]
    [INFO] ------------------------------------------------------------------------
    [INFO] Skipping HBase
    [INFO] This project has been banned from the build due to previous failures.
    [INFO] ------------------------------------------------------------------------
    [INFO] ------------------------------------------------------------------------
    [INFO] Reactor Summary:
    [INFO]
    [INFO] HBase ............................................. SUCCESS [5.057s]
    [INFO] HBase - Common .................................... SUCCESS [5.283s]
    [INFO] HBase - Hadoop Compatibility ...................... SUCCESS [1.385s]
    [INFO] HBase - Hadoop One Compatibility .................. SUCCESS [1.875s]
    [INFO] HBase - Server .................................... FAILURE [45:47.730s]
    [INFO] HBase - Hadoop Two Compatibility .................. SKIPPED
    [INFO] HBase - Integration Tests ......................... SKIPPED
    [INFO] ------------------------------------------------------------------------
    [INFO] BUILD FAILURE
    [INFO] ------------------------------------------------------------------------
    [INFO] Total time: 46:08.388s
    [INFO] Finished at: Wed Jul 18 00:02:38 UTC 2012
    [INFO] Final Memory: 101M/923M
    [INFO] ------------------------------------------------------------------------
    [ERROR] Failed to execute goal org.apache.maven.plugins:maven-surefire-plugin:2.12-TRUNK-HBASE-2:test (secondPartTestsExecution) on project hbase-server: Failure or timeout -> [Help 1]
    [ERROR]
    [ERROR] To see the full stack trace of the errors, re-run Maven with the -e switch.
    [ERROR] Re-run Maven using the -X switch to enable full debug logging.
    [ERROR]
    [ERROR] For more information about the errors and possible solutions, please read the following articles:
    [ERROR] [Help 1] http://cwiki.apache.org/confluence/display/MAVEN/MojoExecutionException
    [ERROR]
    [ERROR] After correcting the problems, you can resume the build with the command
    [ERROR] mvn <goals> -rf :hbase-server
    Build step 'Invoke top-level Maven targets' marked build as failure
    Archiving artifacts
    Recording test results
    Updating HBASE-6405
  • Apache Jenkins Server at Jul 18, 2012 at 1:45 pm
    See <https://builds.apache.org/job/HBase-TRUNK/3143/>

    ------------------------------------------
    [...truncated 2573 lines...]
    Running org.apache.hadoop.hbase.regionserver.TestSplitTransactionOnCluster
    Tests run: 7, Failures: 0, Errors: 0, Skipped: 0, Time elapsed: 47.244 sec
    Running org.apache.hadoop.hbase.regionserver.TestStore
    Tests run: 12, Failures: 0, Errors: 0, Skipped: 0, Time elapsed: 9.429 sec
    Running org.apache.hadoop.hbase.regionserver.wal.TestHLog
    Tests run: 10, Failures: 0, Errors: 0, Skipped: 0, Time elapsed: 64.958 sec
    Running org.apache.hadoop.hbase.mapreduce.TestHFileOutputFormat
    Tests run: 9, Failures: 0, Errors: 0, Skipped: 0, Time elapsed: 219.074 sec
    Running org.apache.hadoop.hbase.regionserver.wal.TestWALReplay
    Tests run: 7, Failures: 0, Errors: 0, Skipped: 0, Time elapsed: 44.811 sec
    Running org.apache.hadoop.hbase.regionserver.wal.TestLogRollAbort
    Tests run: 1, Failures: 0, Errors: 0, Skipped: 0, Time elapsed: 152.124 sec
    Running org.apache.hadoop.hbase.regionserver.wal.TestWALReplayCompressed
    Tests run: 7, Failures: 0, Errors: 0, Skipped: 0, Time elapsed: 42.004 sec
    Running org.apache.hadoop.hbase.regionserver.wal.TestHLogSplit
    Tests run: 30, Failures: 0, Errors: 0, Skipped: 1, Time elapsed: 236.348 sec
    Running org.apache.hadoop.hbase.regionserver.TestCacheOnWriteInSchema
    Tests run: 3, Failures: 0, Errors: 0, Skipped: 0, Time elapsed: 1.199 sec
    Running org.apache.hadoop.hbase.regionserver.TestCompactionState
    Tests run: 2, Failures: 0, Errors: 0, Skipped: 0, Time elapsed: 32.402 sec
    Running org.apache.hadoop.hbase.regionserver.TestMemStore
    Tests run: 21, Failures: 0, Errors: 0, Skipped: 0, Time elapsed: 21.996 sec
    Running org.apache.hadoop.hbase.mapreduce.TestTableInputFormatScan
    Tests run: 12, Failures: 0, Errors: 0, Skipped: 0, Time elapsed: 552.01 sec
    Running org.apache.hadoop.hbase.regionserver.TestMXBean
    Tests run: 1, Failures: 0, Errors: 0, Skipped: 0, Time elapsed: 10.219 sec
    Running org.apache.hadoop.hbase.regionserver.TestGetClosestAtOrBefore
    Tests run: 3, Failures: 0, Errors: 0, Skipped: 0, Time elapsed: 0.887 sec
    Running org.apache.hadoop.hbase.regionserver.TestRegionServerMetrics
    Tests run: 4, Failures: 0, Errors: 0, Skipped: 0, Time elapsed: 65.155 sec
    Running org.apache.hadoop.hbase.regionserver.wal.TestLogRolling
    Tests run: 2, Failures: 0, Errors: 0, Skipped: 0, Time elapsed: 259.98 sec
    Running org.apache.hadoop.hbase.regionserver.TestAtomicOperation
    Tests run: 5, Failures: 0, Errors: 0, Skipped: 0, Time elapsed: 19.529 sec
    Running org.apache.hadoop.hbase.regionserver.TestFSErrorsExposed
    Tests run: 3, Failures: 0, Errors: 0, Skipped: 0, Time elapsed: 26.954 sec
    Running org.apache.hadoop.hbase.regionserver.TestHRegionOnCluster
    Tests run: 1, Failures: 0, Errors: 0, Skipped: 0, Time elapsed: 20.056 sec
    Running org.apache.hadoop.hbase.regionserver.TestParallelPut
    Tests run: 2, Failures: 0, Errors: 0, Skipped: 0, Time elapsed: 3.221 sec
    Running org.apache.hadoop.hbase.regionserver.TestServerCustomProtocol
    Tests run: 7, Failures: 0, Errors: 0, Skipped: 0, Time elapsed: 14.038 sec
    Running org.apache.hadoop.hbase.regionserver.TestRpcMetrics
    Tests run: 1, Failures: 0, Errors: 0, Skipped: 0, Time elapsed: 1.585 sec
    Running org.apache.hadoop.hbase.regionserver.handler.TestCloseRegionHandler
    Tests run: 3, Failures: 0, Errors: 0, Skipped: 0, Time elapsed: 0.95 sec
    Running org.apache.hadoop.hbase.regionserver.TestSeekOptimizations
    Tests run: 6, Failures: 0, Errors: 0, Skipped: 0, Time elapsed: 2.16 sec
    Running org.apache.hadoop.hbase.regionserver.handler.TestOpenRegionHandler
    Tests run: 3, Failures: 0, Errors: 0, Skipped: 0, Time elapsed: 0.787 sec
    Running org.apache.hadoop.hbase.regionserver.TestBlocksRead
    Tests run: 4, Failures: 0, Errors: 0, Skipped: 0, Time elapsed: 0.964 sec
    Running org.apache.hadoop.hbase.regionserver.TestStoreScanner
    Tests run: 16, Failures: 0, Errors: 0, Skipped: 0, Time elapsed: 0.037 sec
    Running org.apache.hadoop.hbase.regionserver.TestSplitLogWorker
    Tests run: 5, Failures: 0, Errors: 0, Skipped: 0, Time elapsed: 2.029 sec
    Running org.apache.hadoop.hbase.regionserver.TestRSKilledWhenMasterInitializing
    Tests run: 1, Failures: 0, Errors: 0, Skipped: 0, Time elapsed: 61.671 sec
    Running org.apache.hadoop.hbase.regionserver.metrics.TestSchemaMetrics
    Running org.apache.hadoop.hbase.regionserver.TestCompoundBloomFilter
    Tests run: 3, Failures: 0, Errors: 0, Skipped: 0, Time elapsed: 17.891 sec
    Tests run: 6, Failures: 0, Errors: 0, Skipped: 0, Time elapsed: 11.594 sec
    Running org.apache.hadoop.hbase.regionserver.TestStoreFileBlockCacheSummary
    Tests run: 1, Failures: 0, Errors: 0, Skipped: 0, Time elapsed: 13.993 sec
    Running org.apache.hadoop.hbase.regionserver.TestCompaction
    Tests run: 15, Failures: 0, Errors: 0, Skipped: 0, Time elapsed: 30.176 sec
    Running org.apache.hadoop.hbase.regionserver.TestMasterAddressManager
    Tests run: 1, Failures: 0, Errors: 0, Skipped: 0, Time elapsed: 0.488 sec
    Running org.apache.hadoop.hbase.regionserver.TestMultiColumnScanner
    Tests run: 12, Failures: 0, Errors: 0, Skipped: 0, Time elapsed: 30.972 sec
    Running org.apache.hadoop.hbase.regionserver.TestHRegionServerBulkLoad
    Tests run: 1, Failures: 0, Errors: 0, Skipped: 0, Time elapsed: 45.722 sec
    Running org.apache.hadoop.hbase.TestLocalHBaseCluster
    Tests run: 1, Failures: 0, Errors: 0, Skipped: 0, Time elapsed: 8.349 sec
    Running org.apache.hadoop.hbase.security.token.TestTokenAuthentication
    Tests run: 1, Failures: 0, Errors: 0, Skipped: 0, Time elapsed: 10.064 sec
    Running org.apache.hadoop.hbase.regionserver.TestHRegion
    Tests run: 66, Failures: 0, Errors: 0, Skipped: 0, Time elapsed: 35.573 sec
    Running org.apache.hadoop.hbase.regionserver.TestEndToEndSplitTransaction
    Tests run: 2, Failures: 0, Errors: 0, Skipped: 0, Time elapsed: 59.6 sec
    Running org.apache.hadoop.hbase.security.token.TestZKSecretWatcher
    Tests run: 1, Failures: 0, Errors: 0, Skipped: 0, Time elapsed: 15.205 sec
    Running org.apache.hadoop.hbase.security.access.TestZKPermissionsWatcher
    Tests run: 1, Failures: 0, Errors: 0, Skipped: 0, Time elapsed: 10.701 sec
    Running org.apache.hadoop.hbase.security.access.TestAccessControlFilter
    Tests run: 1, Failures: 0, Errors: 0, Skipped: 0, Time elapsed: 15.186 sec
    Running org.apache.hadoop.hbase.ipc.TestDelayedRpc
    Tests run: 4, Failures: 0, Errors: 0, Skipped: 0, Time elapsed: 2.253 sec
    Running org.apache.hadoop.hbase.security.access.TestTablePermissions
    Tests run: 5, Failures: 0, Errors: 0, Skipped: 0, Time elapsed: 25.546 sec
    Running org.apache.hadoop.hbase.TestGlobalMemStoreSize
    Tests run: 1, Failures: 0, Errors: 0, Skipped: 0, Time elapsed: 15.237 sec
    Running org.apache.hadoop.hbase.security.access.TestAccessController
    Tests run: 28, Failures: 0, Errors: 0, Skipped: 0, Time elapsed: 30.773 sec
    Running org.apache.hadoop.hbase.rest.client.TestRemoteAdmin
    Tests run: 1, Failures: 0, Errors: 0, Skipped: 0, Time elapsed: 14.577 sec
    Running org.apache.hadoop.hbase.rest.TestSchemaResource
    Tests run: 2, Failures: 0, Errors: 0, Skipped: 0, Time elapsed: 18.068 sec
    Running org.apache.hadoop.hbase.constraint.TestConstraint
    Tests run: 5, Failures: 0, Errors: 0, Skipped: 0, Time elapsed: 26.848 sec
    Running org.apache.hadoop.hbase.TestFullLogReconstruction
    Tests run: 1, Failures: 0, Errors: 0, Skipped: 0, Time elapsed: 52.676 sec
    Running org.apache.hadoop.hbase.rest.client.TestRemoteTable
    Tests run: 3, Failures: 0, Errors: 0, Skipped: 0, Time elapsed: 14.517 sec
    Running org.apache.hadoop.hbase.rest.TestMultiRowResource
    Tests run: 3, Failures: 0, Errors: 0, Skipped: 0, Time elapsed: 13.118 sec
    Running org.apache.hadoop.hbase.rest.TestTableResource
    Tests run: 8, Failures: 0, Errors: 0, Skipped: 0, Time elapsed: 22.197 sec
    Running org.apache.hadoop.hbase.rest.TestGzipFilter
    Tests run: 3, Failures: 0, Errors: 0, Skipped: 0, Time elapsed: 13.825 sec
    Running org.apache.hadoop.hbase.rest.TestRowResource
    Tests run: 11, Failures: 0, Errors: 0, Skipped: 0, Time elapsed: 15.474 sec
    Running org.apache.hadoop.hbase.rest.TestVersionResource
    Tests run: 7, Failures: 0, Errors: 0, Skipped: 0, Time elapsed: 11.661 sec
    Running org.apache.hadoop.hbase.rest.TestStatusResource
    Tests run: 2, Failures: 0, Errors: 0, Skipped: 0, Time elapsed: 11.695 sec
    Running org.apache.hadoop.hbase.io.hfile.TestHFileBlockIndex
    Tests run: 10, Failures: 0, Errors: 0, Skipped: 0, Time elapsed: 7.316 sec
    Running org.apache.hadoop.hbase.io.hfile.TestHFileSeek
    Tests run: 1, Failures: 0, Errors: 0, Skipped: 0, Time elapsed: 6.561 sec
    Running org.apache.hadoop.hbase.rest.TestScannersWithFilters
    Tests run: 10, Failures: 0, Errors: 0, Skipped: 0, Time elapsed: 16.707 sec
    Running org.apache.hadoop.hbase.rest.TestScannerResource
    Tests run: 5, Failures: 0, Errors: 0, Skipped: 0, Time elapsed: 30.766 sec
    Running org.apache.hadoop.hbase.io.hfile.TestHFilePerformance
    Tests run: 1, Failures: 0, Errors: 0, Skipped: 0, Time elapsed: 4.411 sec
    Running org.apache.hadoop.hbase.io.hfile.TestCacheOnWrite
    Tests run: 36, Failures: 0, Errors: 0, Skipped: 0, Time elapsed: 29.263 sec
    Running org.apache.hadoop.hbase.io.hfile.TestForceCacheImportantBlocks
    Tests run: 4, Failures: 0, Errors: 0, Skipped: 0, Time elapsed: 43.294 sec
    Running org.apache.hadoop.hbase.io.hfile.slab.TestSlabCache
    Tests run: 7, Failures: 0, Errors: 0, Skipped: 0, Time elapsed: 9.89 sec
    Running org.apache.hadoop.hbase.io.hfile.TestHFileBlock
    Tests run: 16, Failures: 0, Errors: 0, Skipped: 0, Time elapsed: 45.475 sec
    Running org.apache.hadoop.hbase.io.hfile.slab.TestSingleSizeCache
    Tests run: 5, Failures: 0, Errors: 0, Skipped: 0, Time elapsed: 14.58 sec
    Running org.apache.hadoop.hbase.io.hfile.TestScannerSelectionUsingTTL
    Tests run: 6, Failures: 0, Errors: 0, Skipped: 0, Time elapsed: 61.161 sec
    Running org.apache.hadoop.hbase.io.encoding.TestEncodedSeekers
    Tests run: 8, Failures: 0, Errors: 0, Skipped: 0, Time elapsed: 25.47 sec
    Running org.apache.hadoop.hbase.io.encoding.TestBufferedDataBlockEncoder
    Tests run: 1, Failures: 0, Errors: 0, Skipped: 0, Time elapsed: 17.672 sec
    Running org.apache.hadoop.hbase.io.encoding.TestLoadAndSwitchEncodeOnDisk
    Tests run: 1, Failures: 0, Errors: 0, Skipped: 0, Time elapsed: 25.396 sec
    Running org.apache.hadoop.hbase.io.encoding.TestUpgradeFromHFileV1ToEncoding
    Tests run: 1, Failures: 0, Errors: 0, Skipped: 0, Time elapsed: 79.665 sec
    Running org.apache.hadoop.hbase.io.encoding.TestDataBlockEncoders
    Tests run: 12, Failures: 0, Errors: 0, Skipped: 0, Time elapsed: 83.716 sec
    Running org.apache.hadoop.hbase.TestRegionRebalancing
    Tests run: 2, Failures: 0, Errors: 0, Skipped: 0, Time elapsed: 38.352 sec
    Running org.apache.hadoop.hbase.replication.TestReplicationZookeeper
    Tests run: 1, Failures: 0, Errors: 0, Skipped: 0, Time elapsed: 0.551 sec
    Running org.apache.hadoop.hbase.mapred.TestTableInputFormat
    Tests run: 10, Failures: 0, Errors: 0, Skipped: 0, Time elapsed: 26.116 sec
    Running org.apache.hadoop.hbase.replication.regionserver.TestReplicationSourceManager
    Tests run: 1, Failures: 0, Errors: 0, Skipped: 0, Time elapsed: 0.965 sec
    Running org.apache.hadoop.hbase.replication.TestReplicationSource
    Tests run: 1, Failures: 0, Errors: 0, Skipped: 0, Time elapsed: 2.481 sec
    Running org.apache.hadoop.hbase.replication.regionserver.TestReplicationSink
    Tests run: 5, Failures: 0, Errors: 0, Skipped: 0, Time elapsed: 14.102 sec
    Running org.apache.hadoop.hbase.replication.TestReplicationPeer
    Tests run: 1, Failures: 0, Errors: 0, Skipped: 0, Time elapsed: 0.831 sec
    Running org.apache.hadoop.hbase.replication.TestMultiSlaveReplication
    Tests run: 1, Failures: 0, Errors: 0, Skipped: 0, Time elapsed: 40.444 sec
    Running org.apache.hadoop.hbase.replication.TestMasterReplication
    Tests run: 2, Failures: 0, Errors: 0, Skipped: 0, Time elapsed: 60.243 sec
    Running org.apache.hadoop.hbase.util.TestMergeTool
    Tests run: 1, Failures: 0, Errors: 0, Skipped: 0, Time elapsed: 25.374 sec
    Running org.apache.hadoop.hbase.util.TestFSTableDescriptors
    Tests run: 10, Failures: 0, Errors: 0, Skipped: 0, Time elapsed: 0.763 sec
    Running org.apache.hadoop.hbase.io.encoding.TestChangingEncoding
    Tests run: 4, Failures: 0, Errors: 0, Skipped: 0, Time elapsed: 242.399 sec
    Running org.apache.hadoop.hbase.mapred.TestTableMapReduce
    Tests run: 1, Failures: 0, Errors: 0, Skipped: 0, Time elapsed: 153.403 sec
    Running org.apache.hadoop.hbase.util.TestEnvironmentEdgeManager
    Tests run: 2, Failures: 0, Errors: 0, Skipped: 0, Time elapsed: 0.348 sec
    Running org.apache.hadoop.hbase.util.TestIdLock
    Tests run: 1, Failures: 0, Errors: 0, Skipped: 0, Time elapsed: 15.291 sec
    Running org.apache.hadoop.hbase.util.TestMergeTable
    Tests run: 1, Failures: 0, Errors: 0, Skipped: 0, Time elapsed: 23.523 sec
    Running org.apache.hadoop.hbase.util.TestMiniClusterLoadSequential
    Tests run: 4, Failures: 0, Errors: 0, Skipped: 0, Time elapsed: 93.306 sec
    Running org.apache.hadoop.hbase.util.TestMiniClusterLoadParallel
    Tests run: 4, Failures: 0, Errors: 0, Skipped: 0, Time elapsed: 91.15 sec
    Running org.apache.hadoop.hbase.util.TestFSUtils
    Tests run: 5, Failures: 0, Errors: 0, Skipped: 0, Time elapsed: 20.456 sec
    Running org.apache.hadoop.hbase.util.TestProcessBasedCluster
    Tests run: 1, Failures: 0, Errors: 0, Skipped: 0, Time elapsed: 0.307 sec
    Running org.apache.hadoop.hbase.util.TestRegionSplitter
    Tests run: 5, Failures: 0, Errors: 0, Skipped: 0, Time elapsed: 16.944 sec
    Running org.apache.hadoop.hbase.util.hbck.TestOfflineMetaRebuildBase
    Tests run: 1, Failures: 0, Errors: 0, Skipped: 0, Time elapsed: 19.919 sec
    Running org.apache.hadoop.hbase.util.hbck.TestOfflineMetaRebuildOverlap
    Tests run: 1, Failures: 0, Errors: 0, Skipped: 0, Time elapsed: 16.623 sec
    Running org.apache.hadoop.hbase.util.TestMiniClusterLoadEncoded
    Tests run: 4, Failures: 0, Errors: 0, Skipped: 0, Time elapsed: 59.885 sec
    Running org.apache.hadoop.hbase.util.TestDefaultEnvironmentEdge
    Tests run: 1, Failures: 0, Errors: 0, Skipped: 0, Time elapsed: 0.169 sec
    Running org.apache.hadoop.hbase.util.hbck.TestOfflineMetaRebuildHole
    Tests run: 1, Failures: 0, Errors: 0, Skipped: 0, Time elapsed: 16.718 sec
    Running org.apache.hadoop.hbase.TestInfoServers
    Tests run: 2, Failures: 0, Errors: 0, Skipped: 0, Time elapsed: 10.874 sec
    Running org.apache.hadoop.hbase.util.TestHBaseFsck
    Tests run: 21, Failures: 0, Errors: 0, Skipped: 0, Time elapsed: 169.931 sec

    Results :

    Tests run: 1021, Failures: 0, Errors: 0, Skipped: 9

    [INFO]
    [INFO] ------------------------------------------------------------------------
    [INFO] Skipping HBase
    [INFO] This project has been banned from the build due to previous failures.
    [INFO] ------------------------------------------------------------------------
    [INFO]
    [INFO] ------------------------------------------------------------------------
    [INFO] Skipping HBase
    [INFO] This project has been banned from the build due to previous failures.
    [INFO] ------------------------------------------------------------------------
    [INFO] ------------------------------------------------------------------------
    [INFO] Reactor Summary:
    [INFO]
    [INFO] HBase ............................................. SUCCESS [5.272s]
    [INFO] HBase - Common .................................... SUCCESS [4.791s]
    [INFO] HBase - Hadoop Compatibility ...................... SUCCESS [1.102s]
    [INFO] HBase - Hadoop One Compatibility .................. SUCCESS [1.745s]
    [INFO] HBase - Server .................................... FAILURE [47:46.864s]
    [INFO] HBase - Hadoop Two Compatibility .................. SKIPPED
    [INFO] HBase - Integration Tests ......................... SKIPPED
    [INFO] ------------------------------------------------------------------------
    [INFO] BUILD FAILURE
    [INFO] ------------------------------------------------------------------------
    [INFO] Total time: 48:00.322s
    [INFO] Finished at: Wed Jul 18 13:43:22 UTC 2012
    [INFO] Final Memory: 103M/421M
    [INFO] ------------------------------------------------------------------------
    [ERROR] Failed to execute goal org.apache.maven.plugins:maven-surefire-plugin:2.12-TRUNK-HBASE-2:test (secondPartTestsExecution) on project hbase-server: Failure or timeout -> [Help 1]
    [ERROR]
    [ERROR] To see the full stack trace of the errors, re-run Maven with the -e switch.
    [ERROR] Re-run Maven using the -X switch to enable full debug logging.
    [ERROR]
    [ERROR] For more information about the errors and possible solutions, please read the following articles:
    [ERROR] [Help 1] http://cwiki.apache.org/confluence/display/MAVEN/MojoExecutionException
    [ERROR]
    [ERROR] After correcting the problems, you can resume the build with the command
    [ERROR] mvn <goals> -rf :hbase-server
    Build step 'Invoke top-level Maven targets' marked build as failure
    Archiving artifacts
    Recording test results
  • Apache Jenkins Server at Jul 18, 2012 at 6:56 pm
    See <https://builds.apache.org/job/HBase-TRUNK/3144/changes>

    Changes:

    [tedyu] HBASE-6419 PersistentMetricsTimeVaryingRate gets used for non-time-based metrics (part2 of HBASE-6220) (Paul Cavallaro)

    [tedyu] HBASE-6400 Add getMasterAdmin() and getMasterMonitor() to HConnection (Enis)

    ------------------------------------------
    [...truncated 2575 lines...]
    Tests run: 7, Failures: 0, Errors: 0, Skipped: 0, Time elapsed: 10.872 sec
    Running org.apache.hadoop.hbase.rest.client.TestRemoteAdmin
    Tests run: 1, Failures: 0, Errors: 0, Skipped: 0, Time elapsed: 14.613 sec
    Running org.apache.hadoop.hbase.rest.TestStatusResource
    Tests run: 2, Failures: 0, Errors: 0, Skipped: 0, Time elapsed: 11.859 sec
    Running org.apache.hadoop.hbase.rest.TestTableResource
    Tests run: 8, Failures: 0, Errors: 0, Skipped: 0, Time elapsed: 23.76 sec
    Running org.apache.hadoop.hbase.rest.TestScannersWithFilters
    Tests run: 10, Failures: 0, Errors: 0, Skipped: 0, Time elapsed: 17.449 sec
    Running org.apache.hadoop.hbase.TestInfoServers
    Tests run: 2, Failures: 0, Errors: 0, Skipped: 0, Time elapsed: 11.398 sec
    Running org.apache.hadoop.hbase.rest.TestScannerResource
    Tests run: 5, Failures: 0, Errors: 0, Skipped: 0, Time elapsed: 33.001 sec
    Running org.apache.hadoop.hbase.regionserver.TestServerCustomProtocol
    Tests run: 7, Failures: 0, Errors: 0, Skipped: 0, Time elapsed: 18.171 sec
    Running org.apache.hadoop.hbase.regionserver.TestAtomicOperation
    Tests run: 5, Failures: 0, Errors: 0, Skipped: 0, Time elapsed: 36.361 sec
    Running org.apache.hadoop.hbase.regionserver.TestHRegion
    Tests run: 66, Failures: 0, Errors: 0, Skipped: 0, Time elapsed: 45.616 sec
    Running org.apache.hadoop.hbase.regionserver.TestCompaction
    Tests run: 15, Failures: 0, Errors: 0, Skipped: 0, Time elapsed: 45.147 sec
    Running org.apache.hadoop.hbase.regionserver.TestEndToEndSplitTransaction
    Tests run: 2, Failures: 0, Errors: 0, Skipped: 0, Time elapsed: 61.407 sec
    Running org.apache.hadoop.hbase.regionserver.wal.TestWALReplayCompressed
    Tests run: 7, Failures: 0, Errors: 0, Skipped: 0, Time elapsed: 41.759 sec
    Running org.apache.hadoop.hbase.regionserver.wal.TestHLog
    Tests run: 10, Failures: 0, Errors: 0, Skipped: 0, Time elapsed: 66.189 sec
    Running org.apache.hadoop.hbase.regionserver.wal.TestWALReplay
    Tests run: 7, Failures: 0, Errors: 0, Skipped: 0, Time elapsed: 46.572 sec
    Running org.apache.hadoop.hbase.regionserver.wal.TestLogRollAbort
    Tests run: 1, Failures: 0, Errors: 0, Skipped: 0, Time elapsed: 157.431 sec
    Running org.apache.hadoop.hbase.regionserver.TestRpcMetrics
    Tests run: 1, Failures: 0, Errors: 0, Skipped: 0, Time elapsed: 1.784 sec
    Running org.apache.hadoop.hbase.regionserver.TestStore
    Tests run: 12, Failures: 0, Errors: 0, Skipped: 0, Time elapsed: 9.463 sec
    Running org.apache.hadoop.hbase.regionserver.TestBlocksRead
    Tests run: 4, Failures: 0, Errors: 0, Skipped: 0, Time elapsed: 1.146 sec
    Running org.apache.hadoop.hbase.regionserver.TestCompoundBloomFilter
    Tests run: 3, Failures: 0, Errors: 0, Skipped: 0, Time elapsed: 25.584 sec
    Running org.apache.hadoop.hbase.regionserver.TestHRegionOnCluster
    Tests run: 1, Failures: 0, Errors: 0, Skipped: 0, Time elapsed: 20.41 sec
    Running org.apache.hadoop.hbase.regionserver.metrics.TestSchemaMetrics
    Tests run: 6, Failures: 0, Errors: 0, Skipped: 0, Time elapsed: 15.338 sec
    Running org.apache.hadoop.hbase.regionserver.TestCacheOnWriteInSchema
    Tests run: 3, Failures: 0, Errors: 0, Skipped: 0, Time elapsed: 1.688 sec
    Running org.apache.hadoop.hbase.regionserver.TestParallelPut
    Tests run: 2, Failures: 0, Errors: 0, Skipped: 0, Time elapsed: 5.685 sec
    Running org.apache.hadoop.hbase.regionserver.TestStoreScanner
    Tests run: 16, Failures: 0, Errors: 0, Skipped: 0, Time elapsed: 0.053 sec
    Running org.apache.hadoop.hbase.regionserver.TestRegionServerMetrics
    Tests run: 4, Failures: 0, Errors: 0, Skipped: 0, Time elapsed: 65.264 sec
    Running org.apache.hadoop.hbase.regionserver.TestStoreFileBlockCacheSummary
    Tests run: 1, Failures: 0, Errors: 0, Skipped: 0, Time elapsed: 13.959 sec
    Running org.apache.hadoop.hbase.regionserver.wal.TestLogRolling
    Tests run: 2, Failures: 0, Errors: 0, Skipped: 0, Time elapsed: 203.56 sec
    Running org.apache.hadoop.hbase.regionserver.TestGetClosestAtOrBefore
    Tests run: 3, Failures: 0, Errors: 0, Skipped: 0, Time elapsed: 0.946 sec
    Running org.apache.hadoop.hbase.regionserver.TestMemStore
    Tests run: 21, Failures: 0, Errors: 0, Skipped: 0, Time elapsed: 30.152 sec
    Running org.apache.hadoop.hbase.regionserver.TestMXBean
    Tests run: 1, Failures: 0, Errors: 0, Skipped: 0, Time elapsed: 10.306 sec
    Running org.apache.hadoop.hbase.regionserver.handler.TestCloseRegionHandler
    Tests run: 3, Failures: 0, Errors: 0, Skipped: 0, Time elapsed: 1.259 sec
    Running org.apache.hadoop.hbase.regionserver.handler.TestOpenRegionHandler
    Tests run: 3, Failures: 0, Errors: 0, Skipped: 0, Time elapsed: 1.089 sec
    Running org.apache.hadoop.hbase.regionserver.TestSplitTransactionOnCluster
    Tests run: 7, Failures: 0, Errors: 0, Skipped: 0, Time elapsed: 55.571 sec
    Running org.apache.hadoop.hbase.regionserver.TestMultiColumnScanner
    Tests run: 12, Failures: 0, Errors: 0, Skipped: 0, Time elapsed: 44.136 sec
    Running org.apache.hadoop.hbase.regionserver.TestMasterAddressManager
    Tests run: 1, Failures: 0, Errors: 0, Skipped: 0, Time elapsed: 0.706 sec
    Running org.apache.hadoop.hbase.regionserver.TestRSKilledWhenMasterInitializing
    Tests run: 1, Failures: 0, Errors: 0, Skipped: 0, Time elapsed: 37.111 sec
    Running org.apache.hadoop.hbase.regionserver.TestSplitLogWorker
    Tests run: 5, Failures: 0, Errors: 0, Skipped: 0, Time elapsed: 2.275 sec
    Running org.apache.hadoop.hbase.regionserver.TestHRegionServerBulkLoad
    Tests run: 1, Failures: 0, Errors: 0, Skipped: 0, Time elapsed: 45.514 sec
    Running org.apache.hadoop.hbase.regionserver.TestSeekOptimizations
    Tests run: 6, Failures: 0, Errors: 0, Skipped: 0, Time elapsed: 3.04 sec
    Running org.apache.hadoop.hbase.filter.TestColumnRangeFilter
    Tests run: 1, Failures: 0, Errors: 0, Skipped: 0, Time elapsed: 16.611 sec
    Running org.apache.hadoop.hbase.regionserver.TestCompactionState
    Tests run: 2, Failures: 0, Errors: 0, Skipped: 0, Time elapsed: 30.424 sec
    Running org.apache.hadoop.hbase.regionserver.wal.TestHLogSplit
    Tests run: 30, Failures: 0, Errors: 0, Skipped: 1, Time elapsed: 237.693 sec
    Running org.apache.hadoop.hbase.regionserver.TestFSErrorsExposed
    Tests run: 3, Failures: 0, Errors: 0, Skipped: 0, Time elapsed: 28.63 sec
    Running org.apache.hadoop.hbase.security.token.TestTokenAuthentication
    Tests run: 1, Failures: 0, Errors: 0, Skipped: 0, Time elapsed: 9.079 sec
    Running org.apache.hadoop.hbase.TestGlobalMemStoreSize
    Tests run: 1, Failures: 0, Errors: 0, Skipped: 0, Time elapsed: 14.717 sec
    Running org.apache.hadoop.hbase.security.access.TestZKPermissionsWatcher
    Tests run: 1, Failures: 0, Errors: 0, Skipped: 0, Time elapsed: 9.974 sec
    Running org.apache.hadoop.hbase.security.token.TestZKSecretWatcher
    Tests run: 1, Failures: 0, Errors: 0, Skipped: 0, Time elapsed: 15.299 sec
    Running org.apache.hadoop.hbase.security.access.TestAccessControlFilter
    Tests run: 1, Failures: 0, Errors: 0, Skipped: 0, Time elapsed: 13.486 sec
    Running org.apache.hadoop.hbase.security.access.TestTablePermissions
    Running org.apache.hadoop.hbase.TestMultiVersions
    Tests run: 5, Failures: 0, Errors: 0, Skipped: 0, Time elapsed: 25.421 sec
    Tests run: 3, Failures: 0, Errors: 0, Skipped: 0, Time elapsed: 21.837 sec
    Running org.apache.hadoop.hbase.security.access.TestAccessController
    Tests run: 28, Failures: 0, Errors: 0, Skipped: 0, Time elapsed: 32.963 sec
    Running org.apache.hadoop.hbase.TestHBaseTestingUtility
    Tests run: 7, Failures: 0, Errors: 0, Skipped: 0, Time elapsed: 55.842 sec
    Running org.apache.hadoop.hbase.thrift2.TestThriftHBaseServiceHandler
    Tests run: 12, Failures: 0, Errors: 0, Skipped: 0, Time elapsed: 13.072 sec
    Running org.apache.hadoop.hbase.replication.TestReplicationZookeeper
    Tests run: 1, Failures: 0, Errors: 0, Skipped: 0, Time elapsed: 0.722 sec
    Running org.apache.hadoop.hbase.replication.regionserver.TestReplicationSourceManager
    Tests run: 1, Failures: 0, Errors: 0, Skipped: 0, Time elapsed: 1.013 sec
    Running org.apache.hadoop.hbase.TestRegionRebalancing
    Tests run: 2, Failures: 0, Errors: 0, Skipped: 0, Time elapsed: 39.011 sec
    Running org.apache.hadoop.hbase.replication.TestReplicationPeer
    Tests run: 1, Failures: 0, Errors: 0, Skipped: 0, Time elapsed: 1.398 sec
    Running org.apache.hadoop.hbase.replication.regionserver.TestReplicationSink
    Tests run: 5, Failures: 0, Errors: 0, Skipped: 0, Time elapsed: 15.161 sec
    Running org.apache.hadoop.hbase.replication.TestReplicationSource
    Tests run: 1, Failures: 0, Errors: 0, Skipped: 0, Time elapsed: 2.509 sec
    Running org.apache.hadoop.hbase.replication.TestMasterReplication
    Tests run: 2, Failures: 0, Errors: 0, Skipped: 0, Time elapsed: 60.176 sec
    Running org.apache.hadoop.hbase.avro.TestAvroServer
    Tests run: 3, Failures: 0, Errors: 0, Skipped: 0, Time elapsed: 27.812 sec
    Running org.apache.hadoop.hbase.replication.TestMultiSlaveReplication
    Tests run: 1, Failures: 0, Errors: 0, Skipped: 0, Time elapsed: 38.184 sec
    Running org.apache.hadoop.hbase.TestLocalHBaseCluster
    Tests run: 1, Failures: 0, Errors: 0, Skipped: 0, Time elapsed: 8.458 sec
    Running org.apache.hadoop.hbase.coprocessor.TestRegionServerCoprocessorExceptionWithRemove
    Tests run: 1, Failures: 0, Errors: 0, Skipped: 0, Time elapsed: 15.465 sec
    Running org.apache.hadoop.hbase.coprocessor.TestRegionObserverInterface
    Tests run: 7, Failures: 0, Errors: 0, Skipped: 0, Time elapsed: 36.114 sec
    Running org.apache.hadoop.hbase.coprocessor.TestMasterObserver
    Tests run: 3, Failures: 0, Errors: 0, Skipped: 0, Time elapsed: 30.333 sec
    Running org.apache.hadoop.hbase.coprocessor.TestWALObserver
    Tests run: 3, Failures: 0, Errors: 0, Skipped: 0, Time elapsed: 14.763 sec
    Running org.apache.hadoop.hbase.coprocessor.TestRegionObserverBypass
    Tests run: 2, Failures: 0, Errors: 0, Skipped: 0, Time elapsed: 10.729 sec
    Running org.apache.hadoop.hbase.coprocessor.TestCoprocessorEndpoint
    Tests run: 3, Failures: 0, Errors: 0, Skipped: 1, Time elapsed: 29.848 sec
    Running org.apache.hadoop.hbase.coprocessor.TestRegionServerCoprocessorExceptionWithAbort
    Tests run: 1, Failures: 0, Errors: 0, Skipped: 0, Time elapsed: 13.662 sec
    Running org.apache.hadoop.hbase.TestAcidGuarantees
    Tests run: 3, Failures: 0, Errors: 0, Skipped: 0, Time elapsed: 95.66 sec
    Running org.apache.hadoop.hbase.coprocessor.TestMasterCoprocessorExceptionWithAbort
    Tests run: 1, Failures: 0, Errors: 0, Skipped: 0, Time elapsed: 25.71 sec
    Running org.apache.hadoop.hbase.coprocessor.TestAggregateProtocol
    Tests run: 45, Failures: 0, Errors: 0, Skipped: 0, Time elapsed: 16.149 sec
    Running org.apache.hadoop.hbase.coprocessor.TestMasterCoprocessorExceptionWithRemove
    Tests run: 1, Failures: 0, Errors: 0, Skipped: 0, Time elapsed: 15.581 sec
    Running org.apache.hadoop.hbase.coprocessor.TestClassLoading
    Tests run: 6, Failures: 0, Errors: 0, Skipped: 0, Time elapsed: 30.606 sec
    Running org.apache.hadoop.hbase.constraint.TestConstraint
    Tests run: 5, Failures: 0, Errors: 0, Skipped: 0, Time elapsed: 27.512 sec
    Running org.apache.hadoop.hbase.coprocessor.TestRowProcessorEndpoint
    Tests run: 4, Failures: 0, Errors: 0, Skipped: 0, Time elapsed: 31.855 sec
    Running org.apache.hadoop.hbase.master.TestOpenedRegionHandler
    Tests run: 2, Failures: 0, Errors: 0, Skipped: 0, Time elapsed: 13.653 sec
    Running org.apache.hadoop.hbase.master.TestAssignmentManager
    Tests run: 12, Failures: 0, Errors: 0, Skipped: 0, Time elapsed: 2.098 sec
    Running org.apache.hadoop.hbase.master.TestActiveMasterManager
    Tests run: 2, Failures: 0, Errors: 0, Skipped: 0, Time elapsed: 0.855 sec
    Running org.apache.hadoop.hbase.mapred.TestTableInputFormat
    Tests run: 10, Failures: 0, Errors: 0, Skipped: 0, Time elapsed: 27.437 sec
    Running org.apache.hadoop.hbase.master.TestMasterRestartAfterDisablingTable
    Tests run: 1, Failures: 0, Errors: 0, Skipped: 0, Time elapsed: 16.862 sec
    Running org.apache.hadoop.hbase.master.TestMasterFailover
    Tests run: 4, Failures: 0, Errors: 0, Skipped: 0, Time elapsed: 63.174 sec
    Running org.apache.hadoop.hbase.mapred.TestTableMapReduce
    Tests run: 1, Failures: 0, Errors: 0, Skipped: 0, Time elapsed: 91.11 sec
    Running org.apache.hadoop.hbase.master.TestRollingRestart
    Tests run: 1, Failures: 0, Errors: 0, Skipped: 0, Time elapsed: 45.905 sec
    Running org.apache.hadoop.hbase.master.TestMasterStatusServlet
    Tests run: 5, Failures: 0, Errors: 0, Skipped: 0, Time elapsed: 1.169 sec
    Running org.apache.hadoop.hbase.master.TestHMasterRPCException
    Tests run: 1, Failures: 0, Errors: 0, Skipped: 0, Time elapsed: 1.061 sec
    Running org.apache.hadoop.hbase.master.TestMasterTransitions
    Tests run: 3, Failures: 0, Errors: 0, Skipped: 3, Time elapsed: 18.439 sec
    Running org.apache.hadoop.hbase.master.TestRestartCluster
    Tests run: 2, Failures: 0, Errors: 0, Skipped: 0, Time elapsed: 27.361 sec
    Running org.apache.hadoop.hbase.master.TestMXBean
    Tests run: 1, Failures: 0, Errors: 0, Skipped: 0, Time elapsed: 11.902 sec
    Running org.apache.hadoop.hbase.master.balancer.TestBaseLoadBalancer
    Tests run: 3, Failures: 0, Errors: 0, Skipped: 0, Time elapsed: 0.346 sec
    Running org.apache.hadoop.hbase.master.balancer.TestDefaultLoadBalancer
    Tests run: 1, Failures: 0, Errors: 0, Skipped: 0, Time elapsed: 1.422 sec
    Running org.apache.hadoop.hbase.master.TestMaster
    Tests run: 1, Failures: 0, Errors: 0, Skipped: 0, Time elapsed: 14.721 sec
    Running org.apache.hadoop.hbase.master.TestMasterShutdown
    Tests run: 1, Failures: 0, Errors: 0, Skipped: 0, Time elapsed: 13.867 sec
    Running org.apache.hadoop.hbase.master.TestSplitLogManager
    Tests run: 12, Failures: 0, Errors: 0, Skipped: 0, Time elapsed: 15.613 sec
    Running org.apache.hadoop.hbase.master.TestMasterNoCluster
    Tests run: 3, Failures: 0, Errors: 0, Skipped: 0, Time elapsed: 8.6 sec
    Running org.apache.hadoop.hbase.master.TestDistributedLogSplitting
    Tests run: 4, Failures: 0, Errors: 0, Skipped: 0, Time elapsed: 80.951 sec
    Running org.apache.hadoop.hbase.master.TestLogsCleaner
    Tests run: 1, Failures: 0, Errors: 0, Skipped: 0, Time elapsed: 2.968 sec
    Running org.apache.hadoop.hbase.master.TestZKBasedOpenCloseRegion
    Tests run: 4, Failures: 0, Errors: 0, Skipped: 0, Time elapsed: 17.806 sec
    Running org.apache.hadoop.hbase.master.balancer.TestStochasticLoadBalancer
    Tests run: 4, Failures: 0, Errors: 0, Skipped: 0, Time elapsed: 96.131 sec

    Results :

    Tests run: 1021, Failures: 0, Errors: 0, Skipped: 9

    [INFO]
    [INFO] ------------------------------------------------------------------------
    [INFO] Skipping HBase
    [INFO] This project has been banned from the build due to previous failures.
    [INFO] ------------------------------------------------------------------------
    [INFO]
    [INFO] ------------------------------------------------------------------------
    [INFO] Skipping HBase
    [INFO] This project has been banned from the build due to previous failures.
    [INFO] ------------------------------------------------------------------------
    [INFO] ------------------------------------------------------------------------
    [INFO] Reactor Summary:
    [INFO]
    [INFO] HBase ............................................. SUCCESS [6.743s]
    [INFO] HBase - Common .................................... SUCCESS [4.751s]
    [INFO] HBase - Hadoop Compatibility ...................... SUCCESS [1.235s]
    [INFO] HBase - Hadoop One Compatibility .................. SUCCESS [1.992s]
    [INFO] HBase - Server .................................... FAILURE [48:11.942s]
    [INFO] HBase - Hadoop Two Compatibility .................. SKIPPED
    [INFO] HBase - Integration Tests ......................... SKIPPED
    [INFO] ------------------------------------------------------------------------
    [INFO] BUILD FAILURE
    [INFO] ------------------------------------------------------------------------
    [INFO] Total time: 48:27.367s
    [INFO] Finished at: Wed Jul 18 18:55:05 UTC 2012
    [INFO] Final Memory: 92M/547M
    [INFO] ------------------------------------------------------------------------
    [ERROR] Failed to execute goal org.apache.maven.plugins:maven-surefire-plugin:2.12-TRUNK-HBASE-2:test (secondPartTestsExecution) on project hbase-server: Failure or timeout -> [Help 1]
    [ERROR]
    [ERROR] To see the full stack trace of the errors, re-run Maven with the -e switch.
    [ERROR] Re-run Maven using the -X switch to enable full debug logging.
    [ERROR]
    [ERROR] For more information about the errors and possible solutions, please read the following articles:
    [ERROR] [Help 1] http://cwiki.apache.org/confluence/display/MAVEN/MojoExecutionException
    [ERROR]
    [ERROR] After correcting the problems, you can resume the build with the command
    [ERROR] mvn <goals> -rf :hbase-server
    Build step 'Invoke top-level Maven targets' marked build as failure
    Archiving artifacts
    Recording test results
    Updating HBASE-6400
    Updating HBASE-6220
    Updating HBASE-6419
  • Apache Jenkins Server at Jul 19, 2012 at 12:34 am
    See <https://builds.apache.org/job/HBase-TRUNK/3145/changes>

    Changes:

    [tedyu] HBASE-6389 Revert, the patch breaks TestZooKeeper

    ------------------------------------------
    [...truncated 2469 lines...]
    Tests run: 10, Failures: 0, Errors: 0, Skipped: 0, Time elapsed: 18.108 sec
    Running org.apache.hadoop.hbase.TestInfoServers
    Tests run: 2, Failures: 0, Errors: 0, Skipped: 0, Time elapsed: 12.754 sec
    Running org.apache.hadoop.hbase.rest.TestScannerResource
    Tests run: 5, Failures: 0, Errors: 0, Skipped: 0, Time elapsed: 30.31 sec
    Running org.apache.hadoop.hbase.regionserver.TestServerCustomProtocol
    Tests run: 7, Failures: 0, Errors: 0, Skipped: 0, Time elapsed: 17.976 sec
    Running org.apache.hadoop.hbase.regionserver.TestAtomicOperation
    Tests run: 5, Failures: 0, Errors: 0, Skipped: 0, Time elapsed: 36.931 sec
    Running org.apache.hadoop.hbase.regionserver.TestHRegion
    Running org.apache.hadoop.hbase.regionserver.TestCompaction
    Tests run: 15, Failures: 0, Errors: 0, Skipped: 0, Time elapsed: 48.844 sec
    Tests run: 66, Failures: 0, Errors: 0, Skipped: 0, Time elapsed: 48.189 sec
    Running org.apache.hadoop.hbase.regionserver.TestEndToEndSplitTransaction
    Tests run: 2, Failures: 0, Errors: 0, Skipped: 0, Time elapsed: 61.223 sec
    Running org.apache.hadoop.hbase.regionserver.wal.TestWALReplayCompressed
    Tests run: 7, Failures: 0, Errors: 0, Skipped: 0, Time elapsed: 44.584 sec
    Running org.apache.hadoop.hbase.regionserver.wal.TestWALReplay
    Tests run: 7, Failures: 0, Errors: 0, Skipped: 0, Time elapsed: 40.387 sec
    Running org.apache.hadoop.hbase.regionserver.wal.TestHLog
    Tests run: 10, Failures: 0, Errors: 0, Skipped: 0, Time elapsed: 65.308 sec
    Running org.apache.hadoop.hbase.regionserver.wal.TestLogRollAbort
    Tests run: 1, Failures: 0, Errors: 0, Skipped: 0, Time elapsed: 151.249 sec
    Running org.apache.hadoop.hbase.regionserver.TestRpcMetrics
    Tests run: 1, Failures: 0, Errors: 0, Skipped: 0, Time elapsed: 1.809 sec
    Running org.apache.hadoop.hbase.regionserver.TestStore
    Tests run: 12, Failures: 0, Errors: 0, Skipped: 0, Time elapsed: 9.526 sec
    Running org.apache.hadoop.hbase.regionserver.TestBlocksRead
    Tests run: 4, Failures: 0, Errors: 0, Skipped: 0, Time elapsed: 1.146 sec
    Running org.apache.hadoop.hbase.regionserver.TestCompoundBloomFilter
    Tests run: 3, Failures: 0, Errors: 0, Skipped: 0, Time elapsed: 25.12 sec
    Running org.apache.hadoop.hbase.regionserver.TestHRegionOnCluster
    Tests run: 1, Failures: 0, Errors: 0, Skipped: 0, Time elapsed: 20.388 sec
    Running org.apache.hadoop.hbase.regionserver.metrics.TestSchemaMetrics
    Tests run: 6, Failures: 0, Errors: 0, Skipped: 0, Time elapsed: 15.21 sec
    Running org.apache.hadoop.hbase.regionserver.TestCacheOnWriteInSchema
    Tests run: 3, Failures: 0, Errors: 0, Skipped: 0, Time elapsed: 1.668 sec
    Running org.apache.hadoop.hbase.regionserver.TestRegionServerMetrics
    Tests run: 4, Failures: 0, Errors: 0, Skipped: 0, Time elapsed: 66.363 sec
    Running org.apache.hadoop.hbase.regionserver.TestStoreScanner
    Tests run: 16, Failures: 0, Errors: 0, Skipped: 0, Time elapsed: 0.07 sec
    Running org.apache.hadoop.hbase.regionserver.TestParallelPut
    Tests run: 2, Failures: 0, Errors: 0, Skipped: 0, Time elapsed: 5.882 sec
    Running org.apache.hadoop.hbase.regionserver.TestStoreFileBlockCacheSummary
    Tests run: 1, Failures: 0, Errors: 0, Skipped: 0, Time elapsed: 12.825 sec
    Running org.apache.hadoop.hbase.regionserver.wal.TestLogRolling
    Tests run: 2, Failures: 0, Errors: 0, Skipped: 0, Time elapsed: 200.862 sec
    Running org.apache.hadoop.hbase.regionserver.TestGetClosestAtOrBefore
    Tests run: 3, Failures: 0, Errors: 0, Skipped: 0, Time elapsed: 1.128 sec
    Running org.apache.hadoop.hbase.regionserver.TestMemStore
    Tests run: 21, Failures: 0, Errors: 0, Skipped: 0, Time elapsed: 30.625 sec
    Running org.apache.hadoop.hbase.regionserver.TestMXBean
    Tests run: 1, Failures: 0, Errors: 0, Skipped: 0, Time elapsed: 10.278 sec
    Running org.apache.hadoop.hbase.regionserver.handler.TestCloseRegionHandler
    Tests run: 3, Failures: 0, Errors: 0, Skipped: 0, Time elapsed: 1.272 sec
    Running org.apache.hadoop.hbase.regionserver.handler.TestOpenRegionHandler
    Tests run: 3, Failures: 0, Errors: 0, Skipped: 0, Time elapsed: 0.994 sec
    Running org.apache.hadoop.hbase.regionserver.TestMultiColumnScanner
    Tests run: 12, Failures: 0, Errors: 0, Skipped: 0, Time elapsed: 43.804 sec
    Running org.apache.hadoop.hbase.regionserver.TestSplitTransactionOnCluster
    Tests run: 7, Failures: 0, Errors: 0, Skipped: 0, Time elapsed: 98.766 sec
    Running org.apache.hadoop.hbase.regionserver.TestHRegionServerBulkLoad
    Tests run: 1, Failures: 0, Errors: 0, Skipped: 0, Time elapsed: 47.953 sec
    Running org.apache.hadoop.hbase.regionserver.TestMasterAddressManager
    Tests run: 1, Failures: 0, Errors: 0, Skipped: 0, Time elapsed: 0.726 sec
    Running org.apache.hadoop.hbase.regionserver.TestSplitLogWorker
    Tests run: 5, Failures: 0, Errors: 0, Skipped: 0, Time elapsed: 2.173 sec
    Running org.apache.hadoop.hbase.regionserver.TestSeekOptimizations
    Tests run: 6, Failures: 0, Errors: 0, Skipped: 0, Time elapsed: 2.999 sec
    Running org.apache.hadoop.hbase.regionserver.wal.TestHLogSplit
    Tests run: 30, Failures: 0, Errors: 0, Skipped: 1, Time elapsed: 242.341 sec
    Running org.apache.hadoop.hbase.regionserver.TestCompactionState
    Tests run: 2, Failures: 0, Errors: 0, Skipped: 0, Time elapsed: 30.442 sec
    Running org.apache.hadoop.hbase.regionserver.TestFSErrorsExposed
    Tests run: 3, Failures: 0, Errors: 0, Skipped: 0, Time elapsed: 28.266 sec
    Running org.apache.hadoop.hbase.TestGlobalMemStoreSize
    Running org.apache.hadoop.hbase.filter.TestColumnRangeFilter
    Tests run: 1, Failures: 0, Errors: 0, Skipped: 0, Time elapsed: 15.679 sec
    Tests run: 1, Failures: 0, Errors: 0, Skipped: 0, Time elapsed: 18.091 sec
    Running org.apache.hadoop.hbase.regionserver.TestRSKilledWhenMasterInitializing
    Tests run: 1, Failures: 0, Errors: 0, Skipped: 0, Time elapsed: 61.014 sec
    Running org.apache.hadoop.hbase.security.token.TestTokenAuthentication
    Tests run: 1, Failures: 0, Errors: 0, Skipped: 0, Time elapsed: 9.963 sec
    Running org.apache.hadoop.hbase.security.access.TestZKPermissionsWatcher
    Tests run: 1, Failures: 0, Errors: 0, Skipped: 0, Time elapsed: 9.705 sec
    Running org.apache.hadoop.hbase.security.token.TestZKSecretWatcher
    Tests run: 1, Failures: 0, Errors: 0, Skipped: 0, Time elapsed: 15.404 sec
    Running org.apache.hadoop.hbase.security.access.TestAccessControlFilter
    Tests run: 1, Failures: 0, Errors: 0, Skipped: 0, Time elapsed: 15.904 sec
    Running org.apache.hadoop.hbase.security.access.TestTablePermissions
    Tests run: 5, Failures: 0, Errors: 0, Skipped: 0, Time elapsed: 25.096 sec
    Running org.apache.hadoop.hbase.security.access.TestAccessController
    Tests run: 28, Failures: 0, Errors: 0, Skipped: 0, Time elapsed: 28.767 sec
    Running org.apache.hadoop.hbase.TestHBaseTestingUtility
    Tests run: 7, Failures: 0, Errors: 0, Skipped: 0, Time elapsed: 56.563 sec
    Running org.apache.hadoop.hbase.TestMultiVersions
    Tests run: 3, Failures: 0, Errors: 0, Skipped: 0, Time elapsed: 22.026 sec
    Running org.apache.hadoop.hbase.thrift2.TestThriftHBaseServiceHandler
    Tests run: 12, Failures: 0, Errors: 0, Skipped: 0, Time elapsed: 12.365 sec
    Running org.apache.hadoop.hbase.replication.TestReplicationZookeeper
    Tests run: 1, Failures: 0, Errors: 0, Skipped: 0, Time elapsed: 0.639 sec
    Running org.apache.hadoop.hbase.replication.regionserver.TestReplicationSourceManager
    Tests run: 1, Failures: 0, Errors: 0, Skipped: 0, Time elapsed: 0.968 sec
    Running org.apache.hadoop.hbase.replication.regionserver.TestReplicationSink
    Tests run: 5, Failures: 0, Errors: 0, Skipped: 0, Time elapsed: 15.499 sec
    Running org.apache.hadoop.hbase.replication.TestReplicationPeer
    Tests run: 1, Failures: 0, Errors: 0, Skipped: 0, Time elapsed: 1.205 sec
    Running org.apache.hadoop.hbase.TestRegionRebalancing
    Tests run: 2, Failures: 0, Errors: 0, Skipped: 0, Time elapsed: 40.282 sec
    Running org.apache.hadoop.hbase.replication.TestReplicationSource
    Tests run: 1, Failures: 0, Errors: 0, Skipped: 0, Time elapsed: 2.626 sec
    Running org.apache.hadoop.hbase.avro.TestAvroServer
    Tests run: 3, Failures: 0, Errors: 0, Skipped: 0, Time elapsed: 24.635 sec
    Running org.apache.hadoop.hbase.replication.TestMultiSlaveReplication
    Tests run: 1, Failures: 0, Errors: 0, Skipped: 0, Time elapsed: 34.556 sec
    Running org.apache.hadoop.hbase.replication.TestMasterReplication
    Tests run: 2, Failures: 0, Errors: 0, Skipped: 0, Time elapsed: 58.654 sec
    Running org.apache.hadoop.hbase.TestLocalHBaseCluster
    Tests run: 1, Failures: 0, Errors: 0, Skipped: 0, Time elapsed: 5.475 sec
    Running org.apache.hadoop.hbase.coprocessor.TestRegionServerCoprocessorExceptionWithRemove
    Tests run: 1, Failures: 0, Errors: 0, Skipped: 0, Time elapsed: 16.945 sec
    Running org.apache.hadoop.hbase.coprocessor.TestRegionObserverInterface
    Tests run: 7, Failures: 0, Errors: 0, Skipped: 0, Time elapsed: 37.176 sec
    Running org.apache.hadoop.hbase.coprocessor.TestMasterObserver
    Tests run: 3, Failures: 0, Errors: 0, Skipped: 0, Time elapsed: 31.978 sec
    Running org.apache.hadoop.hbase.coprocessor.TestWALObserver
    Tests run: 3, Failures: 0, Errors: 0, Skipped: 0, Time elapsed: 14.631 sec
    Running org.apache.hadoop.hbase.coprocessor.TestCoprocessorEndpoint
    Tests run: 3, Failures: 0, Errors: 0, Skipped: 1, Time elapsed: 29.413 sec
    Running org.apache.hadoop.hbase.coprocessor.TestRegionObserverBypass
    Tests run: 2, Failures: 0, Errors: 0, Skipped: 0, Time elapsed: 11.944 sec
    Running org.apache.hadoop.hbase.TestAcidGuarantees
    Tests run: 3, Failures: 0, Errors: 0, Skipped: 0, Time elapsed: 96.467 sec
    Running org.apache.hadoop.hbase.coprocessor.TestRegionServerCoprocessorExceptionWithAbort
    Tests run: 1, Failures: 0, Errors: 0, Skipped: 0, Time elapsed: 16.362 sec
    Running org.apache.hadoop.hbase.replication.TestReplication
    Tests run: 10, Failures: 0, Errors: 0, Skipped: 0, Time elapsed: 160.792 sec
    Running org.apache.hadoop.hbase.coprocessor.TestMasterCoprocessorExceptionWithAbort
    Tests run: 1, Failures: 0, Errors: 0, Skipped: 0, Time elapsed: 24.885 sec
    Running org.apache.hadoop.hbase.coprocessor.TestAggregateProtocol
    Tests run: 45, Failures: 0, Errors: 0, Skipped: 0, Time elapsed: 16.712 sec
    Running org.apache.hadoop.hbase.coprocessor.TestMasterCoprocessorExceptionWithRemove
    Tests run: 1, Failures: 0, Errors: 0, Skipped: 0, Time elapsed: 15.745 sec
    Running org.apache.hadoop.hbase.coprocessor.TestClassLoading
    Tests run: 6, Failures: 0, Errors: 0, Skipped: 0, Time elapsed: 29.963 sec
    Running org.apache.hadoop.hbase.coprocessor.TestRowProcessorEndpoint
    Tests run: 4, Failures: 0, Errors: 0, Skipped: 0, Time elapsed: 33.262 sec
    Running org.apache.hadoop.hbase.constraint.TestConstraint
    Tests run: 5, Failures: 0, Errors: 0, Skipped: 0, Time elapsed: 27.552 sec
    Running org.apache.hadoop.hbase.master.TestAssignmentManager
    Tests run: 12, Failures: 0, Errors: 0, Skipped: 0, Time elapsed: 2.409 sec
    Running org.apache.hadoop.hbase.master.TestActiveMasterManager
    Tests run: 2, Failures: 0, Errors: 0, Skipped: 0, Time elapsed: 0.926 sec
    Running org.apache.hadoop.hbase.master.TestOpenedRegionHandler
    Tests run: 2, Failures: 0, Errors: 0, Skipped: 0, Time elapsed: 13.329 sec
    Running org.apache.hadoop.hbase.mapred.TestTableInputFormat
    Tests run: 10, Failures: 0, Errors: 0, Skipped: 0, Time elapsed: 30.948 sec
    Running org.apache.hadoop.hbase.master.TestMasterRestartAfterDisablingTable
    Tests run: 1, Failures: 0, Errors: 0, Skipped: 0, Time elapsed: 16.053 sec
    Running org.apache.hadoop.hbase.master.TestMasterTransitions
    Tests run: 3, Failures: 0, Errors: 0, Skipped: 3, Time elapsed: 18.471 sec
    Running org.apache.hadoop.hbase.master.TestRollingRestart
    Tests run: 1, Failures: 0, Errors: 0, Skipped: 0, Time elapsed: 41.828 sec
    Running org.apache.hadoop.hbase.master.TestMasterStatusServlet
    Tests run: 5, Failures: 0, Errors: 0, Skipped: 0, Time elapsed: 1.118 sec
    Running org.apache.hadoop.hbase.master.TestHMasterRPCException
    Tests run: 1, Failures: 0, Errors: 0, Skipped: 0, Time elapsed: 0.976 sec
    Running org.apache.hadoop.hbase.master.TestMasterFailover
    Tests run: 4, Failures: 0, Errors: 0, Skipped: 0, Time elapsed: 65.055 sec
    Running org.apache.hadoop.hbase.master.TestRestartCluster
    Tests run: 2, Failures: 0, Errors: 0, Skipped: 0, Time elapsed: 30.622 sec
    Running org.apache.hadoop.hbase.master.balancer.TestBaseLoadBalancer
    Tests run: 3, Failures: 0, Errors: 0, Skipped: 0, Time elapsed: 0.491 sec
    Running org.apache.hadoop.hbase.master.TestMXBean
    Tests run: 1, Failures: 0, Errors: 0, Skipped: 0, Time elapsed: 11.645 sec
    Running org.apache.hadoop.hbase.master.balancer.TestDefaultLoadBalancer
    Tests run: 1, Failures: 0, Errors: 0, Skipped: 0, Time elapsed: 1.496 sec
    Running org.apache.hadoop.hbase.master.TestMaster
    Tests run: 1, Failures: 0, Errors: 0, Skipped: 0, Time elapsed: 15.676 sec
    Running org.apache.hadoop.hbase.master.TestMasterShutdown
    Tests run: 1, Failures: 0, Errors: 0, Skipped: 0, Time elapsed: 13.513 sec
    Running org.apache.hadoop.hbase.mapred.TestTableMapReduce
    Tests run: 1, Failures: 0, Errors: 0, Skipped: 0, Time elapsed: 151.529 sec
    Running org.apache.hadoop.hbase.master.TestSplitLogManager
    Tests run: 12, Failures: 0, Errors: 0, Skipped: 0, Time elapsed: 15.681 sec
    Running org.apache.hadoop.hbase.master.TestMasterNoCluster
    Tests run: 3, Failures: 0, Errors: 0, Skipped: 0, Time elapsed: 5.672 sec
    Running org.apache.hadoop.hbase.master.TestLogsCleaner
    Tests run: 1, Failures: 0, Errors: 0, Skipped: 0, Time elapsed: 3.093 sec
    Running org.apache.hadoop.hbase.master.TestDistributedLogSplitting
    Tests run: 4, Failures: 0, Errors: 0, Skipped: 0, Time elapsed: 83.663 sec
    Running org.apache.hadoop.hbase.master.TestZKBasedOpenCloseRegion
    Tests run: 4, Failures: 0, Errors: 0, Skipped: 0, Time elapsed: 20.247 sec
    Running org.apache.hadoop.hbase.master.balancer.TestStochasticLoadBalancer
    Tests run: 4, Failures: 0, Errors: 0, Skipped: 0, Time elapsed: 95.612 sec

    Results :

    Tests in error:
    testCacheBlocks[1](org.apache.hadoop.hbase.io.hfile.TestForceCacheImportantBlocks): region: myTable,,1342656998842.bf87ca88a076e5051183fe6fc7189077.
    testCacheBlocks[2](org.apache.hadoop.hbase.io.hfile.TestForceCacheImportantBlocks): unable to create new native thread
    testCacheBlocks[3](org.apache.hadoop.hbase.io.hfile.TestForceCacheImportantBlocks): unable to create new native thread

    Tests run: 1042, Failures: 0, Errors: 3, Skipped: 9

    [INFO]
    [INFO] ------------------------------------------------------------------------
    [INFO] Skipping HBase
    [INFO] This project has been banned from the build due to previous failures.
    [INFO] ------------------------------------------------------------------------
    [INFO]
    [INFO] ------------------------------------------------------------------------
    [INFO] Skipping HBase
    [INFO] This project has been banned from the build due to previous failures.
    [INFO] ------------------------------------------------------------------------
    [INFO] ------------------------------------------------------------------------
    [INFO] Reactor Summary:
    [INFO]
    [INFO] HBase ............................................. SUCCESS [5.674s]
    [INFO] HBase - Common .................................... SUCCESS [7.662s]
    [INFO] HBase - Hadoop Compatibility ...................... SUCCESS [1.247s]
    [INFO] HBase - Hadoop One Compatibility .................. SUCCESS [1.689s]
    [INFO] HBase - Server .................................... FAILURE [36:28.921s]
    [INFO] HBase - Hadoop Two Compatibility .................. SKIPPED
    [INFO] HBase - Integration Tests ......................... SKIPPED
    [INFO] ------------------------------------------------------------------------
    [INFO] BUILD FAILURE
    [INFO] ------------------------------------------------------------------------
    [INFO] Total time: 36:46.045s
    [INFO] Finished at: Thu Jul 19 00:33:31 UTC 2012
    [INFO] Final Memory: 69M/345M
    [INFO] ------------------------------------------------------------------------
    [ERROR] Failed to execute goal org.apache.maven.plugins:maven-surefire-plugin:2.12-TRUNK-HBASE-2:test (secondPartTestsExecution) on project hbase-server: There are test failures.
    [ERROR]
    [ERROR] Please refer to <https://builds.apache.org/job/HBase-TRUNK/ws/trunk/hbase-server/target/surefire-reports> for the individual test results.
    [ERROR] -> [Help 1]
    [ERROR]
    [ERROR] To see the full stack trace of the errors, re-run Maven with the -e switch.
    [ERROR] Re-run Maven using the -X switch to enable full debug logging.
    [ERROR]
    [ERROR] For more information about the errors and possible solutions, please read the following articles:
    [ERROR] [Help 1] http://cwiki.apache.org/confluence/display/MAVEN/MojoFailureException
    [ERROR]
    [ERROR] After correcting the problems, you can resume the build with the command
    [ERROR] mvn <goals> -rf :hbase-server
    Build step 'Invoke top-level Maven targets' marked build as failure
    Archiving artifacts
    Recording test results
    Updating HBASE-6389
  • Apache Jenkins Server at Jul 19, 2012 at 1:29 am

Related Discussions

Discussion Navigation
viewthread | post
Discussion Overview
groupdev @
categorieshbase, hadoop
postedJul 17, '12 at 5:15a
activeJul 19, '12 at 1:29a
posts7
users1
websitehbase.apache.org

1 user in discussion

Apache Jenkins Server: 7 posts

People

Translate

site design / logo © 2022 Grokbase