Grokbase Groups HBase dev July 2012
FAQ
See <https://builds.apache.org/job/HBase-0.92/473/>

------------------------------------------
Started by an SCM change
Building remotely on ubuntu2 in workspace <https://builds.apache.org/job/HBase-0.92/ws/>
Cleaning local Directory trunk
Checking out https://svn.apache.org/repos/asf/hbase/branches/0.92
ERROR: Failed to check out https://svn.apache.org/repos/asf/hbase/branches/0.92
org.tmatesoft.svn.core.SVNException: svn: OPTIONS /repos/asf/hbase/branches/0.92 failed
at org.tmatesoft.svn.core.internal.io.dav.http.HTTPConnection.request(HTTPConnection.java:298)
at org.tmatesoft.svn.core.internal.io.dav.http.HTTPConnection.request(HTTPConnection.java:283)
at org.tmatesoft.svn.core.internal.io.dav.http.HTTPConnection.request(HTTPConnection.java:271)
at org.tmatesoft.svn.core.internal.io.dav.DAVConnection.exchangeCapabilities(DAVConnection.java:533)
at org.tmatesoft.svn.core.internal.io.dav.DAVConnection.open(DAVConnection.java:98)
at org.tmatesoft.svn.core.internal.io.dav.DAVRepository.openConnection(DAVRepository.java:1011)
at org.tmatesoft.svn.core.internal.io.dav.DAVRepository.getLatestRevision(DAVRepository.java:180)
at org.tmatesoft.svn.core.wc.SVNBasicClient.getRevisionNumber(SVNBasicClient.java:482)
at org.tmatesoft.svn.core.wc.SVNBasicClient.getLocations(SVNBasicClient.java:876)
at org.tmatesoft.svn.core.wc.SVNBasicClient.createRepository(SVNBasicClient.java:534)
at org.tmatesoft.svn.core.wc.SVNUpdateClient.doCheckout(SVNUpdateClient.java:901)
at hudson.scm.subversion.CheckoutUpdater$1.perform(CheckoutUpdater.java:84)
at hudson.scm.subversion.WorkspaceUpdater$UpdateTask.delegateTo(WorkspaceUpdater.java:136)
at hudson.scm.SubversionSCM$CheckOutTask.perform(SubversionSCM.java:788)
at hudson.scm.SubversionSCM$CheckOutTask.invoke(SubversionSCM.java:769)
at hudson.scm.SubversionSCM$CheckOutTask.invoke(SubversionSCM.java:753)
at hudson.FilePath$FileCallableWrapper.call(FilePath.java:2196)
at hudson.remoting.UserRequest.perform(UserRequest.java:118)
at hudson.remoting.UserRequest.perform(UserRequest.java:48)
at hudson.remoting.Request$2.run(Request.java:326)
at hudson.remoting.InterceptingExecutorService$1.call(InterceptingExecutorService.java:72)
at java.util.concurrent.FutureTask$Sync.innerRun(FutureTask.java:334)
at java.util.concurrent.FutureTask.run(FutureTask.java:166)
at java.util.concurrent.ThreadPoolExecutor.runWorker(ThreadPoolExecutor.java:1110)
at java.util.concurrent.ThreadPoolExecutor$Worker.run(ThreadPoolExecutor.java:603)
at java.lang.Thread.run(Thread.java:636)
Caused by: org.tmatesoft.svn.core.SVNErrorMessage: svn: OPTIONS /repos/asf/hbase/branches/0.92 failed
at org.tmatesoft.svn.core.SVNErrorMessage.create(SVNErrorMessage.java:200)
at org.tmatesoft.svn.core.SVNErrorMessage.create(SVNErrorMessage.java:146)
at org.tmatesoft.svn.core.SVNErrorMessage.create(SVNErrorMessage.java:89)
... 26 more
Caused by: org.tmatesoft.svn.core.SVNException: svn: OPTIONS request failed on '/repos/asf/hbase/branches/0.92'
svn: connection refused by the server
at org.tmatesoft.svn.core.internal.wc.SVNErrorManager.error(SVNErrorManager.java:64)
at org.tmatesoft.svn.core.internal.wc.SVNErrorManager.error(SVNErrorManager.java:51)
at org.tmatesoft.svn.core.internal.io.dav.http.HTTPConnection._request(HTTPConnection.java:662)
at org.tmatesoft.svn.core.internal.io.dav.http.HTTPConnection.request(HTTPConnection.java:292)
... 25 more
Caused by: org.tmatesoft.svn.core.SVNErrorMessage: svn: OPTIONS request failed on '/repos/asf/hbase/branches/0.92'
at org.tmatesoft.svn.core.SVNErrorMessage.create(SVNErrorMessage.java:200)
at org.tmatesoft.svn.core.internal.io.dav.http.HTTPConnection._request(HTTPConnection.java:660)
... 26 more
Caused by: org.tmatesoft.svn.core.SVNErrorMessage: svn: connection refused by the server
at org.tmatesoft.svn.core.SVNErrorMessage.create(SVNErrorMessage.java:200)
at org.tmatesoft.svn.core.internal.io.dav.http.HTTPConnection._request(HTTPConnection.java:418)
... 26 more
Caused by: java.net.ConnectException: Connection timed out
at java.net.PlainSocketImpl.socketConnect(Native Method)
at java.net.AbstractPlainSocketImpl.doConnect(AbstractPlainSocketImpl.java:327)
at java.net.AbstractPlainSocketImpl.connectToAddress(AbstractPlainSocketImpl.java:193)
at java.net.AbstractPlainSocketImpl.connect(AbstractPlainSocketImpl.java:180)
at java.net.SocksSocketImpl.connect(SocksSocketImpl.java:384)
at java.net.Socket.connect(Socket.java:546)
at sun.security.ssl.SSLSocketImpl.connect(SSLSocketImpl.java:584)
at org.tmatesoft.svn.core.internal.util.SVNSocketConnection.run(SVNSocketConnection.java:57)
... 1 more
FATAL: null
java.lang.NullPointerException
at java.util.ArrayList.addAll(ArrayList.java:530)
at hudson.scm.SubversionSCM.checkout(SubversionSCM.java:743)
at hudson.scm.SubversionSCM.checkout(SubversionSCM.java:685)
at hudson.model.AbstractProject.checkout(AbstractProject.java:1256)
at hudson.model.AbstractBuild$AbstractBuildExecution.defaultCheckout(AbstractBuild.java:589)
at jenkins.scm.SCMCheckoutStrategy.checkout(SCMCheckoutStrategy.java:88)
at hudson.model.AbstractBuild$AbstractBuildExecution.run(AbstractBuild.java:494)
at hudson.model.Run.execute(Run.java:1488)
at hudson.model.FreeStyleBuild.run(FreeStyleBuild.java:46)
at hudson.model.ResourceController.execute(ResourceController.java:88)
at hudson.model.Executor.run(Executor.java:236)

Search Discussions

  • Apache Jenkins Server at Jul 11, 2012 at 7:19 am
    See <https://builds.apache.org/job/HBase-0.92/474/>

    ------------------------------------------
    Started by an SCM change
    Building remotely on ubuntu2 in workspace <https://builds.apache.org/job/HBase-0.92/ws/>
    Cleaning local Directory trunk
    Checking out https://svn.apache.org/repos/asf/hbase/branches/0.92
    ERROR: Failed to check out https://svn.apache.org/repos/asf/hbase/branches/0.92
    org.tmatesoft.svn.core.SVNException: svn: OPTIONS /repos/asf/hbase/branches/0.92 failed
    at org.tmatesoft.svn.core.internal.io.dav.http.HTTPConnection.request(HTTPConnection.java:298)
    at org.tmatesoft.svn.core.internal.io.dav.http.HTTPConnection.request(HTTPConnection.java:283)
    at org.tmatesoft.svn.core.internal.io.dav.http.HTTPConnection.request(HTTPConnection.java:271)
    at org.tmatesoft.svn.core.internal.io.dav.DAVConnection.exchangeCapabilities(DAVConnection.java:533)
    at org.tmatesoft.svn.core.internal.io.dav.DAVConnection.open(DAVConnection.java:98)
    at org.tmatesoft.svn.core.internal.io.dav.DAVRepository.openConnection(DAVRepository.java:1011)
    at org.tmatesoft.svn.core.internal.io.dav.DAVRepository.getLatestRevision(DAVRepository.java:180)
    at org.tmatesoft.svn.core.wc.SVNBasicClient.getRevisionNumber(SVNBasicClient.java:482)
    at org.tmatesoft.svn.core.wc.SVNBasicClient.getLocations(SVNBasicClient.java:876)
    at org.tmatesoft.svn.core.wc.SVNBasicClient.createRepository(SVNBasicClient.java:534)
    at org.tmatesoft.svn.core.wc.SVNUpdateClient.doCheckout(SVNUpdateClient.java:901)
    at hudson.scm.subversion.CheckoutUpdater$1.perform(CheckoutUpdater.java:84)
    at hudson.scm.subversion.WorkspaceUpdater$UpdateTask.delegateTo(WorkspaceUpdater.java:136)
    at hudson.scm.SubversionSCM$CheckOutTask.perform(SubversionSCM.java:788)
    at hudson.scm.SubversionSCM$CheckOutTask.invoke(SubversionSCM.java:769)
    at hudson.scm.SubversionSCM$CheckOutTask.invoke(SubversionSCM.java:753)
    at hudson.FilePath$FileCallableWrapper.call(FilePath.java:2196)
    at hudson.remoting.UserRequest.perform(UserRequest.java:118)
    at hudson.remoting.UserRequest.perform(UserRequest.java:48)
    at hudson.remoting.Request$2.run(Request.java:326)
    at hudson.remoting.InterceptingExecutorService$1.call(InterceptingExecutorService.java:72)
    at java.util.concurrent.FutureTask$Sync.innerRun(FutureTask.java:334)
    at java.util.concurrent.FutureTask.run(FutureTask.java:166)
    at java.util.concurrent.ThreadPoolExecutor.runWorker(ThreadPoolExecutor.java:1110)
    at java.util.concurrent.ThreadPoolExecutor$Worker.run(ThreadPoolExecutor.java:603)
    at java.lang.Thread.run(Thread.java:636)
    Caused by: org.tmatesoft.svn.core.SVNErrorMessage: svn: OPTIONS /repos/asf/hbase/branches/0.92 failed
    at org.tmatesoft.svn.core.SVNErrorMessage.create(SVNErrorMessage.java:200)
    at org.tmatesoft.svn.core.SVNErrorMessage.create(SVNErrorMessage.java:146)
    at org.tmatesoft.svn.core.SVNErrorMessage.create(SVNErrorMessage.java:89)
    ... 26 more
    Caused by: org.tmatesoft.svn.core.SVNException: svn: OPTIONS request failed on '/repos/asf/hbase/branches/0.92'
    svn: connection refused by the server
    at org.tmatesoft.svn.core.internal.wc.SVNErrorManager.error(SVNErrorManager.java:64)
    at org.tmatesoft.svn.core.internal.wc.SVNErrorManager.error(SVNErrorManager.java:51)
    at org.tmatesoft.svn.core.internal.io.dav.http.HTTPConnection._request(HTTPConnection.java:662)
    at org.tmatesoft.svn.core.internal.io.dav.http.HTTPConnection.request(HTTPConnection.java:292)
    ... 25 more
    Caused by: org.tmatesoft.svn.core.SVNErrorMessage: svn: OPTIONS request failed on '/repos/asf/hbase/branches/0.92'
    at org.tmatesoft.svn.core.SVNErrorMessage.create(SVNErrorMessage.java:200)
    at org.tmatesoft.svn.core.internal.io.dav.http.HTTPConnection._request(HTTPConnection.java:660)
    ... 26 more
    Caused by: org.tmatesoft.svn.core.SVNErrorMessage: svn: connection refused by the server
    at org.tmatesoft.svn.core.SVNErrorMessage.create(SVNErrorMessage.java:200)
    at org.tmatesoft.svn.core.internal.io.dav.http.HTTPConnection._request(HTTPConnection.java:418)
    ... 26 more
    Caused by: java.net.ConnectException: Connection timed out
    at java.net.PlainSocketImpl.socketConnect(Native Method)
    at java.net.AbstractPlainSocketImpl.doConnect(AbstractPlainSocketImpl.java:327)
    at java.net.AbstractPlainSocketImpl.connectToAddress(AbstractPlainSocketImpl.java:193)
    at java.net.AbstractPlainSocketImpl.connect(AbstractPlainSocketImpl.java:180)
    at java.net.SocksSocketImpl.connect(SocksSocketImpl.java:384)
    at java.net.Socket.connect(Socket.java:546)
    at sun.security.ssl.SSLSocketImpl.connect(SSLSocketImpl.java:584)
    at org.tmatesoft.svn.core.internal.util.SVNSocketConnection.run(SVNSocketConnection.java:57)
    ... 1 more
    FATAL: null
    java.lang.NullPointerException
    at java.util.ArrayList.addAll(ArrayList.java:530)
    at hudson.scm.SubversionSCM.checkout(SubversionSCM.java:743)
    at hudson.scm.SubversionSCM.checkout(SubversionSCM.java:685)
    at hudson.model.AbstractProject.checkout(AbstractProject.java:1256)
    at hudson.model.AbstractBuild$AbstractBuildExecution.defaultCheckout(AbstractBuild.java:589)
    at jenkins.scm.SCMCheckoutStrategy.checkout(SCMCheckoutStrategy.java:88)
    at hudson.model.AbstractBuild$AbstractBuildExecution.run(AbstractBuild.java:494)
    at hudson.model.Run.execute(Run.java:1488)
    at hudson.model.FreeStyleBuild.run(FreeStyleBuild.java:46)
    at hudson.model.ResourceController.execute(ResourceController.java:88)
    at hudson.model.Executor.run(Executor.java:236)
  • Apache Jenkins Server at Jul 13, 2012 at 7:17 am
    See <https://builds.apache.org/job/HBase-0.92/475/>

    ------------------------------------------
    [...truncated 1824 lines...]
    Running org.apache.hadoop.hbase.rest.model.TestScannerModel
    Tests run: 3, Failures: 0, Errors: 0, Skipped: 0, Time elapsed: 0.54 sec
    Running org.apache.hadoop.hbase.rest.model.TestTableInfoModel
    Tests run: 3, Failures: 0, Errors: 0, Skipped: 0, Time elapsed: 0.519 sec
    Running org.apache.hadoop.hbase.rest.model.TestCellModel
    Tests run: 3, Failures: 0, Errors: 0, Skipped: 0, Time elapsed: 0.453 sec
    Running org.apache.hadoop.hbase.rest.TestRowResource
    Tests run: 11, Failures: 0, Errors: 0, Skipped: 0, Time elapsed: 26.698 sec
    Running org.apache.hadoop.hbase.rest.client.TestRemoteAdmin
    Tests run: 1, Failures: 0, Errors: 0, Skipped: 0, Time elapsed: 24.863 sec
    Running org.apache.hadoop.hbase.rest.client.TestRemoteTable
    Tests run: 3, Failures: 0, Errors: 0, Skipped: 0, Time elapsed: 25.812 sec
    Running org.apache.hadoop.hbase.rest.TestGzipFilter
    Tests run: 3, Failures: 0, Errors: 0, Skipped: 0, Time elapsed: 23.601 sec
    Running org.apache.hadoop.hbase.rest.TestMultiRowResource
    Tests run: 3, Failures: 0, Errors: 0, Skipped: 0, Time elapsed: 24.572 sec
    Running org.apache.hadoop.hbase.TestCompare
    Tests run: 1, Failures: 0, Errors: 0, Skipped: 0, Time elapsed: 0.921 sec
    Running org.apache.hadoop.hbase.TestLocalHBaseCluster
    Tests run: 1, Failures: 0, Errors: 0, Skipped: 0, Time elapsed: 18.781 sec
    Running org.apache.hadoop.hbase.TestHRegionLocation
    Tests run: 3, Failures: 0, Errors: 0, Skipped: 0, Time elapsed: 2.114 sec
    Running org.apache.hadoop.hbase.filter.TestFilterList
    Tests run: 5, Failures: 0, Errors: 0, Skipped: 0, Time elapsed: 1.732 sec
    Running org.apache.hadoop.hbase.filter.TestColumnPrefixFilter
    Tests run: 2, Failures: 0, Errors: 0, Skipped: 0, Time elapsed: 9.018 sec
    Running org.apache.hadoop.hbase.filter.TestPageFilter
    Tests run: 2, Failures: 0, Errors: 0, Skipped: 0, Time elapsed: 0.194 sec
    Running org.apache.hadoop.hbase.filter.TestDependentColumnFilter
    Tests run: 2, Failures: 0, Errors: 0, Skipped: 0, Time elapsed: 4.964 sec
    Running org.apache.hadoop.hbase.filter.TestSingleColumnValueFilter
    Tests run: 2, Failures: 0, Errors: 0, Skipped: 0, Time elapsed: 0.921 sec
    Running org.apache.hadoop.hbase.filter.TestColumnPaginationFilter
    Tests run: 1, Failures: 0, Errors: 0, Skipped: 0, Time elapsed: 0.145 sec
    Running org.apache.hadoop.hbase.filter.TestSingleColumnValueExcludeFilter
    Tests run: 1, Failures: 0, Errors: 0, Skipped: 0, Time elapsed: 0.146 sec
    Running org.apache.hadoop.hbase.filter.TestRandomRowFilter
    Tests run: 2, Failures: 0, Errors: 0, Skipped: 0, Time elapsed: 0.898 sec
    Running org.apache.hadoop.hbase.filter.TestPrefixFilter
    Tests run: 3, Failures: 0, Errors: 0, Skipped: 0, Time elapsed: 0.135 sec
    Running org.apache.hadoop.hbase.filter.TestMultipleColumnPrefixFilter
    Tests run: 3, Failures: 0, Errors: 0, Skipped: 0, Time elapsed: 6.472 sec
    Running org.apache.hadoop.hbase.filter.TestFilter
    Tests run: 18, Failures: 0, Errors: 0, Skipped: 0, Time elapsed: 9.571 sec
    Running org.apache.hadoop.hbase.filter.TestColumnRangeFilter
    Tests run: 1, Failures: 0, Errors: 0, Skipped: 0, Time elapsed: 43.992 sec
    Running org.apache.hadoop.hbase.filter.TestInclusiveStopFilter
    Tests run: 2, Failures: 0, Errors: 0, Skipped: 0, Time elapsed: 1.215 sec
    Running org.apache.hadoop.hbase.filter.TestBitComparator
    Tests run: 3, Failures: 0, Errors: 0, Skipped: 0, Time elapsed: 1.045 sec
    Running org.apache.hadoop.hbase.filter.TestParseFilter
    Tests run: 33, Failures: 0, Errors: 0, Skipped: 0, Time elapsed: 9.851 sec
    Running org.apache.hadoop.hbase.TestInfoServers
    Tests run: 2, Failures: 0, Errors: 0, Skipped: 0, Time elapsed: 47.747 sec
    Running org.apache.hadoop.hbase.TestKeyValue
    Tests run: 15, Failures: 0, Errors: 0, Skipped: 0, Time elapsed: 1.04 sec
    Running org.apache.hadoop.hbase.thrift.TestThriftServer
    Tests run: 1, Failures: 0, Errors: 0, Skipped: 0, Time elapsed: 54.181 sec
    Running org.apache.hadoop.hbase.master.TestClockSkewDetection
    Tests run: 1, Failures: 0, Errors: 0, Skipped: 0, Time elapsed: 2.4 sec
    Running org.apache.hadoop.hbase.master.TestAssignmentManager
    Tests run: 1, Failures: 0, Errors: 0, Skipped: 0, Time elapsed: 6.337 sec
    Running org.apache.hadoop.hbase.master.TestMasterStatusServlet
    Tests run: 5, Failures: 0, Errors: 0, Skipped: 0, Time elapsed: 2.26 sec
    Running org.apache.hadoop.hbase.master.TestCatalogJanitor
    Tests run: 5, Failures: 0, Errors: 0, Skipped: 0, Time elapsed: 15.886 sec
    Running org.apache.hadoop.hbase.master.TestHMasterRPCException
    Tests run: 1, Failures: 1, Errors: 0, Skipped: 0, Time elapsed: 10.076 sec <<< FAILURE!
    Running org.apache.hadoop.hbase.master.TestDefaultLoadBalancer
    Tests run: 4, Failures: 0, Errors: 0, Skipped: 0, Time elapsed: 2.885 sec
    Running org.apache.hadoop.hbase.master.TestLogsCleaner
    Tests run: 1, Failures: 0, Errors: 0, Skipped: 0, Time elapsed: 5.326 sec
    Running org.apache.hadoop.hbase.master.TestSplitLogManager
    Tests run: 12, Failures: 0, Errors: 0, Skipped: 0, Time elapsed: 19.693 sec
    Running org.apache.hadoop.hbase.master.TestRestartCluster
    Tests run: 2, Failures: 0, Errors: 1, Skipped: 0, Time elapsed: 72.707 sec <<< FAILURE!
    Running org.apache.hadoop.hbase.master.TestZKBasedOpenCloseRegion
    Tests run: 4, Failures: 0, Errors: 0, Skipped: 0, Time elapsed: 33.001 sec
    Running org.apache.hadoop.hbase.master.TestMasterShutdown
    Tests run: 1, Failures: 0, Errors: 0, Skipped: 0, Time elapsed: 23.549 sec
    Running org.apache.hadoop.hbase.master.TestActiveMasterManager
    Tests run: 2, Failures: 0, Errors: 0, Skipped: 0, Time elapsed: 1.848 sec
    Running org.apache.hadoop.hbase.master.TestMasterRestartAfterDisablingTable
    Tests run: 1, Failures: 0, Errors: 0, Skipped: 0, Time elapsed: 33.352 sec
    Running org.apache.hadoop.hbase.master.TestMXBean
    Tests run: 1, Failures: 0, Errors: 0, Skipped: 0, Time elapsed: 35.519 sec
    Running org.apache.hadoop.hbase.master.TestDistributedLogSplitting
    Tests run: 4, Failures: 0, Errors: 0, Skipped: 0, Time elapsed: 152.038 sec
    Running org.apache.hadoop.hbase.master.TestMasterTransitions
    Tests run: 3, Failures: 0, Errors: 0, Skipped: 3, Time elapsed: 34.866 sec
    Running org.apache.hadoop.hbase.master.TestMasterZKSessionRecovery
    Tests run: 4, Failures: 0, Errors: 0, Skipped: 0, Time elapsed: 108.01 sec
    Running org.apache.hadoop.hbase.master.TestRollingRestart
    Tests run: 1, Failures: 0, Errors: 0, Skipped: 0, Time elapsed: 74.566 sec
    Running org.apache.hadoop.hbase.master.TestMasterFailover
    Tests run: 4, Failures: 0, Errors: 0, Skipped: 0, Time elapsed: 111.315 sec
    Running org.apache.hadoop.hbase.master.TestMaster
    Tests run: 1, Failures: 0, Errors: 0, Skipped: 0, Time elapsed: 24.695 sec
    Running org.apache.hadoop.hbase.master.TestOpenedRegionHandler
    Tests run: 2, Failures: 0, Errors: 0, Skipped: 0, Time elapsed: 28.368 sec
    Running org.apache.hadoop.hbase.master.TestDeadServer
    Tests run: 1, Failures: 0, Errors: 0, Skipped: 0, Time elapsed: 0.181 sec
    Running org.apache.hadoop.hbase.client.TestGet
    Tests run: 2, Failures: 0, Errors: 0, Skipped: 0, Time elapsed: 0.17 sec
    Running org.apache.hadoop.hbase.client.TestScan
    Tests run: 2, Failures: 0, Errors: 0, Skipped: 0, Time elapsed: 0.172 sec
    Running org.apache.hadoop.hbase.client.TestScannerTimeout
    Tests run: 4, Failures: 0, Errors: 0, Skipped: 0, Time elapsed: 58.186 sec
    Running org.apache.hadoop.hbase.client.TestAdmin
    Tests run: 35, Failures: 0, Errors: 1, Skipped: 0, Time elapsed: 400.821 sec <<< FAILURE!
    Running org.apache.hadoop.hbase.client.TestMultiParallel
    Tests run: 10, Failures: 0, Errors: 0, Skipped: 0, Time elapsed: 102.621 sec
    Running org.apache.hadoop.hbase.client.replication.TestReplicationAdmin
    Tests run: 1, Failures: 0, Errors: 0, Skipped: 0, Time elapsed: 3.755 sec
    Running org.apache.hadoop.hbase.client.TestTimestampsFilter
    Tests run: 3, Failures: 0, Errors: 0, Skipped: 0, Time elapsed: 40.931 sec
    Running org.apache.hadoop.hbase.client.TestMetaMigrationRemovingHTD
    Tests run: 3, Failures: 0, Errors: 0, Skipped: 0, Time elapsed: 66.782 sec
    Running org.apache.hadoop.hbase.client.TestPutDotHas
    Tests run: 4, Failures: 0, Errors: 0, Skipped: 0, Time elapsed: 0.622 sec
    Running org.apache.hadoop.hbase.client.TestFromClientSide
    Tests run: 48, Failures: 0, Errors: 0, Skipped: 3, Time elapsed: 263.395 sec
    Running org.apache.hadoop.hbase.client.TestShell
    Tests run: 1, Failures: 0, Errors: 0, Skipped: 0, Time elapsed: 142.562 sec
    Running org.apache.hadoop.hbase.client.TestHTablePool
    Tests run: 18, Failures: 0, Errors: 0, Skipped: 0, Time elapsed: 42.119 sec
    Running org.apache.hadoop.hbase.client.TestHCM
    Tests run: 5, Failures: 0, Errors: 0, Skipped: 0, Time elapsed: 30.027 sec
    Running org.apache.hadoop.hbase.client.TestResult
    Tests run: 3, Failures: 0, Errors: 0, Skipped: 0, Time elapsed: 0.189 sec
    Running org.apache.hadoop.hbase.client.TestMetaScanner
    Tests run: 1, Failures: 0, Errors: 0, Skipped: 0, Time elapsed: 28.892 sec
    Running org.apache.hadoop.hbase.client.TestHTableUtil
    Tests run: 2, Failures: 0, Errors: 0, Skipped: 0, Time elapsed: 30.873 sec
    Running org.apache.hadoop.hbase.client.TestOperation
    Tests run: 1, Failures: 0, Errors: 0, Skipped: 0, Time elapsed: 0.583 sec
    Running org.apache.hadoop.hbase.client.TestMultipleTimestamps
    Tests run: 8, Failures: 0, Errors: 0, Skipped: 0, Time elapsed: 78.029 sec
    Running org.apache.hadoop.hbase.client.TestAttributes
    Tests run: 3, Failures: 0, Errors: 0, Skipped: 0, Time elapsed: 0.239 sec
    Running org.apache.hadoop.hbase.ipc.TestDelayedRpc
    Tests run: 4, Failures: 0, Errors: 0, Skipped: 0, Time elapsed: 2.522 sec
    Running org.apache.hadoop.hbase.TestHBaseTestingUtility
    Tests run: 7, Failures: 0, Errors: 0, Skipped: 0, Time elapsed: 127.134 sec
    Running org.apache.hadoop.hbase.TestZooKeeper
    Tests run: 7, Failures: 0, Errors: 0, Skipped: 0, Time elapsed: 89.412 sec
    Running org.apache.hadoop.hbase.util.TestSortedCopyOnWriteSet
    Tests run: 2, Failures: 0, Errors: 0, Skipped: 0, Time elapsed: 0.084 sec
    Running org.apache.hadoop.hbase.util.TestEnvironmentEdgeManager
    Tests run: 2, Failures: 0, Errors: 0, Skipped: 0, Time elapsed: 0.269 sec
    Running org.apache.hadoop.hbase.util.TestMergeTable
    Tests run: 1, Failures: 0, Errors: 0, Skipped: 0, Time elapsed: 66.191 sec
    Running org.apache.hadoop.hbase.util.TestMergeTool
    Tests run: 1, Failures: 0, Errors: 0, Skipped: 0, Time elapsed: 470.628 sec
    Running org.apache.hadoop.hbase.util.TestHBaseFsckComparator
    Tests run: 6, Failures: 0, Errors: 0, Skipped: 0, Time elapsed: 1.023 sec
    Running org.apache.hadoop.hbase.util.TestBytes
    Tests run: 13, Failures: 0, Errors: 0, Skipped: 0, Time elapsed: 0.147 sec
    Running org.apache.hadoop.hbase.util.TestFSTableDescriptors
    Tests run: 10, Failures: 0, Errors: 0, Skipped: 0, Time elapsed: 1.673 sec
    Running org.apache.hadoop.hbase.util.hbck.TestOfflineMetaRebuildOverlap
    Tests run: 1, Failures: 0, Errors: 0, Skipped: 0, Time elapsed: 44.573 sec
    Running org.apache.hadoop.hbase.util.hbck.TestOfflineMetaRebuildBase
    Tests run: 1, Failures: 0, Errors: 0, Skipped: 0, Time elapsed: 41.827 sec
    Running org.apache.hadoop.hbase.util.hbck.TestOfflineMetaRebuildHole
    Tests run: 1, Failures: 0, Errors: 0, Skipped: 0, Time elapsed: 39.631 sec
    Running org.apache.hadoop.hbase.util.TestLoadTestKVGenerator
    Tests run: 3, Failures: 0, Errors: 0, Skipped: 0, Time elapsed: 0.935 sec
    Running org.apache.hadoop.hbase.util.TestKeying
    Tests run: 1, Failures: 0, Errors: 0, Skipped: 0, Time elapsed: 0.052 sec
    Running org.apache.hadoop.hbase.util.TestRegionSplitCalculator
    Tests run: 15, Failures: 0, Errors: 0, Skipped: 0, Time elapsed: 0.251 sec
    Running org.apache.hadoop.hbase.util.TestMiniClusterLoadSequential
    Tests run: 2, Failures: 0, Errors: 0, Skipped: 0, Time elapsed: 101.678 sec
    Running org.apache.hadoop.hbase.util.TestPoolMap
    Tests run: 9, Failures: 0, Errors: 0, Skipped: 0, Time elapsed: 0.1 sec
    Running org.apache.hadoop.hbase.util.TestBase64
    Tests run: 1, Failures: 0, Errors: 0, Skipped: 0, Time elapsed: 0.264 sec
    Running org.apache.hadoop.hbase.util.TestIdLock
    Tests run: 1, Failures: 0, Errors: 0, Skipped: 0, Time elapsed: 15.507 sec
    Running org.apache.hadoop.hbase.util.TestRootPath
    Tests run: 1, Failures: 0, Errors: 0, Skipped: 0, Time elapsed: 0.502 sec
    Running org.apache.hadoop.hbase.util.TestHBaseFsck
    Tests run: 21, Failures: 0, Errors: 0, Skipped: 0, Time elapsed: 194.37 sec
    Running org.apache.hadoop.hbase.util.TestIncrementingEnvironmentEdge
    Tests run: 1, Failures: 0, Errors: 0, Skipped: 0, Time elapsed: 0.082 sec
    Running org.apache.hadoop.hbase.util.TestMiniClusterLoadParallel
    Tests run: 2, Failures: 0, Errors: 0, Skipped: 0, Time elapsed: 89.398 sec
    Running org.apache.hadoop.hbase.util.TestByteBloomFilter
    Tests run: 5, Failures: 0, Errors: 0, Skipped: 0, Time elapsed: 1.697 sec
    Running org.apache.hadoop.hbase.util.TestFSUtils
    Tests run: 2, Failures: 0, Errors: 0, Skipped: 0, Time elapsed: 49.147 sec
    Running org.apache.hadoop.hbase.util.TestDefaultEnvironmentEdge
    Tests run: 1, Failures: 0, Errors: 0, Skipped: 0, Time elapsed: 0.522 sec
    Running org.apache.hadoop.hbase.util.TestCompressionTest
    Tests run: 1, Failures: 0, Errors: 0, Skipped: 0, Time elapsed: 1.359 sec
    Running org.apache.hadoop.hbase.TestDrainingServer
    Tests run: 2, Failures: 0, Errors: 0, Skipped: 0, Time elapsed: 48.298 sec
    Running org.apache.hadoop.hbase.TestHServerInfo
    Tests run: 6, Failures: 0, Errors: 0, Skipped: 0, Time elapsed: 0.655 sec
    Running org.apache.hadoop.hbase.TestClusterBootOrder
    Tests run: 2, Failures: 0, Errors: 0, Skipped: 0, Time elapsed: 80.665 sec
    Running org.apache.hadoop.hbase.TestSerialization
    Tests run: 18, Failures: 0, Errors: 0, Skipped: 0, Time elapsed: 6.405 sec
    Running org.apache.hadoop.hbase.executor.TestExecutorService
    Tests run: 1, Failures: 0, Errors: 0, Skipped: 0, Time elapsed: 4.58 sec
    Running org.apache.hadoop.hbase.security.TestUser
    Tests run: 3, Failures: 0, Errors: 0, Skipped: 0, Time elapsed: 1.856 sec
    Running org.apache.hadoop.hbase.TestGlobalMemStoreSize
    Tests run: 1, Failures: 0, Errors: 0, Skipped: 0, Time elapsed: 45.721 sec
    Running org.apache.hadoop.hbase.mapred.TestTableMapReduce
    Tests run: 1, Failures: 0, Errors: 1, Skipped: 0, Time elapsed: 49.953 sec <<< FAILURE!
    Running org.apache.hadoop.hbase.mapred.TestTableInputFormat
    Tests run: 10, Failures: 0, Errors: 0, Skipped: 0, Time elapsed: 43.635 sec

    Results :

    Failed tests: testStarted(org.apache.hadoop.hbase.coprocessor.TestMasterObserver): postStartMaster() hook should have been called
    testRPCException(org.apache.hadoop.hbase.master.TestHMasterRPCException): Unexpected throwable: java.net.SocketTimeoutException: Call to hudson_solaris/192.87.106.251:33511 failed on socket timeout exception: java.net.SocketTimeoutException: 100 millis timeout while waiting for channel to be ready for read. ch : java.nio.channels.SocketChannel[connected local=/192.87.106.251:33513 remote=hudson_solaris/192.87.106.251:33511]

    Tests in error:
    testRetrying(org.apache.hadoop.hbase.catalog.TestMetaReaderEditor): test timed out after 180000 milliseconds
    testGetRegionsCatalogTables(org.apache.hadoop.hbase.catalog.TestMetaReaderEditor): Failed after attempts=10, exceptions:
    testTableExists(org.apache.hadoop.hbase.catalog.TestMetaReaderEditor): Connection refused
    testGetRegion(org.apache.hadoop.hbase.catalog.TestMetaReaderEditor): Connection refused
    testScanMetaForTable(org.apache.hadoop.hbase.catalog.TestMetaReaderEditor): Failed after attempts=10, exceptions:
    testClusterRestart(org.apache.hadoop.hbase.master.TestRestartCluster): org.apache.hadoop.hbase.PleaseHoldException: Master is initializing
    testHundredsOfTable(org.apache.hadoop.hbase.client.TestAdmin): Call to hudson_solaris/192.87.106.251:39006 failed on socket timeout exception: java.net.SocketTimeoutException: 1500 millis timeout while waiting for channel to be ready for read. ch : java.nio.channels.SocketChannel[connected local=/192.87.106.251:45022 remote=hudson_solaris/192.87.106.251:39006]
    testMultiRegionTable(org.apache.hadoop.hbase.mapred.TestTableMapReduce): Job failed!

    Tests run: 1144, Failures: 2, Errors: 3, Skipped: 8

    [INFO] ------------------------------------------------------------------------
    [INFO] BUILD FAILURE
    [INFO] ------------------------------------------------------------------------
    [INFO] Total time: 2:44:52.236s
    [INFO] Finished at: Fri Jul 13 07:11:38 GMT+00:00 2012
    [INFO] Final Memory: 57M/1040M
    [INFO] ------------------------------------------------------------------------
    [ERROR] Failed to execute goal org.apache.maven.plugins:maven-surefire-plugin:2.10:test (default-test) on project hbase: Failure or timeout -> [Help 1]
    [ERROR]
    [ERROR] To see the full stack trace of the errors, re-run Maven with the -e switch.
    [ERROR] Re-run Maven using the -X switch to enable full debug logging.
    [ERROR]
    [ERROR] For more information about the errors and possible solutions, please read the following articles:
    [ERROR] [Help 1] http://cwiki.apache.org/confluence/display/MAVEN/MojoExecutionException
    Build step 'Invoke top-level Maven targets' marked build as failure
    Archiving artifacts
    Recording test results
  • Apache Jenkins Server at Jul 14, 2012 at 5:44 am
    See <https://builds.apache.org/job/HBase-0.92/476/changes>

    Changes:

    [jxiang] HBASE-6394 verifyrep MR job map tasks throws NullPointerException

    ------------------------------------------
    [...truncated 1806 lines...]
    Tests run: 13, Failures: 0, Errors: 0, Skipped: 0, Time elapsed: 0.122 sec
    Running org.apache.hadoop.hbase.util.TestCompressionTest
    Tests run: 1, Failures: 0, Errors: 0, Skipped: 0, Time elapsed: 0.398 sec
    Running org.apache.hadoop.hbase.util.TestByteBloomFilter
    Tests run: 5, Failures: 0, Errors: 0, Skipped: 0, Time elapsed: 1.349 sec
    Running org.apache.hadoop.hbase.mapred.TestTableInputFormat
    Tests run: 10, Failures: 0, Errors: 0, Skipped: 0, Time elapsed: 46.389 sec
    Running org.apache.hadoop.hbase.mapred.TestTableMapReduce
    Tests run: 1, Failures: 0, Errors: 0, Skipped: 0, Time elapsed: 87.78 sec
    Running org.apache.hadoop.hbase.TestHServerInfo
    Tests run: 6, Failures: 0, Errors: 0, Skipped: 0, Time elapsed: 0.151 sec
    Running org.apache.hadoop.hbase.regionserver.TestRSStatusServlet
    Tests run: 2, Failures: 0, Errors: 0, Skipped: 0, Time elapsed: 0.766 sec
    Running org.apache.hadoop.hbase.regionserver.TestRegionSplitPolicy
    Tests run: 3, Failures: 0, Errors: 0, Skipped: 0, Time elapsed: 0.708 sec
    Running org.apache.hadoop.hbase.regionserver.TestStoreFileBlockCacheSummary
    Tests run: 1, Failures: 0, Errors: 0, Skipped: 0, Time elapsed: 26.021 sec
    Running org.apache.hadoop.hbase.regionserver.TestScanner
    Tests run: 7, Failures: 0, Errors: 0, Skipped: 0, Time elapsed: 4.799 sec
    Running org.apache.hadoop.hbase.regionserver.TestCompactSelection
    Tests run: 1, Failures: 0, Errors: 0, Skipped: 0, Time elapsed: 0.757 sec
    Running org.apache.hadoop.hbase.regionserver.TestStore
    Tests run: 11, Failures: 0, Errors: 0, Skipped: 0, Time elapsed: 1.871 sec
    Running org.apache.hadoop.hbase.regionserver.TestCompaction
    Tests run: 12, Failures: 0, Errors: 0, Skipped: 0, Time elapsed: 17.636 sec
    Running org.apache.hadoop.hbase.regionserver.TestMemStore
    Tests run: 21, Failures: 0, Errors: 0, Skipped: 0, Time elapsed: 27.543 sec
    Running org.apache.hadoop.hbase.regionserver.TestScanWildcardColumnTracker
    Tests run: 2, Failures: 0, Errors: 0, Skipped: 0, Time elapsed: 0.464 sec
    Running org.apache.hadoop.hbase.regionserver.TestSplitTransactionOnCluster
    Tests run: 7, Failures: 0, Errors: 0, Skipped: 0, Time elapsed: 93.004 sec
    Running org.apache.hadoop.hbase.regionserver.handler.TestOpenRegionHandler
    Tests run: 3, Failures: 0, Errors: 0, Skipped: 0, Time elapsed: 1.334 sec
    Running org.apache.hadoop.hbase.regionserver.handler.TestCloseRegionHandler
    Tests run: 3, Failures: 0, Errors: 0, Skipped: 0, Time elapsed: 1.531 sec
    Running org.apache.hadoop.hbase.regionserver.TestResettingCounters
    Tests run: 1, Failures: 0, Errors: 0, Skipped: 0, Time elapsed: 0.823 sec
    Running org.apache.hadoop.hbase.regionserver.TestServerCustomProtocol
    Tests run: 7, Failures: 0, Errors: 0, Skipped: 0, Time elapsed: 23.614 sec
    Running org.apache.hadoop.hbase.regionserver.TestQueryMatcher
    Tests run: 4, Failures: 0, Errors: 0, Skipped: 0, Time elapsed: 0.544 sec
    Running org.apache.hadoop.hbase.regionserver.TestRSKilledWhenMasterInitializing
    Tests run: 1, Failures: 0, Errors: 0, Skipped: 0, Time elapsed: 80.035 sec
    Running org.apache.hadoop.hbase.regionserver.TestScanDeleteTracker
    Tests run: 6, Failures: 0, Errors: 0, Skipped: 0, Time elapsed: 0.607 sec
    Running org.apache.hadoop.hbase.regionserver.TestBlocksRead
    Tests run: 3, Failures: 0, Errors: 0, Skipped: 0, Time elapsed: 1.211 sec
    Running org.apache.hadoop.hbase.regionserver.TestMasterAddressManager
    Tests run: 1, Failures: 0, Errors: 0, Skipped: 0, Time elapsed: 0.706 sec
    Running org.apache.hadoop.hbase.regionserver.wal.TestHLog
    Tests run: 9, Failures: 0, Errors: 0, Skipped: 0, Time elapsed: 73.558 sec
    Running org.apache.hadoop.hbase.regionserver.wal.TestWALReplay
    Tests run: 5, Failures: 0, Errors: 0, Skipped: 0, Time elapsed: 36.993 sec
    Running org.apache.hadoop.hbase.regionserver.wal.TestHLogMethods
    Tests run: 3, Failures: 0, Errors: 0, Skipped: 0, Time elapsed: 0.897 sec
    Running org.apache.hadoop.hbase.regionserver.wal.TestLogRolling
    Tests run: 3, Failures: 0, Errors: 0, Skipped: 0, Time elapsed: 655.169 sec
    Running org.apache.hadoop.hbase.regionserver.wal.TestWALActionsListener
    Tests run: 1, Failures: 0, Errors: 0, Skipped: 0, Time elapsed: 0.798 sec
    Running org.apache.hadoop.hbase.regionserver.wal.TestLogRollAbort
    Tests run: 1, Failures: 0, Errors: 0, Skipped: 0, Time elapsed: 167.983 sec
    Running org.apache.hadoop.hbase.regionserver.wal.TestHLogSplit
    Tests run: 30, Failures: 0, Errors: 0, Skipped: 1, Time elapsed: 263.776 sec
    Running org.apache.hadoop.hbase.regionserver.TestMXBean
    Tests run: 1, Failures: 0, Errors: 0, Skipped: 0, Time elapsed: 18.631 sec
    Running org.apache.hadoop.hbase.regionserver.TestColumnSeeking
    Tests run: 2, Failures: 0, Errors: 0, Skipped: 0, Time elapsed: 4.56 sec
    Running org.apache.hadoop.hbase.regionserver.TestReadWriteConsistencyControl
    Tests run: 1, Failures: 0, Errors: 0, Skipped: 0, Time elapsed: 10.133 sec
    Running org.apache.hadoop.hbase.regionserver.TestKeyValueHeap
    Tests run: 3, Failures: 0, Errors: 0, Skipped: 0, Time elapsed: 0.539 sec
    Running org.apache.hadoop.hbase.regionserver.TestRpcMetrics
    Tests run: 1, Failures: 0, Errors: 0, Skipped: 0, Time elapsed: 1.939 sec
    Running org.apache.hadoop.hbase.regionserver.TestScanWithBloomError
    Tests run: 3, Failures: 0, Errors: 0, Skipped: 0, Time elapsed: 1.122 sec
    Running org.apache.hadoop.hbase.regionserver.TestGetClosestAtOrBefore
    Tests run: 3, Failures: 0, Errors: 0, Skipped: 0, Time elapsed: 1.248 sec
    Running org.apache.hadoop.hbase.regionserver.TestHRegionInfo
    Tests run: 6, Failures: 0, Errors: 0, Skipped: 0, Time elapsed: 0.633 sec
    Running org.apache.hadoop.hbase.regionserver.TestStoreScanner
    Tests run: 14, Failures: 0, Errors: 0, Skipped: 0, Time elapsed: 0.149 sec
    Running org.apache.hadoop.hbase.regionserver.TestCacheOnWriteInSchema
    Tests run: 3, Failures: 0, Errors: 0, Skipped: 0, Time elapsed: 1.907 sec
    Running org.apache.hadoop.hbase.regionserver.TestFSErrorsExposed
    Tests run: 3, Failures: 0, Errors: 0, Skipped: 0, Time elapsed: 36.317 sec
    Running org.apache.hadoop.hbase.regionserver.TestKeyValueScanFixture
    Tests run: 1, Failures: 0, Errors: 0, Skipped: 0, Time elapsed: 0.118 sec
    Running org.apache.hadoop.hbase.regionserver.TestStoreFile
    Tests run: 8, Failures: 0, Errors: 0, Skipped: 0, Time elapsed: 1.815 sec
    Running org.apache.hadoop.hbase.regionserver.TestKeyValueSkipListSet
    Tests run: 4, Failures: 0, Errors: 0, Skipped: 0, Time elapsed: 0.122 sec
    Running org.apache.hadoop.hbase.regionserver.TestExplicitColumnTracker
    Tests run: 4, Failures: 0, Errors: 0, Skipped: 0, Time elapsed: 0.892 sec
    Running org.apache.hadoop.hbase.regionserver.TestHRegionServerBulkLoad
    Tests run: 1, Failures: 0, Errors: 0, Skipped: 0, Time elapsed: 58.218 sec
    Running org.apache.hadoop.hbase.regionserver.TestMemStoreLAB
    Tests run: 3, Failures: 0, Errors: 0, Skipped: 0, Time elapsed: 1.343 sec
    Running org.apache.hadoop.hbase.regionserver.TestSplitLogWorker
    Tests run: 5, Failures: 0, Errors: 0, Skipped: 0, Time elapsed: 2.682 sec
    Running org.apache.hadoop.hbase.regionserver.TestMultiColumnScanner
    Tests run: 6, Failures: 0, Errors: 0, Skipped: 0, Time elapsed: 18.714 sec
    Running org.apache.hadoop.hbase.regionserver.TestSplitTransaction
    Tests run: 7, Failures: 0, Errors: 0, Skipped: 0, Time elapsed: 4.006 sec
    Running org.apache.hadoop.hbase.regionserver.TestCompoundBloomFilter
    Tests run: 3, Failures: 0, Errors: 0, Skipped: 0, Time elapsed: 21.324 sec
    Running org.apache.hadoop.hbase.regionserver.TestEndToEndSplitTransaction
    Tests run: 2, Failures: 0, Errors: 0, Skipped: 0, Time elapsed: 69.134 sec
    Running org.apache.hadoop.hbase.regionserver.TestWideScanner
    Tests run: 1, Failures: 0, Errors: 0, Skipped: 0, Time elapsed: 1.96 sec
    Running org.apache.hadoop.hbase.regionserver.TestHRegion
    Tests run: 61, Failures: 0, Errors: 0, Skipped: 0, Time elapsed: 39.117 sec
    Running org.apache.hadoop.hbase.regionserver.TestMinVersions
    Tests run: 6, Failures: 0, Errors: 0, Skipped: 0, Time elapsed: 1.265 sec
    Running org.apache.hadoop.hbase.client.TestGet
    Tests run: 2, Failures: 0, Errors: 0, Skipped: 0, Time elapsed: 0.139 sec
    Running org.apache.hadoop.hbase.client.TestPutDotHas
    Tests run: 4, Failures: 0, Errors: 0, Skipped: 0, Time elapsed: 0.15 sec
    Running org.apache.hadoop.hbase.client.TestAttributes
    Tests run: 3, Failures: 0, Errors: 0, Skipped: 0, Time elapsed: 0.141 sec
    Running org.apache.hadoop.hbase.client.TestResult
    Tests run: 3, Failures: 0, Errors: 0, Skipped: 0, Time elapsed: 0.146 sec
    Running org.apache.hadoop.hbase.client.replication.TestReplicationAdmin
    Tests run: 1, Failures: 0, Errors: 0, Skipped: 0, Time elapsed: 1.029 sec
    Running org.apache.hadoop.hbase.client.TestTimestampsFilter
    Tests run: 3, Failures: 0, Errors: 0, Skipped: 0, Time elapsed: 38.269 sec
    Running org.apache.hadoop.hbase.client.TestMultipleTimestamps
    Tests run: 8, Failures: 0, Errors: 0, Skipped: 0, Time elapsed: 97.638 sec
    Running org.apache.hadoop.hbase.client.TestFromClientSide
    Tests run: 48, Failures: 0, Errors: 0, Skipped: 3, Time elapsed: 332.621 sec
    Running org.apache.hadoop.hbase.client.TestHCM
    Tests run: 5, Failures: 0, Errors: 0, Skipped: 0, Time elapsed: 29.837 sec
    Running org.apache.hadoop.hbase.client.TestHTablePool
    Tests run: 18, Failures: 0, Errors: 0, Skipped: 0, Time elapsed: 37.169 sec
    Running org.apache.hadoop.hbase.client.TestHTableUtil
    Tests run: 2, Failures: 0, Errors: 0, Skipped: 0, Time elapsed: 29.093 sec
    Running org.apache.hadoop.hbase.client.TestScan
    Tests run: 2, Failures: 0, Errors: 0, Skipped: 0, Time elapsed: 0.142 sec
    Running org.apache.hadoop.hbase.client.TestAdmin
    Tests run: 35, Failures: 0, Errors: 0, Skipped: 0, Time elapsed: 568.634 sec
    Running org.apache.hadoop.hbase.client.TestMetaScanner
    Tests run: 1, Failures: 0, Errors: 0, Skipped: 0, Time elapsed: 23.957 sec
    Running org.apache.hadoop.hbase.client.TestShell
    Tests run: 1, Failures: 0, Errors: 0, Skipped: 0, Time elapsed: 104.171 sec
    Running org.apache.hadoop.hbase.client.TestScannerTimeout
    Tests run: 4, Failures: 0, Errors: 0, Skipped: 0, Time elapsed: 54.953 sec
    Running org.apache.hadoop.hbase.client.TestMetaMigrationRemovingHTD
    Tests run: 3, Failures: 0, Errors: 0, Skipped: 0, Time elapsed: 33.228 sec
    Running org.apache.hadoop.hbase.client.TestOperation
    Tests run: 1, Failures: 0, Errors: 0, Skipped: 0, Time elapsed: 0.531 sec
    Running org.apache.hadoop.hbase.client.TestMultiParallel
    Tests run: 10, Failures: 0, Errors: 0, Skipped: 0, Time elapsed: 54.934 sec
    Running org.apache.hadoop.hbase.TestMultiVersions
    Tests run: 3, Failures: 0, Errors: 0, Skipped: 0, Time elapsed: 39.513 sec
    Running org.apache.hadoop.hbase.thrift.TestThriftServer
    Tests run: 1, Failures: 0, Errors: 0, Skipped: 0, Time elapsed: 26.362 sec
    Running org.apache.hadoop.hbase.master.TestRollingRestart
    Tests run: 1, Failures: 0, Errors: 0, Skipped: 0, Time elapsed: 91.053 sec
    Running org.apache.hadoop.hbase.master.TestActiveMasterManager
    Tests run: 2, Failures: 0, Errors: 0, Skipped: 0, Time elapsed: 1.194 sec
    Running org.apache.hadoop.hbase.master.TestDeadServer
    Tests run: 1, Failures: 0, Errors: 0, Skipped: 0, Time elapsed: 0.137 sec
    Running org.apache.hadoop.hbase.master.TestLogsCleaner
    Tests run: 1, Failures: 0, Errors: 0, Skipped: 0, Time elapsed: 3.318 sec
    Running org.apache.hadoop.hbase.master.TestZKBasedOpenCloseRegion
    Tests run: 4, Failures: 0, Errors: 0, Skipped: 0, Time elapsed: 34.3 sec
    Running org.apache.hadoop.hbase.master.TestMaster
    Tests run: 1, Failures: 0, Errors: 0, Skipped: 0, Time elapsed: 25.968 sec
    Running org.apache.hadoop.hbase.master.TestMasterTransitions
    Tests run: 3, Failures: 0, Errors: 0, Skipped: 3, Time elapsed: 31.939 sec
    Running org.apache.hadoop.hbase.master.TestOpenedRegionHandler
    Tests run: 2, Failures: 0, Errors: 0, Skipped: 0, Time elapsed: 27.15 sec
    Running org.apache.hadoop.hbase.master.TestClockSkewDetection
    Tests run: 1, Failures: 0, Errors: 0, Skipped: 0, Time elapsed: 0.262 sec
    Running org.apache.hadoop.hbase.master.TestCatalogJanitor
    Tests run: 5, Failures: 0, Errors: 0, Skipped: 0, Time elapsed: 10.429 sec
    Running org.apache.hadoop.hbase.master.TestMXBean
    Tests run: 1, Failures: 0, Errors: 0, Skipped: 0, Time elapsed: 27.442 sec
    Running org.apache.hadoop.hbase.master.TestSplitLogManager
    Tests run: 12, Failures: 0, Errors: 0, Skipped: 0, Time elapsed: 15.884 sec
    Running org.apache.hadoop.hbase.master.TestMasterRestartAfterDisablingTable
    Tests run: 1, Failures: 0, Errors: 0, Skipped: 0, Time elapsed: 29.695 sec
    Running org.apache.hadoop.hbase.master.TestAssignmentManager
    Tests run: 1, Failures: 0, Errors: 0, Skipped: 0, Time elapsed: 1.392 sec
    Running org.apache.hadoop.hbase.master.TestDistributedLogSplitting
    Tests run: 4, Failures: 0, Errors: 0, Skipped: 0, Time elapsed: 155.612 sec
    Running org.apache.hadoop.hbase.master.TestDefaultLoadBalancer
    Tests run: 4, Failures: 0, Errors: 0, Skipped: 0, Time elapsed: 1.461 sec
    Running org.apache.hadoop.hbase.master.TestMasterStatusServlet
    Tests run: 5, Failures: 0, Errors: 0, Skipped: 0, Time elapsed: 1.283 sec
    Running org.apache.hadoop.hbase.master.TestHMasterRPCException
    Tests run: 1, Failures: 0, Errors: 0, Skipped: 0, Time elapsed: 1.416 sec
    Running org.apache.hadoop.hbase.master.TestMasterFailover
    Tests run: 4, Failures: 0, Errors: 0, Skipped: 0, Time elapsed: 109.958 sec
    Running org.apache.hadoop.hbase.master.TestMasterZKSessionRecovery
    Tests run: 4, Failures: 0, Errors: 0, Skipped: 0, Time elapsed: 113.01 sec
    Running org.apache.hadoop.hbase.master.TestMasterShutdown
    Tests run: 1, Failures: 0, Errors: 0, Skipped: 0, Time elapsed: 20.599 sec
    Running org.apache.hadoop.hbase.master.TestRestartCluster
    Tests run: 2, Failures: 0, Errors: 0, Skipped: 0, Time elapsed: 60.099 sec
    Running org.apache.hadoop.hbase.migration.TestMigrationFrom090To092
    Tests run: 1, Failures: 0, Errors: 0, Skipped: 0, Time elapsed: 0.29 sec
    Running org.apache.hadoop.hbase.TestRegionRebalancing
    Tests run: 1, Failures: 0, Errors: 0, Skipped: 0, Time elapsed: 54.212 sec
    Running org.apache.hadoop.hbase.avro.TestAvroUtil
    Tests run: 1, Failures: 0, Errors: 0, Skipped: 0, Time elapsed: 0.561 sec
    Running org.apache.hadoop.hbase.avro.TestAvroServer
    Tests run: 3, Failures: 0, Errors: 0, Skipped: 0, Time elapsed: 38.497 sec
    Running org.apache.hadoop.hbase.TestAcidGuarantees
    Tests run: 3, Failures: 0, Errors: 0, Skipped: 0, Time elapsed: 122.443 sec
    Running org.apache.hadoop.hbase.TestHRegionLocation
    Tests run: 3, Failures: 0, Errors: 0, Skipped: 0, Time elapsed: 0.143 sec
    Running org.apache.hadoop.hbase.TestZooKeeper
    Tests run: 7, Failures: 0, Errors: 0, Skipped: 0, Time elapsed: 88.667 sec
    Running org.apache.hadoop.hbase.TestCompare
    Tests run: 1, Failures: 0, Errors: 0, Skipped: 0, Time elapsed: 0.241 sec
    Running org.apache.hadoop.hbase.ipc.TestDelayedRpc
    Tests run: 4, Failures: 0, Errors: 0, Skipped: 0, Time elapsed: 2.421 sec
    Running org.apache.hadoop.hbase.TestFSTableDescriptorForceCreation
    Tests run: 3, Failures: 0, Errors: 0, Skipped: 0, Time elapsed: 0.647 sec
    Running org.apache.hadoop.hbase.TestInfoServers
    Tests run: 2, Failures: 0, Errors: 0, Skipped: 0, Time elapsed: 19.615 sec

    Results :

    Failed tests: queueFailover(org.apache.hadoop.hbase.replication.TestReplication): Waited too much time for queueFailover replication

    Tests run: 1149, Failures: 1, Errors: 0, Skipped: 8

    [INFO] ------------------------------------------------------------------------
    [INFO] BUILD FAILURE
    [INFO] ------------------------------------------------------------------------
    [INFO] Total time: 2:27:08.853s
    [INFO] Finished at: Sat Jul 14 05:43:38 UTC 2012
    [INFO] Final Memory: 38M/443M
    [INFO] ------------------------------------------------------------------------
    [ERROR] Failed to execute goal org.apache.maven.plugins:maven-surefire-plugin:2.10:test (default-test) on project hbase: There are test failures.
    [ERROR]
    [ERROR] Please refer to <https://builds.apache.org/job/HBase-0.92/ws/trunk/target/surefire-reports> for the individual test results.
    [ERROR] -> [Help 1]
    [ERROR]
    [ERROR] To see the full stack trace of the errors, re-run Maven with the -e switch.
    [ERROR] Re-run Maven using the -X switch to enable full debug logging.
    [ERROR]
    [ERROR] For more information about the errors and possible solutions, please read the following articles:
    [ERROR] [Help 1] http://cwiki.apache.org/confluence/display/MAVEN/MojoFailureException
    Build step 'Invoke top-level Maven targets' marked build as failure
    Archiving artifacts
    Recording test results
    Updating HBASE-6394
  • Apache Jenkins Server at Jul 16, 2012 at 11:56 pm
    See <https://builds.apache.org/job/HBase-0.92/477/changes>

    Changes:

    [jxiang] HBASE-6397 [hbck] print out bulk load commands for sidelined regions if necessary

    ------------------------------------------
    [...truncated 2239 lines...]
    Tests run: 1, Failures: 0, Errors: 0, Skipped: 0, Time elapsed: 6.619 sec
    Running org.apache.hadoop.hbase.coprocessor.TestMasterCoprocessorExceptionWithAbort
    Tests run: 1, Failures: 0, Errors: 0, Skipped: 0, Time elapsed: 21.274 sec
    Running org.apache.hadoop.hbase.coprocessor.TestRegionObserverInterface
    Tests run: 5, Failures: 0, Errors: 0, Skipped: 0, Time elapsed: 40.192 sec
    Running org.apache.hadoop.hbase.coprocessor.TestMasterCoprocessorExceptionWithRemove
    Tests run: 1, Failures: 0, Errors: 0, Skipped: 0, Time elapsed: 26.128 sec
    Running org.apache.hadoop.hbase.coprocessor.TestRegionObserverBypass
    Tests run: 2, Failures: 0, Errors: 0, Skipped: 0, Time elapsed: 24.144 sec
    Running org.apache.hadoop.hbase.mapred.TestTableMapReduce
    Tests run: 1, Failures: 0, Errors: 1, Skipped: 0, Time elapsed: 142.096 sec <<< FAILURE!
    Running org.apache.hadoop.hbase.mapred.TestTableInputFormat
    Tests run: 10, Failures: 0, Errors: 0, Skipped: 0, Time elapsed: 43.013 sec
    Running org.apache.hadoop.hbase.TestGlobalMemStoreSize
    Tests run: 1, Failures: 0, Errors: 0, Skipped: 0, Time elapsed: 28.517 sec
    Running org.apache.hadoop.hbase.mapreduce.TestTableSplit
    Tests run: 1, Failures: 0, Errors: 0, Skipped: 0, Time elapsed: 0.182 sec
    Running org.apache.hadoop.hbase.mapreduce.TestTableMapReduce
    Tests run: 1, Failures: 0, Errors: 0, Skipped: 0, Time elapsed: 162.416 sec
    Running org.apache.hadoop.hbase.mapreduce.TestLoadIncrementalHFilesSplitRecovery
    Tests run: 4, Failures: 0, Errors: 0, Skipped: 0, Time elapsed: 66.849 sec
    Running org.apache.hadoop.hbase.mapreduce.TestSimpleTotalOrderPartitioner
    Tests run: 1, Failures: 0, Errors: 0, Skipped: 0, Time elapsed: 0.791 sec
    Running org.apache.hadoop.hbase.mapreduce.TestHFileOutputFormat
    Tests run: 8, Failures: 1, Errors: 0, Skipped: 0, Time elapsed: 267.463 sec <<< FAILURE!
    Running org.apache.hadoop.hbase.mapreduce.TestImportTsv
    Tests run: 8, Failures: 0, Errors: 0, Skipped: 0, Time elapsed: 110.053 sec
    Running org.apache.hadoop.hbase.mapreduce.TestTableInputFormatScan
    Tests run: 11, Failures: 0, Errors: 0, Skipped: 0, Time elapsed: 602.916 sec
    Running org.apache.hadoop.hbase.mapreduce.TestTimeRangeMapRed
    Tests run: 1, Failures: 0, Errors: 0, Skipped: 0, Time elapsed: 53.45 sec
    Running org.apache.hadoop.hbase.mapreduce.TestLoadIncrementalHFiles
    Tests run: 6, Failures: 0, Errors: 0, Skipped: 0, Time elapsed: 42.162 sec
    Running org.apache.hadoop.hbase.TestAcidGuarantees
    Tests run: 3, Failures: 0, Errors: 0, Skipped: 0, Time elapsed: 125.489 sec
    Running org.apache.hadoop.hbase.TestSerialization
    Tests run: 18, Failures: 0, Errors: 0, Skipped: 0, Time elapsed: 0.474 sec
    Running org.apache.hadoop.hbase.catalog.TestMetaReaderEditorNoCluster
    Tests run: 1, Failures: 0, Errors: 0, Skipped: 0, Time elapsed: 4.994 sec
    Running org.apache.hadoop.hbase.catalog.TestMetaReaderEditor
    Tests run: 5, Failures: 0, Errors: 0, Skipped: 0, Time elapsed: 42.662 sec
    Running org.apache.hadoop.hbase.catalog.TestCatalogTrackerOnCluster
    Tests run: 1, Failures: 0, Errors: 0, Skipped: 0, Time elapsed: 150.274 sec
    Running org.apache.hadoop.hbase.catalog.TestCatalogTracker
    Tests run: 9, Failures: 0, Errors: 0, Skipped: 1, Time elapsed: 4.527 sec
    Running org.apache.hadoop.hbase.client.TestResult
    Tests run: 3, Failures: 0, Errors: 0, Skipped: 0, Time elapsed: 0.156 sec
    Running org.apache.hadoop.hbase.client.TestTimestampsFilter
    Tests run: 3, Failures: 0, Errors: 0, Skipped: 0, Time elapsed: 37.09 sec
    Running org.apache.hadoop.hbase.client.TestShell
    Running org.apache.hadoop.hbase.client.TestFromClientSide
    Tests run: 48, Failures: 0, Errors: 0, Skipped: 3, Time elapsed: 196.257 sec
    Running org.apache.hadoop.hbase.client.TestHCM
    Tests run: 5, Failures: 0, Errors: 0, Skipped: 0, Time elapsed: 24.692 sec
    Running org.apache.hadoop.hbase.client.TestAttributes
    Tests run: 3, Failures: 0, Errors: 0, Skipped: 0, Time elapsed: 0.313 sec
    Running org.apache.hadoop.hbase.client.TestScannerTimeout
    Tests run: 4, Failures: 0, Errors: 0, Skipped: 0, Time elapsed: 58.529 sec
    Running org.apache.hadoop.hbase.client.TestMetaScanner
    Tests run: 1, Failures: 0, Errors: 0, Skipped: 0, Time elapsed: 22.518 sec
    Running org.apache.hadoop.hbase.client.TestHTableUtil
    Tests run: 2, Failures: 0, Errors: 0, Skipped: 0, Time elapsed: 24.274 sec
    Running org.apache.hadoop.hbase.client.TestMetaMigrationRemovingHTD
    Tests run: 3, Failures: 0, Errors: 0, Skipped: 0, Time elapsed: 34.536 sec
    Running org.apache.hadoop.hbase.client.TestOperation
    Tests run: 1, Failures: 0, Errors: 0, Skipped: 0, Time elapsed: 0.817 sec
    Running org.apache.hadoop.hbase.client.TestHTablePool
    Tests run: 18, Failures: 0, Errors: 0, Skipped: 0, Time elapsed: 31.503 sec
    Running org.apache.hadoop.hbase.client.TestPutDotHas
    Tests run: 4, Failures: 0, Errors: 0, Skipped: 0, Time elapsed: 0.29 sec
    Running org.apache.hadoop.hbase.client.TestGet
    Tests run: 2, Failures: 0, Errors: 0, Skipped: 0, Time elapsed: 0.28 sec
    Running org.apache.hadoop.hbase.client.TestMultipleTimestamps
    Tests run: 8, Failures: 0, Errors: 0, Skipped: 0, Time elapsed: 71.169 sec
    Running org.apache.hadoop.hbase.client.replication.TestReplicationAdmin
    Tests run: 1, Failures: 0, Errors: 0, Skipped: 0, Time elapsed: 1.736 sec
    Running org.apache.hadoop.hbase.client.TestMultiParallel
    Tests run: 10, Failures: 0, Errors: 0, Skipped: 0, Time elapsed: 50.037 sec
    Running org.apache.hadoop.hbase.client.TestAdmin
    Tests run: 35, Failures: 0, Errors: 0, Skipped: 0, Time elapsed: 500.447 sec
    Running org.apache.hadoop.hbase.client.TestScan
    Tests run: 2, Failures: 0, Errors: 0, Skipped: 0, Time elapsed: 0.268 sec
    Running org.apache.hadoop.hbase.TestHServerInfo
    Tests run: 6, Failures: 0, Errors: 0, Skipped: 0, Time elapsed: 0.229 sec
    Running org.apache.hadoop.hbase.metrics.TestExponentiallyDecayingSample
    Tests run: 2, Failures: 0, Errors: 0, Skipped: 0, Time elapsed: 0.136 sec
    Running org.apache.hadoop.hbase.metrics.TestMetricsMBeanBase
    Tests run: 2, Failures: 0, Errors: 0, Skipped: 0, Time elapsed: 1.253 sec
    Running org.apache.hadoop.hbase.metrics.TestExactCounterMetric
    Tests run: 1, Failures: 0, Errors: 0, Skipped: 0, Time elapsed: 0.218 sec
    Running org.apache.hadoop.hbase.metrics.TestMetricsHistogram
    Tests run: 2, Failures: 0, Errors: 0, Skipped: 0, Time elapsed: 0.123 sec
    Running org.apache.hadoop.hbase.executor.TestExecutorService
    Tests run: 1, Failures: 0, Errors: 0, Skipped: 0, Time elapsed: 2.702 sec
    Running org.apache.hadoop.hbase.rest.TestGzipFilter
    Tests run: 3, Failures: 0, Errors: 0, Skipped: 0, Time elapsed: 26.92 sec
    Running org.apache.hadoop.hbase.rest.TestMultiRowResource
    Tests run: 3, Failures: 0, Errors: 0, Skipped: 0, Time elapsed: 25.924 sec
    Running org.apache.hadoop.hbase.rest.TestScannersWithFilters
    Tests run: 10, Failures: 0, Errors: 0, Skipped: 0, Time elapsed: 29.894 sec
    Running org.apache.hadoop.hbase.rest.TestRowResource
    Tests run: 11, Failures: 0, Errors: 0, Skipped: 0, Time elapsed: 27.995 sec
    Running org.apache.hadoop.hbase.rest.model.TestCellModel
    Tests run: 3, Failures: 0, Errors: 0, Skipped: 0, Time elapsed: 0.526 sec
    Running org.apache.hadoop.hbase.rest.model.TestCellSetModel
    Tests run: 3, Failures: 0, Errors: 0, Skipped: 0, Time elapsed: 0.829 sec
    Running org.apache.hadoop.hbase.rest.model.TestTableListModel
    Tests run: 3, Failures: 0, Errors: 0, Skipped: 0, Time elapsed: 0.659 sec
    Running org.apache.hadoop.hbase.rest.model.TestVersionModel
    Tests run: 3, Failures: 0, Errors: 0, Skipped: 0, Time elapsed: 1.093 sec
    Running org.apache.hadoop.hbase.rest.model.TestColumnSchemaModel
    Tests run: 2, Failures: 0, Errors: 0, Skipped: 0, Time elapsed: 0.527 sec
    Running org.apache.hadoop.hbase.rest.model.TestTableInfoModel
    Tests run: 3, Failures: 0, Errors: 0, Skipped: 0, Time elapsed: 0.616 sec
    Running org.apache.hadoop.hbase.rest.model.TestRowModel
    Tests run: 2, Failures: 0, Errors: 0, Skipped: 0, Time elapsed: 0.708 sec
    Running org.apache.hadoop.hbase.rest.model.TestTableSchemaModel
    Tests run: 3, Failures: 0, Errors: 0, Skipped: 0, Time elapsed: 0.995 sec
    Running org.apache.hadoop.hbase.rest.model.TestStorageClusterVersionModel
    Tests run: 2, Failures: 0, Errors: 0, Skipped: 0, Time elapsed: 0.525 sec
    Running org.apache.hadoop.hbase.rest.model.TestTableRegionModel
    Tests run: 4, Failures: 0, Errors: 0, Skipped: 0, Time elapsed: 0.787 sec
    Running org.apache.hadoop.hbase.rest.model.TestStorageClusterStatusModel
    Tests run: 3, Failures: 0, Errors: 0, Skipped: 0, Time elapsed: 0.734 sec
    Running org.apache.hadoop.hbase.rest.model.TestScannerModel
    Tests run: 3, Failures: 0, Errors: 0, Skipped: 0, Time elapsed: 0.728 sec
    Running org.apache.hadoop.hbase.rest.client.TestRemoteAdmin
    Tests run: 1, Failures: 0, Errors: 0, Skipped: 0, Time elapsed: 25.746 sec
    Running org.apache.hadoop.hbase.rest.client.TestRemoteTable
    Tests run: 3, Failures: 0, Errors: 0, Skipped: 0, Time elapsed: 26.813 sec
    Running org.apache.hadoop.hbase.rest.TestVersionResource
    Tests run: 7, Failures: 0, Errors: 0, Skipped: 0, Time elapsed: 22.81 sec
    Running org.apache.hadoop.hbase.rest.TestScannerResource
    Tests run: 5, Failures: 0, Errors: 0, Skipped: 0, Time elapsed: 39.996 sec
    Running org.apache.hadoop.hbase.rest.TestTableResource
    Tests run: 8, Failures: 0, Errors: 0, Skipped: 0, Time elapsed: 32.122 sec
    Running org.apache.hadoop.hbase.rest.TestStatusResource
    Tests run: 2, Failures: 0, Errors: 0, Skipped: 0, Time elapsed: 20.706 sec
    Running org.apache.hadoop.hbase.rest.TestSchemaResource
    Tests run: 2, Failures: 0, Errors: 0, Skipped: 0, Time elapsed: 30.469 sec
    Running org.apache.hadoop.hbase.thrift.TestThriftServer
    Tests run: 1, Failures: 0, Errors: 0, Skipped: 0, Time elapsed: 27.83 sec
    Running org.apache.hadoop.hbase.io.TestHeapSize
    Tests run: 2, Failures: 0, Errors: 0, Skipped: 0, Time elapsed: 0.204 sec
    Running org.apache.hadoop.hbase.io.hfile.TestHFileSeek
    Tests run: 1, Failures: 0, Errors: 0, Skipped: 0, Time elapsed: 7.922 sec
    Running org.apache.hadoop.hbase.io.hfile.slab.TestSlab
    Tests run: 1, Failures: 0, Errors: 0, Skipped: 0, Time elapsed: 0.348 sec
    Running org.apache.hadoop.hbase.io.hfile.slab.TestSlabCache
    Tests run: 7, Failures: 0, Errors: 0, Skipped: 0, Time elapsed: 23.39 sec
    Running org.apache.hadoop.hbase.io.hfile.slab.TestSingleSizeCache
    Tests run: 5, Failures: 0, Errors: 0, Skipped: 0, Time elapsed: 43.24 sec
    Running org.apache.hadoop.hbase.io.hfile.TestCachedBlockQueue
    Tests run: 2, Failures: 0, Errors: 0, Skipped: 0, Time elapsed: 0.237 sec
    Running org.apache.hadoop.hbase.io.hfile.TestHFileBlockIndex
    Tests run: 10, Failures: 0, Errors: 0, Skipped: 0, Time elapsed: 14.487 sec
    Running org.apache.hadoop.hbase.io.hfile.TestLruBlockCache
    Tests run: 7, Failures: 0, Errors: 0, Skipped: 0, Time elapsed: 0.453 sec
    Running org.apache.hadoop.hbase.io.hfile.TestHFilePerformance
    Tests run: 1, Failures: 0, Errors: 0, Skipped: 0, Time elapsed: 8.383 sec
    Running org.apache.hadoop.hbase.io.hfile.TestFixedFileTrailer
    Tests run: 2, Failures: 0, Errors: 0, Skipped: 0, Time elapsed: 1.162 sec
    Running org.apache.hadoop.hbase.io.hfile.TestHFileWriterV2
    Tests run: 1, Failures: 0, Errors: 0, Skipped: 0, Time elapsed: 1.749 sec
    Running org.apache.hadoop.hbase.io.hfile.TestBlockCacheColumnFamilySummary
    Tests run: 4, Failures: 0, Errors: 0, Skipped: 0, Time elapsed: 0.077 sec
    Running org.apache.hadoop.hbase.io.hfile.TestHFileReaderV1
    Tests run: 1, Failures: 0, Errors: 0, Skipped: 0, Time elapsed: 0.917 sec
    Running org.apache.hadoop.hbase.io.hfile.TestHFile
    Tests run: 6, Failures: 0, Errors: 0, Skipped: 0, Time elapsed: 1.345 sec
    Running org.apache.hadoop.hbase.io.hfile.TestReseekTo
    Tests run: 1, Failures: 0, Errors: 0, Skipped: 0, Time elapsed: 1.248 sec
    Running org.apache.hadoop.hbase.io.hfile.TestHFileBlock
    Tests run: 7, Failures: 0, Errors: 0, Skipped: 0, Time elapsed: 28.746 sec
    Running org.apache.hadoop.hbase.io.hfile.TestSeekTo
    Tests run: 3, Failures: 0, Errors: 0, Skipped: 0, Time elapsed: 1.245 sec
    Running org.apache.hadoop.hbase.io.hfile.TestCacheOnWrite
    Tests run: 6, Failures: 0, Errors: 0, Skipped: 0, Time elapsed: 10.945 sec
    Running org.apache.hadoop.hbase.io.TestHbaseObjectWritable
    Tests run: 5, Failures: 0, Errors: 0, Skipped: 0, Time elapsed: 0.987 sec
    Running org.apache.hadoop.hbase.io.TestImmutableBytesWritable
    Tests run: 3, Failures: 0, Errors: 0, Skipped: 0, Time elapsed: 0.135 sec
    Running org.apache.hadoop.hbase.io.TestHalfStoreFileReader
    Tests run: 1, Failures: 0, Errors: 0, Skipped: 0, Time elapsed: 1.289 sec
    Running org.apache.hadoop.hbase.TestClusterBootOrder
    Tests run: 2, Failures: 0, Errors: 0, Skipped: 0, Time elapsed: 37.933 sec
    Running org.apache.hadoop.hbase.migration.TestMigrationFrom090To092
    Tests run: 1, Failures: 0, Errors: 0, Skipped: 0, Time elapsed: 0.51 sec
    Running org.apache.hadoop.hbase.TestFSTableDescriptorForceCreation
    Tests run: 3, Failures: 0, Errors: 0, Skipped: 0, Time elapsed: 1.021 sec
    Running org.apache.hadoop.hbase.avro.TestAvroUtil
    Tests run: 1, Failures: 0, Errors: 0, Skipped: 0, Time elapsed: 0.764 sec
    Running org.apache.hadoop.hbase.avro.TestAvroServer
    Tests run: 3, Failures: 0, Errors: 0, Skipped: 0, Time elapsed: 37.004 sec
    Running org.apache.hadoop.hbase.TestKeyValue
    Tests run: 15, Failures: 0, Errors: 0, Skipped: 0, Time elapsed: 0.203 sec
    Running org.apache.hadoop.hbase.replication.TestMultiSlaveReplication
    Tests run: 1, Failures: 0, Errors: 0, Skipped: 0, Time elapsed: 65.307 sec
    Running org.apache.hadoop.hbase.replication.regionserver.TestReplicationSourceManager
    Tests run: 1, Failures: 0, Errors: 0, Skipped: 0, Time elapsed: 1.735 sec
    Running org.apache.hadoop.hbase.replication.regionserver.TestReplicationSink
    Tests run: 5, Failures: 0, Errors: 0, Skipped: 0, Time elapsed: 27.012 sec
    Running org.apache.hadoop.hbase.replication.TestMasterReplication
    Tests run: 2, Failures: 0, Errors: 0, Skipped: 0, Time elapsed: 114.523 sec
    Running org.apache.hadoop.hbase.replication.TestReplicationSource
    Tests run: 1, Failures: 0, Errors: 0, Skipped: 0, Time elapsed: 5.014 sec
    Running org.apache.hadoop.hbase.replication.TestReplicationPeer
    Tests run: 1, Failures: 0, Errors: 0, Skipped: 0, Time elapsed: 26.138 sec
    Running org.apache.hadoop.hbase.replication.TestReplicationZookeeper
    Tests run: 1, Failures: 0, Errors: 0, Skipped: 0, Time elapsed: 1.115 sec
    Running org.apache.hadoop.hbase.replication.TestReplication
    Tests run: 8, Failures: 1, Errors: 0, Skipped: 0, Time elapsed: 190.142 sec <<< FAILURE!
    Running org.apache.hadoop.hbase.ipc.TestDelayedRpc
    Tests run: 4, Failures: 0, Errors: 0, Skipped: 0, Time elapsed: 8.721 sec
    Running org.apache.hadoop.hbase.TestCompare
    Tests run: 1, Failures: 0, Errors: 0, Skipped: 0, Time elapsed: 0.46 sec
    Running org.apache.hadoop.hbase.TestZooKeeper
    Tests run: 7, Failures: 0, Errors: 0, Skipped: 0, Time elapsed: 92.489 sec
    Running org.apache.hadoop.hbase.TestHBaseTestingUtility
    Tests run: 7, Failures: 0, Errors: 0, Skipped: 0, Time elapsed: 130.41 sec

    Results :

    Failed tests: testMRIncrementalLoadWithSplit(org.apache.hadoop.hbase.mapreduce.TestHFileOutputFormat)
    queueFailover(org.apache.hadoop.hbase.replication.TestReplication): Waited too much time for queueFailover replication

    Tests in error:
    testMultiRegionTable(org.apache.hadoop.hbase.mapred.TestTableMapReduce): Job failed!

    Tests run: 1148, Failures: 2, Errors: 1, Skipped: 8

    [INFO] ------------------------------------------------------------------------
    [INFO] BUILD FAILURE
    [INFO] ------------------------------------------------------------------------
    [INFO] Total time: 2:39:33.885s
    [INFO] Finished at: Mon Jul 16 23:56:14 UTC 2012
    [INFO] Final Memory: 50M/868M
    [INFO] ------------------------------------------------------------------------
    [ERROR] Failed to execute goal org.apache.maven.plugins:maven-surefire-plugin:2.10:test (default-test) on project hbase: Failure or timeout -> [Help 1]
    [ERROR]
    [ERROR] To see the full stack trace of the errors, re-run Maven with the -e switch.
    [ERROR] Re-run Maven using the -X switch to enable full debug logging.
    [ERROR]
    [ERROR] For more information about the errors and possible solutions, please read the following articles:
    [ERROR] [Help 1] http://cwiki.apache.org/confluence/display/MAVEN/MojoExecutionException
    Build step 'Invoke top-level Maven targets' marked build as failure
    Archiving artifacts
    Recording test results
    Updating HBASE-6397
  • Apache Jenkins Server at Jul 17, 2012 at 2:47 am
    See <https://builds.apache.org/job/HBase-0.92/478/changes>

    Changes:

    [stack] HBASE-6382 Upgrade Jersey to 1.8 to match Hadoop 1 and 2

    ------------------------------------------
    [...truncated 2501 lines...]
    Tests run: 3, Failures: 0, Errors: 0, Skipped: 0, Time elapsed: 0.515 sec
    Running org.apache.hadoop.hbase.rest.model.TestVersionModel
    Tests run: 3, Failures: 0, Errors: 0, Skipped: 0, Time elapsed: 0.47 sec
    Running org.apache.hadoop.hbase.rest.model.TestColumnSchemaModel
    Tests run: 2, Failures: 0, Errors: 0, Skipped: 0, Time elapsed: 0.347 sec
    Running org.apache.hadoop.hbase.rest.model.TestCellModel
    Tests run: 3, Failures: 0, Errors: 0, Skipped: 0, Time elapsed: 0.46 sec
    Running org.apache.hadoop.hbase.rest.model.TestRowModel
    Tests run: 2, Failures: 0, Errors: 0, Skipped: 0, Time elapsed: 0.454 sec
    Running org.apache.hadoop.hbase.rest.model.TestTableListModel
    Tests run: 3, Failures: 0, Errors: 0, Skipped: 0, Time elapsed: 0.477 sec
    Running org.apache.hadoop.hbase.rest.TestVersionResource
    Tests run: 7, Failures: 0, Errors: 0, Skipped: 0, Time elapsed: 19.943 sec
    Running org.apache.hadoop.hbase.rest.TestGzipFilter
    Tests run: 3, Failures: 0, Errors: 0, Skipped: 0, Time elapsed: 23.338 sec
    Running org.apache.hadoop.hbase.rest.client.TestRemoteTable
    Tests run: 3, Failures: 0, Errors: 0, Skipped: 0, Time elapsed: 23.076 sec
    Running org.apache.hadoop.hbase.rest.client.TestRemoteAdmin
    Tests run: 1, Failures: 0, Errors: 0, Skipped: 0, Time elapsed: 23.341 sec
    Running org.apache.hadoop.hbase.rest.TestStatusResource
    Tests run: 2, Failures: 0, Errors: 0, Skipped: 0, Time elapsed: 22.765 sec
    Running org.apache.hadoop.hbase.rest.TestTableResource
    Tests run: 8, Failures: 0, Errors: 0, Skipped: 0, Time elapsed: 50.598 sec
    Running org.apache.hadoop.hbase.rest.TestRowResource
    Tests run: 11, Failures: 0, Errors: 0, Skipped: 0, Time elapsed: 66.566 sec
    Running org.apache.hadoop.hbase.rest.TestScannersWithFilters
    Tests run: 10, Failures: 0, Errors: 0, Skipped: 0, Time elapsed: 53.663 sec
    Running org.apache.hadoop.hbase.rest.TestMultiRowResource
    Tests run: 3, Failures: 0, Errors: 0, Skipped: 0, Time elapsed: 50.764 sec
    Running org.apache.hadoop.hbase.rest.TestScannerResource
    Tests run: 5, Failures: 0, Errors: 0, Skipped: 0, Time elapsed: 76.347 sec
    Running org.apache.hadoop.hbase.mapred.TestTableInputFormat
    Tests run: 10, Failures: 0, Errors: 0, Skipped: 0, Time elapsed: 50.087 sec
    Running org.apache.hadoop.hbase.mapred.TestTableMapReduce
    Tests run: 1, Failures: 0, Errors: 1, Skipped: 0, Time elapsed: 50.589 sec <<< FAILURE!
    Running org.apache.hadoop.hbase.replication.TestMultiSlaveReplication
    Tests run: 1, Failures: 0, Errors: 0, Skipped: 0, Time elapsed: 78.351 sec
    Running org.apache.hadoop.hbase.replication.TestReplicationZookeeper
    Tests run: 1, Failures: 0, Errors: 0, Skipped: 0, Time elapsed: 3.71 sec
    Running org.apache.hadoop.hbase.replication.TestMasterReplication
    Tests run: 2, Failures: 0, Errors: 0, Skipped: 0, Time elapsed: 120.95 sec
    Running org.apache.hadoop.hbase.replication.TestReplication
    Tests run: 8, Failures: 0, Errors: 0, Skipped: 0, Time elapsed: 166.453 sec
    Running org.apache.hadoop.hbase.replication.regionserver.TestReplicationSink
    Tests run: 5, Failures: 0, Errors: 0, Skipped: 0, Time elapsed: 36.246 sec
    Running org.apache.hadoop.hbase.replication.regionserver.TestReplicationSourceManager
    Tests run: 1, Failures: 0, Errors: 0, Skipped: 0, Time elapsed: 1.889 sec
    Running org.apache.hadoop.hbase.replication.TestReplicationPeer
    Tests run: 1, Failures: 1, Errors: 0, Skipped: 0, Time elapsed: 25.911 sec <<< FAILURE!
    Running org.apache.hadoop.hbase.replication.TestReplicationSource
    Tests run: 1, Failures: 0, Errors: 0, Skipped: 0, Time elapsed: 5.79 sec
    Running org.apache.hadoop.hbase.TestFullLogReconstruction
    Tests run: 1, Failures: 0, Errors: 0, Skipped: 0, Time elapsed: 69.391 sec
    Running org.apache.hadoop.hbase.TestHRegionLocation
    Tests run: 3, Failures: 0, Errors: 0, Skipped: 0, Time elapsed: 0.175 sec
    Running org.apache.hadoop.hbase.TestZooKeeper
    Tests run: 7, Failures: 0, Errors: 0, Skipped: 0, Time elapsed: 91.952 sec
    Running org.apache.hadoop.hbase.security.TestUser
    Tests run: 3, Failures: 0, Errors: 0, Skipped: 0, Time elapsed: 0.599 sec
    Running org.apache.hadoop.hbase.coprocessor.TestMasterCoprocessorExceptionWithAbort
    Tests run: 1, Failures: 0, Errors: 0, Skipped: 0, Time elapsed: 23.682 sec
    Running org.apache.hadoop.hbase.coprocessor.TestRegionObserverStacking
    Tests run: 1, Failures: 0, Errors: 0, Skipped: 0, Time elapsed: 1.557 sec
    Running org.apache.hadoop.hbase.coprocessor.TestWALObserver
    Tests run: 3, Failures: 0, Errors: 0, Skipped: 0, Time elapsed: 34.698 sec
    Running org.apache.hadoop.hbase.coprocessor.TestClassLoading
    Tests run: 6, Failures: 0, Errors: 0, Skipped: 0, Time elapsed: 51.503 sec
    Running org.apache.hadoop.hbase.coprocessor.TestRegionObserverBypass
    Tests run: 2, Failures: 0, Errors: 0, Skipped: 0, Time elapsed: 30.142 sec
    Running org.apache.hadoop.hbase.coprocessor.TestCoprocessorInterface
    Tests run: 1, Failures: 0, Errors: 0, Skipped: 0, Time elapsed: 4.694 sec
    Running org.apache.hadoop.hbase.coprocessor.TestMasterObserver
    Tests run: 3, Failures: 0, Errors: 0, Skipped: 0, Time elapsed: 46.977 sec
    Running org.apache.hadoop.hbase.coprocessor.TestCoprocessorEndpoint
    Tests run: 3, Failures: 0, Errors: 0, Skipped: 0, Time elapsed: 45.076 sec
    Running org.apache.hadoop.hbase.coprocessor.TestAggregateProtocol
    Tests run: 44, Failures: 0, Errors: 0, Skipped: 0, Time elapsed: 29.835 sec
    Running org.apache.hadoop.hbase.coprocessor.TestRegionObserverInterface
    Tests run: 5, Failures: 0, Errors: 0, Skipped: 0, Time elapsed: 46.977 sec
    Running org.apache.hadoop.hbase.coprocessor.TestMasterCoprocessorExceptionWithRemove
    Tests run: 1, Failures: 0, Errors: 0, Skipped: 0, Time elapsed: 30.455 sec
    Running org.apache.hadoop.hbase.coprocessor.TestRegionServerCoprocessorExceptionWithRemove
    Tests run: 1, Failures: 0, Errors: 0, Skipped: 0, Time elapsed: 36.25 sec
    Running org.apache.hadoop.hbase.coprocessor.TestRegionServerCoprocessorExceptionWithAbort
    Tests run: 1, Failures: 0, Errors: 0, Skipped: 0, Time elapsed: 73.701 sec
    Running org.apache.hadoop.hbase.executor.TestExecutorService
    Tests run: 1, Failures: 0, Errors: 0, Skipped: 0, Time elapsed: 5.629 sec
    Running org.apache.hadoop.hbase.TestInfoServers
    Tests run: 2, Failures: 0, Errors: 0, Skipped: 0, Time elapsed: 66.546 sec
    Running org.apache.hadoop.hbase.TestHServerAddress
    Tests run: 6, Failures: 0, Errors: 0, Skipped: 0, Time elapsed: 0.393 sec
    Running org.apache.hadoop.hbase.avro.TestAvroServer
    Tests run: 3, Failures: 0, Errors: 0, Skipped: 0, Time elapsed: 65.153 sec
    Running org.apache.hadoop.hbase.avro.TestAvroUtil
    Tests run: 1, Failures: 0, Errors: 0, Skipped: 0, Time elapsed: 4.043 sec
    Running org.apache.hadoop.hbase.filter.TestRandomRowFilter
    Tests run: 2, Failures: 0, Errors: 0, Skipped: 0, Time elapsed: 1.142 sec
    Running org.apache.hadoop.hbase.filter.TestFilter
    Tests run: 18, Failures: 0, Errors: 0, Skipped: 0, Time elapsed: 10.787 sec
    Running org.apache.hadoop.hbase.filter.TestDependentColumnFilter
    Tests run: 2, Failures: 0, Errors: 0, Skipped: 0, Time elapsed: 1.396 sec
    Running org.apache.hadoop.hbase.filter.TestInclusiveStopFilter
    Tests run: 2, Failures: 0, Errors: 0, Skipped: 0, Time elapsed: 0.141 sec
    Running org.apache.hadoop.hbase.filter.TestParseFilter
    Tests run: 33, Failures: 0, Errors: 0, Skipped: 0, Time elapsed: 0.728 sec
    Running org.apache.hadoop.hbase.filter.TestSingleColumnValueExcludeFilter
    Tests run: 1, Failures: 0, Errors: 0, Skipped: 0, Time elapsed: 0.148 sec
    Running org.apache.hadoop.hbase.filter.TestColumnRangeFilter
    Tests run: 1, Failures: 0, Errors: 0, Skipped: 0, Time elapsed: 37.237 sec
    Running org.apache.hadoop.hbase.filter.TestColumnPrefixFilter
    Tests run: 2, Failures: 0, Errors: 0, Skipped: 0, Time elapsed: 4.89 sec
    Running org.apache.hadoop.hbase.filter.TestColumnPaginationFilter
    Tests run: 1, Failures: 0, Errors: 0, Skipped: 0, Time elapsed: 0.153 sec
    Running org.apache.hadoop.hbase.filter.TestMultipleColumnPrefixFilter
    Tests run: 3, Failures: 0, Errors: 0, Skipped: 0, Time elapsed: 6.205 sec
    Running org.apache.hadoop.hbase.filter.TestPrefixFilter
    Tests run: 3, Failures: 0, Errors: 0, Skipped: 0, Time elapsed: 0.135 sec
    Running org.apache.hadoop.hbase.filter.TestBitComparator
    Tests run: 3, Failures: 0, Errors: 0, Skipped: 0, Time elapsed: 0.057 sec
    Running org.apache.hadoop.hbase.filter.TestSingleColumnValueFilter
    Tests run: 2, Failures: 0, Errors: 0, Skipped: 0, Time elapsed: 0.197 sec
    Running org.apache.hadoop.hbase.filter.TestPageFilter
    Tests run: 2, Failures: 0, Errors: 0, Skipped: 0, Time elapsed: 0.046 sec
    Running org.apache.hadoop.hbase.filter.TestFilterList
    Tests run: 5, Failures: 0, Errors: 0, Skipped: 0, Time elapsed: 0.31 sec
    Running org.apache.hadoop.hbase.TestAcidGuarantees
    Tests run: 3, Failures: 0, Errors: 0, Skipped: 0, Time elapsed: 127.242 sec
    Running org.apache.hadoop.hbase.TestKeyValue
    Tests run: 15, Failures: 0, Errors: 0, Skipped: 0, Time elapsed: 0.249 sec
    Running org.apache.hadoop.hbase.TestRegionRebalancing
    Tests run: 1, Failures: 0, Errors: 0, Skipped: 0, Time elapsed: 56.335 sec
    Running org.apache.hadoop.hbase.thrift.TestThriftServer
    Tests run: 1, Failures: 0, Errors: 0, Skipped: 0, Time elapsed: 34.728 sec
    Running org.apache.hadoop.hbase.master.TestLogsCleaner
    Tests run: 1, Failures: 0, Errors: 0, Skipped: 0, Time elapsed: 3.294 sec
    Running org.apache.hadoop.hbase.master.TestMXBean
    Tests run: 1, Failures: 0, Errors: 0, Skipped: 0, Time elapsed: 29.424 sec
    Running org.apache.hadoop.hbase.master.TestDefaultLoadBalancer
    Tests run: 4, Failures: 0, Errors: 0, Skipped: 0, Time elapsed: 2.183 sec
    Running org.apache.hadoop.hbase.master.TestHMasterRPCException
    Tests run: 1, Failures: 0, Errors: 0, Skipped: 0, Time elapsed: 1.554 sec
    Running org.apache.hadoop.hbase.master.TestAssignmentManager
    Tests run: 1, Failures: 0, Errors: 0, Skipped: 0, Time elapsed: 1.977 sec
    Running org.apache.hadoop.hbase.master.TestRestartCluster
    Tests run: 2, Failures: 0, Errors: 0, Skipped: 0, Time elapsed: 66.479 sec
    Running org.apache.hadoop.hbase.master.TestMaster
    Tests run: 1, Failures: 0, Errors: 0, Skipped: 0, Time elapsed: 43.226 sec
    Running org.apache.hadoop.hbase.master.TestMasterStatusServlet
    Tests run: 5, Failures: 0, Errors: 0, Skipped: 0, Time elapsed: 2.187 sec
    Running org.apache.hadoop.hbase.master.TestMasterShutdown
    Tests run: 1, Failures: 0, Errors: 0, Skipped: 0, Time elapsed: 23.246 sec
    Running org.apache.hadoop.hbase.master.TestDistributedLogSplitting
    Tests run: 4, Failures: 0, Errors: 0, Skipped: 0, Time elapsed: 164.211 sec
    Running org.apache.hadoop.hbase.master.TestRollingRestart
    Tests run: 1, Failures: 0, Errors: 0, Skipped: 0, Time elapsed: 78.353 sec
    Running org.apache.hadoop.hbase.master.TestMasterFailover
    Tests run: 4, Failures: 0, Errors: 1, Skipped: 0, Time elapsed: 266.223 sec <<< FAILURE!
    Running org.apache.hadoop.hbase.master.TestMasterZKSessionRecovery
    Tests run: 4, Failures: 0, Errors: 0, Skipped: 0, Time elapsed: 113.374 sec
    Running org.apache.hadoop.hbase.master.TestSplitLogManager
    Tests run: 12, Failures: 0, Errors: 0, Skipped: 0, Time elapsed: 14.932 sec
    Running org.apache.hadoop.hbase.master.TestCatalogJanitor
    Tests run: 5, Failures: 0, Errors: 0, Skipped: 0, Time elapsed: 10.837 sec
    Running org.apache.hadoop.hbase.master.TestOpenedRegionHandler
    Tests run: 2, Failures: 0, Errors: 0, Skipped: 0, Time elapsed: 28.878 sec
    Running org.apache.hadoop.hbase.master.TestMasterTransitions
    Tests run: 3, Failures: 0, Errors: 0, Skipped: 3, Time elapsed: 28.438 sec
    Running org.apache.hadoop.hbase.master.TestMasterRestartAfterDisablingTable
    Tests run: 1, Failures: 0, Errors: 0, Skipped: 0, Time elapsed: 32.893 sec
    Running org.apache.hadoop.hbase.master.TestZKBasedOpenCloseRegion
    Tests run: 4, Failures: 0, Errors: 0, Skipped: 0, Time elapsed: 38.765 sec
    Running org.apache.hadoop.hbase.master.TestClockSkewDetection
    Tests run: 1, Failures: 0, Errors: 0, Skipped: 0, Time elapsed: 1.192 sec
    Running org.apache.hadoop.hbase.master.TestDeadServer
    Tests run: 1, Failures: 0, Errors: 0, Skipped: 0, Time elapsed: 0.166 sec
    Running org.apache.hadoop.hbase.master.TestActiveMasterManager
    Tests run: 2, Failures: 0, Errors: 0, Skipped: 0, Time elapsed: 4.319 sec
    Running org.apache.hadoop.hbase.client.TestHTablePool
    Tests run: 18, Failures: 0, Errors: 0, Skipped: 0, Time elapsed: 53.107 sec
    Running org.apache.hadoop.hbase.client.TestPutDotHas
    Tests run: 4, Failures: 0, Errors: 0, Skipped: 0, Time elapsed: 1.115 sec
    Running org.apache.hadoop.hbase.client.TestTimestampsFilter
    Tests run: 3, Failures: 0, Errors: 0, Skipped: 0, Time elapsed: 57.386 sec
    Running org.apache.hadoop.hbase.client.TestMetaMigrationRemovingHTD
    Tests run: 3, Failures: 0, Errors: 0, Skipped: 0, Time elapsed: 71.268 sec
    Running org.apache.hadoop.hbase.client.TestHCM
    Tests run: 5, Failures: 0, Errors: 0, Skipped: 0, Time elapsed: 30.404 sec
    Running org.apache.hadoop.hbase.client.TestHTableUtil
    Tests run: 2, Failures: 0, Errors: 0, Skipped: 0, Time elapsed: 25.956 sec
    Running org.apache.hadoop.hbase.client.TestFromClientSide
    Tests run: 48, Failures: 0, Errors: 0, Skipped: 3, Time elapsed: 196.823 sec
    Running org.apache.hadoop.hbase.client.TestAttributes
    Tests run: 3, Failures: 0, Errors: 0, Skipped: 0, Time elapsed: 0.185 sec
    Running org.apache.hadoop.hbase.client.TestMetaScanner
    Tests run: 1, Failures: 0, Errors: 0, Skipped: 0, Time elapsed: 24.258 sec
    Running org.apache.hadoop.hbase.client.TestAdmin
    Tests run: 35, Failures: 0, Errors: 0, Skipped: 0, Time elapsed: 470.409 sec
    Running org.apache.hadoop.hbase.client.TestMultipleTimestamps
    Tests run: 8, Failures: 0, Errors: 0, Skipped: 0, Time elapsed: 77.838 sec
    Running org.apache.hadoop.hbase.client.replication.TestReplicationAdmin
    Tests run: 1, Failures: 0, Errors: 0, Skipped: 0, Time elapsed: 3.267 sec
    Running org.apache.hadoop.hbase.client.TestMultiParallel
    Tests run: 10, Failures: 0, Errors: 0, Skipped: 0, Time elapsed: 54.809 sec
    Running org.apache.hadoop.hbase.client.TestOperation
    Tests run: 1, Failures: 0, Errors: 0, Skipped: 0, Time elapsed: 0.517 sec
    Running org.apache.hadoop.hbase.client.TestGet
    Tests run: 2, Failures: 0, Errors: 0, Skipped: 0, Time elapsed: 0.198 sec
    Running org.apache.hadoop.hbase.client.TestScannerTimeout
    Tests run: 4, Failures: 0, Errors: 0, Skipped: 0, Time elapsed: 59.875 sec
    Running org.apache.hadoop.hbase.client.TestShell
    Tests run: 1, Failures: 0, Errors: 0, Skipped: 0, Time elapsed: 143.055 sec
    Running org.apache.hadoop.hbase.client.TestScan
    Tests run: 2, Failures: 0, Errors: 0, Skipped: 0, Time elapsed: 0.827 sec
    Running org.apache.hadoop.hbase.client.TestResult
    Tests run: 3, Failures: 0, Errors: 0, Skipped: 0, Time elapsed: 0.587 sec
    Running org.apache.hadoop.hbase.TestSerialization
    Tests run: 18, Failures: 0, Errors: 0, Skipped: 0, Time elapsed: 15.086 sec

    Results :

    Failed tests: testResetZooKeeperSession(org.apache.hadoop.hbase.replication.TestReplicationPeer): ReplicationPeer ZooKeeper session was not properly expired.

    Tests in error:
    testMultiRegionTable(org.apache.hadoop.hbase.mapred.TestTableMapReduce): Job failed!
    testShouldCheckMasterFailOverWhenMETAIsInOpenedState(org.apache.hadoop.hbase.master.TestMasterFailover): test timed out after 180000 milliseconds

    Tests run: 1149, Failures: 1, Errors: 2, Skipped: 8

    [INFO] ------------------------------------------------------------------------
    [INFO] BUILD FAILURE
    [INFO] ------------------------------------------------------------------------
    [INFO] Total time: 2:38:31.411s
    [INFO] Finished at: Tue Jul 17 02:43:38 GMT+00:00 2012
    [INFO] Final Memory: 46M/989M
    [INFO] ------------------------------------------------------------------------
    [ERROR] Failed to execute goal org.apache.maven.plugins:maven-surefire-plugin:2.10:test (default-test) on project hbase: There are test failures.
    [ERROR]
    [ERROR] Please refer to /zonestorage/hudson_solaris/home/hudson/hudson-slave/workspace/HBase-0.92/trunk/target/surefire-reports for the individual test results.
    [ERROR] -> [Help 1]
    [ERROR]
    [ERROR] To see the full stack trace of the errors, re-run Maven with the -e switch.
    [ERROR] Re-run Maven using the -X switch to enable full debug logging.
    [ERROR]
    [ERROR] For more information about the errors and possible solutions, please read the following articles:
    [ERROR] [Help 1] http://cwiki.apache.org/confluence/display/MAVEN/MojoFailureException
    Build step 'Invoke top-level Maven targets' marked build as failure
    Archiving artifacts
    Recording test results
    Updating HBASE-6382
  • Apache Jenkins Server at Jul 19, 2012 at 3:22 am

Related Discussions

Discussion Navigation
viewthread | post
Discussion Overview
groupdev @
categorieshbase, hadoop
postedJul 10, '12 at 9:17p
activeJul 19, '12 at 3:22a
posts7
users1
websitehbase.apache.org

1 user in discussion

Apache Jenkins Server: 7 posts

People

Translate

site design / logo © 2022 Grokbase