Grokbase Groups HBase dev May 2012
FAQ
See <https://builds.apache.org/job/HBase-0.94/209/changes>

Changes:

[tedyu] HBASE-6047 Put.has() can't determine result correctly (Alex Newman)

------------------------------------------
[...truncated 639 lines...]
Running org.apache.hadoop.hbase.regionserver.TestFSErrorsExposed
Tests run: 3, Failures: 0, Errors: 0, Skipped: 0, Time elapsed: 29.399 sec
Running org.apache.hadoop.hbase.regionserver.wal.TestWALReplay
Tests run: 5, Failures: 0, Errors: 0, Skipped: 0, Time elapsed: 30.98 sec
Running org.apache.hadoop.hbase.regionserver.wal.TestWALReplayCompressed
Tests run: 5, Failures: 0, Errors: 0, Skipped: 0, Time elapsed: 29.104 sec
Running org.apache.hadoop.hbase.regionserver.wal.TestHLog
Tests run: 10, Failures: 0, Errors: 0, Skipped: 0, Time elapsed: 60.807 sec
Running org.apache.hadoop.hbase.regionserver.wal.TestHLogBench
Tests run: 1, Failures: 0, Errors: 0, Skipped: 0, Time elapsed: 1.287 sec
Running org.apache.hadoop.hbase.regionserver.handler.TestCloseRegionHandler
Tests run: 3, Failures: 0, Errors: 0, Skipped: 0, Time elapsed: 1.217 sec
Running org.apache.hadoop.hbase.regionserver.handler.TestOpenRegionHandler
Tests run: 3, Failures: 0, Errors: 0, Skipped: 0, Time elapsed: 1.047 sec
Running org.apache.hadoop.hbase.regionserver.wal.TestLogRollAbort
Tests run: 1, Failures: 0, Errors: 0, Skipped: 0, Time elapsed: 156.705 sec
Running org.apache.hadoop.hbase.filter.TestColumnRangeFilter
Tests run: 1, Failures: 0, Errors: 0, Skipped: 0, Time elapsed: 16.413 sec
Running org.apache.hadoop.hbase.regionserver.TestHRegionServerBulkLoad
Tests run: 1, Failures: 0, Errors: 0, Skipped: 0, Time elapsed: 46.249 sec
Running org.apache.hadoop.hbase.coprocessor.TestClassLoading
Tests run: 6, Failures: 0, Errors: 0, Skipped: 0, Time elapsed: 32.054 sec
Running org.apache.hadoop.hbase.coprocessor.TestAggregateProtocol
Tests run: 45, Failures: 0, Errors: 0, Skipped: 0, Time elapsed: 17.132 sec
Running org.apache.hadoop.hbase.coprocessor.TestRegionServerCoprocessorExceptionWithRemove
Tests run: 1, Failures: 0, Errors: 0, Skipped: 0, Time elapsed: 17.378 sec
Running org.apache.hadoop.hbase.coprocessor.TestRegionServerCoprocessorExceptionWithAbort
Tests run: 1, Failures: 0, Errors: 0, Skipped: 0, Time elapsed: 13.894 sec
Running org.apache.hadoop.hbase.coprocessor.TestMasterObserver
Tests run: 3, Failures: 0, Errors: 0, Skipped: 0, Time elapsed: 29.131 sec
Running org.apache.hadoop.hbase.coprocessor.TestCoprocessorEndpoint
Tests run: 3, Failures: 0, Errors: 0, Skipped: 1, Time elapsed: 28.46 sec
Running org.apache.hadoop.hbase.coprocessor.TestMasterCoprocessorExceptionWithAbort
Tests run: 1, Failures: 0, Errors: 0, Skipped: 0, Time elapsed: 10.494 sec
Running org.apache.hadoop.hbase.coprocessor.TestWALObserver
Tests run: 3, Failures: 0, Errors: 0, Skipped: 0, Time elapsed: 16.221 sec
Running org.apache.hadoop.hbase.coprocessor.TestRegionObserverInterface
Tests run: 6, Failures: 0, Errors: 0, Skipped: 0, Time elapsed: 32.928 sec
Running org.apache.hadoop.hbase.coprocessor.TestMasterCoprocessorExceptionWithRemove
Tests run: 1, Failures: 0, Errors: 0, Skipped: 0, Time elapsed: 16.237 sec
Running org.apache.hadoop.hbase.coprocessor.TestRegionObserverBypass
Tests run: 2, Failures: 0, Errors: 0, Skipped: 0, Time elapsed: 11.846 sec
Running org.apache.hadoop.hbase.regionserver.wal.TestHLogSplit
Tests run: 30, Failures: 0, Errors: 0, Skipped: 1, Time elapsed: 242.695 sec
Running org.apache.hadoop.hbase.mapred.TestTableInputFormat
Tests run: 10, Failures: 0, Errors: 0, Skipped: 0, Time elapsed: 27.125 sec
Running org.apache.hadoop.hbase.TestGlobalMemStoreSize
Tests run: 1, Failures: 0, Errors: 0, Skipped: 0, Time elapsed: 14.591 sec
Running org.apache.hadoop.hbase.mapreduce.TestHLogRecordReader
Tests run: 2, Failures: 0, Errors: 0, Skipped: 0, Time elapsed: 5.939 sec
Running org.apache.hadoop.hbase.mapred.TestTableMapReduce
Tests run: 1, Failures: 0, Errors: 0, Skipped: 0, Time elapsed: 92.283 sec
Running org.apache.hadoop.hbase.regionserver.wal.TestLogRolling
Tests run: 3, Failures: 0, Errors: 0, Skipped: 0, Time elapsed: 296.485 sec
Running org.apache.hadoop.hbase.mapreduce.TestLoadIncrementalHFilesSplitRecovery
Tests run: 4, Failures: 0, Errors: 0, Skipped: 0, Time elapsed: 99.802 sec
Running org.apache.hadoop.hbase.mapreduce.TestTableMapReduce
Tests run: 1, Failures: 0, Errors: 0, Skipped: 0, Time elapsed: 117.692 sec
Running org.apache.hadoop.hbase.mapreduce.TestWALPlayer
Tests run: 1, Failures: 0, Errors: 0, Skipped: 0, Time elapsed: 45.27 sec
Running org.apache.hadoop.hbase.mapreduce.TestMultithreadedTableMapper
Tests run: 1, Failures: 0, Errors: 0, Skipped: 0, Time elapsed: 111.589 sec
Running org.apache.hadoop.hbase.mapreduce.TestTimeRangeMapRed
Tests run: 1, Failures: 0, Errors: 0, Skipped: 0, Time elapsed: 45.896 sec
Running org.apache.hadoop.hbase.mapreduce.TestImportTsv
Tests run: 9, Failures: 0, Errors: 0, Skipped: 0, Time elapsed: 203.383 sec
Running org.apache.hadoop.hbase.mapreduce.TestLoadIncrementalHFiles
Tests run: 6, Failures: 0, Errors: 0, Skipped: 0, Time elapsed: 35.732 sec
Running org.apache.hadoop.hbase.mapreduce.TestHFileOutputFormat
Tests run: 9, Failures: 0, Errors: 0, Skipped: 0, Time elapsed: 275.935 sec
Running org.apache.hadoop.hbase.thrift2.TestThriftHBaseServiceHandler
Tests run: 12, Failures: 0, Errors: 0, Skipped: 0, Time elapsed: 13.966 sec
Running org.apache.hadoop.hbase.catalog.TestMetaReaderEditorNoCluster
Tests run: 1, Failures: 0, Errors: 0, Skipped: 0, Time elapsed: 4.043 sec
Running org.apache.hadoop.hbase.mapreduce.TestImportExport
Tests run: 2, Failures: 0, Errors: 0, Skipped: 0, Time elapsed: 51.043 sec
Running org.apache.hadoop.hbase.catalog.TestMetaReaderEditor
Tests run: 5, Failures: 0, Errors: 0, Skipped: 0, Time elapsed: 22.435 sec
Running org.apache.hadoop.hbase.catalog.TestCatalogTracker
Tests run: 9, Failures: 0, Errors: 0, Skipped: 1, Time elapsed: 6.327 sec
Running org.apache.hadoop.hbase.client.TestTimestampsFilter
Tests run: 3, Failures: 0, Errors: 0, Skipped: 0, Time elapsed: 22.448 sec
Running org.apache.hadoop.hbase.TestAcidGuarantees
Tests run: 3, Failures: 0, Errors: 0, Skipped: 0, Time elapsed: 96.883 sec
Running org.apache.hadoop.hbase.catalog.TestCatalogTrackerOnCluster
Tests run: 1, Failures: 0, Errors: 0, Skipped: 0, Time elapsed: 77.733 sec
Running org.apache.hadoop.hbase.client.TestHCM
Tests run: 6, Failures: 0, Errors: 0, Skipped: 0, Time elapsed: 15.37 sec
Running org.apache.hadoop.hbase.client.TestShell
Tests run: 1, Failures: 0, Errors: 0, Skipped: 0, Time elapsed: 84.145 sec
Running org.apache.hadoop.hbase.client.TestScannerTimeout
Tests run: 4, Failures: 0, Errors: 0, Skipped: 0, Time elapsed: 44.042 sec
Running org.apache.hadoop.hbase.client.TestMetaScanner
Tests run: 1, Failures: 0, Errors: 0, Skipped: 0, Time elapsed: 15.221 sec
Running org.apache.hadoop.hbase.client.TestHTableUtil
Tests run: 2, Failures: 0, Errors: 0, Skipped: 0, Time elapsed: 14.127 sec
Running org.apache.hadoop.hbase.client.TestMetaMigrationRemovingHTD
Tests run: 3, Failures: 0, Errors: 0, Skipped: 0, Time elapsed: 23.489 sec
Running org.apache.hadoop.hbase.client.TestHTablePool$TestHTableReusablePool
Tests run: 9, Failures: 0, Errors: 0, Skipped: 0, Time elapsed: 4.119 sec
Running org.apache.hadoop.hbase.client.TestHTablePool$TestHTableThreadLocalPool
Tests run: 9, Failures: 0, Errors: 0, Skipped: 0, Time elapsed: 23.791 sec
Running org.apache.hadoop.hbase.client.replication.TestReplicationAdmin
Tests run: 1, Failures: 0, Errors: 0, Skipped: 0, Time elapsed: 1.08 sec
Running org.apache.hadoop.hbase.client.TestMultipleTimestamps
Tests run: 8, Failures: 0, Errors: 0, Skipped: 0, Time elapsed: 33.257 sec
Running org.apache.hadoop.hbase.client.TestMultiParallel
Tests run: 11, Failures: 0, Errors: 0, Skipped: 0, Time elapsed: 38.999 sec
Running org.apache.hadoop.hbase.metrics.TestMetricsMBeanBase
Tests run: 2, Failures: 0, Errors: 0, Skipped: 0, Time elapsed: 1.118 sec
Running org.apache.hadoop.hbase.client.TestFromClientSide
Tests run: 55, Failures: 0, Errors: 0, Skipped: 3, Time elapsed: 179.96 sec
Running org.apache.hadoop.hbase.constraint.TestConstraint
Tests run: 5, Failures: 0, Errors: 0, Skipped: 0, Time elapsed: 29.541 sec
Running org.apache.hadoop.hbase.rest.TestGzipFilter
Tests run: 3, Failures: 0, Errors: 0, Skipped: 0, Time elapsed: 16.082 sec
Running org.apache.hadoop.hbase.rest.TestMultiRowResource
Tests run: 3, Failures: 0, Errors: 0, Skipped: 0, Time elapsed: 14.374 sec
Running org.apache.hadoop.hbase.rest.TestScannersWithFilters
Tests run: 10, Failures: 0, Errors: 0, Skipped: 0, Time elapsed: 17.574 sec
Running org.apache.hadoop.hbase.rest.TestRowResource
Tests run: 11, Failures: 0, Errors: 0, Skipped: 0, Time elapsed: 20.824 sec
Running org.apache.hadoop.hbase.rest.client.TestRemoteAdmin
Tests run: 1, Failures: 0, Errors: 0, Skipped: 0, Time elapsed: 20.427 sec
Running org.apache.hadoop.hbase.rest.client.TestRemoteTable
Tests run: 3, Failures: 0, Errors: 0, Skipped: 0, Time elapsed: 15.255 sec
Running org.apache.hadoop.hbase.rest.TestVersionResource
Tests run: 7, Failures: 0, Errors: 0, Skipped: 0, Time elapsed: 11.271 sec
Running org.apache.hadoop.hbase.mapreduce.TestTableInputFormatScan
Tests run: 12, Failures: 0, Errors: 0, Skipped: 0, Time elapsed: 562.02 sec
Running org.apache.hadoop.hbase.rest.TestStatusResource
Tests run: 2, Failures: 0, Errors: 0, Skipped: 0, Time elapsed: 11.857 sec
Running org.apache.hadoop.hbase.rest.TestTableResource
Tests run: 8, Failures: 0, Errors: 0, Skipped: 0, Time elapsed: 21.631 sec
Running org.apache.hadoop.hbase.rest.TestScannerResource
Tests run: 5, Failures: 0, Errors: 0, Skipped: 0, Time elapsed: 29.104 sec
Running org.apache.hadoop.hbase.rest.TestSchemaResource
Tests run: 2, Failures: 0, Errors: 0, Skipped: 0, Time elapsed: 18.387 sec
Running org.apache.hadoop.hbase.thrift.TestThriftServer
Tests run: 1, Failures: 0, Errors: 0, Skipped: 0, Time elapsed: 43.361 sec
Running org.apache.hadoop.hbase.io.encoding.TestLoadAndSwitchEncodeOnDisk
Tests run: 1, Failures: 0, Errors: 0, Skipped: 0, Time elapsed: 28.697 sec
Running org.apache.hadoop.hbase.client.TestAdmin
Tests run: 37, Failures: 0, Errors: 0, Skipped: 0, Time elapsed: 181.848 sec
Running org.apache.hadoop.hbase.io.encoding.TestUpgradeFromHFileV1ToEncoding
Tests run: 1, Failures: 0, Errors: 0, Skipped: 0, Time elapsed: 82.567 sec
Running org.apache.hadoop.hbase.io.hfile.TestHFileSeek
Tests run: 1, Failures: 0, Errors: 0, Skipped: 0, Time elapsed: 8.39 sec
Running org.apache.hadoop.hbase.io.hfile.slab.TestSlabCache
Tests run: 7, Failures: 0, Errors: 0, Skipped: 0, Time elapsed: 20.429 sec
Running org.apache.hadoop.hbase.io.encoding.TestDataBlockEncoders
Tests run: 12, Failures: 0, Errors: 0, Skipped: 0, Time elapsed: 140.322 sec
Running org.apache.hadoop.hbase.io.hfile.TestChecksum
Tests run: 3, Failures: 0, Errors: 0, Skipped: 0, Time elapsed: 0.842 sec
Running org.apache.hadoop.hbase.io.hfile.slab.TestSingleSizeCache
Tests run: 5, Failures: 0, Errors: 0, Skipped: 0, Time elapsed: 25.357 sec
Running org.apache.hadoop.hbase.io.hfile.TestLruBlockCache
Tests run: 16, Failures: 0, Errors: 0, Skipped: 0, Time elapsed: 0.741 sec
Running org.apache.hadoop.hbase.io.hfile.TestHFilePerformance
Tests run: 1, Failures: 0, Errors: 0, Skipped: 0, Time elapsed: 6.781 sec
Running org.apache.hadoop.hbase.io.hfile.TestHFileBlockIndex
Tests run: 10, Failures: 0, Errors: 0, Skipped: 0, Time elapsed: 10.019 sec
Running org.apache.hadoop.hbase.io.hfile.TestFixedFileTrailer
Tests run: 2, Failures: 0, Errors: 0, Skipped: 0, Time elapsed: 0.584 sec
Running org.apache.hadoop.hbase.io.hfile.TestHFileBlockCompatibility
Tests run: 10, Failures: 0, Errors: 0, Skipped: 0, Time elapsed: 1.143 sec
Running org.apache.hadoop.hbase.io.hfile.TestForceCacheImportantBlocks
#
# There is insufficient memory for the Java Runtime Environment to continue.
# Native memory allocation (malloc) failed to allocate 65920 bytes for Chunk::new
# An error report file with more information is saved as:
# <https://builds.apache.org/job/HBase-0.94/ws/trunk/hs_err_pid26438.log>
Aborted
org.apache.maven.surefire.booter.SurefireBooterForkException: Error occurred in starting fork, check output in log
at org.apache.maven.plugin.surefire.booterclient.ForkStarter.fork(ForkStarter.java:238)
at org.apache.maven.plugin.surefire.booterclient.ForkStarter.access$000(ForkStarter.java:64)
at org.apache.maven.plugin.surefire.booterclient.ForkStarter$ParallelFork.call(ForkStarter.java:303)
at org.apache.maven.plugin.surefire.booterclient.ForkStarter$ParallelFork.call(ForkStarter.java:285)
at java.util.concurrent.FutureTask$Sync.innerRun(FutureTask.java:303)
at java.util.concurrent.FutureTask.run(FutureTask.java:138)
at java.util.concurrent.ThreadPoolExecutor$Worker.runTask(ThreadPoolExecutor.java:886)
at java.util.concurrent.ThreadPoolExecutor$Worker.run(ThreadPoolExecutor.java:908)
at java.lang.Thread.run(Thread.java:662)
Running org.apache.hadoop.hbase.io.hfile.TestHFileBlock
Tests run: 16, Failures: 0, Errors: 0, Skipped: 0, Time elapsed: 47.992 sec
Running org.apache.hadoop.hbase.io.hfile.TestCacheOnWrite
Tests run: 36, Failures: 0, Errors: 0, Skipped: 0, Time elapsed: 40.602 sec
Running org.apache.hadoop.hbase.TestClusterBootOrder
Tests run: 2, Failures: 0, Errors: 0, Skipped: 0, Time elapsed: 28.06 sec
Running org.apache.hadoop.hbase.io.encoding.TestChangingEncoding
Tests run: 4, Failures: 0, Errors: 0, Skipped: 0, Time elapsed: 242.983 sec
Running org.apache.hadoop.hbase.replication.regionserver.TestReplicationSourceManager
Tests run: 1, Failures: 0, Errors: 0, Skipped: 0, Time elapsed: 0.969 sec
Running org.apache.hadoop.hbase.avro.TestAvroServer
Tests run: 3, Failures: 0, Errors: 0, Skipped: 0, Time elapsed: 28.299 sec
Running org.apache.hadoop.hbase.replication.regionserver.TestReplicationSink
Tests run: 5, Failures: 0, Errors: 0, Skipped: 0, Time elapsed: 14.077 sec
Running org.apache.hadoop.hbase.replication.TestReplicationSource
Tests run: 1, Failures: 0, Errors: 0, Skipped: 0, Time elapsed: 2.651 sec
Running org.apache.hadoop.hbase.replication.TestReplicationPeer
Tests run: 1, Failures: 0, Errors: 0, Skipped: 0, Time elapsed: 7.569 sec
Running org.apache.hadoop.hbase.replication.TestMultiSlaveReplication
Tests run: 1, Failures: 0, Errors: 0, Skipped: 0, Time elapsed: 39.01 sec
Running org.apache.hadoop.hbase.replication.TestReplicationZookeeper
Tests run: 1, Failures: 0, Errors: 0, Skipped: 0, Time elapsed: 0.589 sec
Running org.apache.hadoop.hbase.ipc.TestDelayedRpc
Tests run: 4, Failures: 0, Errors: 0, Skipped: 0, Time elapsed: 2.433 sec
Running org.apache.hadoop.hbase.replication.TestMasterReplication
Tests run: 2, Failures: 0, Errors: 0, Skipped: 0, Time elapsed: 63.776 sec
Running org.apache.hadoop.hbase.TestZooKeeper
Tests run: 8, Failures: 0, Errors: 0, Skipped: 0, Time elapsed: 37.804 sec
Running org.apache.hadoop.hbase.thrift.TestThriftServerCmdLine
Tests run: 20, Failures: 0, Errors: 0, Skipped: 0, Time elapsed: 380.964 sec
No results for java.util.concurrent.FutureTask@cde302
Running org.apache.hadoop.hbase.TestHBaseTestingUtility
Tests run: 7, Failures: 0, Errors: 0, Skipped: 0, Time elapsed: 59.996 sec
Running org.apache.hadoop.hbase.replication.TestReplication
Tests run: 10, Failures: 0, Errors: 0, Skipped: 0, Time elapsed: 147.222 sec

Results :

Tests in error:
testLocalHBaseCluster(org.apache.hadoop.hbase.TestLocalHBaseCluster): Master not initialized after 200 seconds
testCacheBlocks[1](org.apache.hadoop.hbase.io.hfile.TestForceCacheImportantBlocks): region: myTable,,1337748618622.d8d4b8c9703c936518a7414dd7bccb52.
testCacheBlocks[2](org.apache.hadoop.hbase.io.hfile.TestForceCacheImportantBlocks): unable to create new native thread

Tests run: 927, Failures: 0, Errors: 1, Skipped: 9

[INFO] ------------------------------------------------------------------------
[INFO] BUILD FAILURE
[INFO] ------------------------------------------------------------------------
[INFO] Total time: 38:05.156s
[INFO] Finished at: Wed May 23 04:54:24 UTC 2012
[INFO] Final Memory: 48M/532M
[INFO] ------------------------------------------------------------------------
[ERROR] Failed to execute goal org.apache.maven.plugins:maven-surefire-plugin:2.12-TRUNK-HBASE-2:test (secondPartTestsExecution) on project hbase: There are test failures.
[ERROR]
[ERROR] Please refer to <https://builds.apache.org/job/HBase-0.94/ws/trunk/target/surefire-reports> for the individual test results.
[ERROR] -> [Help 1]
[ERROR]
[ERROR] To see the full stack trace of the errors, re-run Maven with the -e switch.
[ERROR] Re-run Maven using the -X switch to enable full debug logging.
[ERROR]
[ERROR] For more information about the errors and possible solutions, please read the following articles:
[ERROR] [Help 1] http://cwiki.apache.org/confluence/display/MAVEN/MojoFailureException
Build step 'Invoke top-level Maven targets' marked build as failure
Archiving artifacts
Updating HBASE-6047
Recording test results

Search Discussions

  • Apache Jenkins Server at May 23, 2012 at 6:12 pm
    See <https://builds.apache.org/job/HBase-0.94/210/changes>

    Changes:

    [tedyu] HBASE-6069 TableInputFormatBase#createRecordReader() doesn't initialize TableRecordReader which causes NPE (Jie Huang)

    ------------------------------------------
    [...truncated 561 lines...]
    Running org.apache.hadoop.hbase.regionserver.TestEndToEndSplitTransaction
    Tests run: 1, Failures: 0, Errors: 0, Skipped: 0, Time elapsed: 42.362 sec
    Running org.apache.hadoop.hbase.regionserver.TestHRegionOnCluster
    Tests run: 1, Failures: 0, Errors: 0, Skipped: 0, Time elapsed: 21.583 sec
    Running org.apache.hadoop.hbase.regionserver.metrics.TestSchemaMetrics
    Running org.apache.hadoop.hbase.regionserver.TestAtomicOperation
    Tests run: 5, Failures: 0, Errors: 0, Skipped: 0, Time elapsed: 40.521 sec
    Tests run: 6, Failures: 0, Errors: 0, Skipped: 0, Time elapsed: 22.344 sec
    Running org.apache.hadoop.hbase.regionserver.TestBlocksRead
    Tests run: 4, Failures: 0, Errors: 0, Skipped: 0, Time elapsed: 1.477 sec
    Running org.apache.hadoop.hbase.regionserver.wal.TestLogRollingNoCluster
    Tests run: 1, Failures: 0, Errors: 0, Skipped: 0, Time elapsed: 3.05 sec
    Running org.apache.hadoop.hbase.regionserver.TestStoreFileBlockCacheSummary
    Tests run: 1, Failures: 0, Errors: 0, Skipped: 0, Time elapsed: 19.148 sec
    Running org.apache.hadoop.hbase.regionserver.TestHRegion
    Tests run: 62, Failures: 0, Errors: 0, Skipped: 0, Time elapsed: 47.27 sec
    Running org.apache.hadoop.hbase.regionserver.TestFSErrorsExposed
    Tests run: 3, Failures: 0, Errors: 0, Skipped: 0, Time elapsed: 31.328 sec
    Running org.apache.hadoop.hbase.regionserver.wal.TestWALReplay
    Tests run: 5, Failures: 0, Errors: 0, Skipped: 0, Time elapsed: 31.019 sec
    Running org.apache.hadoop.hbase.regionserver.wal.TestWALReplayCompressed
    Tests run: 5, Failures: 0, Errors: 0, Skipped: 0, Time elapsed: 33.369 sec
    Running org.apache.hadoop.hbase.regionserver.wal.TestHLog
    Tests run: 10, Failures: 0, Errors: 0, Skipped: 0, Time elapsed: 62.655 sec
    Running org.apache.hadoop.hbase.regionserver.wal.TestHLogBench
    Tests run: 1, Failures: 0, Errors: 0, Skipped: 0, Time elapsed: 1.34 sec
    Running org.apache.hadoop.hbase.regionserver.handler.TestCloseRegionHandler
    Tests run: 3, Failures: 0, Errors: 0, Skipped: 0, Time elapsed: 1.312 sec
    Running org.apache.hadoop.hbase.regionserver.handler.TestOpenRegionHandler
    Tests run: 3, Failures: 0, Errors: 0, Skipped: 0, Time elapsed: 1.038 sec
    Running org.apache.hadoop.hbase.regionserver.wal.TestLogRollAbort
    Tests run: 1, Failures: 0, Errors: 0, Skipped: 0, Time elapsed: 158.234 sec
    Running org.apache.hadoop.hbase.filter.TestColumnRangeFilter
    Tests run: 1, Failures: 0, Errors: 0, Skipped: 0, Time elapsed: 18.189 sec
    Running org.apache.hadoop.hbase.regionserver.TestHRegionServerBulkLoad
    Tests run: 1, Failures: 0, Errors: 0, Skipped: 0, Time elapsed: 49.867 sec
    Running org.apache.hadoop.hbase.coprocessor.TestAggregateProtocol
    Tests run: 45, Failures: 0, Errors: 0, Skipped: 0, Time elapsed: 20.053 sec
    Running org.apache.hadoop.hbase.coprocessor.TestClassLoading
    Tests run: 6, Failures: 0, Errors: 0, Skipped: 0, Time elapsed: 35.96 sec
    Running org.apache.hadoop.hbase.coprocessor.TestRegionServerCoprocessorExceptionWithAbort
    Tests run: 1, Failures: 0, Errors: 0, Skipped: 0, Time elapsed: 14.609 sec
    Running org.apache.hadoop.hbase.coprocessor.TestRegionServerCoprocessorExceptionWithRemove
    Tests run: 1, Failures: 0, Errors: 0, Skipped: 0, Time elapsed: 18.256 sec
    Running org.apache.hadoop.hbase.coprocessor.TestMasterObserver
    Tests run: 3, Failures: 0, Errors: 0, Skipped: 0, Time elapsed: 28.014 sec
    Running org.apache.hadoop.hbase.coprocessor.TestCoprocessorEndpoint
    Tests run: 3, Failures: 0, Errors: 0, Skipped: 1, Time elapsed: 30.587 sec
    Running org.apache.hadoop.hbase.coprocessor.TestMasterCoprocessorExceptionWithAbort
    Tests run: 1, Failures: 0, Errors: 0, Skipped: 0, Time elapsed: 11.435 sec
    Running org.apache.hadoop.hbase.coprocessor.TestWALObserver
    Tests run: 3, Failures: 0, Errors: 0, Skipped: 0, Time elapsed: 17.54 sec
    Running org.apache.hadoop.hbase.coprocessor.TestRegionObserverInterface
    Tests run: 6, Failures: 0, Errors: 0, Skipped: 0, Time elapsed: 34.264 sec
    Running org.apache.hadoop.hbase.coprocessor.TestMasterCoprocessorExceptionWithRemove
    Tests run: 1, Failures: 0, Errors: 0, Skipped: 0, Time elapsed: 20.551 sec
    Running org.apache.hadoop.hbase.coprocessor.TestRegionObserverBypass
    Tests run: 2, Failures: 0, Errors: 0, Skipped: 0, Time elapsed: 12.908 sec
    Running org.apache.hadoop.hbase.regionserver.wal.TestHLogSplit
    Tests run: 30, Failures: 0, Errors: 0, Skipped: 1, Time elapsed: 247.063 sec
    Running org.apache.hadoop.hbase.TestGlobalMemStoreSize
    Tests run: 1, Failures: 0, Errors: 0, Skipped: 0, Time elapsed: 25.059 sec
    Running org.apache.hadoop.hbase.mapred.TestTableInputFormat
    Tests run: 10, Failures: 0, Errors: 0, Skipped: 0, Time elapsed: 40.073 sec
    Running org.apache.hadoop.hbase.mapreduce.TestHLogRecordReader
    Tests run: 2, Failures: 0, Errors: 0, Skipped: 0, Time elapsed: 13.324 sec
    Running org.apache.hadoop.hbase.mapred.TestTableMapReduce
    Tests run: 1, Failures: 0, Errors: 0, Skipped: 0, Time elapsed: 108.795 sec
    Running org.apache.hadoop.hbase.mapreduce.TestLoadIncrementalHFilesSplitRecovery
    Tests run: 4, Failures: 0, Errors: 0, Skipped: 0, Time elapsed: 107.873 sec
    Running org.apache.hadoop.hbase.mapreduce.TestTableMapReduce
    Tests run: 1, Failures: 0, Errors: 0, Skipped: 0, Time elapsed: 127.93 sec
    Running org.apache.hadoop.hbase.mapreduce.TestWALPlayer
    Tests run: 1, Failures: 0, Errors: 0, Skipped: 0, Time elapsed: 64.237 sec
    Running org.apache.hadoop.hbase.mapreduce.TestImportTsv
    Tests run: 9, Failures: 0, Errors: 0, Skipped: 0, Time elapsed: 152.851 sec
    Running org.apache.hadoop.hbase.regionserver.wal.TestLogRolling
    Tests run: 3, Failures: 0, Errors: 0, Skipped: 0, Time elapsed: 544.52 sec
    Running org.apache.hadoop.hbase.mapreduce.TestHFileOutputFormat
    Tests run: 9, Failures: 0, Errors: 0, Skipped: 0, Time elapsed: 257.687 sec
    Running org.apache.hadoop.hbase.mapreduce.TestTimeRangeMapRed
    Tests run: 1, Failures: 0, Errors: 0, Skipped: 0, Time elapsed: 48.426 sec
    Running org.apache.hadoop.hbase.mapreduce.TestLoadIncrementalHFiles
    Tests run: 6, Failures: 0, Errors: 0, Skipped: 0, Time elapsed: 39.521 sec
    Running org.apache.hadoop.hbase.mapreduce.TestImportExport
    Tests run: 2, Failures: 0, Errors: 0, Skipped: 0, Time elapsed: 54.919 sec
    Running org.apache.hadoop.hbase.mapreduce.TestMultithreadedTableMapper
    Tests run: 1, Failures: 0, Errors: 0, Skipped: 0, Time elapsed: 137.322 sec
    Running org.apache.hadoop.hbase.catalog.TestMetaReaderEditorNoCluster
    Tests run: 1, Failures: 0, Errors: 0, Skipped: 0, Time elapsed: 4.921 sec
    Running org.apache.hadoop.hbase.thrift2.TestThriftHBaseServiceHandler
    Tests run: 12, Failures: 0, Errors: 0, Skipped: 0, Time elapsed: 18.742 sec
    Running org.apache.hadoop.hbase.catalog.TestMetaReaderEditor
    Tests run: 5, Failures: 0, Errors: 0, Skipped: 0, Time elapsed: 26.092 sec
    Running org.apache.hadoop.hbase.catalog.TestCatalogTracker
    Tests run: 9, Failures: 0, Errors: 0, Skipped: 1, Time elapsed: 6.488 sec
    Running org.apache.hadoop.hbase.TestAcidGuarantees
    Tests run: 3, Failures: 0, Errors: 0, Skipped: 0, Time elapsed: 103.31 sec
    Running org.apache.hadoop.hbase.client.TestTimestampsFilter
    Tests run: 3, Failures: 0, Errors: 0, Skipped: 0, Time elapsed: 20.679 sec
    Running org.apache.hadoop.hbase.catalog.TestCatalogTrackerOnCluster
    Tests run: 1, Failures: 0, Errors: 0, Skipped: 0, Time elapsed: 77.746 sec
    Running org.apache.hadoop.hbase.client.TestHCM
    Tests run: 6, Failures: 0, Errors: 0, Skipped: 0, Time elapsed: 18.606 sec
    Running org.apache.hadoop.hbase.client.TestShell
    Tests run: 1, Failures: 0, Errors: 0, Skipped: 0, Time elapsed: 90.764 sec
    Running org.apache.hadoop.hbase.client.TestMetaScanner
    Tests run: 1, Failures: 0, Errors: 0, Skipped: 0, Time elapsed: 15.801 sec
    Running org.apache.hadoop.hbase.client.TestScannerTimeout
    Tests run: 4, Failures: 0, Errors: 0, Skipped: 0, Time elapsed: 46.5 sec
    Running org.apache.hadoop.hbase.client.TestHTableUtil
    Tests run: 2, Failures: 0, Errors: 0, Skipped: 0, Time elapsed: 16.479 sec
    Running org.apache.hadoop.hbase.client.TestMetaMigrationRemovingHTD
    Tests run: 3, Failures: 0, Errors: 0, Skipped: 0, Time elapsed: 24.742 sec
    Running org.apache.hadoop.hbase.client.TestHTablePool$TestHTableReusablePool
    Tests run: 9, Failures: 0, Errors: 0, Skipped: 0, Time elapsed: 4.14 sec
    Running org.apache.hadoop.hbase.client.TestHTablePool$TestHTableThreadLocalPool
    Tests run: 9, Failures: 0, Errors: 0, Skipped: 0, Time elapsed: 26.065 sec
    Running org.apache.hadoop.hbase.client.replication.TestReplicationAdmin
    Tests run: 1, Failures: 0, Errors: 0, Skipped: 0, Time elapsed: 1.296 sec
    Running org.apache.hadoop.hbase.client.TestMultipleTimestamps
    Tests run: 8, Failures: 0, Errors: 0, Skipped: 0, Time elapsed: 36.597 sec
    Running org.apache.hadoop.hbase.client.TestFromClientSide
    Tests run: 55, Failures: 1, Errors: 0, Skipped: 3, Time elapsed: 176.32 sec <<< FAILURE!
    Running org.apache.hadoop.hbase.metrics.TestMetricsMBeanBase
    Tests run: 2, Failures: 0, Errors: 0, Skipped: 0, Time elapsed: 1.121 sec
    Running org.apache.hadoop.hbase.client.TestMultiParallel
    Tests run: 11, Failures: 0, Errors: 0, Skipped: 0, Time elapsed: 40.737 sec
    Running org.apache.hadoop.hbase.rest.TestGzipFilter
    Tests run: 3, Failures: 0, Errors: 0, Skipped: 0, Time elapsed: 17.674 sec
    Running org.apache.hadoop.hbase.constraint.TestConstraint
    Tests run: 5, Failures: 0, Errors: 0, Skipped: 0, Time elapsed: 30.758 sec
    Running org.apache.hadoop.hbase.rest.TestMultiRowResource
    Tests run: 3, Failures: 0, Errors: 0, Skipped: 0, Time elapsed: 14.565 sec
    Running org.apache.hadoop.hbase.rest.TestScannersWithFilters
    Tests run: 10, Failures: 0, Errors: 0, Skipped: 0, Time elapsed: 18.474 sec
    Running org.apache.hadoop.hbase.rest.TestRowResource
    Tests run: 11, Failures: 0, Errors: 0, Skipped: 0, Time elapsed: 15.826 sec
    Running org.apache.hadoop.hbase.rest.client.TestRemoteAdmin
    Tests run: 1, Failures: 0, Errors: 0, Skipped: 0, Time elapsed: 15.454 sec
    Running org.apache.hadoop.hbase.rest.client.TestRemoteTable
    Tests run: 3, Failures: 0, Errors: 0, Skipped: 0, Time elapsed: 15.926 sec
    Running org.apache.hadoop.hbase.rest.TestVersionResource
    Tests run: 7, Failures: 0, Errors: 0, Skipped: 0, Time elapsed: 11.859 sec
    Running org.apache.hadoop.hbase.rest.TestScannerResource
    Tests run: 5, Failures: 0, Errors: 0, Skipped: 0, Time elapsed: 28.669 sec
    Running org.apache.hadoop.hbase.rest.TestTableResource
    Tests run: 8, Failures: 0, Errors: 0, Skipped: 0, Time elapsed: 22.987 sec
    Running org.apache.hadoop.hbase.rest.TestStatusResource
    Tests run: 2, Failures: 0, Errors: 0, Skipped: 0, Time elapsed: 11.922 sec
    Running org.apache.hadoop.hbase.rest.TestSchemaResource
    Tests run: 2, Failures: 0, Errors: 0, Skipped: 0, Time elapsed: 19.107 sec
    Running org.apache.hadoop.hbase.mapreduce.TestTableInputFormatScan
    Tests run: 12, Failures: 0, Errors: 0, Skipped: 0, Time elapsed: 599.117 sec
    Running org.apache.hadoop.hbase.io.encoding.TestLoadAndSwitchEncodeOnDisk
    Tests run: 1, Failures: 0, Errors: 0, Skipped: 0, Time elapsed: 27.144 sec
    Running org.apache.hadoop.hbase.thrift.TestThriftServer
    Tests run: 1, Failures: 0, Errors: 0, Skipped: 0, Time elapsed: 41.213 sec
    Running org.apache.hadoop.hbase.client.TestAdmin
    Tests run: 37, Failures: 0, Errors: 0, Skipped: 0, Time elapsed: 185.507 sec
    Running org.apache.hadoop.hbase.io.encoding.TestUpgradeFromHFileV1ToEncoding
    Tests run: 1, Failures: 0, Errors: 0, Skipped: 0, Time elapsed: 87.325 sec
    Running org.apache.hadoop.hbase.io.hfile.TestHFileSeek
    Tests run: 1, Failures: 0, Errors: 0, Skipped: 0, Time elapsed: 8.801 sec
    Running org.apache.hadoop.hbase.io.hfile.slab.TestSlabCache
    Tests run: 7, Failures: 0, Errors: 0, Skipped: 0, Time elapsed: 19.992 sec
    Running org.apache.hadoop.hbase.io.encoding.TestDataBlockEncoders
    Tests run: 12, Failures: 0, Errors: 0, Skipped: 0, Time elapsed: 146.728 sec
    Running org.apache.hadoop.hbase.io.hfile.TestChecksum
    Tests run: 3, Failures: 0, Errors: 0, Skipped: 0, Time elapsed: 0.918 sec
    Running org.apache.hadoop.hbase.io.hfile.slab.TestSingleSizeCache
    Tests run: 5, Failures: 0, Errors: 0, Skipped: 0, Time elapsed: 28.998 sec
    Running org.apache.hadoop.hbase.io.hfile.TestLruBlockCache
    Tests run: 16, Failures: 0, Errors: 0, Skipped: 0, Time elapsed: 0.905 sec
    Running org.apache.hadoop.hbase.io.hfile.TestHFileBlockIndex
    Tests run: 10, Failures: 0, Errors: 0, Skipped: 0, Time elapsed: 13.176 sec
    Running org.apache.hadoop.hbase.io.hfile.TestHFilePerformance
    Tests run: 1, Failures: 0, Errors: 0, Skipped: 0, Time elapsed: 6.967 sec
    Running org.apache.hadoop.hbase.io.hfile.TestFixedFileTrailer
    Tests run: 2, Failures: 0, Errors: 0, Skipped: 0, Time elapsed: 0.636 sec
    Running org.apache.hadoop.hbase.io.hfile.TestHFileBlockCompatibility
    Tests run: 10, Failures: 0, Errors: 0, Skipped: 0, Time elapsed: 1.373 sec
    Running org.apache.hadoop.hbase.io.hfile.TestHFileBlock
    Tests run: 16, Failures: 0, Errors: 0, Skipped: 0, Time elapsed: 50.912 sec
    Running org.apache.hadoop.hbase.io.hfile.TestForceCacheImportantBlocks
    Tests run: 4, Failures: 0, Errors: 0, Skipped: 0, Time elapsed: 69.6 sec
    Running org.apache.hadoop.hbase.io.encoding.TestChangingEncoding
    Tests run: 4, Failures: 0, Errors: 0, Skipped: 0, Time elapsed: 258.791 sec
    Running org.apache.hadoop.hbase.io.hfile.TestCacheOnWrite
    Tests run: 36, Failures: 0, Errors: 0, Skipped: 0, Time elapsed: 40.864 sec
    Running org.apache.hadoop.hbase.TestClusterBootOrder
    Tests run: 2, Failures: 0, Errors: 0, Skipped: 0, Time elapsed: 28.603 sec
    Running org.apache.hadoop.hbase.replication.regionserver.TestReplicationSourceManager
    Tests run: 1, Failures: 0, Errors: 0, Skipped: 0, Time elapsed: 1.349 sec
    Running org.apache.hadoop.hbase.replication.regionserver.TestReplicationSink
    Tests run: 5, Failures: 0, Errors: 0, Skipped: 0, Time elapsed: 17.057 sec
    Running org.apache.hadoop.hbase.avro.TestAvroServer
    Tests run: 3, Failures: 0, Errors: 0, Skipped: 0, Time elapsed: 30.461 sec
    Running org.apache.hadoop.hbase.replication.TestReplicationSource
    Tests run: 1, Failures: 0, Errors: 0, Skipped: 0, Time elapsed: 3.71 sec
    Running org.apache.hadoop.hbase.replication.TestReplicationPeer
    Tests run: 1, Failures: 0, Errors: 0, Skipped: 0, Time elapsed: 7.603 sec
    Running org.apache.hadoop.hbase.replication.TestReplicationZookeeper
    Tests run: 1, Failures: 0, Errors: 0, Skipped: 0, Time elapsed: 0.712 sec
    Running org.apache.hadoop.hbase.replication.TestMultiSlaveReplication
    Tests run: 1, Failures: 0, Errors: 0, Skipped: 0, Time elapsed: 43.987 sec
    Running org.apache.hadoop.hbase.ipc.TestDelayedRpc
    Tests run: 4, Failures: 0, Errors: 0, Skipped: 0, Time elapsed: 2.562 sec
    Running org.apache.hadoop.hbase.thrift.TestThriftServerCmdLine
    Tests run: 20, Failures: 0, Errors: 0, Skipped: 0, Time elapsed: 392.821 sec
    Running org.apache.hadoop.hbase.TestZooKeeper
    Tests run: 8, Failures: 0, Errors: 0, Skipped: 0, Time elapsed: 36.857 sec
    Running org.apache.hadoop.hbase.replication.TestMasterReplication
    Tests run: 2, Failures: 0, Errors: 0, Skipped: 0, Time elapsed: 71.01 sec
    Running org.apache.hadoop.hbase.TestHBaseTestingUtility
    Tests run: 7, Failures: 0, Errors: 0, Skipped: 0, Time elapsed: 58.75 sec
    Running org.apache.hadoop.hbase.replication.TestReplication
    Tests run: 10, Failures: 0, Errors: 0, Skipped: 0, Time elapsed: 139.047 sec

    Results :

    Failed tests: testPoolBehavior(org.apache.hadoop.hbase.client.TestFromClientSide): expected:<3> but was:<4>

    Tests in error:
    testLocalHBaseCluster(org.apache.hadoop.hbase.TestLocalHBaseCluster): Master not initialized after 200 seconds

    Tests run: 931, Failures: 1, Errors: 1, Skipped: 9

    [INFO] ------------------------------------------------------------------------
    [INFO] BUILD FAILURE
    [INFO] ------------------------------------------------------------------------
    [INFO] Total time: 41:00.849s
    [INFO] Finished at: Wed May 23 18:11:29 UTC 2012
    [INFO] Final Memory: 49M/779M
    [INFO] ------------------------------------------------------------------------
    [ERROR] Failed to execute goal org.apache.maven.plugins:maven-surefire-plugin:2.12-TRUNK-HBASE-2:test (secondPartTestsExecution) on project hbase: There are test failures.
    [ERROR]
    [ERROR] Please refer to <https://builds.apache.org/job/HBase-0.94/ws/trunk/target/surefire-reports> for the individual test results.
    [ERROR] -> [Help 1]
    [ERROR]
    [ERROR] To see the full stack trace of the errors, re-run Maven with the -e switch.
    [ERROR] Re-run Maven using the -X switch to enable full debug logging.
    [ERROR]
    [ERROR] For more information about the errors and possible solutions, please read the following articles:
    [ERROR] [Help 1] http://cwiki.apache.org/confluence/display/MAVEN/MojoFailureException
    Build step 'Invoke top-level Maven targets' marked build as failure
    Archiving artifacts
    Updating HBASE-6069
    Recording test results
  • Apache Jenkins Server at May 23, 2012 at 7:40 pm
    See <https://builds.apache.org/job/HBase-0.94/211/>

    ------------------------------------------
    [...truncated 563 lines...]
    Tests run: 10, Failures: 0, Errors: 0, Skipped: 0, Time elapsed: 14.285 sec
    Running org.apache.hadoop.hbase.io.hfile.TestChecksum
    Tests run: 3, Failures: 0, Errors: 0, Skipped: 0, Time elapsed: 2.493 sec
    Running org.apache.hadoop.hbase.io.hfile.TestForceCacheImportantBlocks
    Tests run: 4, Failures: 0, Errors: 0, Skipped: 0, Time elapsed: 62 sec
    Running org.apache.hadoop.hbase.io.hfile.TestHFilePerformance
    Tests run: 1, Failures: 0, Errors: 0, Skipped: 0, Time elapsed: 9.037 sec
    Running org.apache.hadoop.hbase.io.hfile.TestHFileBlock
    Tests run: 16, Failures: 0, Errors: 0, Skipped: 0, Time elapsed: 49.019 sec
    Running org.apache.hadoop.hbase.io.hfile.TestFixedFileTrailer
    Tests run: 2, Failures: 0, Errors: 0, Skipped: 0, Time elapsed: 1.055 sec
    Running org.apache.hadoop.hbase.io.hfile.TestHFileSeek
    Tests run: 1, Failures: 0, Errors: 0, Skipped: 0, Time elapsed: 11.226 sec
    Running org.apache.hadoop.hbase.io.hfile.slab.TestSlabCache
    Tests run: 7, Failures: 0, Errors: 0, Skipped: 0, Time elapsed: 25.656 sec
    Running org.apache.hadoop.hbase.zookeeper.TestZKTable
    Tests run: 1, Failures: 0, Errors: 0, Skipped: 0, Time elapsed: 1.288 sec
    Running org.apache.hadoop.hbase.zookeeper.TestZKLeaderManager
    Tests run: 1, Failures: 0, Errors: 0, Skipped: 0, Time elapsed: 1.129 sec
    Running org.apache.hadoop.hbase.io.hfile.slab.TestSingleSizeCache
    Tests run: 5, Failures: 0, Errors: 0, Skipped: 0, Time elapsed: 38.356 sec
    Running org.apache.hadoop.hbase.zookeeper.TestZooKeeperNodeTracker
    Tests run: 2, Failures: 0, Errors: 0, Skipped: 0, Time elapsed: 0.723 sec
    Running org.apache.hadoop.hbase.io.encoding.TestChangingEncoding
    Tests run: 4, Failures: 0, Errors: 0, Skipped: 0, Time elapsed: 250.753 sec
    Running org.apache.hadoop.hbase.rest.TestSchemaResource
    Tests run: 2, Failures: 0, Errors: 0, Skipped: 0, Time elapsed: 20.818 sec
    Running org.apache.hadoop.hbase.io.hfile.TestCacheOnWrite
    Tests run: 36, Failures: 0, Errors: 0, Skipped: 0, Time elapsed: 38.477 sec
    Running org.apache.hadoop.hbase.rest.TestGzipFilter
    Tests run: 3, Failures: 0, Errors: 0, Skipped: 0, Time elapsed: 14.523 sec
    Running org.apache.hadoop.hbase.rest.TestRowResource
    Tests run: 11, Failures: 0, Errors: 0, Skipped: 0, Time elapsed: 14.916 sec
    Running org.apache.hadoop.hbase.rest.TestMultiRowResource
    Tests run: 3, Failures: 0, Errors: 0, Skipped: 0, Time elapsed: 13.577 sec
    Running org.apache.hadoop.hbase.rest.client.TestRemoteTable
    Tests run: 3, Failures: 0, Errors: 0, Skipped: 0, Time elapsed: 14.068 sec
    Running org.apache.hadoop.hbase.rest.TestVersionResource
    Tests run: 7, Failures: 0, Errors: 0, Skipped: 0, Time elapsed: 11.338 sec
    Running org.apache.hadoop.hbase.rest.client.TestRemoteAdmin
    Tests run: 1, Failures: 0, Errors: 0, Skipped: 0, Time elapsed: 14.952 sec
    Running org.apache.hadoop.hbase.rest.TestTableResource
    Tests run: 8, Failures: 0, Errors: 0, Skipped: 0, Time elapsed: 20.962 sec
    Running org.apache.hadoop.hbase.rest.TestStatusResource
    Tests run: 2, Failures: 0, Errors: 0, Skipped: 0, Time elapsed: 11.018 sec
    Running org.apache.hadoop.hbase.TestInfoServers
    Tests run: 2, Failures: 0, Errors: 0, Skipped: 0, Time elapsed: 11.949 sec
    Running org.apache.hadoop.hbase.monitoring.TestTaskMonitor
    Tests run: 3, Failures: 0, Errors: 0, Skipped: 0, Time elapsed: 0.329 sec
    Running org.apache.hadoop.hbase.monitoring.TestMemoryBoundedLogMessageBuffer
    Tests run: 2, Failures: 0, Errors: 0, Skipped: 0, Time elapsed: 0.257 sec
    Running org.apache.hadoop.hbase.rest.TestScannerResource
    Tests run: 5, Failures: 0, Errors: 0, Skipped: 0, Time elapsed: 29.401 sec
    Running org.apache.hadoop.hbase.metrics.TestMetricsMBeanBase
    Tests run: 2, Failures: 0, Errors: 0, Skipped: 0, Time elapsed: 1.144 sec
    Running org.apache.hadoop.hbase.rest.TestScannersWithFilters
    Tests run: 10, Failures: 0, Errors: 0, Skipped: 0, Time elapsed: 17.724 sec
    Running org.apache.hadoop.hbase.regionserver.TestServerCustomProtocol
    Tests run: 7, Failures: 0, Errors: 0, Skipped: 0, Time elapsed: 17.099 sec
    Running org.apache.hadoop.hbase.zookeeper.TestZooKeeperACL
    Tests run: 5, Failures: 0, Errors: 0, Skipped: 0, Time elapsed: 103.28 sec
    Running org.apache.hadoop.hbase.regionserver.TestAtomicOperation
    Tests run: 5, Failures: 0, Errors: 0, Skipped: 0, Time elapsed: 38.174 sec
    Running org.apache.hadoop.hbase.regionserver.TestHRegion
    Tests run: 62, Failures: 0, Errors: 0, Skipped: 0, Time elapsed: 43.468 sec
    Running org.apache.hadoop.hbase.regionserver.wal.TestWALReplayCompressed
    Tests run: 5, Failures: 0, Errors: 0, Skipped: 0, Time elapsed: 35.604 sec
    Running org.apache.hadoop.hbase.regionserver.TestEndToEndSplitTransaction
    Tests run: 1, Failures: 0, Errors: 0, Skipped: 0, Time elapsed: 45.239 sec
    Running org.apache.hadoop.hbase.regionserver.wal.TestWALReplay
    Tests run: 5, Failures: 0, Errors: 0, Skipped: 0, Time elapsed: 27.507 sec
    Running org.apache.hadoop.hbase.regionserver.wal.TestHLog
    Tests run: 10, Failures: 0, Errors: 0, Skipped: 0, Time elapsed: 59.927 sec
    Running org.apache.hadoop.hbase.regionserver.wal.TestLogRollingNoCluster
    Tests run: 1, Failures: 0, Errors: 0, Skipped: 0, Time elapsed: 2.122 sec
    Running org.apache.hadoop.hbase.regionserver.wal.TestHLogBench
    Tests run: 1, Failures: 0, Errors: 0, Skipped: 0, Time elapsed: 1.351 sec
    Running org.apache.hadoop.hbase.regionserver.TestStore
    Tests run: 12, Failures: 0, Errors: 0, Skipped: 0, Time elapsed: 9.358 sec
    Running org.apache.hadoop.hbase.regionserver.TestRpcMetrics
    Tests run: 1, Failures: 0, Errors: 0, Skipped: 0, Time elapsed: 2.038 sec
    Running org.apache.hadoop.hbase.regionserver.TestBlocksRead
    Tests run: 4, Failures: 0, Errors: 0, Skipped: 0, Time elapsed: 1.005 sec
    Running org.apache.hadoop.hbase.regionserver.wal.TestLogRollAbort
    Tests run: 1, Failures: 0, Errors: 0, Skipped: 0, Time elapsed: 162.291 sec
    Running org.apache.hadoop.hbase.regionserver.TestHRegionOnCluster
    Tests run: 1, Failures: 0, Errors: 0, Skipped: 0, Time elapsed: 20.577 sec
    Running org.apache.hadoop.hbase.regionserver.metrics.TestSchemaMetrics
    Tests run: 6, Failures: 0, Errors: 0, Skipped: 0, Time elapsed: 15.318 sec
    Running org.apache.hadoop.hbase.regionserver.TestParallelPut
    Tests run: 2, Failures: 0, Errors: 0, Skipped: 0, Time elapsed: 5.872 sec
    Running org.apache.hadoop.hbase.regionserver.wal.TestLogRolling
    Running org.apache.hadoop.hbase.regionserver.TestStoreScanner
    Tests run: 16, Failures: 0, Errors: 0, Skipped: 0, Time elapsed: 0.068 sec
    Tests run: 3, Failures: 0, Errors: 0, Skipped: 0, Time elapsed: 153.968 sec
    Running org.apache.hadoop.hbase.regionserver.TestRegionServerMetrics
    Tests run: 3, Failures: 0, Errors: 0, Skipped: 0, Time elapsed: 53.51 sec
    Running org.apache.hadoop.hbase.regionserver.TestStoreFileBlockCacheSummary
    Tests run: 1, Failures: 0, Errors: 0, Skipped: 0, Time elapsed: 13.605 sec
    Running org.apache.hadoop.hbase.regionserver.handler.TestCloseRegionHandler
    Tests run: 3, Failures: 0, Errors: 0, Skipped: 0, Time elapsed: 1.349 sec
    Running org.apache.hadoop.hbase.regionserver.handler.TestOpenRegionHandler
    Tests run: 3, Failures: 0, Errors: 0, Skipped: 0, Time elapsed: 1.029 sec
    Running org.apache.hadoop.hbase.regionserver.TestSplitTransactionOnCluster
    Tests run: 6, Failures: 0, Errors: 0, Skipped: 0, Time elapsed: 49.003 sec
    Running org.apache.hadoop.hbase.regionserver.TestMultiColumnScanner
    Tests run: 12, Failures: 0, Errors: 0, Skipped: 0, Time elapsed: 44.377 sec
    Running org.apache.hadoop.hbase.regionserver.TestMasterAddressManager
    Tests run: 1, Failures: 0, Errors: 0, Skipped: 0, Time elapsed: 0.744 sec
    Running org.apache.hadoop.hbase.regionserver.TestSplitLogWorker
    Tests run: 5, Failures: 0, Errors: 0, Skipped: 0, Time elapsed: 2.257 sec
    Running org.apache.hadoop.hbase.regionserver.TestSeekOptimizations
    Tests run: 6, Failures: 0, Errors: 0, Skipped: 0, Time elapsed: 3.161 sec
    Running org.apache.hadoop.hbase.regionserver.TestHRegionServerBulkLoad
    Tests run: 1, Failures: 0, Errors: 0, Skipped: 0, Time elapsed: 45.672 sec
    Running org.apache.hadoop.hbase.filter.TestColumnRangeFilter
    Tests run: 1, Failures: 0, Errors: 0, Skipped: 0, Time elapsed: 18.956 sec
    Running org.apache.hadoop.hbase.TestGlobalMemStoreSize
    Tests run: 1, Failures: 0, Errors: 0, Skipped: 0, Time elapsed: 14.779 sec
    Running org.apache.hadoop.hbase.regionserver.TestFSErrorsExposed
    Tests run: 3, Failures: 0, Errors: 0, Skipped: 0, Time elapsed: 29.297 sec
    Running org.apache.hadoop.hbase.TestMultiVersions
    Tests run: 3, Failures: 0, Errors: 0, Skipped: 0, Time elapsed: 22.622 sec
    Running org.apache.hadoop.hbase.thrift2.TestThriftHBaseServiceHandler
    Tests run: 12, Failures: 0, Errors: 0, Skipped: 0, Time elapsed: 12.467 sec
    Running org.apache.hadoop.hbase.TestRegionRebalancing
    Tests run: 1, Failures: 0, Errors: 0, Skipped: 0, Time elapsed: 36.379 sec
    Running org.apache.hadoop.hbase.TestHBaseTestingUtility
    Tests run: 7, Failures: 0, Errors: 0, Skipped: 0, Time elapsed: 56.783 sec
    Running org.apache.hadoop.hbase.replication.TestReplicationZookeeper
    Tests run: 1, Failures: 0, Errors: 0, Skipped: 0, Time elapsed: 0.567 sec
    Running org.apache.hadoop.hbase.replication.regionserver.TestReplicationSourceManager
    Tests run: 1, Failures: 0, Errors: 0, Skipped: 0, Time elapsed: 0.972 sec
    Running org.apache.hadoop.hbase.regionserver.wal.TestHLogSplit
    Tests run: 30, Failures: 0, Errors: 0, Skipped: 1, Time elapsed: 246.272 sec
    Running org.apache.hadoop.hbase.replication.regionserver.TestReplicationSink
    Tests run: 5, Failures: 0, Errors: 0, Skipped: 0, Time elapsed: 13.765 sec
    Running org.apache.hadoop.hbase.replication.TestReplicationPeer
    Tests run: 1, Failures: 0, Errors: 0, Skipped: 0, Time elapsed: 7.585 sec
    Running org.apache.hadoop.hbase.replication.TestReplicationSource
    Tests run: 1, Failures: 0, Errors: 0, Skipped: 0, Time elapsed: 2.649 sec
    Running org.apache.hadoop.hbase.replication.TestMasterReplication
    Tests run: 2, Failures: 0, Errors: 0, Skipped: 0, Time elapsed: 60.387 sec
    Running org.apache.hadoop.hbase.avro.TestAvroServer
    Tests run: 3, Failures: 0, Errors: 0, Skipped: 0, Time elapsed: 25.59 sec
    Running org.apache.hadoop.hbase.replication.TestMultiSlaveReplication
    Tests run: 1, Failures: 0, Errors: 0, Skipped: 0, Time elapsed: 39.334 sec
    Running org.apache.hadoop.hbase.coprocessor.TestRegionServerCoprocessorExceptionWithRemove
    Tests run: 1, Failures: 0, Errors: 0, Skipped: 0, Time elapsed: 16.561 sec
    Running org.apache.hadoop.hbase.replication.TestReplication
    Tests run: 10, Failures: 0, Errors: 0, Skipped: 0, Time elapsed: 120.596 sec
    Running org.apache.hadoop.hbase.coprocessor.TestRegionObserverInterface
    Tests run: 6, Failures: 0, Errors: 0, Skipped: 0, Time elapsed: 31.619 sec
    Running org.apache.hadoop.hbase.coprocessor.TestMasterObserver
    Tests run: 3, Failures: 0, Errors: 0, Skipped: 0, Time elapsed: 26.16 sec
    Running org.apache.hadoop.hbase.TestAcidGuarantees
    Tests run: 3, Failures: 0, Errors: 0, Skipped: 0, Time elapsed: 94.249 sec
    Running org.apache.hadoop.hbase.coprocessor.TestCoprocessorEndpoint
    Tests run: 3, Failures: 0, Errors: 0, Skipped: 1, Time elapsed: 28.22 sec
    Running org.apache.hadoop.hbase.coprocessor.TestWALObserver
    Tests run: 3, Failures: 0, Errors: 0, Skipped: 0, Time elapsed: 14.054 sec
    Running org.apache.hadoop.hbase.coprocessor.TestMasterCoprocessorExceptionWithAbort
    Tests run: 1, Failures: 0, Errors: 0, Skipped: 0, Time elapsed: 10.628 sec
    Running org.apache.hadoop.hbase.coprocessor.TestRegionObserverBypass
    Tests run: 2, Failures: 0, Errors: 0, Skipped: 0, Time elapsed: 11.714 sec
    Running org.apache.hadoop.hbase.coprocessor.TestRegionServerCoprocessorExceptionWithAbort
    Tests run: 1, Failures: 0, Errors: 0, Skipped: 0, Time elapsed: 14.286 sec
    Running org.apache.hadoop.hbase.coprocessor.TestAggregateProtocol
    Tests run: 45, Failures: 0, Errors: 0, Skipped: 0, Time elapsed: 16.005 sec
    Running org.apache.hadoop.hbase.coprocessor.TestMasterCoprocessorExceptionWithRemove
    Tests run: 1, Failures: 0, Errors: 0, Skipped: 0, Time elapsed: 14.423 sec
    Running org.apache.hadoop.hbase.constraint.TestConstraint
    Tests run: 5, Failures: 0, Errors: 0, Skipped: 0, Time elapsed: 26.855 sec
    Running org.apache.hadoop.hbase.coprocessor.TestClassLoading
    Tests run: 6, Failures: 0, Errors: 0, Skipped: 0, Time elapsed: 32.544 sec
    Running org.apache.hadoop.hbase.master.TestOpenedRegionHandler
    Tests run: 2, Failures: 0, Errors: 0, Skipped: 0, Time elapsed: 13.553 sec
    Running org.apache.hadoop.hbase.master.TestActiveMasterManager
    Tests run: 2, Failures: 0, Errors: 0, Skipped: 0, Time elapsed: 1.237 sec
    Running org.apache.hadoop.hbase.mapred.TestTableInputFormat
    Tests run: 10, Failures: 0, Errors: 0, Skipped: 0, Time elapsed: 30.145 sec
    Running org.apache.hadoop.hbase.master.TestMasterRestartAfterDisablingTable
    Tests run: 1, Failures: 0, Errors: 0, Skipped: 0, Time elapsed: 17.979 sec
    Running org.apache.hadoop.hbase.TestLocalHBaseCluster
    Tests run: 1, Failures: 0, Errors: 1, Skipped: 0, Time elapsed: 201.389 sec <<< FAILURE!
    Running org.apache.hadoop.hbase.mapred.TestTableMapReduce
    Tests run: 1, Failures: 0, Errors: 0, Skipped: 0, Time elapsed: 93.399 sec
    Running org.apache.hadoop.hbase.master.TestMasterTransitions
    Tests run: 3, Failures: 0, Errors: 0, Skipped: 3, Time elapsed: 17.844 sec
    Running org.apache.hadoop.hbase.master.TestMasterStatusServlet
    Tests run: 5, Failures: 0, Errors: 0, Skipped: 0, Time elapsed: 1.151 sec
    Running org.apache.hadoop.hbase.master.TestClockSkewDetection
    Tests run: 1, Failures: 0, Errors: 0, Skipped: 0, Time elapsed: 0.292 sec
    Running org.apache.hadoop.hbase.master.TestDefaultLoadBalancer
    Tests run: 4, Failures: 0, Errors: 0, Skipped: 0, Time elapsed: 1.55 sec
    Running org.apache.hadoop.hbase.master.TestMasterFailover
    Tests run: 4, Failures: 0, Errors: 0, Skipped: 0, Time elapsed: 61.157 sec
    Running org.apache.hadoop.hbase.master.TestHMasterRPCException
    Tests run: 1, Failures: 0, Errors: 0, Skipped: 0, Time elapsed: 1.18 sec
    Running org.apache.hadoop.hbase.master.TestRollingRestart
    Tests run: 1, Failures: 0, Errors: 0, Skipped: 0, Time elapsed: 44.349 sec
    Running org.apache.hadoop.hbase.master.TestMaster
    Tests run: 1, Failures: 0, Errors: 0, Skipped: 0, Time elapsed: 15.082 sec
    Running org.apache.hadoop.hbase.master.TestRestartCluster
    Tests run: 2, Failures: 0, Errors: 0, Skipped: 0, Time elapsed: 26.567 sec
    Running org.apache.hadoop.hbase.master.TestDeadServer
    Tests run: 1, Failures: 0, Errors: 0, Skipped: 0, Time elapsed: 0.206 sec
    Running org.apache.hadoop.hbase.master.TestLogsCleaner
    Tests run: 1, Failures: 0, Errors: 0, Skipped: 0, Time elapsed: 3.273 sec
    Running org.apache.hadoop.hbase.master.TestMasterShutdown
    Tests run: 1, Failures: 0, Errors: 0, Skipped: 0, Time elapsed: 13.388 sec
    Running org.apache.hadoop.hbase.master.TestSplitLogManager
    Tests run: 12, Failures: 0, Errors: 0, Skipped: 0, Time elapsed: 14.251 sec
    Running org.apache.hadoop.hbase.master.TestMasterZKSessionRecovery
    Tests run: 2, Failures: 0, Errors: 0, Skipped: 0, Time elapsed: 17.244 sec
    Running org.apache.hadoop.hbase.master.TestZKBasedOpenCloseRegion
    Tests run: 4, Failures: 0, Errors: 0, Skipped: 0, Time elapsed: 19.274 sec
    Running org.apache.hadoop.hbase.master.TestDistributedLogSplitting
    Tests run: 4, Failures: 0, Errors: 0, Skipped: 0, Time elapsed: 97.691 sec

    Results :

    Failed tests: testClientSessionExpired(org.apache.hadoop.hbase.TestZooKeeper)

    Tests in error:
    testLocalHBaseCluster(org.apache.hadoop.hbase.TestLocalHBaseCluster): Master not initialized after 200 seconds

    Tests run: 931, Failures: 1, Errors: 1, Skipped: 9

    [INFO] ------------------------------------------------------------------------
    [INFO] BUILD FAILURE
    [INFO] ------------------------------------------------------------------------
    [INFO] Total time: 37:11.354s
    [INFO] Finished at: Wed May 23 19:39:26 UTC 2012
    [INFO] Final Memory: 48M/786M
    [INFO] ------------------------------------------------------------------------
    [ERROR] Failed to execute goal org.apache.maven.plugins:maven-surefire-plugin:2.12-TRUNK-HBASE-2:test (secondPartTestsExecution) on project hbase: There are test failures.
    [ERROR]
    [ERROR] Please refer to <https://builds.apache.org/job/HBase-0.94/ws/trunk/target/surefire-reports> for the individual test results.
    [ERROR] -> [Help 1]
    [ERROR]
    [ERROR] To see the full stack trace of the errors, re-run Maven with the -e switch.
    [ERROR] Re-run Maven using the -X switch to enable full debug logging.
    [ERROR]
    [ERROR] For more information about the errors and possible solutions, please read the following articles:
    [ERROR] [Help 1] http://cwiki.apache.org/confluence/display/MAVEN/MojoFailureException
    Build step 'Invoke top-level Maven targets' marked build as failure
    Archiving artifacts
    Recording test results
  • Apache Jenkins Server at May 23, 2012 at 9:25 pm
    See <https://builds.apache.org/job/HBase-0.94/212/changes>

    Changes:

    [tedyu] HBASE-6065 Log for flush would append a non-sequential edit in the hlog, leading to possible data loss (Chunhui)

    ------------------------------------------
    [...truncated 588 lines...]
    Running org.apache.hadoop.hbase.replication.TestMultiSlaveReplication
    Tests run: 1, Failures: 0, Errors: 0, Skipped: 0, Time elapsed: 76.592 sec
    Running org.apache.hadoop.hbase.TestLocalHBaseCluster
    Tests run: 1, Failures: 0, Errors: 0, Skipped: 0, Time elapsed: 7.598 sec
    Running org.apache.hadoop.hbase.io.encoding.TestChangingEncoding
    Tests run: 4, Failures: 0, Errors: 1, Skipped: 0, Time elapsed: 603.958 sec <<< FAILURE!
    Running org.apache.hadoop.hbase.replication.TestMasterReplication
    Tests run: 2, Failures: 0, Errors: 0, Skipped: 0, Time elapsed: 130.764 sec
    Running org.apache.hadoop.hbase.coprocessor.TestAggregateProtocol
    Tests run: 45, Failures: 0, Errors: 0, Skipped: 0, Time elapsed: 22.802 sec
    Running org.apache.hadoop.hbase.coprocessor.TestClassLoading
    Tests run: 6, Failures: 0, Errors: 0, Skipped: 0, Time elapsed: 44.085 sec
    Running org.apache.hadoop.hbase.coprocessor.TestRegionObserverBypass
    Tests run: 2, Failures: 0, Errors: 0, Skipped: 0, Time elapsed: 23.461 sec
    Running org.apache.hadoop.hbase.coprocessor.TestRegionServerCoprocessorExceptionWithAbort
    Tests run: 1, Failures: 0, Errors: 0, Skipped: 0, Time elapsed: 30.286 sec
    Running org.apache.hadoop.hbase.coprocessor.TestCoprocessorEndpoint
    Tests run: 3, Failures: 0, Errors: 0, Skipped: 1, Time elapsed: 49.44 sec
    Running org.apache.hadoop.hbase.coprocessor.TestRegionObserverInterface
    Tests run: 6, Failures: 0, Errors: 0, Skipped: 0, Time elapsed: 51.694 sec
    Running org.apache.hadoop.hbase.coprocessor.TestMasterCoprocessorExceptionWithRemove
    Tests run: 1, Failures: 0, Errors: 0, Skipped: 0, Time elapsed: 19.959 sec
    Running org.apache.hadoop.hbase.coprocessor.TestRegionServerCoprocessorExceptionWithRemove
    Tests run: 1, Failures: 0, Errors: 0, Skipped: 0, Time elapsed: 24.744 sec
    Running org.apache.hadoop.hbase.coprocessor.TestWALObserver
    Tests run: 3, Failures: 0, Errors: 0, Skipped: 0, Time elapsed: 22.943 sec
    Running org.apache.hadoop.hbase.coprocessor.TestMasterObserver
    Tests run: 3, Failures: 0, Errors: 0, Skipped: 0, Time elapsed: 40.691 sec
    Running org.apache.hadoop.hbase.replication.TestReplication
    Tests run: 10, Failures: 0, Errors: 0, Skipped: 0, Time elapsed: 201.803 sec
    Running org.apache.hadoop.hbase.util.TestMergeTable
    Tests run: 1, Failures: 0, Errors: 0, Skipped: 0, Time elapsed: 41.431 sec
    Running org.apache.hadoop.hbase.util.TestFSUtils
    Tests run: 4, Failures: 0, Errors: 0, Skipped: 0, Time elapsed: 50.781 sec
    Running org.apache.hadoop.hbase.coprocessor.TestMasterCoprocessorExceptionWithAbort
    Tests run: 1, Failures: 0, Errors: 0, Skipped: 0, Time elapsed: 75.664 sec
    Running org.apache.hadoop.hbase.util.hbck.TestOfflineMetaRebuildOverlap
    Tests run: 1, Failures: 0, Errors: 0, Skipped: 0, Time elapsed: 31.438 sec
    Running org.apache.hadoop.hbase.util.hbck.TestOfflineMetaRebuildBase
    Tests run: 1, Failures: 0, Errors: 0, Skipped: 0, Time elapsed: 39.26 sec
    Running org.apache.hadoop.hbase.util.TestPoolMap$TestRoundRobinPoolType
    Tests run: 3, Failures: 0, Errors: 0, Skipped: 0, Time elapsed: 0.008 sec
    Running org.apache.hadoop.hbase.util.TestPoolMap$TestThreadLocalPoolType
    Tests run: 3, Failures: 0, Errors: 0, Skipped: 0, Time elapsed: 0.014 sec
    Running org.apache.hadoop.hbase.util.TestPoolMap$TestReusablePoolType
    Tests run: 3, Failures: 0, Errors: 0, Skipped: 0, Time elapsed: 0.038 sec
    Running org.apache.hadoop.hbase.util.hbck.TestOfflineMetaRebuildHole
    Tests run: 1, Failures: 0, Errors: 0, Skipped: 0, Time elapsed: 38.039 sec
    Running org.apache.hadoop.hbase.util.TestIdLock
    Tests run: 1, Failures: 0, Errors: 0, Skipped: 0, Time elapsed: 15.389 sec
    Running org.apache.hadoop.hbase.util.TestDefaultEnvironmentEdge
    Tests run: 1, Failures: 0, Errors: 0, Skipped: 0, Time elapsed: 0.195 sec
    Running org.apache.hadoop.hbase.util.TestMiniClusterLoadEncoded
    Tests run: 4, Failures: 0, Errors: 0, Skipped: 0, Time elapsed: 187.072 sec
    Running org.apache.hadoop.hbase.util.TestFSTableDescriptors
    Tests run: 10, Failures: 0, Errors: 0, Skipped: 0, Time elapsed: 0.897 sec
    Running org.apache.hadoop.hbase.util.TestEnvironmentEdgeManager
    Tests run: 2, Failures: 0, Errors: 0, Skipped: 0, Time elapsed: 0.451 sec
    Running org.apache.hadoop.hbase.util.TestMergeTool
    Tests run: 1, Failures: 0, Errors: 0, Skipped: 0, Time elapsed: 249.736 sec
    Running org.apache.hadoop.hbase.util.TestMiniClusterLoadSequential
    Tests run: 4, Failures: 0, Errors: 0, Skipped: 0, Time elapsed: 377.231 sec
    Running org.apache.hadoop.hbase.util.TestRegionSplitter
    Tests run: 5, Failures: 0, Errors: 0, Skipped: 0, Time elapsed: 164.802 sec
    Running org.apache.hadoop.hbase.mapred.TestTableInputFormat
    Tests run: 10, Failures: 0, Errors: 0, Skipped: 0, Time elapsed: 83.315 sec
    Running org.apache.hadoop.hbase.util.TestMiniClusterLoadParallel
    Tests run: 4, Failures: 0, Errors: 0, Skipped: 0, Time elapsed: 354.788 sec
    Running org.apache.hadoop.hbase.regionserver.TestStore
    Tests run: 12, Failures: 0, Errors: 0, Skipped: 0, Time elapsed: 9.538 sec
    Running org.apache.hadoop.hbase.util.TestHBaseFsck
    Tests run: 17, Failures: 0, Errors: 0, Skipped: 0, Time elapsed: 465.83 sec
    Running org.apache.hadoop.hbase.regionserver.TestStoreFileBlockCacheSummary
    Tests run: 1, Failures: 0, Errors: 0, Skipped: 0, Time elapsed: 18.149 sec
    Running org.apache.hadoop.hbase.regionserver.handler.TestOpenRegionHandler
    Tests run: 3, Failures: 0, Errors: 0, Skipped: 0, Time elapsed: 1.234 sec
    Running org.apache.hadoop.hbase.regionserver.handler.TestCloseRegionHandler
    Tests run: 3, Failures: 0, Errors: 0, Skipped: 0, Time elapsed: 1.665 sec
    Running org.apache.hadoop.hbase.regionserver.TestParallelPut
    Tests run: 2, Failures: 0, Errors: 0, Skipped: 0, Time elapsed: 5.557 sec
    Running org.apache.hadoop.hbase.regionserver.TestServerCustomProtocol
    Tests run: 7, Failures: 0, Errors: 0, Skipped: 0, Time elapsed: 31.469 sec
    Running org.apache.hadoop.hbase.regionserver.TestHRegionOnCluster
    Tests run: 1, Failures: 0, Errors: 0, Skipped: 0, Time elapsed: 36.327 sec
    Running org.apache.hadoop.hbase.regionserver.TestRegionServerMetrics
    Tests run: 3, Failures: 0, Errors: 0, Skipped: 0, Time elapsed: 101.052 sec
    Running org.apache.hadoop.hbase.regionserver.TestBlocksRead
    Tests run: 4, Failures: 0, Errors: 0, Skipped: 0, Time elapsed: 1.406 sec
    Running org.apache.hadoop.hbase.regionserver.TestMasterAddressManager
    Tests run: 1, Failures: 0, Errors: 0, Skipped: 0, Time elapsed: 2.877 sec
    Running org.apache.hadoop.hbase.regionserver.TestAtomicOperation
    Tests run: 5, Failures: 0, Errors: 0, Skipped: 0, Time elapsed: 28.45 sec
    Running org.apache.hadoop.hbase.mapred.TestTableMapReduce
    Tests run: 1, Failures: 0, Errors: 0, Skipped: 0, Time elapsed: 147.599 sec
    Running org.apache.hadoop.hbase.regionserver.TestSplitTransactionOnCluster
    Tests run: 6, Failures: 0, Errors: 0, Skipped: 0, Time elapsed: 158.647 sec
    Running org.apache.hadoop.hbase.regionserver.wal.TestLogRollingNoCluster
    Tests run: 1, Failures: 0, Errors: 0, Skipped: 0, Time elapsed: 2.328 sec
    Running org.apache.hadoop.hbase.regionserver.wal.TestHLogBench
    Tests run: 1, Failures: 0, Errors: 0, Skipped: 0, Time elapsed: 1.454 sec
    Running org.apache.hadoop.hbase.regionserver.wal.TestWALReplay
    Tests run: 5, Failures: 0, Errors: 0, Skipped: 0, Time elapsed: 70.461 sec
    Running org.apache.hadoop.hbase.regionserver.wal.TestWALReplayCompressed
    Tests run: 5, Failures: 0, Errors: 0, Skipped: 0, Time elapsed: 87.041 sec
    Running org.apache.hadoop.hbase.regionserver.wal.TestHLog
    Tests run: 10, Failures: 0, Errors: 0, Skipped: 0, Time elapsed: 83.495 sec
    Running org.apache.hadoop.hbase.regionserver.metrics.TestSchemaMetrics
    Tests run: 6, Failures: 0, Errors: 0, Skipped: 0, Time elapsed: 15.04 sec
    Running org.apache.hadoop.hbase.regionserver.TestRpcMetrics
    Tests run: 1, Failures: 0, Errors: 0, Skipped: 0, Time elapsed: 1.887 sec
    Running org.apache.hadoop.hbase.regionserver.TestStoreScanner
    Tests run: 16, Failures: 0, Errors: 0, Skipped: 0, Time elapsed: 0.068 sec
    Running org.apache.hadoop.hbase.regionserver.TestSeekOptimizations
    Tests run: 6, Failures: 0, Errors: 0, Skipped: 0, Time elapsed: 2.747 sec
    Running org.apache.hadoop.hbase.regionserver.TestFSErrorsExposed
    Tests run: 3, Failures: 0, Errors: 0, Skipped: 0, Time elapsed: 31.501 sec
    Running org.apache.hadoop.hbase.regionserver.wal.TestLogRollAbort
    Tests run: 1, Failures: 0, Errors: 0, Skipped: 0, Time elapsed: 184.503 sec
    Running org.apache.hadoop.hbase.regionserver.TestHRegionServerBulkLoad
    Tests run: 1, Failures: 0, Errors: 0, Skipped: 0, Time elapsed: 50.351 sec
    Running org.apache.hadoop.hbase.regionserver.TestSplitLogWorker
    Tests run: 5, Failures: 0, Errors: 0, Skipped: 0, Time elapsed: 3.619 sec
    Running org.apache.hadoop.hbase.regionserver.TestMultiColumnScanner
    Tests run: 12, Failures: 0, Errors: 0, Skipped: 0, Time elapsed: 42.373 sec
    Running org.apache.hadoop.hbase.regionserver.TestEndToEndSplitTransaction
    Tests run: 1, Failures: 0, Errors: 0, Skipped: 0, Time elapsed: 47.475 sec
    Running org.apache.hadoop.hbase.client.replication.TestReplicationAdmin
    Tests run: 1, Failures: 0, Errors: 0, Skipped: 0, Time elapsed: 2.1 sec
    Running org.apache.hadoop.hbase.regionserver.TestHRegion
    Tests run: 62, Failures: 0, Errors: 0, Skipped: 0, Time elapsed: 46.696 sec
    Running org.apache.hadoop.hbase.client.TestTimestampsFilter
    Tests run: 3, Failures: 0, Errors: 0, Skipped: 0, Time elapsed: 41.917 sec
    Running org.apache.hadoop.hbase.client.TestMultipleTimestamps
    Tests run: 8, Failures: 0, Errors: 0, Skipped: 0, Time elapsed: 41.77 sec
    Running org.apache.hadoop.hbase.regionserver.wal.TestHLogSplit
    Tests run: 30, Failures: 0, Errors: 0, Skipped: 1, Time elapsed: 278.937 sec
    Running org.apache.hadoop.hbase.client.TestHCM
    Tests run: 6, Failures: 0, Errors: 0, Skipped: 0, Time elapsed: 29.522 sec
    Running org.apache.hadoop.hbase.client.TestHTableUtil
    Tests run: 2, Failures: 0, Errors: 0, Skipped: 0, Time elapsed: 24.075 sec
    Running org.apache.hadoop.hbase.client.TestHTablePool$TestHTableReusablePool
    Tests run: 9, Failures: 0, Errors: 0, Skipped: 0, Time elapsed: 6.783 sec
    Running org.apache.hadoop.hbase.client.TestHTablePool$TestHTableThreadLocalPool
    Tests run: 9, Failures: 0, Errors: 0, Skipped: 0, Time elapsed: 38.731 sec
    Running org.apache.hadoop.hbase.client.TestMetaScanner
    Tests run: 1, Failures: 0, Errors: 0, Skipped: 0, Time elapsed: 26.663 sec
    Running org.apache.hadoop.hbase.regionserver.wal.TestLogRolling
    Tests run: 3, Failures: 0, Errors: 0, Skipped: 0, Time elapsed: 493.424 sec
    Running org.apache.hadoop.hbase.client.TestScannerTimeout
    Tests run: 4, Failures: 0, Errors: 0, Skipped: 0, Time elapsed: 59.702 sec
    Running org.apache.hadoop.hbase.client.TestFromClientSide
    Tests run: 55, Failures: 0, Errors: 0, Skipped: 3, Time elapsed: 241.506 sec
    Running org.apache.hadoop.hbase.client.TestShell
    Tests run: 1, Failures: 0, Errors: 0, Skipped: 0, Time elapsed: 125.035 sec
    Running org.apache.hadoop.hbase.client.TestMetaMigrationRemovingHTD
    Tests run: 3, Failures: 0, Errors: 0, Skipped: 0, Time elapsed: 34.387 sec
    Running org.apache.hadoop.hbase.TestMultiVersions
    Tests run: 3, Failures: 0, Errors: 0, Skipped: 0, Time elapsed: 32.631 sec
    Running org.apache.hadoop.hbase.client.TestMultiParallel
    Tests run: 11, Failures: 0, Errors: 0, Skipped: 0, Time elapsed: 65.824 sec
    Running org.apache.hadoop.hbase.thrift.TestThriftServer
    Tests run: 1, Failures: 0, Errors: 0, Skipped: 0, Time elapsed: 59.68 sec
    Running org.apache.hadoop.hbase.master.TestActiveMasterManager
    Tests run: 2, Failures: 0, Errors: 0, Skipped: 0, Time elapsed: 1.305 sec
    Running org.apache.hadoop.hbase.master.TestDeadServer
    Tests run: 1, Failures: 0, Errors: 0, Skipped: 0, Time elapsed: 0.2 sec
    Running org.apache.hadoop.hbase.master.TestLogsCleaner
    Tests run: 1, Failures: 0, Errors: 0, Skipped: 0, Time elapsed: 3.259 sec
    Running org.apache.hadoop.hbase.master.TestRollingRestart
    Tests run: 1, Failures: 0, Errors: 0, Skipped: 0, Time elapsed: 74.103 sec
    Running org.apache.hadoop.hbase.master.TestZKBasedOpenCloseRegion
    Tests run: 4, Failures: 0, Errors: 0, Skipped: 0, Time elapsed: 35.243 sec
    Running org.apache.hadoop.hbase.client.TestAdmin
    Tests run: 37, Failures: 0, Errors: 0, Skipped: 0, Time elapsed: 301.888 sec
    Running org.apache.hadoop.hbase.master.TestMaster
    Tests run: 1, Failures: 0, Errors: 0, Skipped: 0, Time elapsed: 22.862 sec
    Running org.apache.hadoop.hbase.master.TestClockSkewDetection
    Tests run: 1, Failures: 0, Errors: 0, Skipped: 0, Time elapsed: 0.324 sec
    Running org.apache.hadoop.hbase.master.TestOpenedRegionHandler
    Tests run: 2, Failures: 0, Errors: 0, Skipped: 0, Time elapsed: 19.905 sec
    Running org.apache.hadoop.hbase.master.TestMasterTransitions
    Tests run: 3, Failures: 0, Errors: 0, Skipped: 3, Time elapsed: 29.178 sec
    Running org.apache.hadoop.hbase.master.TestSplitLogManager
    Tests run: 12, Failures: 0, Errors: 0, Skipped: 0, Time elapsed: 16.431 sec
    Running org.apache.hadoop.hbase.master.TestDefaultLoadBalancer
    Tests run: 4, Failures: 0, Errors: 0, Skipped: 0, Time elapsed: 1.502 sec
    Running org.apache.hadoop.hbase.master.TestMasterStatusServlet
    Tests run: 5, Failures: 0, Errors: 0, Skipped: 0, Time elapsed: 1.073 sec
    Running org.apache.hadoop.hbase.master.TestHMasterRPCException
    Tests run: 1, Failures: 0, Errors: 0, Skipped: 0, Time elapsed: 1.199 sec
    Running org.apache.hadoop.hbase.master.TestMasterRestartAfterDisablingTable
    Tests run: 1, Failures: 0, Errors: 0, Skipped: 0, Time elapsed: 24.267 sec
    Running org.apache.hadoop.hbase.master.TestMasterZKSessionRecovery
    Tests run: 2, Failures: 0, Errors: 0, Skipped: 0, Time elapsed: 30.09 sec
    Running org.apache.hadoop.hbase.master.TestMasterShutdown
    Tests run: 1, Failures: 0, Errors: 0, Skipped: 0, Time elapsed: 18.819 sec
    Running org.apache.hadoop.hbase.master.TestMasterFailover
    Tests run: 4, Failures: 0, Errors: 0, Skipped: 0, Time elapsed: 99.275 sec
    Running org.apache.hadoop.hbase.master.TestRestartCluster
    Tests run: 2, Failures: 0, Errors: 0, Skipped: 0, Time elapsed: 47.009 sec
    Running org.apache.hadoop.hbase.avro.TestAvroServer
    Tests run: 3, Failures: 0, Errors: 0, Skipped: 0, Time elapsed: 34.109 sec
    Running org.apache.hadoop.hbase.master.TestDistributedLogSplitting
    Tests run: 4, Failures: 0, Errors: 0, Skipped: 0, Time elapsed: 167.873 sec
    Running org.apache.hadoop.hbase.TestRegionRebalancing
    Tests run: 1, Failures: 0, Errors: 0, Skipped: 0, Time elapsed: 77.665 sec
    Running org.apache.hadoop.hbase.ipc.TestDelayedRpc
    Tests run: 4, Failures: 0, Errors: 0, Skipped: 0, Time elapsed: 2.456 sec
    Running org.apache.hadoop.hbase.thrift2.TestThriftHBaseServiceHandler
    Tests run: 12, Failures: 0, Errors: 0, Skipped: 0, Time elapsed: 18.102 sec
    Running org.apache.hadoop.hbase.TestZooKeeper
    Tests run: 8, Failures: 0, Errors: 0, Skipped: 0, Time elapsed: 45.303 sec
    Running org.apache.hadoop.hbase.TestInfoServers
    Tests run: 2, Failures: 0, Errors: 0, Skipped: 0, Time elapsed: 17.022 sec
    Running org.apache.hadoop.hbase.TestAcidGuarantees
    Tests run: 3, Failures: 0, Errors: 0, Skipped: 0, Time elapsed: 104.312 sec
    Running org.apache.hadoop.hbase.thrift.TestThriftServerCmdLine
    Tests run: 20, Failures: 0, Errors: 0, Skipped: 0, Time elapsed: 459.847 sec

    Results :

    Failed tests: testResetZooKeeperSession(org.apache.hadoop.hbase.replication.TestReplicationPeer): ReplicationPeer ZooKeeper session was not properly expired.

    Tests in error:
    testFlippingEncodeOnDisk(org.apache.hadoop.hbase.io.encoding.TestChangingEncoding): test timed out after 240000 milliseconds

    Tests run: 931, Failures: 1, Errors: 1, Skipped: 9

    [INFO] ------------------------------------------------------------------------
    [INFO] BUILD FAILURE
    [INFO] ------------------------------------------------------------------------
    [INFO] Total time: 58:16.036s
    [INFO] Finished at: Wed May 23 21:23:44 UTC 2012
    [INFO] Final Memory: 40M/338M
    [INFO] ------------------------------------------------------------------------
    [ERROR] Failed to execute goal org.apache.maven.plugins:maven-surefire-plugin:2.12-TRUNK-HBASE-2:test (secondPartTestsExecution) on project hbase: There are test failures.
    [ERROR]
    [ERROR] Please refer to <https://builds.apache.org/job/HBase-0.94/ws/trunk/target/surefire-reports> for the individual test results.
    [ERROR] -> [Help 1]
    [ERROR]
    [ERROR] To see the full stack trace of the errors, re-run Maven with the -e switch.
    [ERROR] Re-run Maven using the -X switch to enable full debug logging.
    [ERROR]
    [ERROR] For more information about the errors and possible solutions, please read the following articles:
    [ERROR] [Help 1] http://cwiki.apache.org/confluence/display/MAVEN/MojoFailureException
    Build step 'Invoke top-level Maven targets' marked build as failure
    Archiving artifacts
    Updating HBASE-6065
    Recording test results
  • Apache Jenkins Server at May 23, 2012 at 10:29 pm
    See <https://builds.apache.org/job/HBase-0.94/213/>

    ------------------------------------------
    [...truncated 563 lines...]
    Tests run: 3, Failures: 0, Errors: 0, Skipped: 0, Time elapsed: 1.188 sec
    Running org.apache.hadoop.hbase.io.hfile.TestHFileBlockIndex
    Tests run: 10, Failures: 0, Errors: 0, Skipped: 0, Time elapsed: 13.957 sec
    Running org.apache.hadoop.hbase.io.hfile.TestForceCacheImportantBlocks
    Tests run: 4, Failures: 0, Errors: 0, Skipped: 0, Time elapsed: 65.507 sec
    Running org.apache.hadoop.hbase.io.hfile.TestHFilePerformance
    Tests run: 1, Failures: 0, Errors: 0, Skipped: 0, Time elapsed: 8.716 sec
    Running org.apache.hadoop.hbase.io.hfile.TestFixedFileTrailer
    Tests run: 2, Failures: 0, Errors: 0, Skipped: 0, Time elapsed: 1.089 sec
    Running org.apache.hadoop.hbase.io.hfile.TestHFileSeek
    Tests run: 1, Failures: 0, Errors: 0, Skipped: 0, Time elapsed: 10.313 sec
    Running org.apache.hadoop.hbase.io.hfile.slab.TestSlabCache
    Tests run: 7, Failures: 0, Errors: 0, Skipped: 0, Time elapsed: 23.792 sec
    Running org.apache.hadoop.hbase.zookeeper.TestZKTable
    Tests run: 1, Failures: 0, Errors: 0, Skipped: 0, Time elapsed: 1.456 sec
    Running org.apache.hadoop.hbase.zookeeper.TestZKLeaderManager
    Tests run: 1, Failures: 0, Errors: 0, Skipped: 0, Time elapsed: 1.152 sec
    Running org.apache.hadoop.hbase.io.hfile.slab.TestSingleSizeCache
    Tests run: 5, Failures: 0, Errors: 0, Skipped: 0, Time elapsed: 36.704 sec
    Running org.apache.hadoop.hbase.zookeeper.TestZooKeeperNodeTracker
    Tests run: 2, Failures: 0, Errors: 0, Skipped: 0, Time elapsed: 0.782 sec
    Running org.apache.hadoop.hbase.io.encoding.TestChangingEncoding
    Tests run: 4, Failures: 0, Errors: 0, Skipped: 0, Time elapsed: 248.906 sec
    Running org.apache.hadoop.hbase.rest.TestSchemaResource
    Tests run: 2, Failures: 0, Errors: 0, Skipped: 0, Time elapsed: 19.549 sec
    Running org.apache.hadoop.hbase.io.hfile.TestCacheOnWrite
    Tests run: 36, Failures: 0, Errors: 0, Skipped: 0, Time elapsed: 37.878 sec
    Running org.apache.hadoop.hbase.rest.TestGzipFilter
    Tests run: 3, Failures: 0, Errors: 0, Skipped: 0, Time elapsed: 14.832 sec
    Running org.apache.hadoop.hbase.rest.TestMultiRowResource
    Tests run: 3, Failures: 0, Errors: 0, Skipped: 0, Time elapsed: 13.314 sec
    Running org.apache.hadoop.hbase.rest.TestRowResource
    Tests run: 11, Failures: 0, Errors: 0, Skipped: 0, Time elapsed: 15.37 sec
    Running org.apache.hadoop.hbase.rest.client.TestRemoteTable
    Tests run: 3, Failures: 0, Errors: 0, Skipped: 0, Time elapsed: 14.036 sec
    Running org.apache.hadoop.hbase.rest.TestVersionResource
    Tests run: 7, Failures: 0, Errors: 0, Skipped: 0, Time elapsed: 12.149 sec
    Running org.apache.hadoop.hbase.rest.client.TestRemoteAdmin
    Tests run: 1, Failures: 0, Errors: 0, Skipped: 0, Time elapsed: 14.385 sec
    Running org.apache.hadoop.hbase.rest.TestStatusResource
    Tests run: 2, Failures: 0, Errors: 0, Skipped: 0, Time elapsed: 11.916 sec
    Running org.apache.hadoop.hbase.rest.TestTableResource
    Tests run: 8, Failures: 0, Errors: 0, Skipped: 0, Time elapsed: 21.137 sec
    Running org.apache.hadoop.hbase.TestInfoServers
    Tests run: 2, Failures: 0, Errors: 0, Skipped: 0, Time elapsed: 11.056 sec
    Running org.apache.hadoop.hbase.rest.TestScannerResource
    Tests run: 5, Failures: 0, Errors: 0, Skipped: 0, Time elapsed: 29.006 sec
    Running org.apache.hadoop.hbase.monitoring.TestTaskMonitor
    Tests run: 3, Failures: 0, Errors: 0, Skipped: 0, Time elapsed: 0.304 sec
    Running org.apache.hadoop.hbase.monitoring.TestMemoryBoundedLogMessageBuffer
    Tests run: 2, Failures: 0, Errors: 0, Skipped: 0, Time elapsed: 0.256 sec
    Running org.apache.hadoop.hbase.metrics.TestMetricsMBeanBase
    Tests run: 2, Failures: 0, Errors: 0, Skipped: 0, Time elapsed: 1.128 sec
    Running org.apache.hadoop.hbase.rest.TestScannersWithFilters
    Tests run: 10, Failures: 0, Errors: 0, Skipped: 0, Time elapsed: 17.664 sec
    Running org.apache.hadoop.hbase.zookeeper.TestZooKeeperACL
    Tests run: 5, Failures: 0, Errors: 0, Skipped: 0, Time elapsed: 90.899 sec
    Running org.apache.hadoop.hbase.regionserver.TestServerCustomProtocol
    Tests run: 7, Failures: 1, Errors: 0, Skipped: 0, Time elapsed: 16.874 sec <<< FAILURE!
    Running org.apache.hadoop.hbase.regionserver.TestAtomicOperation
    Tests run: 5, Failures: 0, Errors: 0, Skipped: 0, Time elapsed: 36.992 sec
    Running org.apache.hadoop.hbase.regionserver.TestEndToEndSplitTransaction
    Tests run: 1, Failures: 0, Errors: 0, Skipped: 0, Time elapsed: 44.959 sec
    Running org.apache.hadoop.hbase.regionserver.TestHRegion
    Tests run: 62, Failures: 0, Errors: 0, Skipped: 0, Time elapsed: 47.162 sec
    Running org.apache.hadoop.hbase.regionserver.wal.TestWALReplayCompressed
    Tests run: 5, Failures: 0, Errors: 0, Skipped: 0, Time elapsed: 35.49 sec
    Running org.apache.hadoop.hbase.regionserver.wal.TestWALReplay
    Tests run: 5, Failures: 0, Errors: 0, Skipped: 0, Time elapsed: 29.209 sec
    Running org.apache.hadoop.hbase.regionserver.wal.TestHLog
    Tests run: 10, Failures: 0, Errors: 0, Skipped: 0, Time elapsed: 60.045 sec
    Running org.apache.hadoop.hbase.regionserver.wal.TestLogRollingNoCluster
    Tests run: 1, Failures: 0, Errors: 0, Skipped: 0, Time elapsed: 2.208 sec
    Running org.apache.hadoop.hbase.regionserver.wal.TestHLogBench
    Tests run: 1, Failures: 0, Errors: 0, Skipped: 0, Time elapsed: 1.47 sec
    Running org.apache.hadoop.hbase.regionserver.TestStore
    Tests run: 12, Failures: 0, Errors: 0, Skipped: 0, Time elapsed: 9.367 sec
    Running org.apache.hadoop.hbase.regionserver.TestRpcMetrics
    Tests run: 1, Failures: 0, Errors: 0, Skipped: 0, Time elapsed: 1.943 sec
    Running org.apache.hadoop.hbase.regionserver.TestBlocksRead
    Tests run: 4, Failures: 0, Errors: 0, Skipped: 0, Time elapsed: 1.043 sec
    Running org.apache.hadoop.hbase.regionserver.wal.TestLogRollAbort
    Tests run: 1, Failures: 0, Errors: 0, Skipped: 0, Time elapsed: 162.25 sec
    Running org.apache.hadoop.hbase.regionserver.TestHRegionOnCluster
    Tests run: 1, Failures: 0, Errors: 0, Skipped: 0, Time elapsed: 22.408 sec
    Running org.apache.hadoop.hbase.regionserver.TestRegionServerMetrics
    Tests run: 3, Failures: 0, Errors: 0, Skipped: 0, Time elapsed: 52.226 sec
    Running org.apache.hadoop.hbase.regionserver.metrics.TestSchemaMetrics
    Tests run: 6, Failures: 0, Errors: 0, Skipped: 0, Time elapsed: 15.551 sec
    Running org.apache.hadoop.hbase.regionserver.TestStoreScanner
    Tests run: 16, Failures: 0, Errors: 0, Skipped: 0, Time elapsed: 0.083 sec
    Running org.apache.hadoop.hbase.regionserver.TestParallelPut
    Tests run: 2, Failures: 0, Errors: 0, Skipped: 0, Time elapsed: 6.01 sec
    Running org.apache.hadoop.hbase.regionserver.TestStoreFileBlockCacheSummary
    Tests run: 1, Failures: 0, Errors: 0, Skipped: 0, Time elapsed: 12.201 sec
    Running org.apache.hadoop.hbase.regionserver.TestSplitTransactionOnCluster
    Tests run: 6, Failures: 0, Errors: 0, Skipped: 0, Time elapsed: 50.986 sec
    Running org.apache.hadoop.hbase.regionserver.handler.TestCloseRegionHandler
    Tests run: 3, Failures: 0, Errors: 0, Skipped: 0, Time elapsed: 1.255 sec
    Running org.apache.hadoop.hbase.regionserver.handler.TestOpenRegionHandler
    Tests run: 3, Failures: 0, Errors: 0, Skipped: 0, Time elapsed: 0.994 sec
    Running org.apache.hadoop.hbase.regionserver.TestMultiColumnScanner
    Tests run: 12, Failures: 0, Errors: 0, Skipped: 0, Time elapsed: 42.146 sec
    Running org.apache.hadoop.hbase.regionserver.TestMasterAddressManager
    Tests run: 1, Failures: 0, Errors: 0, Skipped: 0, Time elapsed: 0.596 sec
    Running org.apache.hadoop.hbase.regionserver.TestSplitLogWorker
    Tests run: 5, Failures: 0, Errors: 0, Skipped: 0, Time elapsed: 2.113 sec
    Running org.apache.hadoop.hbase.regionserver.TestSeekOptimizations
    Tests run: 6, Failures: 0, Errors: 0, Skipped: 0, Time elapsed: 2.941 sec
    Running org.apache.hadoop.hbase.regionserver.TestFSErrorsExposed
    Tests run: 3, Failures: 0, Errors: 0, Skipped: 0, Time elapsed: 28.526 sec
    Running org.apache.hadoop.hbase.regionserver.TestHRegionServerBulkLoad
    Tests run: 1, Failures: 0, Errors: 0, Skipped: 0, Time elapsed: 46.166 sec
    Running org.apache.hadoop.hbase.regionserver.wal.TestLogRolling
    Tests run: 3, Failures: 0, Errors: 0, Skipped: 0, Time elapsed: 259.273 sec
    Running org.apache.hadoop.hbase.filter.TestColumnRangeFilter
    Tests run: 1, Failures: 0, Errors: 0, Skipped: 0, Time elapsed: 16.272 sec
    Running org.apache.hadoop.hbase.TestGlobalMemStoreSize
    Tests run: 1, Failures: 0, Errors: 0, Skipped: 0, Time elapsed: 15.925 sec
    Running org.apache.hadoop.hbase.TestMultiVersions
    Tests run: 3, Failures: 0, Errors: 0, Skipped: 0, Time elapsed: 21.642 sec
    Running org.apache.hadoop.hbase.regionserver.wal.TestHLogSplit
    Tests run: 30, Failures: 0, Errors: 0, Skipped: 1, Time elapsed: 241.851 sec
    Running org.apache.hadoop.hbase.TestRegionRebalancing
    Tests run: 1, Failures: 0, Errors: 0, Skipped: 0, Time elapsed: 26.498 sec
    Running org.apache.hadoop.hbase.thrift2.TestThriftHBaseServiceHandler
    Tests run: 12, Failures: 0, Errors: 0, Skipped: 0, Time elapsed: 11.79 sec
    Running org.apache.hadoop.hbase.replication.TestReplicationZookeeper
    Tests run: 1, Failures: 0, Errors: 0, Skipped: 0, Time elapsed: 0.675 sec
    Running org.apache.hadoop.hbase.replication.regionserver.TestReplicationSourceManager
    Tests run: 1, Failures: 0, Errors: 0, Skipped: 0, Time elapsed: 1.064 sec
    Running org.apache.hadoop.hbase.TestHBaseTestingUtility
    Tests run: 7, Failures: 0, Errors: 0, Skipped: 0, Time elapsed: 55.16 sec
    Running org.apache.hadoop.hbase.replication.regionserver.TestReplicationSink
    Tests run: 5, Failures: 0, Errors: 0, Skipped: 0, Time elapsed: 14.735 sec
    Running org.apache.hadoop.hbase.replication.TestReplicationPeer
    Tests run: 1, Failures: 0, Errors: 0, Skipped: 0, Time elapsed: 7.572 sec
    Running org.apache.hadoop.hbase.replication.TestReplicationSource
    Tests run: 1, Failures: 0, Errors: 0, Skipped: 0, Time elapsed: 2.66 sec
    Running org.apache.hadoop.hbase.avro.TestAvroServer
    Tests run: 3, Failures: 0, Errors: 0, Skipped: 0, Time elapsed: 27.26 sec
    Running org.apache.hadoop.hbase.replication.TestMasterReplication
    Tests run: 2, Failures: 0, Errors: 0, Skipped: 0, Time elapsed: 62.54 sec
    Running org.apache.hadoop.hbase.replication.TestMultiSlaveReplication
    Tests run: 1, Failures: 0, Errors: 0, Skipped: 0, Time elapsed: 37.553 sec
    Running org.apache.hadoop.hbase.coprocessor.TestRegionServerCoprocessorExceptionWithRemove
    Tests run: 1, Failures: 0, Errors: 0, Skipped: 0, Time elapsed: 15.769 sec
    Running org.apache.hadoop.hbase.coprocessor.TestRegionObserverInterface
    Tests run: 6, Failures: 0, Errors: 0, Skipped: 0, Time elapsed: 32.196 sec
    Running org.apache.hadoop.hbase.coprocessor.TestMasterObserver
    Tests run: 3, Failures: 0, Errors: 0, Skipped: 0, Time elapsed: 25.814 sec
    Running org.apache.hadoop.hbase.replication.TestReplication
    Tests run: 10, Failures: 1, Errors: 0, Skipped: 0, Time elapsed: 153.205 sec <<< FAILURE!
    Running org.apache.hadoop.hbase.TestAcidGuarantees
    Tests run: 3, Failures: 0, Errors: 0, Skipped: 0, Time elapsed: 93.211 sec
    Running org.apache.hadoop.hbase.coprocessor.TestWALObserver
    Tests run: 3, Failures: 0, Errors: 0, Skipped: 0, Time elapsed: 14.898 sec
    Running org.apache.hadoop.hbase.coprocessor.TestRegionObserverBypass
    Tests run: 2, Failures: 0, Errors: 0, Skipped: 0, Time elapsed: 12.655 sec
    Running org.apache.hadoop.hbase.coprocessor.TestCoprocessorEndpoint
    Tests run: 3, Failures: 0, Errors: 0, Skipped: 1, Time elapsed: 26.71 sec
    Running org.apache.hadoop.hbase.coprocessor.TestMasterCoprocessorExceptionWithAbort
    Tests run: 1, Failures: 0, Errors: 0, Skipped: 0, Time elapsed: 10.604 sec
    Running org.apache.hadoop.hbase.coprocessor.TestMasterCoprocessorExceptionWithRemove
    Tests run: 1, Failures: 0, Errors: 0, Skipped: 0, Time elapsed: 14.23 sec
    Running org.apache.hadoop.hbase.coprocessor.TestAggregateProtocol
    Tests run: 45, Failures: 0, Errors: 0, Skipped: 0, Time elapsed: 15.926 sec
    Running org.apache.hadoop.hbase.coprocessor.TestClassLoading
    Tests run: 6, Failures: 0, Errors: 0, Skipped: 0, Time elapsed: 29.867 sec
    Running org.apache.hadoop.hbase.constraint.TestConstraint
    Tests run: 5, Failures: 0, Errors: 0, Skipped: 0, Time elapsed: 29.827 sec
    Running org.apache.hadoop.hbase.coprocessor.TestRegionServerCoprocessorExceptionWithAbort
    Tests run: 1, Failures: 0, Errors: 0, Skipped: 0, Time elapsed: 74.195 sec
    Running org.apache.hadoop.hbase.mapred.TestTableInputFormat
    Tests run: 10, Failures: 0, Errors: 0, Skipped: 0, Time elapsed: 27.564 sec
    Running org.apache.hadoop.hbase.master.TestOpenedRegionHandler
    Tests run: 2, Failures: 0, Errors: 0, Skipped: 0, Time elapsed: 11.162 sec
    Running org.apache.hadoop.hbase.master.TestActiveMasterManager
    Tests run: 2, Failures: 0, Errors: 0, Skipped: 0, Time elapsed: 1.108 sec
    Running org.apache.hadoop.hbase.TestLocalHBaseCluster
    Tests run: 1, Failures: 0, Errors: 1, Skipped: 0, Time elapsed: 201.315 sec <<< FAILURE!
    Running org.apache.hadoop.hbase.master.TestMasterRestartAfterDisablingTable
    Tests run: 1, Failures: 0, Errors: 0, Skipped: 0, Time elapsed: 17.87 sec
    Running org.apache.hadoop.hbase.master.TestMasterTransitions
    Tests run: 3, Failures: 0, Errors: 0, Skipped: 3, Time elapsed: 17.518 sec
    Running org.apache.hadoop.hbase.master.TestRollingRestart
    Tests run: 1, Failures: 0, Errors: 0, Skipped: 0, Time elapsed: 40.964 sec
    Running org.apache.hadoop.hbase.master.TestMasterStatusServlet
    Tests run: 5, Failures: 0, Errors: 0, Skipped: 0, Time elapsed: 0.979 sec
    Running org.apache.hadoop.hbase.master.TestClockSkewDetection
    Tests run: 1, Failures: 0, Errors: 0, Skipped: 0, Time elapsed: 0.315 sec
    Running org.apache.hadoop.hbase.mapred.TestTableMapReduce
    Tests run: 1, Failures: 0, Errors: 0, Skipped: 0, Time elapsed: 83.74 sec
    Running org.apache.hadoop.hbase.master.TestDefaultLoadBalancer
    Tests run: 4, Failures: 0, Errors: 0, Skipped: 0, Time elapsed: 1.501 sec
    Running org.apache.hadoop.hbase.master.TestHMasterRPCException
    Tests run: 1, Failures: 0, Errors: 0, Skipped: 0, Time elapsed: 1.204 sec
    Running org.apache.hadoop.hbase.master.TestMasterFailover
    Tests run: 4, Failures: 0, Errors: 0, Skipped: 0, Time elapsed: 63.434 sec
    Running org.apache.hadoop.hbase.master.TestRestartCluster
    Tests run: 2, Failures: 0, Errors: 0, Skipped: 0, Time elapsed: 26.275 sec
    Running org.apache.hadoop.hbase.master.TestMaster
    Tests run: 1, Failures: 0, Errors: 0, Skipped: 0, Time elapsed: 14.46 sec
    Running org.apache.hadoop.hbase.master.TestDeadServer
    Tests run: 1, Failures: 0, Errors: 0, Skipped: 0, Time elapsed: 0.235 sec
    Running org.apache.hadoop.hbase.master.TestLogsCleaner
    Tests run: 1, Failures: 0, Errors: 0, Skipped: 0, Time elapsed: 3.089 sec
    Running org.apache.hadoop.hbase.master.TestMasterShutdown
    Tests run: 1, Failures: 0, Errors: 0, Skipped: 0, Time elapsed: 12.411 sec
    Running org.apache.hadoop.hbase.master.TestSplitLogManager
    Tests run: 12, Failures: 0, Errors: 0, Skipped: 0, Time elapsed: 14.47 sec
    Running org.apache.hadoop.hbase.master.TestMasterZKSessionRecovery
    Tests run: 2, Failures: 0, Errors: 0, Skipped: 0, Time elapsed: 17.37 sec
    Running org.apache.hadoop.hbase.master.TestZKBasedOpenCloseRegion
    Tests run: 4, Failures: 0, Errors: 0, Skipped: 0, Time elapsed: 19.155 sec
    Running org.apache.hadoop.hbase.master.TestDistributedLogSplitting
    Tests run: 4, Failures: 0, Errors: 0, Skipped: 0, Time elapsed: 96.946 sec

    Results :

    Failed tests: testClientSessionExpired(org.apache.hadoop.hbase.TestZooKeeper)
    testNullCall(org.apache.hadoop.hbase.regionserver.TestServerCustomProtocol): Results should contain region test,bbb,1337811283393.827d261b48e0e0f4280ec4fd3d904b1a. for row 'bbb'
    queueFailover(org.apache.hadoop.hbase.replication.TestReplication): Waited too much time for queueFailover replication

    Tests in error:
    testLocalHBaseCluster(org.apache.hadoop.hbase.TestLocalHBaseCluster): Master not initialized after 200 seconds

    Tests run: 931, Failures: 3, Errors: 1, Skipped: 9

    [INFO] ------------------------------------------------------------------------
    [INFO] BUILD FAILURE
    [INFO] ------------------------------------------------------------------------
    [INFO] Total time: 37:38.725s
    [INFO] Finished at: Wed May 23 22:28:01 UTC 2012
    [INFO] Final Memory: 41M/410M
    [INFO] ------------------------------------------------------------------------
    [ERROR] Failed to execute goal org.apache.maven.plugins:maven-surefire-plugin:2.12-TRUNK-HBASE-2:test (secondPartTestsExecution) on project hbase: There are test failures.
    [ERROR]
    [ERROR] Please refer to <https://builds.apache.org/job/HBase-0.94/ws/trunk/target/surefire-reports> for the individual test results.
    [ERROR] -> [Help 1]
    [ERROR]
    [ERROR] To see the full stack trace of the errors, re-run Maven with the -e switch.
    [ERROR] Re-run Maven using the -X switch to enable full debug logging.
    [ERROR]
    [ERROR] For more information about the errors and possible solutions, please read the following articles:
    [ERROR] [Help 1] http://cwiki.apache.org/confluence/display/MAVEN/MojoFailureException
    Build step 'Invoke top-level Maven targets' marked build as failure
    Archiving artifacts
    Recording test results
  • Apache Jenkins Server at May 24, 2012 at 12:09 am
    See <https://builds.apache.org/job/HBase-0.94/214/>

    ------------------------------------------
    [...truncated 562 lines...]
    Running org.apache.hadoop.hbase.regionserver.TestAtomicOperation
    Tests run: 5, Failures: 0, Errors: 0, Skipped: 0, Time elapsed: 29.66 sec
    Running org.apache.hadoop.hbase.regionserver.TestRegionServerMetrics
    Tests run: 3, Failures: 0, Errors: 0, Skipped: 0, Time elapsed: 60.972 sec
    Running org.apache.hadoop.hbase.regionserver.TestHRegionOnCluster
    Tests run: 1, Failures: 0, Errors: 0, Skipped: 0, Time elapsed: 22.135 sec
    Running org.apache.hadoop.hbase.regionserver.metrics.TestSchemaMetrics
    Tests run: 6, Failures: 0, Errors: 0, Skipped: 0, Time elapsed: 15.384 sec
    Running org.apache.hadoop.hbase.regionserver.TestStoreFileBlockCacheSummary
    Tests run: 1, Failures: 0, Errors: 0, Skipped: 0, Time elapsed: 15.576 sec
    Running org.apache.hadoop.hbase.regionserver.TestBlocksRead
    Tests run: 4, Failures: 0, Errors: 0, Skipped: 0, Time elapsed: 1.169 sec
    Running org.apache.hadoop.hbase.regionserver.wal.TestLogRollingNoCluster
    Tests run: 1, Failures: 0, Errors: 0, Skipped: 0, Time elapsed: 2.501 sec
    Running org.apache.hadoop.hbase.regionserver.TestHRegion
    Tests run: 62, Failures: 0, Errors: 0, Skipped: 0, Time elapsed: 41.161 sec
    Running org.apache.hadoop.hbase.regionserver.TestFSErrorsExposed
    Tests run: 3, Failures: 0, Errors: 0, Skipped: 0, Time elapsed: 28.172 sec
    Running org.apache.hadoop.hbase.regionserver.wal.TestWALReplay
    Tests run: 5, Failures: 0, Errors: 0, Skipped: 0, Time elapsed: 32.562 sec
    Running org.apache.hadoop.hbase.regionserver.wal.TestWALReplayCompressed
    Tests run: 5, Failures: 0, Errors: 0, Skipped: 0, Time elapsed: 32.605 sec
    Running org.apache.hadoop.hbase.regionserver.wal.TestHLog
    Tests run: 10, Failures: 0, Errors: 0, Skipped: 0, Time elapsed: 61.371 sec
    Running org.apache.hadoop.hbase.regionserver.wal.TestHLogBench
    Tests run: 1, Failures: 0, Errors: 0, Skipped: 0, Time elapsed: 1.273 sec
    Running org.apache.hadoop.hbase.regionserver.handler.TestCloseRegionHandler
    Tests run: 3, Failures: 0, Errors: 0, Skipped: 0, Time elapsed: 1.254 sec
    Running org.apache.hadoop.hbase.regionserver.handler.TestOpenRegionHandler
    Tests run: 3, Failures: 0, Errors: 0, Skipped: 0, Time elapsed: 1.016 sec
    Running org.apache.hadoop.hbase.regionserver.wal.TestLogRollAbort
    Tests run: 1, Failures: 0, Errors: 0, Skipped: 0, Time elapsed: 152.69 sec
    Running org.apache.hadoop.hbase.filter.TestColumnRangeFilter
    Tests run: 1, Failures: 0, Errors: 0, Skipped: 0, Time elapsed: 15.499 sec
    Running org.apache.hadoop.hbase.regionserver.TestHRegionServerBulkLoad
    Tests run: 1, Failures: 0, Errors: 0, Skipped: 0, Time elapsed: 45.302 sec
    Running org.apache.hadoop.hbase.coprocessor.TestClassLoading
    Tests run: 6, Failures: 0, Errors: 0, Skipped: 0, Time elapsed: 32.567 sec
    Running org.apache.hadoop.hbase.coprocessor.TestAggregateProtocol
    Tests run: 45, Failures: 0, Errors: 0, Skipped: 0, Time elapsed: 16.897 sec
    Running org.apache.hadoop.hbase.coprocessor.TestRegionServerCoprocessorExceptionWithRemove
    Tests run: 1, Failures: 0, Errors: 0, Skipped: 0, Time elapsed: 18.229 sec
    Running org.apache.hadoop.hbase.coprocessor.TestRegionServerCoprocessorExceptionWithAbort
    Tests run: 1, Failures: 0, Errors: 0, Skipped: 0, Time elapsed: 15.594 sec
    Running org.apache.hadoop.hbase.coprocessor.TestMasterObserver
    Tests run: 3, Failures: 0, Errors: 0, Skipped: 0, Time elapsed: 30.354 sec
    Running org.apache.hadoop.hbase.coprocessor.TestCoprocessorEndpoint
    Tests run: 3, Failures: 0, Errors: 0, Skipped: 1, Time elapsed: 29.703 sec
    Running org.apache.hadoop.hbase.coprocessor.TestWALObserver
    Tests run: 3, Failures: 0, Errors: 0, Skipped: 0, Time elapsed: 15.652 sec
    Running org.apache.hadoop.hbase.coprocessor.TestMasterCoprocessorExceptionWithAbort
    Tests run: 1, Failures: 0, Errors: 0, Skipped: 0, Time elapsed: 10.915 sec
    Running org.apache.hadoop.hbase.regionserver.wal.TestLogRolling
    Tests run: 3, Failures: 0, Errors: 0, Skipped: 0, Time elapsed: 155.108 sec
    Running org.apache.hadoop.hbase.coprocessor.TestRegionObserverInterface
    Tests run: 6, Failures: 0, Errors: 0, Skipped: 0, Time elapsed: 31.64 sec
    Running org.apache.hadoop.hbase.coprocessor.TestMasterCoprocessorExceptionWithRemove
    Tests run: 1, Failures: 0, Errors: 0, Skipped: 0, Time elapsed: 14.834 sec
    Running org.apache.hadoop.hbase.coprocessor.TestRegionObserverBypass
    Tests run: 2, Failures: 0, Errors: 0, Skipped: 0, Time elapsed: 13.838 sec
    Running org.apache.hadoop.hbase.TestGlobalMemStoreSize
    Tests run: 1, Failures: 0, Errors: 0, Skipped: 0, Time elapsed: 15.214 sec
    Running org.apache.hadoop.hbase.regionserver.wal.TestHLogSplit
    Tests run: 30, Failures: 0, Errors: 0, Skipped: 1, Time elapsed: 248.642 sec
    Running org.apache.hadoop.hbase.mapred.TestTableInputFormat
    Tests run: 10, Failures: 0, Errors: 0, Skipped: 0, Time elapsed: 29.619 sec
    Running org.apache.hadoop.hbase.mapreduce.TestHLogRecordReader
    Tests run: 2, Failures: 0, Errors: 0, Skipped: 0, Time elapsed: 5.303 sec
    Running org.apache.hadoop.hbase.mapred.TestTableMapReduce
    Tests run: 1, Failures: 0, Errors: 0, Skipped: 0, Time elapsed: 90.593 sec
    Running org.apache.hadoop.hbase.mapreduce.TestTableMapReduce
    Tests run: 1, Failures: 0, Errors: 0, Skipped: 0, Time elapsed: 117.071 sec
    Running org.apache.hadoop.hbase.mapreduce.TestLoadIncrementalHFilesSplitRecovery
    Tests run: 4, Failures: 0, Errors: 0, Skipped: 0, Time elapsed: 108.693 sec
    Running org.apache.hadoop.hbase.mapreduce.TestWALPlayer
    Tests run: 1, Failures: 0, Errors: 0, Skipped: 0, Time elapsed: 52.527 sec
    Running org.apache.hadoop.hbase.mapreduce.TestMultithreadedTableMapper
    Tests run: 1, Failures: 0, Errors: 0, Skipped: 0, Time elapsed: 130.569 sec
    Running org.apache.hadoop.hbase.mapreduce.TestHFileOutputFormat
    Tests run: 9, Failures: 0, Errors: 0, Skipped: 0, Time elapsed: 244.524 sec
    Running org.apache.hadoop.hbase.mapreduce.TestLoadIncrementalHFiles
    Tests run: 6, Failures: 0, Errors: 0, Skipped: 0, Time elapsed: 34.489 sec
    Running org.apache.hadoop.hbase.mapreduce.TestTimeRangeMapRed
    Tests run: 1, Failures: 0, Errors: 0, Skipped: 0, Time elapsed: 43.637 sec
    Running org.apache.hadoop.hbase.mapreduce.TestImportTsv
    Tests run: 9, Failures: 0, Errors: 0, Skipped: 0, Time elapsed: 209.185 sec
    Running org.apache.hadoop.hbase.thrift2.TestThriftHBaseServiceHandler
    Tests run: 12, Failures: 0, Errors: 0, Skipped: 0, Time elapsed: 12.933 sec
    Running org.apache.hadoop.hbase.catalog.TestMetaReaderEditorNoCluster
    Tests run: 1, Failures: 0, Errors: 0, Skipped: 0, Time elapsed: 4.858 sec
    Running org.apache.hadoop.hbase.mapreduce.TestImportExport
    Tests run: 2, Failures: 0, Errors: 0, Skipped: 0, Time elapsed: 51.85 sec
    Running org.apache.hadoop.hbase.catalog.TestMetaReaderEditor
    Tests run: 5, Failures: 0, Errors: 0, Skipped: 0, Time elapsed: 23.25 sec
    Running org.apache.hadoop.hbase.catalog.TestCatalogTracker
    Tests run: 9, Failures: 0, Errors: 0, Skipped: 1, Time elapsed: 6.347 sec
    Running org.apache.hadoop.hbase.TestAcidGuarantees
    Tests run: 3, Failures: 0, Errors: 0, Skipped: 0, Time elapsed: 97.181 sec
    Running org.apache.hadoop.hbase.client.TestTimestampsFilter
    Tests run: 3, Failures: 0, Errors: 0, Skipped: 0, Time elapsed: 24.919 sec
    Running org.apache.hadoop.hbase.catalog.TestCatalogTrackerOnCluster
    Tests run: 1, Failures: 0, Errors: 0, Skipped: 0, Time elapsed: 79.252 sec
    Running org.apache.hadoop.hbase.client.TestHCM
    Tests run: 6, Failures: 0, Errors: 0, Skipped: 0, Time elapsed: 15.863 sec
    Running org.apache.hadoop.hbase.client.TestScannerTimeout
    Tests run: 4, Failures: 0, Errors: 0, Skipped: 0, Time elapsed: 44.377 sec
    Running org.apache.hadoop.hbase.client.TestShell
    Tests run: 1, Failures: 0, Errors: 0, Skipped: 0, Time elapsed: 92.94 sec
    Running org.apache.hadoop.hbase.client.TestHTableUtil
    Tests run: 2, Failures: 0, Errors: 0, Skipped: 0, Time elapsed: 13.483 sec
    Running org.apache.hadoop.hbase.client.TestMetaScanner
    Tests run: 1, Failures: 0, Errors: 0, Skipped: 0, Time elapsed: 14.936 sec
    Running org.apache.hadoop.hbase.client.TestHTablePool$TestHTableReusablePool
    Tests run: 9, Failures: 0, Errors: 0, Skipped: 0, Time elapsed: 8.123 sec
    Running org.apache.hadoop.hbase.client.TestHTablePool$TestHTableThreadLocalPool
    Tests run: 9, Failures: 0, Errors: 0, Skipped: 0, Time elapsed: 25.125 sec
    Running org.apache.hadoop.hbase.client.TestMetaMigrationRemovingHTD
    Tests run: 3, Failures: 0, Errors: 0, Skipped: 0, Time elapsed: 25.368 sec
    Running org.apache.hadoop.hbase.client.replication.TestReplicationAdmin
    Tests run: 1, Failures: 0, Errors: 0, Skipped: 0, Time elapsed: 0.843 sec
    Running org.apache.hadoop.hbase.client.TestMultipleTimestamps
    Tests run: 8, Failures: 0, Errors: 0, Skipped: 0, Time elapsed: 31.713 sec
    Running org.apache.hadoop.hbase.client.TestMultiParallel
    Tests run: 11, Failures: 0, Errors: 0, Skipped: 0, Time elapsed: 32.591 sec
    Running org.apache.hadoop.hbase.metrics.TestMetricsMBeanBase
    Tests run: 2, Failures: 0, Errors: 0, Skipped: 0, Time elapsed: 1.128 sec
    Running org.apache.hadoop.hbase.client.TestFromClientSide
    Tests run: 55, Failures: 0, Errors: 0, Skipped: 3, Time elapsed: 174.162 sec
    Running org.apache.hadoop.hbase.rest.TestGzipFilter
    Tests run: 3, Failures: 0, Errors: 0, Skipped: 0, Time elapsed: 13.97 sec
    Running org.apache.hadoop.hbase.constraint.TestConstraint
    Tests run: 5, Failures: 0, Errors: 0, Skipped: 0, Time elapsed: 30.232 sec
    Running org.apache.hadoop.hbase.rest.TestMultiRowResource
    Tests run: 3, Failures: 0, Errors: 0, Skipped: 0, Time elapsed: 16.399 sec
    Running org.apache.hadoop.hbase.rest.TestScannersWithFilters
    Tests run: 10, Failures: 0, Errors: 0, Skipped: 0, Time elapsed: 18.178 sec
    Running org.apache.hadoop.hbase.rest.TestRowResource
    Tests run: 11, Failures: 0, Errors: 0, Skipped: 0, Time elapsed: 16.524 sec
    Running org.apache.hadoop.hbase.rest.client.TestRemoteAdmin
    Tests run: 1, Failures: 0, Errors: 0, Skipped: 0, Time elapsed: 15.443 sec
    Running org.apache.hadoop.hbase.rest.client.TestRemoteTable
    Tests run: 3, Failures: 0, Errors: 0, Skipped: 0, Time elapsed: 14.954 sec
    Running org.apache.hadoop.hbase.rest.TestVersionResource
    Tests run: 7, Failures: 0, Errors: 0, Skipped: 0, Time elapsed: 10.391 sec
    Running org.apache.hadoop.hbase.rest.TestTableResource
    Tests run: 8, Failures: 0, Errors: 0, Skipped: 0, Time elapsed: 21.477 sec
    Running org.apache.hadoop.hbase.rest.TestScannerResource
    Tests run: 5, Failures: 0, Errors: 0, Skipped: 0, Time elapsed: 27.383 sec
    Running org.apache.hadoop.hbase.rest.TestStatusResource
    Tests run: 2, Failures: 0, Errors: 0, Skipped: 0, Time elapsed: 11.702 sec
    Running org.apache.hadoop.hbase.rest.TestSchemaResource
    Tests run: 2, Failures: 0, Errors: 0, Skipped: 0, Time elapsed: 18.518 sec
    Running org.apache.hadoop.hbase.mapreduce.TestTableInputFormatScan
    Tests run: 12, Failures: 0, Errors: 0, Skipped: 0, Time elapsed: 576.024 sec
    Running org.apache.hadoop.hbase.io.encoding.TestLoadAndSwitchEncodeOnDisk
    Tests run: 1, Failures: 0, Errors: 0, Skipped: 0, Time elapsed: 25.164 sec
    Running org.apache.hadoop.hbase.thrift.TestThriftServer
    Tests run: 1, Failures: 0, Errors: 0, Skipped: 0, Time elapsed: 40.784 sec
    Running org.apache.hadoop.hbase.client.TestAdmin
    Tests run: 37, Failures: 0, Errors: 0, Skipped: 0, Time elapsed: 175.4 sec
    Running org.apache.hadoop.hbase.io.encoding.TestUpgradeFromHFileV1ToEncoding
    Tests run: 1, Failures: 0, Errors: 0, Skipped: 0, Time elapsed: 89.89 sec
    Running org.apache.hadoop.hbase.io.hfile.TestHFileSeek
    Tests run: 1, Failures: 0, Errors: 0, Skipped: 0, Time elapsed: 9.884 sec
    Running org.apache.hadoop.hbase.io.hfile.slab.TestSlabCache
    Tests run: 7, Failures: 0, Errors: 0, Skipped: 0, Time elapsed: 19.511 sec
    Running org.apache.hadoop.hbase.io.encoding.TestDataBlockEncoders
    Tests run: 12, Failures: 0, Errors: 0, Skipped: 0, Time elapsed: 141.059 sec
    Running org.apache.hadoop.hbase.io.hfile.TestChecksum
    Tests run: 3, Failures: 0, Errors: 0, Skipped: 0, Time elapsed: 1.755 sec
    Running org.apache.hadoop.hbase.io.hfile.TestHFileBlockIndex
    Tests run: 10, Failures: 0, Errors: 0, Skipped: 0, Time elapsed: 10.129 sec
    Running org.apache.hadoop.hbase.io.hfile.TestLruBlockCache
    Tests run: 16, Failures: 0, Errors: 0, Skipped: 0, Time elapsed: 0.772 sec
    Running org.apache.hadoop.hbase.io.hfile.slab.TestSingleSizeCache
    Tests run: 5, Failures: 0, Errors: 0, Skipped: 0, Time elapsed: 26.285 sec
    Running org.apache.hadoop.hbase.io.hfile.TestFixedFileTrailer
    Tests run: 2, Failures: 0, Errors: 0, Skipped: 0, Time elapsed: 0.566 sec
    Running org.apache.hadoop.hbase.io.hfile.TestHFilePerformance
    Tests run: 1, Failures: 0, Errors: 0, Skipped: 0, Time elapsed: 6.75 sec
    Running org.apache.hadoop.hbase.io.hfile.TestHFileBlockCompatibility
    Tests run: 10, Failures: 0, Errors: 0, Skipped: 0, Time elapsed: 1.155 sec
    Running org.apache.hadoop.hbase.io.hfile.TestHFileBlock
    Tests run: 16, Failures: 0, Errors: 0, Skipped: 0, Time elapsed: 48.154 sec
    Running org.apache.hadoop.hbase.io.hfile.TestForceCacheImportantBlocks
    Tests run: 4, Failures: 0, Errors: 0, Skipped: 0, Time elapsed: 63.062 sec
    Running org.apache.hadoop.hbase.io.hfile.TestCacheOnWrite
    Tests run: 36, Failures: 0, Errors: 0, Skipped: 0, Time elapsed: 35.814 sec
    Running org.apache.hadoop.hbase.TestClusterBootOrder
    Tests run: 2, Failures: 0, Errors: 0, Skipped: 0, Time elapsed: 27.866 sec
    Running org.apache.hadoop.hbase.io.encoding.TestChangingEncoding
    Tests run: 4, Failures: 0, Errors: 0, Skipped: 0, Time elapsed: 268.378 sec
    Running org.apache.hadoop.hbase.replication.regionserver.TestReplicationSourceManager
    Tests run: 1, Failures: 0, Errors: 0, Skipped: 0, Time elapsed: 1.07 sec
    Running org.apache.hadoop.hbase.replication.regionserver.TestReplicationSink
    Tests run: 5, Failures: 0, Errors: 0, Skipped: 0, Time elapsed: 12.14 sec
    Running org.apache.hadoop.hbase.avro.TestAvroServer
    Tests run: 3, Failures: 0, Errors: 0, Skipped: 0, Time elapsed: 28.491 sec
    Running org.apache.hadoop.hbase.replication.TestReplicationSource
    Tests run: 1, Failures: 0, Errors: 0, Skipped: 0, Time elapsed: 2.846 sec
    Running org.apache.hadoop.hbase.replication.TestReplicationPeer
    Tests run: 1, Failures: 0, Errors: 0, Skipped: 0, Time elapsed: 7.603 sec
    Running org.apache.hadoop.hbase.replication.TestReplicationZookeeper
    Tests run: 1, Failures: 0, Errors: 0, Skipped: 0, Time elapsed: 0.66 sec
    Running org.apache.hadoop.hbase.replication.TestMultiSlaveReplication
    Tests run: 1, Failures: 0, Errors: 0, Skipped: 0, Time elapsed: 40.831 sec
    Running org.apache.hadoop.hbase.ipc.TestDelayedRpc
    Tests run: 4, Failures: 0, Errors: 0, Skipped: 0, Time elapsed: 2.492 sec
    Running org.apache.hadoop.hbase.replication.TestMasterReplication
    Tests run: 2, Failures: 0, Errors: 0, Skipped: 0, Time elapsed: 65.633 sec
    Running org.apache.hadoop.hbase.TestZooKeeper
    Tests run: 8, Failures: 0, Errors: 0, Skipped: 0, Time elapsed: 51.254 sec
    Running org.apache.hadoop.hbase.thrift.TestThriftServerCmdLine
    Tests run: 20, Failures: 0, Errors: 0, Skipped: 0, Time elapsed: 410.885 sec
    Running org.apache.hadoop.hbase.TestHBaseTestingUtility
    Tests run: 7, Failures: 0, Errors: 0, Skipped: 0, Time elapsed: 62.409 sec
    Running org.apache.hadoop.hbase.replication.TestReplication
    Tests run: 10, Failures: 0, Errors: 0, Skipped: 0, Time elapsed: 195.969 sec

    Results :

    Failed tests: testDeadWorker(org.apache.hadoop.hbase.master.TestSplitLogManager)
    testSingleMethod(org.apache.hadoop.hbase.regionserver.TestServerCustomProtocol): Results should contain region test,ccc,1337816435484.6ec7ccf063a83bcf07dfbfb74a1b730a. for row 'ccc'

    Tests in error:
    testLocalHBaseCluster(org.apache.hadoop.hbase.TestLocalHBaseCluster): Master not initialized after 200 seconds

    Tests run: 931, Failures: 2, Errors: 1, Skipped: 9

    [INFO] ------------------------------------------------------------------------
    [INFO] BUILD FAILURE
    [INFO] ------------------------------------------------------------------------
    [INFO] Total time: 38:33.759s
    [INFO] Finished at: Thu May 24 00:08:18 UTC 2012
    [INFO] Final Memory: 53M/603M
    [INFO] ------------------------------------------------------------------------
    [ERROR] Failed to execute goal org.apache.maven.plugins:maven-surefire-plugin:2.12-TRUNK-HBASE-2:test (secondPartTestsExecution) on project hbase: There are test failures.
    [ERROR]
    [ERROR] Please refer to <https://builds.apache.org/job/HBase-0.94/ws/trunk/target/surefire-reports> for the individual test results.
    [ERROR] -> [Help 1]
    [ERROR]
    [ERROR] To see the full stack trace of the errors, re-run Maven with the -e switch.
    [ERROR] Re-run Maven using the -X switch to enable full debug logging.
    [ERROR]
    [ERROR] For more information about the errors and possible solutions, please read the following articles:
    [ERROR] [Help 1] http://cwiki.apache.org/confluence/display/MAVEN/MojoFailureException
    Build step 'Invoke top-level Maven targets' marked build as failure
    Archiving artifacts
    Recording test results
  • Apache Jenkins Server at May 24, 2012 at 2:16 am
    See <https://builds.apache.org/job/HBase-0.94/215/changes>

    Changes:

    [apurtell] HBASE-6077. Document the most common secure RPC troubleshooting resolutions

    ------------------------------------------
    [...truncated 579 lines...]
    Running org.apache.hadoop.hbase.io.hfile.TestChecksum
    Tests run: 3, Failures: 0, Errors: 0, Skipped: 0, Time elapsed: 2.598 sec
    Running org.apache.hadoop.hbase.io.hfile.TestForceCacheImportantBlocks
    Tests run: 4, Failures: 0, Errors: 0, Skipped: 0, Time elapsed: 62.287 sec
    Running org.apache.hadoop.hbase.io.hfile.TestHFilePerformance
    Tests run: 1, Failures: 0, Errors: 0, Skipped: 0, Time elapsed: 11.001 sec
    Running org.apache.hadoop.hbase.io.hfile.TestHFileBlock
    Tests run: 16, Failures: 0, Errors: 0, Skipped: 0, Time elapsed: 48.272 sec
    Running org.apache.hadoop.hbase.io.hfile.TestFixedFileTrailer
    Tests run: 2, Failures: 0, Errors: 0, Skipped: 0, Time elapsed: 0.665 sec
    Running org.apache.hadoop.hbase.io.hfile.TestHFileSeek
    Tests run: 1, Failures: 0, Errors: 0, Skipped: 0, Time elapsed: 11.35 sec
    Running org.apache.hadoop.hbase.io.hfile.slab.TestSlabCache
    Tests run: 7, Failures: 0, Errors: 0, Skipped: 0, Time elapsed: 25.273 sec
    Running org.apache.hadoop.hbase.zookeeper.TestZKTable
    Tests run: 1, Failures: 0, Errors: 0, Skipped: 0, Time elapsed: 1.068 sec
    Running org.apache.hadoop.hbase.io.hfile.slab.TestSingleSizeCache
    Tests run: 5, Failures: 0, Errors: 0, Skipped: 0, Time elapsed: 39.371 sec
    Running org.apache.hadoop.hbase.zookeeper.TestZKLeaderManager
    Tests run: 1, Failures: 0, Errors: 0, Skipped: 0, Time elapsed: 0.948 sec
    Running org.apache.hadoop.hbase.zookeeper.TestZooKeeperNodeTracker
    Tests run: 2, Failures: 0, Errors: 0, Skipped: 0, Time elapsed: 0.693 sec
    Running org.apache.hadoop.hbase.rest.TestSchemaResource
    Tests run: 2, Failures: 0, Errors: 0, Skipped: 0, Time elapsed: 21.931 sec
    Running org.apache.hadoop.hbase.io.encoding.TestChangingEncoding
    Tests run: 4, Failures: 0, Errors: 0, Skipped: 0, Time elapsed: 254.304 sec
    Running org.apache.hadoop.hbase.io.hfile.TestCacheOnWrite
    Tests run: 36, Failures: 0, Errors: 0, Skipped: 0, Time elapsed: 38.439 sec
    Running org.apache.hadoop.hbase.rest.TestGzipFilter
    Tests run: 3, Failures: 0, Errors: 0, Skipped: 0, Time elapsed: 14.812 sec
    Running org.apache.hadoop.hbase.rest.TestRowResource
    Tests run: 11, Failures: 0, Errors: 0, Skipped: 0, Time elapsed: 14.453 sec
    Running org.apache.hadoop.hbase.rest.TestMultiRowResource
    Tests run: 3, Failures: 0, Errors: 0, Skipped: 0, Time elapsed: 13.628 sec
    Running org.apache.hadoop.hbase.rest.TestVersionResource
    Tests run: 7, Failures: 0, Errors: 0, Skipped: 0, Time elapsed: 11.993 sec
    Running org.apache.hadoop.hbase.rest.client.TestRemoteTable
    Tests run: 3, Failures: 0, Errors: 0, Skipped: 0, Time elapsed: 15.44 sec
    Running org.apache.hadoop.hbase.rest.client.TestRemoteAdmin
    Tests run: 1, Failures: 0, Errors: 0, Skipped: 0, Time elapsed: 14.952 sec
    Running org.apache.hadoop.hbase.rest.TestStatusResource
    Tests run: 2, Failures: 0, Errors: 0, Skipped: 0, Time elapsed: 11.398 sec
    Running org.apache.hadoop.hbase.rest.TestTableResource
    Tests run: 8, Failures: 0, Errors: 0, Skipped: 0, Time elapsed: 21.381 sec
    Running org.apache.hadoop.hbase.rest.TestScannerResource
    Tests run: 5, Failures: 0, Errors: 0, Skipped: 0, Time elapsed: 27.876 sec
    Running org.apache.hadoop.hbase.monitoring.TestTaskMonitor
    Tests run: 3, Failures: 0, Errors: 0, Skipped: 0, Time elapsed: 0.353 sec
    Running org.apache.hadoop.hbase.monitoring.TestMemoryBoundedLogMessageBuffer
    Tests run: 2, Failures: 0, Errors: 0, Skipped: 0, Time elapsed: 0.257 sec
    Running org.apache.hadoop.hbase.rest.TestScannersWithFilters
    Tests run: 10, Failures: 0, Errors: 0, Skipped: 0, Time elapsed: 16.865 sec
    Running org.apache.hadoop.hbase.metrics.TestMetricsMBeanBase
    Tests run: 2, Failures: 0, Errors: 0, Skipped: 0, Time elapsed: 1.125 sec
    Running org.apache.hadoop.hbase.TestInfoServers
    Tests run: 2, Failures: 0, Errors: 0, Skipped: 0, Time elapsed: 12.05 sec
    Running org.apache.hadoop.hbase.zookeeper.TestZooKeeperACL
    Tests run: 5, Failures: 0, Errors: 0, Skipped: 0, Time elapsed: 100.977 sec
    Running org.apache.hadoop.hbase.regionserver.TestServerCustomProtocol
    Tests run: 7, Failures: 0, Errors: 0, Skipped: 0, Time elapsed: 16.367 sec
    Running org.apache.hadoop.hbase.regionserver.TestAtomicOperation
    Tests run: 5, Failures: 0, Errors: 0, Skipped: 0, Time elapsed: 39.94 sec
    Running org.apache.hadoop.hbase.regionserver.wal.TestWALReplayCompressed
    Tests run: 5, Failures: 0, Errors: 0, Skipped: 0, Time elapsed: 34.753 sec
    Running org.apache.hadoop.hbase.regionserver.TestHRegion
    Tests run: 62, Failures: 0, Errors: 0, Skipped: 0, Time elapsed: 48.963 sec
    Running org.apache.hadoop.hbase.regionserver.TestEndToEndSplitTransaction
    Tests run: 1, Failures: 0, Errors: 0, Skipped: 0, Time elapsed: 43.791 sec
    Running org.apache.hadoop.hbase.regionserver.wal.TestLogRollAbort
    Tests run: 1, Failures: 0, Errors: 0, Skipped: 0, Time elapsed: 16.42 sec
    Running org.apache.hadoop.hbase.regionserver.wal.TestLogRollingNoCluster
    Tests run: 1, Failures: 0, Errors: 0, Skipped: 0, Time elapsed: 2.253 sec
    Running org.apache.hadoop.hbase.regionserver.wal.TestWALReplay
    Tests run: 5, Failures: 0, Errors: 0, Skipped: 0, Time elapsed: 28.631 sec
    Running org.apache.hadoop.hbase.regionserver.wal.TestHLog
    Tests run: 10, Failures: 0, Errors: 0, Skipped: 0, Time elapsed: 61.784 sec
    Running org.apache.hadoop.hbase.regionserver.wal.TestHLogBench
    Tests run: 1, Failures: 0, Errors: 0, Skipped: 0, Time elapsed: 1.467 sec
    Running org.apache.hadoop.hbase.regionserver.TestStore
    Tests run: 12, Failures: 0, Errors: 0, Skipped: 0, Time elapsed: 9.37 sec
    Running org.apache.hadoop.hbase.regionserver.TestRpcMetrics
    Tests run: 1, Failures: 0, Errors: 0, Skipped: 0, Time elapsed: 1.933 sec
    Running org.apache.hadoop.hbase.regionserver.TestBlocksRead
    Tests run: 4, Failures: 0, Errors: 0, Skipped: 0, Time elapsed: 1.104 sec
    Running org.apache.hadoop.hbase.regionserver.TestHRegionOnCluster
    Tests run: 1, Failures: 0, Errors: 0, Skipped: 0, Time elapsed: 20.019 sec
    Running org.apache.hadoop.hbase.regionserver.TestRegionServerMetrics
    Tests run: 3, Failures: 0, Errors: 0, Skipped: 0, Time elapsed: 54.192 sec
    Running org.apache.hadoop.hbase.regionserver.metrics.TestSchemaMetrics
    Tests run: 6, Failures: 0, Errors: 0, Skipped: 0, Time elapsed: 15.486 sec
    Running org.apache.hadoop.hbase.regionserver.TestStoreScanner
    Tests run: 16, Failures: 0, Errors: 0, Skipped: 0, Time elapsed: 0.111 sec
    Running org.apache.hadoop.hbase.regionserver.TestParallelPut
    Tests run: 2, Failures: 0, Errors: 0, Skipped: 0, Time elapsed: 6.246 sec
    Running org.apache.hadoop.hbase.regionserver.TestStoreFileBlockCacheSummary
    Tests run: 1, Failures: 0, Errors: 0, Skipped: 0, Time elapsed: 11.279 sec
    Running org.apache.hadoop.hbase.regionserver.TestSplitTransactionOnCluster
    Tests run: 6, Failures: 0, Errors: 0, Skipped: 0, Time elapsed: 52.847 sec
    Running org.apache.hadoop.hbase.regionserver.handler.TestCloseRegionHandler
    Tests run: 3, Failures: 0, Errors: 0, Skipped: 0, Time elapsed: 1.296 sec
    Running org.apache.hadoop.hbase.regionserver.handler.TestOpenRegionHandler
    Tests run: 3, Failures: 0, Errors: 0, Skipped: 0, Time elapsed: 0.994 sec
    Running org.apache.hadoop.hbase.regionserver.TestMultiColumnScanner
    Tests run: 12, Failures: 0, Errors: 0, Skipped: 0, Time elapsed: 43.553 sec
    Running org.apache.hadoop.hbase.regionserver.TestMasterAddressManager
    Tests run: 1, Failures: 0, Errors: 0, Skipped: 0, Time elapsed: 0.602 sec
    Running org.apache.hadoop.hbase.regionserver.TestSplitLogWorker
    Tests run: 5, Failures: 0, Errors: 0, Skipped: 0, Time elapsed: 1.112 sec
    Running org.apache.hadoop.hbase.regionserver.TestSeekOptimizations
    Tests run: 6, Failures: 0, Errors: 0, Skipped: 0, Time elapsed: 2.912 sec
    Running org.apache.hadoop.hbase.regionserver.TestFSErrorsExposed
    Tests run: 3, Failures: 0, Errors: 0, Skipped: 0, Time elapsed: 27.878 sec
    Running org.apache.hadoop.hbase.regionserver.TestHRegionServerBulkLoad
    Tests run: 1, Failures: 0, Errors: 0, Skipped: 0, Time elapsed: 44.686 sec
    Running org.apache.hadoop.hbase.filter.TestColumnRangeFilter
    Tests run: 1, Failures: 0, Errors: 0, Skipped: 0, Time elapsed: 15.101 sec
    Running org.apache.hadoop.hbase.TestGlobalMemStoreSize
    Tests run: 1, Failures: 0, Errors: 0, Skipped: 0, Time elapsed: 15.251 sec
    Running org.apache.hadoop.hbase.regionserver.wal.TestHLogSplit
    Tests run: 30, Failures: 0, Errors: 0, Skipped: 1, Time elapsed: 243.217 sec
    Running org.apache.hadoop.hbase.TestMultiVersions
    Tests run: 3, Failures: 0, Errors: 0, Skipped: 0, Time elapsed: 19.434 sec
    Running org.apache.hadoop.hbase.thrift2.TestThriftHBaseServiceHandler
    Tests run: 12, Failures: 0, Errors: 0, Skipped: 0, Time elapsed: 13.431 sec
    Running org.apache.hadoop.hbase.TestRegionRebalancing
    Tests run: 1, Failures: 0, Errors: 0, Skipped: 0, Time elapsed: 34.61 sec
    Running org.apache.hadoop.hbase.TestHBaseTestingUtility
    Tests run: 7, Failures: 0, Errors: 0, Skipped: 0, Time elapsed: 54.627 sec
    Running org.apache.hadoop.hbase.replication.TestReplicationZookeeper
    Tests run: 1, Failures: 0, Errors: 0, Skipped: 0, Time elapsed: 0.579 sec
    Running org.apache.hadoop.hbase.replication.regionserver.TestReplicationSourceManager
    Tests run: 1, Failures: 0, Errors: 0, Skipped: 0, Time elapsed: 0.962 sec
    Running org.apache.hadoop.hbase.replication.regionserver.TestReplicationSink
    Tests run: 5, Failures: 0, Errors: 0, Skipped: 0, Time elapsed: 13.877 sec
    Running org.apache.hadoop.hbase.replication.TestReplicationPeer
    Tests run: 1, Failures: 0, Errors: 0, Skipped: 0, Time elapsed: 7.559 sec
    Running org.apache.hadoop.hbase.replication.TestMasterReplication
    Tests run: 2, Failures: 0, Errors: 0, Skipped: 0, Time elapsed: 63.418 sec
    Running org.apache.hadoop.hbase.replication.TestReplicationSource
    Tests run: 1, Failures: 0, Errors: 0, Skipped: 0, Time elapsed: 2.289 sec
    Running org.apache.hadoop.hbase.replication.TestMultiSlaveReplication
    Tests run: 1, Failures: 0, Errors: 0, Skipped: 0, Time elapsed: 37.625 sec
    Running org.apache.hadoop.hbase.avro.TestAvroServer
    Tests run: 3, Failures: 0, Errors: 0, Skipped: 0, Time elapsed: 25.522 sec
    Running org.apache.hadoop.hbase.regionserver.wal.TestLogRolling
    Tests run: 3, Failures: 0, Errors: 0, Skipped: 0, Time elapsed: 422.869 sec
    Running org.apache.hadoop.hbase.replication.TestReplication
    Tests run: 10, Failures: 0, Errors: 0, Skipped: 0, Time elapsed: 128.32 sec
    Running org.apache.hadoop.hbase.coprocessor.TestRegionServerCoprocessorExceptionWithRemove
    Tests run: 1, Failures: 0, Errors: 0, Skipped: 0, Time elapsed: 17.156 sec
    Running org.apache.hadoop.hbase.coprocessor.TestMasterObserver
    Tests run: 3, Failures: 0, Errors: 0, Skipped: 0, Time elapsed: 26.753 sec
    Running org.apache.hadoop.hbase.coprocessor.TestRegionObserverInterface
    Tests run: 6, Failures: 0, Errors: 0, Skipped: 0, Time elapsed: 31.739 sec
    Running org.apache.hadoop.hbase.coprocessor.TestWALObserver
    Tests run: 3, Failures: 0, Errors: 0, Skipped: 0, Time elapsed: 15.773 sec
    Running org.apache.hadoop.hbase.TestAcidGuarantees
    Tests run: 3, Failures: 0, Errors: 0, Skipped: 0, Time elapsed: 94.447 sec
    Running org.apache.hadoop.hbase.coprocessor.TestCoprocessorEndpoint
    Tests run: 3, Failures: 0, Errors: 0, Skipped: 1, Time elapsed: 29.097 sec
    Running org.apache.hadoop.hbase.coprocessor.TestRegionObserverBypass
    Tests run: 2, Failures: 0, Errors: 0, Skipped: 0, Time elapsed: 12.314 sec
    Running org.apache.hadoop.hbase.coprocessor.TestMasterCoprocessorExceptionWithAbort
    Tests run: 1, Failures: 0, Errors: 0, Skipped: 0, Time elapsed: 10.819 sec
    Running org.apache.hadoop.hbase.coprocessor.TestRegionServerCoprocessorExceptionWithAbort
    Tests run: 1, Failures: 0, Errors: 0, Skipped: 0, Time elapsed: 14.622 sec
    Running org.apache.hadoop.hbase.coprocessor.TestAggregateProtocol
    Tests run: 45, Failures: 0, Errors: 0, Skipped: 0, Time elapsed: 13.886 sec
    Running org.apache.hadoop.hbase.coprocessor.TestMasterCoprocessorExceptionWithRemove
    Tests run: 1, Failures: 0, Errors: 0, Skipped: 0, Time elapsed: 14.689 sec
    Running org.apache.hadoop.hbase.constraint.TestConstraint
    Tests run: 5, Failures: 0, Errors: 0, Skipped: 0, Time elapsed: 26.609 sec
    Running org.apache.hadoop.hbase.coprocessor.TestClassLoading
    Tests run: 6, Failures: 0, Errors: 0, Skipped: 0, Time elapsed: 34.519 sec
    Running org.apache.hadoop.hbase.master.TestOpenedRegionHandler
    Tests run: 2, Failures: 0, Errors: 0, Skipped: 0, Time elapsed: 13.297 sec
    Running org.apache.hadoop.hbase.master.TestActiveMasterManager
    Tests run: 2, Failures: 0, Errors: 0, Skipped: 0, Time elapsed: 0.982 sec
    Running org.apache.hadoop.hbase.mapred.TestTableInputFormat
    Tests run: 10, Failures: 0, Errors: 0, Skipped: 0, Time elapsed: 28.833 sec
    Running org.apache.hadoop.hbase.master.TestMasterRestartAfterDisablingTable
    Tests run: 1, Failures: 0, Errors: 0, Skipped: 0, Time elapsed: 16.649 sec
    Running org.apache.hadoop.hbase.TestLocalHBaseCluster
    Tests run: 1, Failures: 0, Errors: 1, Skipped: 0, Time elapsed: 201.317 sec <<< FAILURE!
    Running org.apache.hadoop.hbase.mapred.TestTableMapReduce
    Tests run: 1, Failures: 0, Errors: 0, Skipped: 0, Time elapsed: 86.889 sec
    Running org.apache.hadoop.hbase.master.TestMasterTransitions
    Tests run: 3, Failures: 0, Errors: 0, Skipped: 3, Time elapsed: 18.388 sec
    Running org.apache.hadoop.hbase.master.TestMasterStatusServlet
    Tests run: 5, Failures: 0, Errors: 0, Skipped: 0, Time elapsed: 1.028 sec
    Running org.apache.hadoop.hbase.master.TestClockSkewDetection
    Tests run: 1, Failures: 0, Errors: 0, Skipped: 0, Time elapsed: 0.311 sec
    Running org.apache.hadoop.hbase.master.TestDefaultLoadBalancer
    Tests run: 4, Failures: 0, Errors: 0, Skipped: 0, Time elapsed: 1.457 sec
    Running org.apache.hadoop.hbase.master.TestHMasterRPCException
    Tests run: 1, Failures: 0, Errors: 0, Skipped: 0, Time elapsed: 1.092 sec
    Running org.apache.hadoop.hbase.master.TestMasterFailover
    Tests run: 4, Failures: 0, Errors: 0, Skipped: 0, Time elapsed: 62.503 sec
    Running org.apache.hadoop.hbase.master.TestRollingRestart
    Tests run: 1, Failures: 0, Errors: 0, Skipped: 0, Time elapsed: 41.382 sec
    Running org.apache.hadoop.hbase.master.TestRestartCluster
    Tests run: 2, Failures: 0, Errors: 0, Skipped: 0, Time elapsed: 27.365 sec
    Running org.apache.hadoop.hbase.master.TestMaster
    Tests run: 1, Failures: 0, Errors: 0, Skipped: 0, Time elapsed: 15.469 sec
    Running org.apache.hadoop.hbase.master.TestDeadServer
    Tests run: 1, Failures: 0, Errors: 0, Skipped: 0, Time elapsed: 0.209 sec
    Running org.apache.hadoop.hbase.master.TestLogsCleaner
    Tests run: 1, Failures: 0, Errors: 0, Skipped: 0, Time elapsed: 3.038 sec
    Running org.apache.hadoop.hbase.master.TestMasterShutdown
    Tests run: 1, Failures: 0, Errors: 0, Skipped: 0, Time elapsed: 13.661 sec
    Running org.apache.hadoop.hbase.master.TestSplitLogManager
    Tests run: 12, Failures: 0, Errors: 0, Skipped: 0, Time elapsed: 14.504 sec
    Running org.apache.hadoop.hbase.master.TestMasterZKSessionRecovery
    Tests run: 2, Failures: 0, Errors: 0, Skipped: 0, Time elapsed: 18.466 sec
    Running org.apache.hadoop.hbase.master.TestZKBasedOpenCloseRegion
    Tests run: 4, Failures: 0, Errors: 0, Skipped: 0, Time elapsed: 19.335 sec
    Running org.apache.hadoop.hbase.master.TestDistributedLogSplitting
    Tests run: 4, Failures: 0, Errors: 0, Skipped: 0, Time elapsed: 101.784 sec

    Results :

    Failed tests: testClientSessionExpired(org.apache.hadoop.hbase.TestZooKeeper)

    Tests in error:
    testLocalHBaseCluster(org.apache.hadoop.hbase.TestLocalHBaseCluster): Master not initialized after 200 seconds

    Tests run: 931, Failures: 1, Errors: 1, Skipped: 9

    [INFO] ------------------------------------------------------------------------
    [INFO] BUILD FAILURE
    [INFO] ------------------------------------------------------------------------
    [INFO] Total time: 37:59.390s
    [INFO] Finished at: Thu May 24 02:15:16 UTC 2012
    [INFO] Final Memory: 49M/562M
    [INFO] ------------------------------------------------------------------------
    [ERROR] Failed to execute goal org.apache.maven.plugins:maven-surefire-plugin:2.12-TRUNK-HBASE-2:test (secondPartTestsExecution) on project hbase: There are test failures.
    [ERROR]
    [ERROR] Please refer to <https://builds.apache.org/job/HBase-0.94/ws/trunk/target/surefire-reports> for the individual test results.
    [ERROR] -> [Help 1]
    [ERROR]
    [ERROR] To see the full stack trace of the errors, re-run Maven with the -e switch.
    [ERROR] Re-run Maven using the -X switch to enable full debug logging.
    [ERROR]
    [ERROR] For more information about the errors and possible solutions, please read the following articles:
    [ERROR] [Help 1] http://cwiki.apache.org/confluence/display/MAVEN/MojoFailureException
    Build step 'Invoke top-level Maven targets' marked build as failure
    Archiving artifacts
    Updating HBASE-6077
    Recording test results
  • Apache Jenkins Server at May 25, 2012 at 9:26 am
    See <https://builds.apache.org/job/HBase-0.94/216/changes>

    Changes:

    [apurtell] Amend HBASE-6077. Replace HTML formatting that does not work with Docbook

    ------------------------------------------
    Started by user tedyu
    Building remotely on ubuntu2 in workspace <https://builds.apache.org/job/HBase-0.94/ws/>
    Updating https://svn.apache.org/repos/asf/hbase/branches/0.94
    U src/docbkx/troubleshooting.xml
    At revision 1342541
    [HBase-0.94] $ /bin/bash -xe /tmp/hudson5603145496158210476.sh
    + uname -a
    Linux vesta.apache.org 2.6.32-27-server #49-Ubuntu SMP Thu Dec 2 02:05:21 UTC 2010 x86_64 GNU/Linux
    [HBase-0.94] $ /bin/bash -xe /tmp/hudson6189490536887316169.sh
    + ulimit -a
    core file size (blocks, -c) 0
    data seg size (kbytes, -d) unlimited
    scheduling priority (-e) 20
    file size (blocks, -f) unlimited
    pending signals (-i) 16382
    max locked memory (kbytes, -l) 64
    max memory size (kbytes, -m) unlimited
    open files (-n) 40000
    pipe size (512 bytes, -p) 8
    POSIX message queues (bytes, -q) 819200
    real-time priority (-r) 0
    stack size (kbytes, -s) 8192
    cpu time (seconds, -t) unlimited
    max user processes (-u) unlimited
    virtual memory (kbytes, -v) unlimited
    file locks (-x) unlimited
    [trunk] $ /home/hudson/tools/maven/latest3/bin/mvn clean -PrunAllTests -Dmaven.test.redirectTestOutputToFile=true site install assembly:single -DskipITs -Prelease
    [INFO] Scanning for projects...
    [WARNING]
    [WARNING] Some problems were encountered while building the effective model for org.apache.hbase:hbase:jar:0.94.1-SNAPSHOT
    [WARNING] 'dependencies.dependency.scope' for junit:junit:jar must be one of [provided, compile, runtime, test, system] but is 'test,runtime'. @ line 1294, column 14
    [WARNING]
    [WARNING] It is highly recommended to fix these problems because they threaten the stability of your build.
    [WARNING]
    [WARNING] For this reason, future Maven versions might no longer support building such malformed projects.
    [WARNING]
    [INFO]
    [INFO] ------------------------------------------------------------------------
    [INFO] Building HBase 0.94.1-SNAPSHOT
    [INFO] ------------------------------------------------------------------------
    [WARNING] The POM for javax.jms:jms:jar:1.1 is invalid, transitive dependencies (if any) will not be available, enable debug logging for more details
    [WARNING] The POM for com.sun.jdmk:jmxtools:jar:1.2.1 is invalid, transitive dependencies (if any) will not be available, enable debug logging for more details
    [WARNING] The POM for com.sun.jmx:jmxri:jar:1.2.1 is invalid, transitive dependencies (if any) will not be available, enable debug logging for more details
    [INFO]
    [INFO] --- maven-clean-plugin:2.4.1:clean (default-clean) @ hbase ---
    [INFO] Deleting <https://builds.apache.org/job/HBase-0.94/ws/trunk/target>
    [INFO] Deleting <https://builds.apache.org/job/HBase-0.94/ws/trunk/build> (includes = [], excludes = [])
    [INFO]
    [INFO] --- xml-maven-plugin:1.0-beta-3:transform (default) @ hbase ---
    [INFO] Transforming file: <https://builds.apache.org/job/HBase-0.94/ws/trunk/src/main/resources/hbase-default.xml>
    [INFO] Transformed 1 file(s).
    [INFO]
    [INFO] --- docbkx-maven-plugin:2.0.13:generate-html (multipage) @ hbase ---
    [INFO] Processing input file: ops_mgt.xml
    [INFO] Chunking output.
    [INFO] See <https://builds.apache.org/job/HBase-0.94/ws/trunk/target/site/book/ops_mgt> for generated file(s)
    [INFO] Processing input file: troubleshooting.xml
    [INFO] Chunking output.
    Error on line 620 column 396 of file://<https://builds.apache.org/job/HBase-0.94/ws/trunk/src/docbkx/troubleshooting.xml>:
    Error reported by XML parser: The element type "para" must be terminated by the matching end-tag "</para>".
    [INFO] ------------------------------------------------------------------------
    [INFO] BUILD FAILURE
    [INFO] ------------------------------------------------------------------------
    [INFO] Total time: 34.150s
    [INFO] Finished at: Fri May 25 09:26:03 UTC 2012
    [INFO] Final Memory: 14M/203M
    [INFO] ------------------------------------------------------------------------
    [ERROR] Failed to execute goal com.agilejava.docbkx:docbkx-maven-plugin:2.0.13:generate-html (multipage) on project hbase: Failed to transform troubleshooting.xml. org.xml.sax.SAXParseException: The element type "para" must be terminated by the matching end-tag "</para>". -> [Help 1]
    [ERROR]
    [ERROR] To see the full stack trace of the errors, re-run Maven with the -e switch.
    [ERROR] Re-run Maven using the -X switch to enable full debug logging.
    [ERROR]
    [ERROR] For more information about the errors and possible solutions, please read the following articles:
    [ERROR] [Help 1] http://cwiki.apache.org/confluence/display/MAVEN/MojoExecutionException
    Build step 'Invoke top-level Maven targets' marked build as failure
    Archiving artifacts
    Updating HBASE-6077
    Recording test results
  • Apache Jenkins Server at May 25, 2012 at 6:10 pm
    See <https://builds.apache.org/job/HBase-0.94/217/changes>

    Changes:

    [ramkrishna] HBASE-6070 AM.nodeDeleted and SSH races creating problems for regions under SPLIT (Ramkrishna)

    [apurtell] Amend HBASE-6077. Remove stray tag

    ------------------------------------------
    [...truncated 569 lines...]
    Running org.apache.hadoop.hbase.regionserver.TestHRegionOnCluster
    Tests run: 1, Failures: 0, Errors: 0, Skipped: 0, Time elapsed: 29.872 sec
    Running org.apache.hadoop.hbase.regionserver.TestAtomicOperation
    Tests run: 5, Failures: 0, Errors: 0, Skipped: 0, Time elapsed: 43.732 sec
    Running org.apache.hadoop.hbase.regionserver.TestBlocksRead
    Tests run: 4, Failures: 0, Errors: 0, Skipped: 0, Time elapsed: 1.395 sec
    Running org.apache.hadoop.hbase.regionserver.wal.TestLogRollingNoCluster
    Tests run: 1, Failures: 0, Errors: 0, Skipped: 0, Time elapsed: 2.463 sec
    Running org.apache.hadoop.hbase.regionserver.TestStoreFileBlockCacheSummary
    Tests run: 1, Failures: 0, Errors: 0, Skipped: 0, Time elapsed: 19.078 sec
    Running org.apache.hadoop.hbase.regionserver.TestHRegion
    Tests run: 62, Failures: 0, Errors: 0, Skipped: 0, Time elapsed: 47.651 sec
    Running org.apache.hadoop.hbase.regionserver.TestFSErrorsExposed
    Tests run: 3, Failures: 0, Errors: 0, Skipped: 0, Time elapsed: 31.886 sec
    Running org.apache.hadoop.hbase.regionserver.wal.TestWALReplay
    Tests run: 5, Failures: 0, Errors: 0, Skipped: 0, Time elapsed: 37.825 sec
    Running org.apache.hadoop.hbase.regionserver.wal.TestWALReplayCompressed
    Tests run: 5, Failures: 0, Errors: 0, Skipped: 0, Time elapsed: 34.152 sec
    Running org.apache.hadoop.hbase.regionserver.wal.TestHLog
    Tests run: 10, Failures: 0, Errors: 0, Skipped: 0, Time elapsed: 60.799 sec
    Running org.apache.hadoop.hbase.regionserver.wal.TestHLogBench
    Tests run: 1, Failures: 0, Errors: 0, Skipped: 0, Time elapsed: 1.189 sec
    Running org.apache.hadoop.hbase.regionserver.handler.TestCloseRegionHandler
    Tests run: 3, Failures: 0, Errors: 0, Skipped: 0, Time elapsed: 1.201 sec
    Running org.apache.hadoop.hbase.regionserver.handler.TestOpenRegionHandler
    Tests run: 3, Failures: 0, Errors: 0, Skipped: 0, Time elapsed: 0.97 sec
    Running org.apache.hadoop.hbase.regionserver.wal.TestLogRollAbort
    Tests run: 1, Failures: 0, Errors: 0, Skipped: 0, Time elapsed: 158.365 sec
    Running org.apache.hadoop.hbase.filter.TestColumnRangeFilter
    Tests run: 1, Failures: 0, Errors: 0, Skipped: 0, Time elapsed: 17.918 sec
    Running org.apache.hadoop.hbase.regionserver.TestHRegionServerBulkLoad
    Tests run: 1, Failures: 0, Errors: 0, Skipped: 0, Time elapsed: 48.448 sec
    Running org.apache.hadoop.hbase.coprocessor.TestAggregateProtocol
    Tests run: 45, Failures: 0, Errors: 0, Skipped: 0, Time elapsed: 16.582 sec
    Running org.apache.hadoop.hbase.coprocessor.TestClassLoading
    Tests run: 6, Failures: 0, Errors: 0, Skipped: 0, Time elapsed: 31.01 sec
    Running org.apache.hadoop.hbase.coprocessor.TestRegionServerCoprocessorExceptionWithRemove
    Tests run: 1, Failures: 0, Errors: 0, Skipped: 0, Time elapsed: 16.681 sec
    Running org.apache.hadoop.hbase.coprocessor.TestRegionServerCoprocessorExceptionWithAbort
    Tests run: 1, Failures: 0, Errors: 0, Skipped: 0, Time elapsed: 14.283 sec
    Running org.apache.hadoop.hbase.coprocessor.TestMasterObserver
    Tests run: 3, Failures: 0, Errors: 0, Skipped: 0, Time elapsed: 26.982 sec
    Running org.apache.hadoop.hbase.coprocessor.TestCoprocessorEndpoint
    Tests run: 3, Failures: 0, Errors: 0, Skipped: 1, Time elapsed: 28.734 sec
    Running org.apache.hadoop.hbase.coprocessor.TestWALObserver
    Tests run: 3, Failures: 0, Errors: 0, Skipped: 0, Time elapsed: 15.051 sec
    Running org.apache.hadoop.hbase.coprocessor.TestMasterCoprocessorExceptionWithAbort
    Tests run: 1, Failures: 0, Errors: 0, Skipped: 0, Time elapsed: 10.629 sec
    Running org.apache.hadoop.hbase.coprocessor.TestRegionObserverInterface
    Tests run: 6, Failures: 0, Errors: 0, Skipped: 0, Time elapsed: 31.957 sec
    Running org.apache.hadoop.hbase.coprocessor.TestMasterCoprocessorExceptionWithRemove
    Tests run: 1, Failures: 0, Errors: 0, Skipped: 0, Time elapsed: 14.853 sec
    Running org.apache.hadoop.hbase.coprocessor.TestRegionObserverBypass
    Tests run: 2, Failures: 0, Errors: 0, Skipped: 0, Time elapsed: 11.578 sec
    Running org.apache.hadoop.hbase.regionserver.wal.TestHLogSplit
    Tests run: 30, Failures: 0, Errors: 0, Skipped: 1, Time elapsed: 245.651 sec
    Running org.apache.hadoop.hbase.TestGlobalMemStoreSize
    Tests run: 1, Failures: 0, Errors: 0, Skipped: 0, Time elapsed: 14.862 sec
    Running org.apache.hadoop.hbase.mapred.TestTableInputFormat
    Tests run: 10, Failures: 0, Errors: 0, Skipped: 0, Time elapsed: 29.809 sec
    Running org.apache.hadoop.hbase.mapreduce.TestHLogRecordReader
    Tests run: 2, Failures: 0, Errors: 0, Skipped: 0, Time elapsed: 6.587 sec
    Running org.apache.hadoop.hbase.mapred.TestTableMapReduce
    Tests run: 1, Failures: 0, Errors: 0, Skipped: 0, Time elapsed: 90.24 sec
    Running org.apache.hadoop.hbase.mapreduce.TestLoadIncrementalHFilesSplitRecovery
    Tests run: 4, Failures: 0, Errors: 0, Skipped: 0, Time elapsed: 106.279 sec
    Running org.apache.hadoop.hbase.mapreduce.TestTableMapReduce
    Tests run: 1, Failures: 0, Errors: 0, Skipped: 0, Time elapsed: 120.88 sec
    Running org.apache.hadoop.hbase.mapreduce.TestWALPlayer
    Tests run: 1, Failures: 0, Errors: 0, Skipped: 0, Time elapsed: 47.89 sec
    Running org.apache.hadoop.hbase.regionserver.wal.TestLogRolling
    Tests run: 3, Failures: 0, Errors: 0, Skipped: 0, Time elapsed: 434.504 sec
    Running org.apache.hadoop.hbase.mapreduce.TestImportTsv
    Tests run: 9, Failures: 0, Errors: 0, Skipped: 0, Time elapsed: 156.359 sec
    Running org.apache.hadoop.hbase.mapreduce.TestHFileOutputFormat
    Tests run: 9, Failures: 0, Errors: 0, Skipped: 0, Time elapsed: 262.97 sec
    Running org.apache.hadoop.hbase.mapreduce.TestTimeRangeMapRed
    Tests run: 1, Failures: 0, Errors: 0, Skipped: 0, Time elapsed: 49.584 sec
    Running org.apache.hadoop.hbase.mapreduce.TestMultithreadedTableMapper
    Tests run: 1, Failures: 0, Errors: 0, Skipped: 0, Time elapsed: 128.98 sec
    Running org.apache.hadoop.hbase.mapreduce.TestLoadIncrementalHFiles
    Tests run: 6, Failures: 0, Errors: 0, Skipped: 0, Time elapsed: 39.494 sec
    Running org.apache.hadoop.hbase.thrift2.TestThriftHBaseServiceHandler
    Tests run: 12, Failures: 0, Errors: 0, Skipped: 0, Time elapsed: 20.825 sec
    Running org.apache.hadoop.hbase.mapreduce.TestImportExport
    Tests run: 2, Failures: 0, Errors: 0, Skipped: 0, Time elapsed: 54.115 sec
    Running org.apache.hadoop.hbase.catalog.TestMetaReaderEditorNoCluster
    Tests run: 1, Failures: 0, Errors: 0, Skipped: 0, Time elapsed: 4.148 sec
    Running org.apache.hadoop.hbase.catalog.TestMetaReaderEditor
    Tests run: 5, Failures: 1, Errors: 0, Skipped: 0, Time elapsed: 33.835 sec <<< FAILURE!
    Running org.apache.hadoop.hbase.catalog.TestCatalogTracker
    Tests run: 9, Failures: 0, Errors: 0, Skipped: 1, Time elapsed: 6.359 sec
    Running org.apache.hadoop.hbase.client.TestTimestampsFilter
    Tests run: 3, Failures: 0, Errors: 0, Skipped: 0, Time elapsed: 20.75 sec
    Running org.apache.hadoop.hbase.TestAcidGuarantees
    Tests run: 3, Failures: 0, Errors: 0, Skipped: 0, Time elapsed: 111.936 sec
    Running org.apache.hadoop.hbase.catalog.TestCatalogTrackerOnCluster
    Tests run: 1, Failures: 0, Errors: 0, Skipped: 0, Time elapsed: 92.377 sec
    Running org.apache.hadoop.hbase.client.TestHCM
    Tests run: 6, Failures: 0, Errors: 0, Skipped: 0, Time elapsed: 19.706 sec
    Running org.apache.hadoop.hbase.client.TestScannerTimeout
    Tests run: 4, Failures: 0, Errors: 0, Skipped: 0, Time elapsed: 47.574 sec
    Running org.apache.hadoop.hbase.client.TestShell
    Tests run: 1, Failures: 0, Errors: 0, Skipped: 0, Time elapsed: 121.942 sec
    Running org.apache.hadoop.hbase.client.TestMetaScanner
    Tests run: 1, Failures: 0, Errors: 0, Skipped: 0, Time elapsed: 28.173 sec
    Running org.apache.hadoop.hbase.client.TestHTableUtil
    Tests run: 2, Failures: 0, Errors: 0, Skipped: 0, Time elapsed: 14.163 sec
    Running org.apache.hadoop.hbase.client.TestMetaMigrationRemovingHTD
    Tests run: 3, Failures: 0, Errors: 0, Skipped: 0, Time elapsed: 21.759 sec
    Running org.apache.hadoop.hbase.client.TestHTablePool$TestHTableReusablePool
    Tests run: 9, Failures: 0, Errors: 0, Skipped: 0, Time elapsed: 5.157 sec
    Running org.apache.hadoop.hbase.client.TestHTablePool$TestHTableThreadLocalPool
    Tests run: 9, Failures: 0, Errors: 0, Skipped: 0, Time elapsed: 24.432 sec
    Running org.apache.hadoop.hbase.client.replication.TestReplicationAdmin
    Tests run: 1, Failures: 0, Errors: 0, Skipped: 0, Time elapsed: 0.835 sec
    Running org.apache.hadoop.hbase.client.TestMultipleTimestamps
    Tests run: 8, Failures: 0, Errors: 0, Skipped: 0, Time elapsed: 36.57 sec
    Running org.apache.hadoop.hbase.client.TestMultiParallel
    Tests run: 11, Failures: 0, Errors: 0, Skipped: 0, Time elapsed: 46.688 sec
    Running org.apache.hadoop.hbase.metrics.TestMetricsMBeanBase
    Tests run: 2, Failures: 0, Errors: 0, Skipped: 0, Time elapsed: 1.157 sec
    Running org.apache.hadoop.hbase.client.TestFromClientSide
    Tests run: 55, Failures: 1, Errors: 0, Skipped: 3, Time elapsed: 205.688 sec <<< FAILURE!
    Running org.apache.hadoop.hbase.rest.TestGzipFilter
    Tests run: 3, Failures: 0, Errors: 0, Skipped: 0, Time elapsed: 18.393 sec
    Running org.apache.hadoop.hbase.constraint.TestConstraint
    Tests run: 5, Failures: 0, Errors: 0, Skipped: 0, Time elapsed: 40.269 sec
    Running org.apache.hadoop.hbase.rest.TestMultiRowResource
    Tests run: 3, Failures: 0, Errors: 0, Skipped: 0, Time elapsed: 23.025 sec
    Running org.apache.hadoop.hbase.rest.TestScannersWithFilters
    Tests run: 10, Failures: 0, Errors: 0, Skipped: 0, Time elapsed: 21.017 sec
    Running org.apache.hadoop.hbase.rest.TestRowResource
    Tests run: 11, Failures: 0, Errors: 0, Skipped: 0, Time elapsed: 20.45 sec
    Running org.apache.hadoop.hbase.rest.client.TestRemoteAdmin
    Tests run: 1, Failures: 0, Errors: 0, Skipped: 0, Time elapsed: 20.199 sec
    Running org.apache.hadoop.hbase.mapreduce.TestTableInputFormatScan
    Tests run: 12, Failures: 0, Errors: 0, Skipped: 0, Time elapsed: 581.66 sec
    Running org.apache.hadoop.hbase.rest.client.TestRemoteTable
    Tests run: 3, Failures: 0, Errors: 0, Skipped: 0, Time elapsed: 14.755 sec
    Running org.apache.hadoop.hbase.rest.TestVersionResource
    Tests run: 7, Failures: 0, Errors: 0, Skipped: 0, Time elapsed: 14.663 sec
    Running org.apache.hadoop.hbase.rest.TestScannerResource
    Tests run: 5, Failures: 0, Errors: 0, Skipped: 0, Time elapsed: 39.881 sec
    Running org.apache.hadoop.hbase.rest.TestStatusResource
    Tests run: 2, Failures: 0, Errors: 0, Skipped: 0, Time elapsed: 26.822 sec
    Running org.apache.hadoop.hbase.rest.TestTableResource
    Tests run: 8, Failures: 0, Errors: 0, Skipped: 0, Time elapsed: 37.411 sec
    Running org.apache.hadoop.hbase.rest.TestSchemaResource
    Tests run: 2, Failures: 0, Errors: 0, Skipped: 0, Time elapsed: 20.302 sec
    Running org.apache.hadoop.hbase.thrift.TestThriftServer
    Tests run: 1, Failures: 0, Errors: 0, Skipped: 0, Time elapsed: 44.431 sec
    Running org.apache.hadoop.hbase.io.encoding.TestLoadAndSwitchEncodeOnDisk
    Tests run: 1, Failures: 0, Errors: 0, Skipped: 0, Time elapsed: 28.393 sec
    Running org.apache.hadoop.hbase.client.TestAdmin
    Tests run: 37, Failures: 0, Errors: 0, Skipped: 0, Time elapsed: 234.493 sec
    Running org.apache.hadoop.hbase.io.encoding.TestUpgradeFromHFileV1ToEncoding
    Tests run: 1, Failures: 0, Errors: 0, Skipped: 0, Time elapsed: 87.747 sec
    Running org.apache.hadoop.hbase.io.hfile.TestHFileSeek
    Tests run: 1, Failures: 0, Errors: 0, Skipped: 0, Time elapsed: 8.636 sec
    Running org.apache.hadoop.hbase.io.encoding.TestDataBlockEncoders
    Tests run: 12, Failures: 0, Errors: 0, Skipped: 0, Time elapsed: 145.253 sec
    Running org.apache.hadoop.hbase.io.hfile.slab.TestSlabCache
    Tests run: 7, Failures: 0, Errors: 0, Skipped: 0, Time elapsed: 20.184 sec
    Running org.apache.hadoop.hbase.io.hfile.TestChecksum
    Tests run: 3, Failures: 0, Errors: 0, Skipped: 0, Time elapsed: 1.841 sec
    Running org.apache.hadoop.hbase.io.hfile.TestHFileBlockIndex
    Tests run: 10, Failures: 0, Errors: 0, Skipped: 0, Time elapsed: 10.92 sec
    Running org.apache.hadoop.hbase.io.hfile.TestLruBlockCache
    Tests run: 16, Failures: 0, Errors: 0, Skipped: 0, Time elapsed: 0.776 sec
    Running org.apache.hadoop.hbase.io.hfile.TestHFilePerformance
    Tests run: 1, Failures: 0, Errors: 0, Skipped: 0, Time elapsed: 7.332 sec
    Running org.apache.hadoop.hbase.io.hfile.slab.TestSingleSizeCache
    Tests run: 5, Failures: 0, Errors: 0, Skipped: 0, Time elapsed: 29.011 sec
    Running org.apache.hadoop.hbase.io.hfile.TestFixedFileTrailer
    Tests run: 2, Failures: 0, Errors: 0, Skipped: 0, Time elapsed: 1.108 sec
    Running org.apache.hadoop.hbase.io.hfile.TestHFileBlockCompatibility
    Tests run: 10, Failures: 0, Errors: 0, Skipped: 0, Time elapsed: 2.075 sec
    Running org.apache.hadoop.hbase.io.hfile.TestHFileBlock
    Tests run: 16, Failures: 0, Errors: 0, Skipped: 0, Time elapsed: 52.284 sec
    Running org.apache.hadoop.hbase.io.hfile.TestForceCacheImportantBlocks
    Tests run: 4, Failures: 0, Errors: 0, Skipped: 0, Time elapsed: 75.739 sec
    Running org.apache.hadoop.hbase.io.encoding.TestChangingEncoding
    Tests run: 4, Failures: 0, Errors: 0, Skipped: 0, Time elapsed: 265.244 sec
    Running org.apache.hadoop.hbase.io.hfile.TestCacheOnWrite
    Tests run: 36, Failures: 0, Errors: 0, Skipped: 0, Time elapsed: 37.867 sec
    Running org.apache.hadoop.hbase.TestClusterBootOrder
    Tests run: 2, Failures: 0, Errors: 0, Skipped: 0, Time elapsed: 28.669 sec
    Running org.apache.hadoop.hbase.replication.regionserver.TestReplicationSourceManager
    Tests run: 1, Failures: 0, Errors: 0, Skipped: 0, Time elapsed: 2.072 sec
    Running org.apache.hadoop.hbase.avro.TestAvroServer
    Tests run: 3, Failures: 0, Errors: 0, Skipped: 0, Time elapsed: 28.726 sec
    Running org.apache.hadoop.hbase.replication.regionserver.TestReplicationSink
    Tests run: 5, Failures: 0, Errors: 0, Skipped: 0, Time elapsed: 16.312 sec
    Running org.apache.hadoop.hbase.replication.TestReplicationSource
    Tests run: 1, Failures: 0, Errors: 0, Skipped: 0, Time elapsed: 4.076 sec
    Running org.apache.hadoop.hbase.replication.TestMultiSlaveReplication
    Tests run: 1, Failures: 1, Errors: 0, Skipped: 0, Time elapsed: 37.17 sec <<< FAILURE!
    Running org.apache.hadoop.hbase.replication.TestReplicationZookeeper
    Tests run: 1, Failures: 0, Errors: 0, Skipped: 0, Time elapsed: 0.853 sec
    Running org.apache.hadoop.hbase.replication.TestReplicationPeer
    Tests run: 1, Failures: 0, Errors: 0, Skipped: 0, Time elapsed: 7.968 sec
    Running org.apache.hadoop.hbase.ipc.TestDelayedRpc
    Tests run: 4, Failures: 0, Errors: 0, Skipped: 0, Time elapsed: 3.226 sec
    Running org.apache.hadoop.hbase.thrift.TestThriftServerCmdLine
    Tests run: 20, Failures: 0, Errors: 0, Skipped: 0, Time elapsed: 391.749 sec
    Running org.apache.hadoop.hbase.TestZooKeeper
    Tests run: 8, Failures: 0, Errors: 0, Skipped: 0, Time elapsed: 37.327 sec
    Running org.apache.hadoop.hbase.replication.TestMasterReplication
    Tests run: 2, Failures: 0, Errors: 0, Skipped: 0, Time elapsed: 71 sec
    Running org.apache.hadoop.hbase.TestHBaseTestingUtility
    Tests run: 7, Failures: 0, Errors: 0, Skipped: 0, Time elapsed: 61.853 sec
    Running org.apache.hadoop.hbase.replication.TestReplication
    Tests run: 10, Failures: 0, Errors: 0, Skipped: 0, Time elapsed: 144.582 sec

    Results :

    Failed tests: testMultipleResubmits(org.apache.hadoop.hbase.master.TestSplitLogManager)
    testRetrying(org.apache.hadoop.hbase.catalog.TestMetaReaderEditor): writer: count=1, t=org.apache.hadoop.hbase.client.NoServerForRegionException: Unable to find region for testRetrying,,1337968469649.690921ab8d15288d7fc5a39d985130a6. after 10 tries.
    testPoolBehavior(org.apache.hadoop.hbase.client.TestFromClientSide): expected:<3> but was:<4>
    testMultiSlaveReplication(org.apache.hadoop.hbase.replication.TestMultiSlaveReplication): Waited too much time for put replication

    Tests in error:
    testLocalHBaseCluster(org.apache.hadoop.hbase.TestLocalHBaseCluster): Master not initialized after 200 seconds

    Tests run: 931, Failures: 4, Errors: 1, Skipped: 9

    [INFO] ------------------------------------------------------------------------
    [INFO] BUILD FAILURE
    [INFO] ------------------------------------------------------------------------
    [INFO] Total time: 42:04.230s
    [INFO] Finished at: Fri May 25 18:09:22 UTC 2012
    [INFO] Final Memory: 39M/452M
    [INFO] ------------------------------------------------------------------------
    [ERROR] Failed to execute goal org.apache.maven.plugins:maven-surefire-plugin:2.12-TRUNK-HBASE-2:test (secondPartTestsExecution) on project hbase: There are test failures.
    [ERROR]
    [ERROR] Please refer to <https://builds.apache.org/job/HBase-0.94/ws/trunk/target/surefire-reports> for the individual test results.
    [ERROR] -> [Help 1]
    [ERROR]
    [ERROR] To see the full stack trace of the errors, re-run Maven with the -e switch.
    [ERROR] Re-run Maven using the -X switch to enable full debug logging.
    [ERROR]
    [ERROR] For more information about the errors and possible solutions, please read the following articles:
    [ERROR] [Help 1] http://cwiki.apache.org/confluence/display/MAVEN/MojoFailureException
    Build step 'Invoke top-level Maven targets' marked build as failure
    Archiving artifacts
    Updating HBASE-6070
    Updating HBASE-6077
    Recording test results
  • Apache Jenkins Server at May 26, 2012 at 9:58 am
    See <https://builds.apache.org/job/HBase-0.94/218/changes>

    Changes:

    [tedyu] HBASE-5986 Clients can see holes in the META table when regions are being split (Enis)

    ------------------------------------------
    [...truncated 580 lines...]
    Running org.apache.hadoop.hbase.client.TestShell
    Tests run: 1, Failures: 0, Errors: 0, Skipped: 0, Time elapsed: 76.916 sec
    Running org.apache.hadoop.hbase.client.TestMetaScanner
    Tests run: 1, Failures: 0, Errors: 0, Skipped: 0, Time elapsed: 12.949 sec
    Running org.apache.hadoop.hbase.client.TestHTableUtil
    Tests run: 2, Failures: 0, Errors: 0, Skipped: 0, Time elapsed: 12.723 sec
    Running org.apache.hadoop.hbase.client.TestMultiParallel
    Tests run: 11, Failures: 0, Errors: 0, Skipped: 0, Time elapsed: 34.93 sec
    Running org.apache.hadoop.hbase.client.replication.TestReplicationAdmin
    Tests run: 1, Failures: 0, Errors: 0, Skipped: 0, Time elapsed: 0.775 sec
    Running org.apache.hadoop.hbase.client.TestMultipleTimestamps
    Tests run: 8, Failures: 0, Errors: 0, Skipped: 0, Time elapsed: 28.818 sec
    Running org.apache.hadoop.hbase.client.TestHCM
    Tests run: 6, Failures: 0, Errors: 0, Skipped: 0, Time elapsed: 18.013 sec
    Running org.apache.hadoop.hbase.client.TestHTablePool$TestHTableReusablePool
    Tests run: 9, Failures: 0, Errors: 0, Skipped: 0, Time elapsed: 6.131 sec
    Running org.apache.hadoop.hbase.master.TestMasterShutdown
    Tests run: 1, Failures: 0, Errors: 0, Skipped: 0, Time elapsed: 13.373 sec
    Running org.apache.hadoop.hbase.master.TestActiveMasterManager
    Tests run: 2, Failures: 0, Errors: 0, Skipped: 0, Time elapsed: 0.83 sec
    Running org.apache.hadoop.hbase.client.TestHTablePool$TestHTableThreadLocalPool
    Tests run: 9, Failures: 0, Errors: 0, Skipped: 0, Time elapsed: 23.342 sec
    Running org.apache.hadoop.hbase.master.TestMasterStatusServlet
    Tests run: 5, Failures: 0, Errors: 0, Skipped: 0, Time elapsed: 0.944 sec
    Running org.apache.hadoop.hbase.master.TestDeadServer
    Tests run: 1, Failures: 0, Errors: 0, Skipped: 0, Time elapsed: 0.204 sec
    Running org.apache.hadoop.hbase.master.TestHMasterRPCException
    Tests run: 1, Failures: 0, Errors: 0, Skipped: 0, Time elapsed: 1.067 sec
    Running org.apache.hadoop.hbase.master.TestLogsCleaner
    Tests run: 1, Failures: 0, Errors: 0, Skipped: 0, Time elapsed: 3.062 sec
    Running org.apache.hadoop.hbase.client.TestAdmin
    Tests run: 37, Failures: 0, Errors: 0, Skipped: 0, Time elapsed: 169.381 sec
    Running org.apache.hadoop.hbase.master.TestOpenedRegionHandler
    Tests run: 2, Failures: 0, Errors: 0, Skipped: 0, Time elapsed: 14.583 sec
    Running org.apache.hadoop.hbase.client.TestFromClientSide
    Tests run: 55, Failures: 0, Errors: 0, Skipped: 3, Time elapsed: 165.497 sec
    Running org.apache.hadoop.hbase.master.TestMasterTransitions
    Tests run: 3, Failures: 0, Errors: 0, Skipped: 3, Time elapsed: 19.392 sec
    Running org.apache.hadoop.hbase.master.TestDefaultLoadBalancer
    Tests run: 4, Failures: 0, Errors: 0, Skipped: 0, Time elapsed: 1.49 sec
    Running org.apache.hadoop.hbase.master.TestZKBasedOpenCloseRegion
    Tests run: 4, Failures: 0, Errors: 0, Skipped: 0, Time elapsed: 20.855 sec
    Running org.apache.hadoop.hbase.master.TestClockSkewDetection
    Tests run: 1, Failures: 0, Errors: 0, Skipped: 0, Time elapsed: 0.275 sec
    Running org.apache.hadoop.hbase.master.TestRollingRestart
    Tests run: 1, Failures: 0, Errors: 0, Skipped: 0, Time elapsed: 44.875 sec
    Running org.apache.hadoop.hbase.master.TestRestartCluster
    Tests run: 2, Failures: 0, Errors: 0, Skipped: 0, Time elapsed: 25.984 sec
    Running org.apache.hadoop.hbase.master.TestMaster
    Tests run: 1, Failures: 0, Errors: 0, Skipped: 0, Time elapsed: 15.361 sec
    Running org.apache.hadoop.hbase.master.TestSplitLogManager
    Tests run: 12, Failures: 0, Errors: 0, Skipped: 0, Time elapsed: 14.619 sec
    Running org.apache.hadoop.hbase.master.TestMasterZKSessionRecovery
    Tests run: 2, Failures: 0, Errors: 0, Skipped: 0, Time elapsed: 18.263 sec
    Running org.apache.hadoop.hbase.master.TestMasterRestartAfterDisablingTable
    Tests run: 1, Failures: 0, Errors: 0, Skipped: 0, Time elapsed: 17.204 sec
    Running org.apache.hadoop.hbase.metrics.TestMetricsMBeanBase
    Tests run: 2, Failures: 0, Errors: 0, Skipped: 0, Time elapsed: 1.124 sec
    Running org.apache.hadoop.hbase.master.TestMasterFailover
    Tests run: 4, Failures: 0, Errors: 0, Skipped: 0, Time elapsed: 59.787 sec
    Running org.apache.hadoop.hbase.TestGlobalMemStoreSize
    Tests run: 1, Failures: 0, Errors: 0, Skipped: 0, Time elapsed: 16.484 sec
    Running org.apache.hadoop.hbase.replication.TestReplicationZookeeper
    Tests run: 1, Failures: 0, Errors: 0, Skipped: 0, Time elapsed: 0.598 sec
    Running org.apache.hadoop.hbase.TestFullLogReconstruction
    Tests run: 1, Failures: 0, Errors: 0, Skipped: 0, Time elapsed: 37.708 sec
    Running org.apache.hadoop.hbase.replication.TestReplicationSource
    Tests run: 1, Failures: 0, Errors: 0, Skipped: 0, Time elapsed: 2.77 sec
    Running org.apache.hadoop.hbase.TestZooKeeper
    Tests run: 8, Failures: 0, Errors: 0, Skipped: 0, Time elapsed: 51.503 sec
    Running org.apache.hadoop.hbase.master.TestDistributedLogSplitting
    Tests run: 4, Failures: 0, Errors: 0, Skipped: 0, Time elapsed: 101.014 sec
    Running org.apache.hadoop.hbase.replication.TestReplicationPeer
    Tests run: 1, Failures: 0, Errors: 0, Skipped: 0, Time elapsed: 7.566 sec
    Running org.apache.hadoop.hbase.replication.regionserver.TestReplicationSourceManager
    Tests run: 1, Failures: 0, Errors: 0, Skipped: 0, Time elapsed: 0.97 sec
    Running org.apache.hadoop.hbase.replication.regionserver.TestReplicationSink
    Tests run: 5, Failures: 0, Errors: 0, Skipped: 0, Time elapsed: 14.267 sec
    Running org.apache.hadoop.hbase.replication.TestMasterReplication
    Tests run: 2, Failures: 0, Errors: 0, Skipped: 0, Time elapsed: 65.028 sec
    Running org.apache.hadoop.hbase.replication.TestMultiSlaveReplication
    Tests run: 1, Failures: 0, Errors: 0, Skipped: 0, Time elapsed: 38.745 sec
    Running org.apache.hadoop.hbase.TestMultiVersions
    Tests run: 3, Failures: 0, Errors: 0, Skipped: 0, Time elapsed: 20.456 sec
    Running org.apache.hadoop.hbase.catalog.TestMetaReaderEditorNoCluster
    Tests run: 1, Failures: 0, Errors: 0, Skipped: 0, Time elapsed: 4.104 sec
    Running org.apache.hadoop.hbase.catalog.TestCatalogTracker
    Tests run: 9, Failures: 0, Errors: 0, Skipped: 1, Time elapsed: 6.413 sec
    Running org.apache.hadoop.hbase.replication.TestReplication
    Tests run: 10, Failures: 2, Errors: 0, Skipped: 0, Time elapsed: 94.338 sec <<< FAILURE!
    Running org.apache.hadoop.hbase.catalog.TestMetaReaderEditor
    Tests run: 5, Failures: 0, Errors: 0, Skipped: 0, Time elapsed: 21.907 sec
    Running org.apache.hadoop.hbase.TestHBaseTestingUtility
    Tests run: 7, Failures: 0, Errors: 0, Skipped: 0, Time elapsed: 58.204 sec
    Running org.apache.hadoop.hbase.coprocessor.TestAggregateProtocol
    Tests run: 45, Failures: 0, Errors: 0, Skipped: 0, Time elapsed: 14.976 sec
    Running org.apache.hadoop.hbase.coprocessor.TestMasterObserver
    Tests run: 3, Failures: 0, Errors: 0, Skipped: 0, Time elapsed: 27.941 sec
    Running org.apache.hadoop.hbase.coprocessor.TestCoprocessorEndpoint
    Tests run: 3, Failures: 0, Errors: 0, Skipped: 1, Time elapsed: 29.797 sec
    Running org.apache.hadoop.hbase.coprocessor.TestClassLoading
    Tests run: 6, Failures: 0, Errors: 0, Skipped: 0, Time elapsed: 30.504 sec
    Running org.apache.hadoop.hbase.coprocessor.TestMasterCoprocessorExceptionWithRemove
    Tests run: 1, Failures: 0, Errors: 0, Skipped: 0, Time elapsed: 16.051 sec
    Running org.apache.hadoop.hbase.coprocessor.TestRegionObserverInterface
    Tests run: 6, Failures: 0, Errors: 0, Skipped: 0, Time elapsed: 33.336 sec
    Running org.apache.hadoop.hbase.catalog.TestCatalogTrackerOnCluster
    Tests run: 1, Failures: 0, Errors: 0, Skipped: 0, Time elapsed: 77.552 sec
    Running org.apache.hadoop.hbase.coprocessor.TestRegionServerCoprocessorExceptionWithRemove
    Tests run: 1, Failures: 0, Errors: 0, Skipped: 0, Time elapsed: 17.802 sec
    Running org.apache.hadoop.hbase.coprocessor.TestMasterCoprocessorExceptionWithAbort
    Tests run: 1, Failures: 0, Errors: 0, Skipped: 0, Time elapsed: 11.297 sec
    Running org.apache.hadoop.hbase.coprocessor.TestWALObserver
    Tests run: 3, Failures: 0, Errors: 0, Skipped: 0, Time elapsed: 16.309 sec
    Running org.apache.hadoop.hbase.coprocessor.TestRegionObserverBypass
    Tests run: 2, Failures: 0, Errors: 0, Skipped: 0, Time elapsed: 13.337 sec
    Running org.apache.hadoop.hbase.coprocessor.TestRegionServerCoprocessorExceptionWithAbort
    Tests run: 1, Failures: 0, Errors: 0, Skipped: 0, Time elapsed: 14.603 sec
    Running org.apache.hadoop.hbase.thrift2.TestThriftHBaseServiceHandler
    Tests run: 12, Failures: 0, Errors: 0, Skipped: 0, Time elapsed: 12.736 sec
    Running org.apache.hadoop.hbase.monitoring.TestTaskMonitor
    Tests run: 3, Failures: 0, Errors: 0, Skipped: 0, Time elapsed: 0.3 sec
    Running org.apache.hadoop.hbase.monitoring.TestMemoryBoundedLogMessageBuffer
    Tests run: 2, Failures: 0, Errors: 0, Skipped: 0, Time elapsed: 0.234 sec
    Running org.apache.hadoop.hbase.avro.TestAvroServer
    Tests run: 3, Failures: 0, Errors: 0, Skipped: 0, Time elapsed: 27.631 sec
    Running org.apache.hadoop.hbase.regionserver.TestHRegionOnCluster
    Tests run: 1, Failures: 0, Errors: 0, Skipped: 0, Time elapsed: 23.474 sec
    Running org.apache.hadoop.hbase.regionserver.TestMasterAddressManager
    Tests run: 1, Failures: 0, Errors: 0, Skipped: 0, Time elapsed: 0.868 sec
    Running org.apache.hadoop.hbase.thrift.TestThriftServer
    Tests run: 1, Failures: 0, Errors: 0, Skipped: 0, Time elapsed: 41.077 sec
    Running org.apache.hadoop.hbase.regionserver.TestSplitLogWorker
    Tests run: 5, Failures: 0, Errors: 0, Skipped: 0, Time elapsed: 2.267 sec
    Running org.apache.hadoop.hbase.regionserver.TestServerCustomProtocol
    Tests run: 7, Failures: 0, Errors: 0, Skipped: 0, Time elapsed: 15.035 sec
    Running org.apache.hadoop.hbase.regionserver.TestHRegion
    Tests run: 62, Failures: 0, Errors: 0, Skipped: 0, Time elapsed: 38.694 sec
    Running org.apache.hadoop.hbase.regionserver.TestStore
    Tests run: 12, Failures: 0, Errors: 0, Skipped: 0, Time elapsed: 9.439 sec
    Running org.apache.hadoop.hbase.regionserver.TestStoreFileBlockCacheSummary
    Tests run: 1, Failures: 0, Errors: 0, Skipped: 0, Time elapsed: 14.34 sec
    Running org.apache.hadoop.hbase.regionserver.TestBlocksRead
    Tests run: 4, Failures: 0, Errors: 0, Skipped: 0, Time elapsed: 1.667 sec
    Running org.apache.hadoop.hbase.regionserver.TestRegionServerMetrics
    Tests run: 3, Failures: 0, Errors: 0, Skipped: 0, Time elapsed: 56.875 sec
    Running org.apache.hadoop.hbase.regionserver.TestSeekOptimizations
    Tests run: 6, Failures: 0, Errors: 0, Skipped: 0, Time elapsed: 3.79 sec
    Running org.apache.hadoop.hbase.regionserver.TestAtomicOperation
    Tests run: 5, Failures: 0, Errors: 0, Skipped: 0, Time elapsed: 28.937 sec
    Running org.apache.hadoop.hbase.regionserver.handler.TestCloseRegionHandler
    Tests run: 3, Failures: 0, Errors: 0, Skipped: 0, Time elapsed: 1.206 sec
    Running org.apache.hadoop.hbase.regionserver.handler.TestOpenRegionHandler
    Tests run: 3, Failures: 0, Errors: 0, Skipped: 0, Time elapsed: 1.031 sec
    Running org.apache.hadoop.hbase.regionserver.TestFSErrorsExposed
    Tests run: 3, Failures: 0, Errors: 0, Skipped: 0, Time elapsed: 31.596 sec
    Running org.apache.hadoop.hbase.regionserver.metrics.TestSchemaMetrics
    Tests run: 6, Failures: 0, Errors: 0, Skipped: 0, Time elapsed: 15.041 sec
    Running org.apache.hadoop.hbase.regionserver.TestParallelPut
    Tests run: 2, Failures: 0, Errors: 0, Skipped: 0, Time elapsed: 5.465 sec
    Running org.apache.hadoop.hbase.regionserver.wal.TestHLogBench
    Tests run: 1, Failures: 0, Errors: 0, Skipped: 0, Time elapsed: 1.318 sec
    Running org.apache.hadoop.hbase.regionserver.TestHRegionServerBulkLoad
    Tests run: 1, Failures: 0, Errors: 0, Skipped: 0, Time elapsed: 46.3 sec
    Running org.apache.hadoop.hbase.regionserver.TestSplitTransactionOnCluster
    Tests run: 6, Failures: 0, Errors: 0, Skipped: 0, Time elapsed: 54.3 sec
    Running org.apache.hadoop.hbase.regionserver.wal.TestHLog
    Tests run: 10, Failures: 0, Errors: 0, Skipped: 0, Time elapsed: 62.371 sec
    Running org.apache.hadoop.hbase.regionserver.wal.TestLogRollingNoCluster
    Tests run: 1, Failures: 0, Errors: 0, Skipped: 0, Time elapsed: 2.416 sec
    Running org.apache.hadoop.hbase.regionserver.wal.TestLogRollAbort
    Tests run: 1, Failures: 0, Errors: 0, Skipped: 0, Time elapsed: 152.306 sec
    Running org.apache.hadoop.hbase.regionserver.wal.TestWALReplay
    Tests run: 5, Failures: 0, Errors: 0, Skipped: 0, Time elapsed: 31.489 sec
    Running org.apache.hadoop.hbase.thrift.TestThriftServerCmdLine
    Tests run: 20, Failures: 0, Errors: 0, Skipped: 0, Time elapsed: 382.962 sec
    Running org.apache.hadoop.hbase.regionserver.TestStoreScanner
    Tests run: 16, Failures: 0, Errors: 0, Skipped: 0, Time elapsed: 0.051 sec
    Running org.apache.hadoop.hbase.regionserver.wal.TestWALReplayCompressed
    Tests run: 5, Failures: 0, Errors: 0, Skipped: 0, Time elapsed: 33.733 sec
    Running org.apache.hadoop.hbase.regionserver.TestEndToEndSplitTransaction
    Tests run: 2, Failures: 0, Errors: 0, Skipped: 0, Time elapsed: 60.067 sec
    Running org.apache.hadoop.hbase.regionserver.wal.TestHLogSplit
    Tests run: 30, Failures: 0, Errors: 0, Skipped: 1, Time elapsed: 244.437 sec
    Running org.apache.hadoop.hbase.regionserver.TestRpcMetrics
    Tests run: 1, Failures: 0, Errors: 0, Skipped: 0, Time elapsed: 1.898 sec
    Running org.apache.hadoop.hbase.regionserver.TestMultiColumnScanner
    Tests run: 12, Failures: 0, Errors: 0, Skipped: 0, Time elapsed: 41.099 sec
    Running org.apache.hadoop.hbase.mapred.TestTableInputFormat
    Tests run: 10, Failures: 0, Errors: 0, Skipped: 0, Time elapsed: 28.298 sec
    Running org.apache.hadoop.hbase.TestClusterBootOrder
    Tests run: 2, Failures: 0, Errors: 0, Skipped: 0, Time elapsed: 26.308 sec
    Running org.apache.hadoop.hbase.TestDrainingServer
    Tests run: 2, Failures: 0, Errors: 0, Skipped: 0, Time elapsed: 17.286 sec
    Running org.apache.hadoop.hbase.mapred.TestTableMapReduce
    Tests run: 1, Failures: 0, Errors: 0, Skipped: 0, Time elapsed: 90.945 sec
    Running org.apache.hadoop.hbase.mapreduce.TestTimeRangeMapRed
    Tests run: 1, Failures: 0, Errors: 0, Skipped: 0, Time elapsed: 39.224 sec
    Running org.apache.hadoop.hbase.regionserver.wal.TestLogRolling
    Tests run: 3, Failures: 0, Errors: 0, Skipped: 0, Time elapsed: 434.275 sec
    Running org.apache.hadoop.hbase.mapreduce.TestImportExport
    Tests run: 2, Failures: 0, Errors: 0, Skipped: 0, Time elapsed: 51.433 sec
    Running org.apache.hadoop.hbase.mapreduce.TestWALPlayer
    Tests run: 1, Failures: 0, Errors: 0, Skipped: 0, Time elapsed: 51.136 sec
    Running org.apache.hadoop.hbase.mapreduce.TestImportTsv
    Tests run: 9, Failures: 0, Errors: 0, Skipped: 0, Time elapsed: 149.223 sec
    Running org.apache.hadoop.hbase.mapreduce.TestHFileOutputFormat
    Tests run: 9, Failures: 0, Errors: 0, Skipped: 0, Time elapsed: 242.091 sec
    Running org.apache.hadoop.hbase.mapreduce.TestMultithreadedTableMapper
    Tests run: 1, Failures: 0, Errors: 0, Skipped: 0, Time elapsed: 120.677 sec
    Running org.apache.hadoop.hbase.mapreduce.TestLoadIncrementalHFilesSplitRecovery
    Tests run: 4, Failures: 0, Errors: 0, Skipped: 0, Time elapsed: 113.087 sec
    Running org.apache.hadoop.hbase.mapreduce.TestHLogRecordReader
    Tests run: 2, Failures: 0, Errors: 0, Skipped: 0, Time elapsed: 6.022 sec
    Running org.apache.hadoop.hbase.mapreduce.TestLoadIncrementalHFiles
    Tests run: 6, Failures: 0, Errors: 0, Skipped: 0, Time elapsed: 36.841 sec
    Running org.apache.hadoop.hbase.mapreduce.TestTableMapReduce
    Tests run: 1, Failures: 0, Errors: 0, Skipped: 0, Time elapsed: 117.981 sec
    Running org.apache.hadoop.hbase.mapreduce.TestTableInputFormatScan
    Tests run: 12, Failures: 0, Errors: 0, Skipped: 0, Time elapsed: 589.427 sec

    Results :

    Failed tests: testVerifyRepJob(org.apache.hadoop.hbase.replication.TestReplication): Waited too much time for truncate
    queueFailover(org.apache.hadoop.hbase.replication.TestReplication): Waited too much time for truncate

    Tests run: 932, Failures: 2, Errors: 0, Skipped: 9

    [INFO] ------------------------------------------------------------------------
    [INFO] BUILD FAILURE
    [INFO] ------------------------------------------------------------------------
    [INFO] Total time: 40:31.990s
    [INFO] Finished at: Sat May 26 09:56:50 UTC 2012
    [INFO] Final Memory: 46M/507M
    [INFO] ------------------------------------------------------------------------
    [ERROR] Failed to execute goal org.apache.maven.plugins:maven-surefire-plugin:2.12-TRUNK-HBASE-2:test (secondPartTestsExecution) on project hbase: There are test failures.
    [ERROR]
    [ERROR] Please refer to <https://builds.apache.org/job/HBase-0.94/ws/trunk/target/surefire-reports> for the individual test results.
    [ERROR] -> [Help 1]
    [ERROR]
    [ERROR] To see the full stack trace of the errors, re-run Maven with the -e switch.
    [ERROR] Re-run Maven using the -X switch to enable full debug logging.
    [ERROR]
    [ERROR] For more information about the errors and possible solutions, please read the following articles:
    [ERROR] [Help 1] http://cwiki.apache.org/confluence/display/MAVEN/MojoFailureException
    Build step 'Invoke top-level Maven targets' marked build as failure
    Archiving artifacts
    Updating HBASE-5986
    Recording test results
  • Apache Jenkins Server at May 26, 2012 at 3:00 pm

Related Discussions

Discussion Navigation
viewthread | post
Discussion Overview
groupdev @
categorieshbase, hadoop
postedMay 23, '12 at 4:55a
activeMay 26, '12 at 3:00p
posts11
users1
websitehbase.apache.org

1 user in discussion

Apache Jenkins Server: 11 posts

People

Translate

site design / logo © 2022 Grokbase