Grokbase Groups HBase dev May 2012
FAQ
See <https://builds.apache.org/job/HBase-0.94/185/changes>

Changes:

[apurtell] HBASE-5964. HFileSystem: "No FileSystem for scheme: hdfs"

[tedyu] HBASE-5963 ClassCastException: FileSystem$Cache$ClientFinalizer cannot be cast to Thread

------------------------------------------
[...truncated 565 lines...]
Tests run: 3, Failures: 0, Errors: 0, Skipped: 0, Time elapsed: 60.158 sec
Running org.apache.hadoop.hbase.regionserver.TestAtomicOperation
Tests run: 5, Failures: 0, Errors: 0, Skipped: 0, Time elapsed: 33.248 sec
Running org.apache.hadoop.hbase.regionserver.TestStoreFileBlockCacheSummary
Tests run: 1, Failures: 0, Errors: 0, Skipped: 0, Time elapsed: 15.551 sec
Running org.apache.hadoop.hbase.regionserver.metrics.TestSchemaMetrics
Tests run: 6, Failures: 0, Errors: 0, Skipped: 0, Time elapsed: 16.571 sec
Running org.apache.hadoop.hbase.regionserver.TestBlocksRead
Tests run: 4, Failures: 0, Errors: 0, Skipped: 0, Time elapsed: 1.105 sec
Running org.apache.hadoop.hbase.regionserver.wal.TestLogRollingNoCluster
Tests run: 1, Failures: 0, Errors: 0, Skipped: 0, Time elapsed: 3.22 sec
Running org.apache.hadoop.hbase.regionserver.TestHRegion
Tests run: 61, Failures: 0, Errors: 0, Skipped: 0, Time elapsed: 41.987 sec
Running org.apache.hadoop.hbase.regionserver.TestFSErrorsExposed
Tests run: 3, Failures: 0, Errors: 0, Skipped: 0, Time elapsed: 28.698 sec
Running org.apache.hadoop.hbase.regionserver.wal.TestLogRollAbort
Tests run: 1, Failures: 0, Errors: 0, Skipped: 0, Time elapsed: 17.035 sec
Running org.apache.hadoop.hbase.regionserver.wal.TestWALReplay
Tests run: 5, Failures: 0, Errors: 0, Skipped: 0, Time elapsed: 34.081 sec
Running org.apache.hadoop.hbase.regionserver.wal.TestWALReplayCompressed
Tests run: 5, Failures: 0, Errors: 0, Skipped: 0, Time elapsed: 30.289 sec
Running org.apache.hadoop.hbase.regionserver.wal.TestHLog
Tests run: 10, Failures: 0, Errors: 0, Skipped: 0, Time elapsed: 59.618 sec
Running org.apache.hadoop.hbase.regionserver.wal.TestHLogBench
Tests run: 1, Failures: 0, Errors: 0, Skipped: 0, Time elapsed: 1.314 sec
Running org.apache.hadoop.hbase.regionserver.handler.TestCloseRegionHandler
Tests run: 3, Failures: 0, Errors: 0, Skipped: 0, Time elapsed: 1.209 sec
Running org.apache.hadoop.hbase.regionserver.handler.TestOpenRegionHandler
Tests run: 3, Failures: 0, Errors: 0, Skipped: 0, Time elapsed: 0.995 sec
Running org.apache.hadoop.hbase.filter.TestColumnRangeFilter
Tests run: 1, Failures: 0, Errors: 0, Skipped: 0, Time elapsed: 17.193 sec
Running org.apache.hadoop.hbase.regionserver.TestHRegionServerBulkLoad
Tests run: 1, Failures: 0, Errors: 0, Skipped: 0, Time elapsed: 45.754 sec
Running org.apache.hadoop.hbase.coprocessor.TestClassLoading
Tests run: 6, Failures: 1, Errors: 0, Skipped: 0, Time elapsed: 31.331 sec <<< FAILURE!
Running org.apache.hadoop.hbase.coprocessor.TestAggregateProtocol
Tests run: 45, Failures: 0, Errors: 0, Skipped: 0, Time elapsed: 15.82 sec
Running org.apache.hadoop.hbase.coprocessor.TestRegionServerCoprocessorExceptionWithRemove
Tests run: 1, Failures: 0, Errors: 0, Skipped: 0, Time elapsed: 17.667 sec
Running org.apache.hadoop.hbase.coprocessor.TestRegionServerCoprocessorExceptionWithAbort
Tests run: 1, Failures: 0, Errors: 0, Skipped: 0, Time elapsed: 14.943 sec
Running org.apache.hadoop.hbase.coprocessor.TestMasterObserver
Tests run: 3, Failures: 0, Errors: 0, Skipped: 0, Time elapsed: 26.127 sec
Running org.apache.hadoop.hbase.coprocessor.TestCoprocessorEndpoint
Tests run: 3, Failures: 0, Errors: 0, Skipped: 1, Time elapsed: 27.987 sec
Running org.apache.hadoop.hbase.coprocessor.TestWALObserver
Tests run: 3, Failures: 0, Errors: 0, Skipped: 0, Time elapsed: 16.056 sec
Running org.apache.hadoop.hbase.coprocessor.TestMasterCoprocessorExceptionWithAbort
Tests run: 1, Failures: 0, Errors: 0, Skipped: 0, Time elapsed: 12.691 sec
Running org.apache.hadoop.hbase.regionserver.wal.TestHLogSplit
Tests run: 30, Failures: 0, Errors: 0, Skipped: 1, Time elapsed: 249.919 sec
Running org.apache.hadoop.hbase.coprocessor.TestMasterCoprocessorExceptionWithRemove
Tests run: 1, Failures: 0, Errors: 0, Skipped: 0, Time elapsed: 18.498 sec
Running org.apache.hadoop.hbase.coprocessor.TestRegionObserverBypass
Tests run: 2, Failures: 0, Errors: 0, Skipped: 0, Time elapsed: 19.065 sec
Running org.apache.hadoop.hbase.coprocessor.TestRegionObserverInterface
Tests run: 6, Failures: 0, Errors: 0, Skipped: 0, Time elapsed: 39.247 sec
Running org.apache.hadoop.hbase.TestGlobalMemStoreSize
Tests run: 1, Failures: 0, Errors: 0, Skipped: 0, Time elapsed: 14.744 sec
Running org.apache.hadoop.hbase.mapred.TestTableInputFormat
Tests run: 6, Failures: 0, Errors: 0, Skipped: 0, Time elapsed: 21.937 sec
Running org.apache.hadoop.hbase.mapreduce.TestHLogRecordReader
Tests run: 2, Failures: 0, Errors: 0, Skipped: 0, Time elapsed: 5.793 sec
Running org.apache.hadoop.hbase.mapred.TestTableMapReduce
Tests run: 1, Failures: 0, Errors: 0, Skipped: 0, Time elapsed: 95.115 sec
Running org.apache.hadoop.hbase.mapreduce.TestLoadIncrementalHFilesSplitRecovery
Tests run: 4, Failures: 0, Errors: 0, Skipped: 0, Time elapsed: 108.153 sec
Running org.apache.hadoop.hbase.mapreduce.TestTableMapReduce
Tests run: 1, Failures: 0, Errors: 0, Skipped: 0, Time elapsed: 132.293 sec
Running org.apache.hadoop.hbase.mapreduce.TestWALPlayer
Tests run: 1, Failures: 0, Errors: 0, Skipped: 0, Time elapsed: 47.577 sec
Running org.apache.hadoop.hbase.regionserver.wal.TestLogRolling
Tests run: 3, Failures: 0, Errors: 0, Skipped: 0, Time elapsed: 441.924 sec
Running org.apache.hadoop.hbase.mapreduce.TestImportTsv
Tests run: 9, Failures: 0, Errors: 0, Skipped: 0, Time elapsed: 148.265 sec
Running org.apache.hadoop.hbase.mapreduce.TestMultithreadedTableMapper
Tests run: 1, Failures: 0, Errors: 0, Skipped: 0, Time elapsed: 110.942 sec
Running org.apache.hadoop.hbase.mapreduce.TestTimeRangeMapRed
Tests run: 1, Failures: 0, Errors: 0, Skipped: 0, Time elapsed: 40.151 sec
Running org.apache.hadoop.hbase.mapreduce.TestLoadIncrementalHFiles
Tests run: 6, Failures: 0, Errors: 0, Skipped: 0, Time elapsed: 35.129 sec
Running org.apache.hadoop.hbase.mapreduce.TestHFileOutputFormat
Tests run: 9, Failures: 0, Errors: 0, Skipped: 0, Time elapsed: 292.245 sec
Running org.apache.hadoop.hbase.mapreduce.TestImportExport
Tests run: 2, Failures: 0, Errors: 0, Skipped: 0, Time elapsed: 51.503 sec
Running org.apache.hadoop.hbase.catalog.TestMetaReaderEditorNoCluster
Tests run: 1, Failures: 0, Errors: 0, Skipped: 0, Time elapsed: 4.248 sec
Running org.apache.hadoop.hbase.thrift2.TestThriftHBaseServiceHandler
Tests run: 12, Failures: 0, Errors: 0, Skipped: 0, Time elapsed: 12.714 sec
Running org.apache.hadoop.hbase.catalog.TestMetaReaderEditor
Tests run: 5, Failures: 0, Errors: 0, Skipped: 0, Time elapsed: 23.673 sec
Running org.apache.hadoop.hbase.catalog.TestCatalogTracker
Tests run: 9, Failures: 0, Errors: 0, Skipped: 1, Time elapsed: 6.365 sec
Running org.apache.hadoop.hbase.client.TestTimestampsFilter
Tests run: 3, Failures: 0, Errors: 0, Skipped: 0, Time elapsed: 21.471 sec
Running org.apache.hadoop.hbase.TestAcidGuarantees
Tests run: 3, Failures: 0, Errors: 0, Skipped: 0, Time elapsed: 96.162 sec
Running org.apache.hadoop.hbase.catalog.TestCatalogTrackerOnCluster
Tests run: 1, Failures: 0, Errors: 0, Skipped: 0, Time elapsed: 81.284 sec
Running org.apache.hadoop.hbase.client.TestHCM
Tests run: 6, Failures: 0, Errors: 0, Skipped: 0, Time elapsed: 18.835 sec
Running org.apache.hadoop.hbase.client.TestShell
Tests run: 1, Failures: 0, Errors: 0, Skipped: 0, Time elapsed: 91.081 sec
Running org.apache.hadoop.hbase.client.TestScannerTimeout
Tests run: 4, Failures: 0, Errors: 0, Skipped: 0, Time elapsed: 47.442 sec
Running org.apache.hadoop.hbase.client.TestMetaScanner
Tests run: 1, Failures: 0, Errors: 0, Skipped: 0, Time elapsed: 13.558 sec
Running org.apache.hadoop.hbase.client.TestHTableUtil
Tests run: 2, Failures: 0, Errors: 0, Skipped: 0, Time elapsed: 18.482 sec
Running org.apache.hadoop.hbase.client.TestMetaMigrationRemovingHTD
Tests run: 3, Failures: 0, Errors: 0, Skipped: 0, Time elapsed: 23.912 sec
Running org.apache.hadoop.hbase.client.TestHTablePool$TestHTableReusablePool
Tests run: 9, Failures: 0, Errors: 0, Skipped: 0, Time elapsed: 6.14 sec
Running org.apache.hadoop.hbase.client.TestHTablePool$TestHTableThreadLocalPool
Tests run: 9, Failures: 0, Errors: 0, Skipped: 0, Time elapsed: 21.707 sec
Running org.apache.hadoop.hbase.client.replication.TestReplicationAdmin
Tests run: 1, Failures: 0, Errors: 0, Skipped: 0, Time elapsed: 0.837 sec
Running org.apache.hadoop.hbase.client.TestMultipleTimestamps
Tests run: 8, Failures: 0, Errors: 0, Skipped: 0, Time elapsed: 30.773 sec
Running org.apache.hadoop.hbase.client.TestMultiParallel
Tests run: 11, Failures: 0, Errors: 0, Skipped: 0, Time elapsed: 38.773 sec
Running org.apache.hadoop.hbase.metrics.TestMetricsMBeanBase
Tests run: 2, Failures: 0, Errors: 0, Skipped: 0, Time elapsed: 1.127 sec
Running org.apache.hadoop.hbase.client.TestFromClientSide
Tests run: 55, Failures: 0, Errors: 0, Skipped: 3, Time elapsed: 170.948 sec
Running org.apache.hadoop.hbase.rest.TestGzipFilter
Tests run: 3, Failures: 0, Errors: 0, Skipped: 0, Time elapsed: 13.991 sec
Running org.apache.hadoop.hbase.constraint.TestConstraint
Tests run: 5, Failures: 0, Errors: 0, Skipped: 0, Time elapsed: 28.794 sec
Running org.apache.hadoop.hbase.rest.TestMultiRowResource
Tests run: 3, Failures: 0, Errors: 0, Skipped: 0, Time elapsed: 16.217 sec
Running org.apache.hadoop.hbase.rest.TestScannersWithFilters
Tests run: 10, Failures: 0, Errors: 0, Skipped: 0, Time elapsed: 18.566 sec
Running org.apache.hadoop.hbase.rest.TestRowResource
Tests run: 11, Failures: 0, Errors: 0, Skipped: 0, Time elapsed: 14.592 sec
Running org.apache.hadoop.hbase.rest.client.TestRemoteAdmin
Tests run: 1, Failures: 0, Errors: 0, Skipped: 0, Time elapsed: 15.56 sec
Running org.apache.hadoop.hbase.rest.client.TestRemoteTable
Tests run: 3, Failures: 0, Errors: 0, Skipped: 0, Time elapsed: 14.652 sec
Running org.apache.hadoop.hbase.rest.TestVersionResource
Tests run: 7, Failures: 0, Errors: 0, Skipped: 0, Time elapsed: 14.733 sec
Running org.apache.hadoop.hbase.rest.TestScannerResource
Tests run: 5, Failures: 0, Errors: 0, Skipped: 0, Time elapsed: 27.379 sec
Running org.apache.hadoop.hbase.rest.TestTableResource
Tests run: 8, Failures: 0, Errors: 0, Skipped: 0, Time elapsed: 22.952 sec
Running org.apache.hadoop.hbase.rest.TestStatusResource
Tests run: 2, Failures: 0, Errors: 0, Skipped: 0, Time elapsed: 12.159 sec
Running org.apache.hadoop.hbase.rest.TestSchemaResource
Tests run: 2, Failures: 0, Errors: 0, Skipped: 0, Time elapsed: 16.7 sec
Running org.apache.hadoop.hbase.mapreduce.TestTableInputFormatScan
Tests run: 12, Failures: 0, Errors: 0, Skipped: 0, Time elapsed: 572.571 sec
Running org.apache.hadoop.hbase.io.encoding.TestLoadAndSwitchEncodeOnDisk
Tests run: 1, Failures: 0, Errors: 0, Skipped: 0, Time elapsed: 25.181 sec
Running org.apache.hadoop.hbase.thrift.TestThriftServer
Tests run: 1, Failures: 0, Errors: 0, Skipped: 0, Time elapsed: 40.559 sec
Running org.apache.hadoop.hbase.client.TestAdmin
Tests run: 37, Failures: 0, Errors: 0, Skipped: 0, Time elapsed: 183.401 sec
Running org.apache.hadoop.hbase.io.encoding.TestUpgradeFromHFileV1ToEncoding
Tests run: 1, Failures: 0, Errors: 0, Skipped: 0, Time elapsed: 83.26 sec
Running org.apache.hadoop.hbase.io.hfile.TestHFileSeek
Tests run: 1, Failures: 0, Errors: 0, Skipped: 0, Time elapsed: 8.27 sec
Running org.apache.hadoop.hbase.io.hfile.slab.TestSlabCache
Tests run: 7, Failures: 0, Errors: 0, Skipped: 0, Time elapsed: 20.331 sec
Running org.apache.hadoop.hbase.io.encoding.TestDataBlockEncoders
Tests run: 12, Failures: 0, Errors: 0, Skipped: 0, Time elapsed: 140.608 sec
Running org.apache.hadoop.hbase.io.hfile.slab.TestSingleSizeCache
Tests run: 5, Failures: 0, Errors: 0, Skipped: 0, Time elapsed: 25.816 sec
Running org.apache.hadoop.hbase.io.hfile.TestChecksum
Tests run: 3, Failures: 0, Errors: 0, Skipped: 0, Time elapsed: 0.854 sec
Running org.apache.hadoop.hbase.io.hfile.TestLruBlockCache
Tests run: 16, Failures: 0, Errors: 0, Skipped: 0, Time elapsed: 0.742 sec
Running org.apache.hadoop.hbase.io.hfile.TestHFilePerformance
Tests run: 1, Failures: 0, Errors: 0, Skipped: 0, Time elapsed: 6.647 sec
Running org.apache.hadoop.hbase.io.hfile.TestHFileBlockIndex
Running org.apache.hadoop.hbase.io.hfile.TestFixedFileTrailer
Tests run: 2, Failures: 0, Errors: 0, Skipped: 0, Time elapsed: 0.57 sec
Tests run: 10, Failures: 0, Errors: 0, Skipped: 0, Time elapsed: 9.873 sec
Running org.apache.hadoop.hbase.io.hfile.TestHFileBlockCompatibility
Tests run: 10, Failures: 0, Errors: 0, Skipped: 0, Time elapsed: 1.145 sec
Running org.apache.hadoop.hbase.io.hfile.TestForceCacheImportantBlocks
Tests run: 4, Failures: 0, Errors: 3, Skipped: 0, Time elapsed: 28.905 sec <<< FAILURE!
Running org.apache.hadoop.hbase.io.hfile.TestHFileBlock
Tests run: 16, Failures: 0, Errors: 0, Skipped: 0, Time elapsed: 48.081 sec
Running org.apache.hadoop.hbase.io.hfile.TestCacheOnWrite
Tests run: 36, Failures: 0, Errors: 0, Skipped: 0, Time elapsed: 40.814 sec
Running org.apache.hadoop.hbase.TestClusterBootOrder
Tests run: 2, Failures: 0, Errors: 0, Skipped: 0, Time elapsed: 26.217 sec
Running org.apache.hadoop.hbase.io.encoding.TestChangingEncoding
Tests run: 4, Failures: 0, Errors: 0, Skipped: 0, Time elapsed: 244.593 sec
Running org.apache.hadoop.hbase.replication.regionserver.TestReplicationSourceManager
Tests run: 1, Failures: 0, Errors: 0, Skipped: 0, Time elapsed: 1.042 sec
Running org.apache.hadoop.hbase.replication.regionserver.TestReplicationSink
Tests run: 5, Failures: 0, Errors: 0, Skipped: 0, Time elapsed: 14.113 sec
Running org.apache.hadoop.hbase.avro.TestAvroServer
Tests run: 3, Failures: 0, Errors: 0, Skipped: 0, Time elapsed: 27.106 sec
Running org.apache.hadoop.hbase.replication.TestReplicationSource
Tests run: 1, Failures: 0, Errors: 0, Skipped: 0, Time elapsed: 3.147 sec
Running org.apache.hadoop.hbase.replication.TestReplicationPeer
Tests run: 1, Failures: 0, Errors: 0, Skipped: 0, Time elapsed: 7.623 sec
Running org.apache.hadoop.hbase.replication.TestReplicationZookeeper
Tests run: 1, Failures: 0, Errors: 0, Skipped: 0, Time elapsed: 0.62 sec
Running org.apache.hadoop.hbase.replication.TestMultiSlaveReplication
Tests run: 1, Failures: 0, Errors: 0, Skipped: 0, Time elapsed: 42.184 sec
Running org.apache.hadoop.hbase.ipc.TestDelayedRpc
Tests run: 4, Failures: 0, Errors: 0, Skipped: 0, Time elapsed: 2.729 sec
Running org.apache.hadoop.hbase.TestZooKeeper
Tests run: 8, Failures: 0, Errors: 0, Skipped: 0, Time elapsed: 37.45 sec
Running org.apache.hadoop.hbase.replication.TestMasterReplication
Tests run: 2, Failures: 0, Errors: 0, Skipped: 0, Time elapsed: 68.705 sec
Running org.apache.hadoop.hbase.thrift.TestThriftServerCmdLine
Tests run: 20, Failures: 0, Errors: 0, Skipped: 0, Time elapsed: 391.607 sec
Running org.apache.hadoop.hbase.TestHBaseTestingUtility
Tests run: 7, Failures: 0, Errors: 0, Skipped: 0, Time elapsed: 59.113 sec
Running org.apache.hadoop.hbase.replication.TestReplication
Tests run: 10, Failures: 0, Errors: 0, Skipped: 0, Time elapsed: 187.011 sec

Results :

Failed tests: testClassLoadingFromHDFS(org.apache.hadoop.hbase.coprocessor.TestClassLoading): Class TestCP1 was missing on a region

Tests in error:
testCacheBlocks[1](org.apache.hadoop.hbase.io.hfile.TestForceCacheImportantBlocks): region: myTable,,1336594460615.f8ce54e4746f9d48471564888905071e.
testCacheBlocks[2](org.apache.hadoop.hbase.io.hfile.TestForceCacheImportantBlocks): unable to create new native thread
testCacheBlocks[3](org.apache.hadoop.hbase.io.hfile.TestForceCacheImportantBlocks): unable to create new native thread

Tests run: 922, Failures: 1, Errors: 3, Skipped: 9

[INFO] ------------------------------------------------------------------------
[INFO] BUILD FAILURE
[INFO] ------------------------------------------------------------------------
[INFO] Total time: 38:00.518s
[INFO] Finished at: Wed May 09 20:19:01 UTC 2012
[INFO] Final Memory: 42M/465M
[INFO] ------------------------------------------------------------------------
[ERROR] Failed to execute goal org.apache.maven.plugins:maven-surefire-plugin:2.12-TRUNK-HBASE-2:test (secondPartTestsExecution) on project hbase: There are test failures.
[ERROR]
[ERROR] Please refer to <https://builds.apache.org/job/HBase-0.94/ws/trunk/target/surefire-reports> for the individual test results.
[ERROR] -> [Help 1]
[ERROR]
[ERROR] To see the full stack trace of the errors, re-run Maven with the -e switch.
[ERROR] Re-run Maven using the -X switch to enable full debug logging.
[ERROR]
[ERROR] For more information about the errors and possible solutions, please read the following articles:
[ERROR] [Help 1] http://cwiki.apache.org/confluence/display/MAVEN/MojoFailureException
Build step 'Invoke top-level Maven targets' marked build as failure
Archiving artifacts
Updating HBASE-5963
Updating HBASE-5964
Recording test results

Search Discussions

  • Apache Jenkins Server at May 10, 2012 at 5:58 pm
    See <https://builds.apache.org/job/HBase-0.94/186/changes>

    Changes:

    [todd] Amend HBASE-5973. Add two missing files from previous commit

    [todd] HBASE-5973. Add ability for potentially long-running IPC calls to abort if client disconnects. Contributed by Todd Lipcon.

    ------------------------------------------
    [...truncated 575 lines...]
    Running org.apache.hadoop.hbase.regionserver.TestHRegionOnCluster
    Tests run: 1, Failures: 0, Errors: 0, Skipped: 0, Time elapsed: 21.469 sec
    Running org.apache.hadoop.hbase.regionserver.TestAtomicOperation
    Tests run: 5, Failures: 0, Errors: 0, Skipped: 0, Time elapsed: 31.455 sec
    Running org.apache.hadoop.hbase.regionserver.TestRegionServerMetrics
    Tests run: 3, Failures: 0, Errors: 0, Skipped: 0, Time elapsed: 55.617 sec
    Running org.apache.hadoop.hbase.regionserver.metrics.TestSchemaMetrics
    Tests run: 6, Failures: 0, Errors: 0, Skipped: 0, Time elapsed: 16.53 sec
    Running org.apache.hadoop.hbase.regionserver.TestBlocksRead
    Tests run: 4, Failures: 0, Errors: 0, Skipped: 0, Time elapsed: 1.36 sec
    Running org.apache.hadoop.hbase.regionserver.wal.TestLogRollingNoCluster
    Tests run: 1, Failures: 0, Errors: 0, Skipped: 0, Time elapsed: 2.728 sec
    Running org.apache.hadoop.hbase.regionserver.TestStoreFileBlockCacheSummary
    Tests run: 1, Failures: 0, Errors: 0, Skipped: 0, Time elapsed: 18.79 sec
    Running org.apache.hadoop.hbase.regionserver.TestFSErrorsExposed
    Tests run: 3, Failures: 0, Errors: 0, Skipped: 0, Time elapsed: 31.096 sec
    Running org.apache.hadoop.hbase.regionserver.TestHRegion
    Tests run: 61, Failures: 0, Errors: 0, Skipped: 0, Time elapsed: 41.994 sec
    Running org.apache.hadoop.hbase.regionserver.wal.TestWALReplay
    Tests run: 5, Failures: 0, Errors: 0, Skipped: 0, Time elapsed: 31.485 sec
    Running org.apache.hadoop.hbase.regionserver.wal.TestWALReplayCompressed
    Tests run: 5, Failures: 0, Errors: 0, Skipped: 0, Time elapsed: 31.056 sec
    Running org.apache.hadoop.hbase.regionserver.wal.TestHLog
    Tests run: 10, Failures: 0, Errors: 0, Skipped: 0, Time elapsed: 72.568 sec
    Running org.apache.hadoop.hbase.regionserver.wal.TestHLogBench
    Tests run: 1, Failures: 0, Errors: 0, Skipped: 0, Time elapsed: 1.221 sec
    Running org.apache.hadoop.hbase.regionserver.handler.TestCloseRegionHandler
    Tests run: 3, Failures: 0, Errors: 0, Skipped: 0, Time elapsed: 1.225 sec
    Running org.apache.hadoop.hbase.regionserver.handler.TestOpenRegionHandler
    Tests run: 3, Failures: 0, Errors: 0, Skipped: 0, Time elapsed: 0.938 sec
    Running org.apache.hadoop.hbase.regionserver.wal.TestLogRollAbort
    Tests run: 1, Failures: 0, Errors: 0, Skipped: 0, Time elapsed: 153.634 sec
    Running org.apache.hadoop.hbase.filter.TestColumnRangeFilter
    Tests run: 1, Failures: 0, Errors: 0, Skipped: 0, Time elapsed: 17.302 sec
    Running org.apache.hadoop.hbase.regionserver.TestHRegionServerBulkLoad
    Tests run: 1, Failures: 0, Errors: 0, Skipped: 0, Time elapsed: 48.728 sec
    Running org.apache.hadoop.hbase.coprocessor.TestClassLoading
    Tests run: 6, Failures: 0, Errors: 0, Skipped: 0, Time elapsed: 32.465 sec
    Running org.apache.hadoop.hbase.coprocessor.TestAggregateProtocol
    Tests run: 45, Failures: 0, Errors: 0, Skipped: 0, Time elapsed: 15.815 sec
    Running org.apache.hadoop.hbase.coprocessor.TestRegionServerCoprocessorExceptionWithRemove
    Tests run: 1, Failures: 0, Errors: 0, Skipped: 0, Time elapsed: 15.767 sec
    Running org.apache.hadoop.hbase.coprocessor.TestRegionServerCoprocessorExceptionWithAbort
    Tests run: 1, Failures: 0, Errors: 0, Skipped: 0, Time elapsed: 12.786 sec
    Running org.apache.hadoop.hbase.coprocessor.TestMasterObserver
    Tests run: 3, Failures: 0, Errors: 0, Skipped: 0, Time elapsed: 26.129 sec
    Running org.apache.hadoop.hbase.coprocessor.TestCoprocessorEndpoint
    Tests run: 3, Failures: 0, Errors: 0, Skipped: 1, Time elapsed: 28.666 sec
    Running org.apache.hadoop.hbase.coprocessor.TestWALObserver
    Tests run: 3, Failures: 0, Errors: 0, Skipped: 0, Time elapsed: 15.727 sec
    Running org.apache.hadoop.hbase.coprocessor.TestMasterCoprocessorExceptionWithAbort
    Tests run: 1, Failures: 0, Errors: 0, Skipped: 0, Time elapsed: 10.495 sec
    Running org.apache.hadoop.hbase.coprocessor.TestMasterCoprocessorExceptionWithRemove
    Tests run: 1, Failures: 0, Errors: 0, Skipped: 0, Time elapsed: 14.463 sec
    Running org.apache.hadoop.hbase.coprocessor.TestRegionObserverInterface
    Tests run: 6, Failures: 0, Errors: 0, Skipped: 0, Time elapsed: 33.38 sec
    Running org.apache.hadoop.hbase.coprocessor.TestRegionObserverBypass
    Tests run: 2, Failures: 0, Errors: 0, Skipped: 0, Time elapsed: 12.021 sec
    Running org.apache.hadoop.hbase.regionserver.wal.TestHLogSplit
    Tests run: 30, Failures: 0, Errors: 0, Skipped: 1, Time elapsed: 244.496 sec
    Running org.apache.hadoop.hbase.mapred.TestTableInputFormat
    Tests run: 6, Failures: 0, Errors: 0, Skipped: 0, Time elapsed: 24.86 sec
    Running org.apache.hadoop.hbase.TestGlobalMemStoreSize
    Tests run: 1, Failures: 0, Errors: 0, Skipped: 0, Time elapsed: 14.511 sec
    Running org.apache.hadoop.hbase.mapreduce.TestHLogRecordReader
    Tests run: 2, Failures: 0, Errors: 0, Skipped: 0, Time elapsed: 4.838 sec
    Running org.apache.hadoop.hbase.mapred.TestTableMapReduce
    Tests run: 1, Failures: 0, Errors: 0, Skipped: 0, Time elapsed: 81.626 sec
    Running org.apache.hadoop.hbase.mapreduce.TestTableMapReduce
    Tests run: 1, Failures: 0, Errors: 0, Skipped: 0, Time elapsed: 108.971 sec
    Running org.apache.hadoop.hbase.mapreduce.TestLoadIncrementalHFilesSplitRecovery
    Tests run: 4, Failures: 0, Errors: 0, Skipped: 0, Time elapsed: 104.272 sec
    Running org.apache.hadoop.hbase.mapreduce.TestWALPlayer
    Tests run: 1, Failures: 0, Errors: 0, Skipped: 0, Time elapsed: 43.849 sec
    Running org.apache.hadoop.hbase.regionserver.wal.TestLogRolling
    Tests run: 3, Failures: 0, Errors: 0, Skipped: 0, Time elapsed: 436.442 sec
    Running org.apache.hadoop.hbase.mapreduce.TestImportTsv
    Tests run: 9, Failures: 0, Errors: 0, Skipped: 0, Time elapsed: 145.081 sec
    Running org.apache.hadoop.hbase.mapreduce.TestHFileOutputFormat
    Tests run: 9, Failures: 0, Errors: 0, Skipped: 0, Time elapsed: 221.998 sec
    Running org.apache.hadoop.hbase.mapreduce.TestLoadIncrementalHFiles
    Tests run: 6, Failures: 0, Errors: 0, Skipped: 0, Time elapsed: 40.521 sec
    Running org.apache.hadoop.hbase.mapreduce.TestTimeRangeMapRed
    Tests run: 1, Failures: 0, Errors: 0, Skipped: 0, Time elapsed: 51.068 sec
    Running org.apache.hadoop.hbase.mapreduce.TestMultithreadedTableMapper
    Tests run: 1, Failures: 0, Errors: 0, Skipped: 0, Time elapsed: 128.563 sec
    Running org.apache.hadoop.hbase.mapreduce.TestImportExport
    Tests run: 2, Failures: 0, Errors: 0, Skipped: 0, Time elapsed: 50.065 sec
    Running org.apache.hadoop.hbase.catalog.TestMetaReaderEditorNoCluster
    Tests run: 1, Failures: 0, Errors: 0, Skipped: 0, Time elapsed: 4.221 sec
    Running org.apache.hadoop.hbase.thrift2.TestThriftHBaseServiceHandler
    Tests run: 12, Failures: 0, Errors: 0, Skipped: 0, Time elapsed: 15.949 sec
    Running org.apache.hadoop.hbase.catalog.TestMetaReaderEditor
    Tests run: 5, Failures: 0, Errors: 0, Skipped: 0, Time elapsed: 30.256 sec
    Running org.apache.hadoop.hbase.catalog.TestCatalogTracker
    Tests run: 9, Failures: 0, Errors: 0, Skipped: 1, Time elapsed: 6.262 sec
    Running org.apache.hadoop.hbase.client.TestTimestampsFilter
    Tests run: 3, Failures: 0, Errors: 0, Skipped: 0, Time elapsed: 20.711 sec
    Running org.apache.hadoop.hbase.TestAcidGuarantees
    Tests run: 3, Failures: 0, Errors: 0, Skipped: 0, Time elapsed: 105.548 sec
    Running org.apache.hadoop.hbase.catalog.TestCatalogTrackerOnCluster
    Tests run: 1, Failures: 0, Errors: 0, Skipped: 0, Time elapsed: 78.21 sec
    Running org.apache.hadoop.hbase.client.TestHCM
    Tests run: 6, Failures: 0, Errors: 0, Skipped: 0, Time elapsed: 18.755 sec
    Running org.apache.hadoop.hbase.client.TestShell
    Tests run: 1, Failures: 0, Errors: 0, Skipped: 0, Time elapsed: 81.911 sec
    Running org.apache.hadoop.hbase.client.TestScannerTimeout
    Tests run: 4, Failures: 0, Errors: 0, Skipped: 0, Time elapsed: 43.392 sec
    Running org.apache.hadoop.hbase.client.TestMetaScanner
    Tests run: 1, Failures: 0, Errors: 0, Skipped: 0, Time elapsed: 12.177 sec
    Running org.apache.hadoop.hbase.client.TestHTableUtil
    Tests run: 2, Failures: 0, Errors: 0, Skipped: 0, Time elapsed: 15.056 sec
    Running org.apache.hadoop.hbase.client.TestMetaMigrationRemovingHTD
    Tests run: 3, Failures: 0, Errors: 0, Skipped: 0, Time elapsed: 25.053 sec
    Running org.apache.hadoop.hbase.client.TestHTablePool$TestHTableReusablePool
    Tests run: 9, Failures: 0, Errors: 0, Skipped: 0, Time elapsed: 6.125 sec
    Running org.apache.hadoop.hbase.client.TestHTablePool$TestHTableThreadLocalPool
    Tests run: 9, Failures: 0, Errors: 0, Skipped: 0, Time elapsed: 20.951 sec
    Running org.apache.hadoop.hbase.client.replication.TestReplicationAdmin
    Tests run: 1, Failures: 0, Errors: 0, Skipped: 0, Time elapsed: 0.78 sec
    Running org.apache.hadoop.hbase.client.TestMultipleTimestamps
    Tests run: 8, Failures: 0, Errors: 0, Skipped: 0, Time elapsed: 30.587 sec
    Running org.apache.hadoop.hbase.client.TestFromClientSide
    Tests run: 55, Failures: 0, Errors: 0, Skipped: 3, Time elapsed: 167.932 sec
    Running org.apache.hadoop.hbase.metrics.TestMetricsMBeanBase
    Tests run: 2, Failures: 0, Errors: 0, Skipped: 0, Time elapsed: 1.121 sec
    Running org.apache.hadoop.hbase.client.TestMultiParallel
    Tests run: 11, Failures: 0, Errors: 0, Skipped: 0, Time elapsed: 39.432 sec
    Running org.apache.hadoop.hbase.rest.TestGzipFilter
    Tests run: 3, Failures: 0, Errors: 0, Skipped: 0, Time elapsed: 14.322 sec
    Running org.apache.hadoop.hbase.constraint.TestConstraint
    Tests run: 5, Failures: 0, Errors: 0, Skipped: 0, Time elapsed: 30.01 sec
    Running org.apache.hadoop.hbase.rest.TestMultiRowResource
    Tests run: 3, Failures: 0, Errors: 0, Skipped: 0, Time elapsed: 14.589 sec
    Running org.apache.hadoop.hbase.rest.TestRowResource
    Tests run: 11, Failures: 0, Errors: 0, Skipped: 0, Time elapsed: 15.816 sec
    Running org.apache.hadoop.hbase.rest.TestScannersWithFilters
    Tests run: 10, Failures: 0, Errors: 0, Skipped: 0, Time elapsed: 16.14 sec
    Running org.apache.hadoop.hbase.rest.client.TestRemoteTable
    Running org.apache.hadoop.hbase.rest.client.TestRemoteAdmin
    Tests run: 3, Failures: 0, Errors: 0, Skipped: 0, Time elapsed: 15.034 sec
    Tests run: 1, Failures: 0, Errors: 0, Skipped: 0, Time elapsed: 15.336 sec
    Running org.apache.hadoop.hbase.rest.TestVersionResource
    Tests run: 7, Failures: 0, Errors: 0, Skipped: 0, Time elapsed: 16.06 sec
    Running org.apache.hadoop.hbase.rest.TestScannerResource
    Tests run: 5, Failures: 0, Errors: 0, Skipped: 0, Time elapsed: 27.422 sec
    Running org.apache.hadoop.hbase.rest.TestTableResource
    Tests run: 8, Failures: 0, Errors: 0, Skipped: 0, Time elapsed: 21.895 sec
    Running org.apache.hadoop.hbase.rest.TestStatusResource
    Tests run: 2, Failures: 0, Errors: 0, Skipped: 0, Time elapsed: 11.396 sec
    Running org.apache.hadoop.hbase.rest.TestSchemaResource
    Tests run: 2, Failures: 0, Errors: 0, Skipped: 0, Time elapsed: 19.109 sec
    Running org.apache.hadoop.hbase.mapreduce.TestTableInputFormatScan
    Tests run: 12, Failures: 0, Errors: 0, Skipped: 0, Time elapsed: 573.001 sec
    Running org.apache.hadoop.hbase.io.encoding.TestLoadAndSwitchEncodeOnDisk
    Tests run: 1, Failures: 0, Errors: 0, Skipped: 0, Time elapsed: 25.702 sec
    Running org.apache.hadoop.hbase.thrift.TestThriftServer
    Tests run: 1, Failures: 0, Errors: 0, Skipped: 0, Time elapsed: 43.35 sec
    Running org.apache.hadoop.hbase.io.encoding.TestDataBlockEncoders
    Tests run: 12, Failures: 0, Errors: 0, Skipped: 0, Time elapsed: 137.575 sec
    Running org.apache.hadoop.hbase.io.encoding.TestUpgradeFromHFileV1ToEncoding
    Tests run: 1, Failures: 0, Errors: 0, Skipped: 0, Time elapsed: 83.396 sec
    Running org.apache.hadoop.hbase.io.hfile.TestHFileSeek
    Tests run: 1, Failures: 0, Errors: 0, Skipped: 0, Time elapsed: 8.248 sec
    Running org.apache.hadoop.hbase.io.encoding.TestChangingEncoding
    Tests run: 4, Failures: 0, Errors: 0, Skipped: 0, Time elapsed: 243.058 sec
    Running org.apache.hadoop.hbase.io.hfile.slab.TestSlabCache
    Tests run: 7, Failures: 0, Errors: 0, Skipped: 0, Time elapsed: 19.091 sec
    Running org.apache.hadoop.hbase.io.hfile.TestChecksum
    Tests run: 3, Failures: 0, Errors: 0, Skipped: 0, Time elapsed: 0.797 sec
    Running org.apache.hadoop.hbase.io.hfile.TestHFileBlockIndex
    Tests run: 10, Failures: 0, Errors: 0, Skipped: 0, Time elapsed: 10.06 sec
    Running org.apache.hadoop.hbase.io.hfile.TestLruBlockCache
    Tests run: 16, Failures: 0, Errors: 0, Skipped: 0, Time elapsed: 0.751 sec
    Running org.apache.hadoop.hbase.io.hfile.slab.TestSingleSizeCache
    Tests run: 5, Failures: 0, Errors: 0, Skipped: 0, Time elapsed: 26.503 sec
    Running org.apache.hadoop.hbase.io.hfile.TestFixedFileTrailer
    Tests run: 2, Failures: 0, Errors: 0, Skipped: 0, Time elapsed: 0.52 sec
    Running org.apache.hadoop.hbase.io.hfile.TestHFileBlockCompatibility
    Tests run: 10, Failures: 0, Errors: 0, Skipped: 0, Time elapsed: 1.082 sec
    Running org.apache.hadoop.hbase.io.hfile.TestHFilePerformance
    Tests run: 1, Failures: 0, Errors: 0, Skipped: 0, Time elapsed: 6.496 sec
    Running org.apache.hadoop.hbase.thrift.TestThriftServerCmdLine
    Tests run: 20, Failures: 0, Errors: 0, Skipped: 0, Time elapsed: 378.155 sec
    Running org.apache.hadoop.hbase.io.hfile.TestHFileBlock
    Tests run: 16, Failures: 0, Errors: 0, Skipped: 0, Time elapsed: 48.316 sec
    Running org.apache.hadoop.hbase.io.hfile.TestForceCacheImportantBlocks
    Tests run: 4, Failures: 0, Errors: 0, Skipped: 0, Time elapsed: 64.408 sec
    Running org.apache.hadoop.hbase.TestClusterBootOrder
    Tests run: 2, Failures: 0, Errors: 0, Skipped: 0, Time elapsed: 29.398 sec
    Running org.apache.hadoop.hbase.io.hfile.TestCacheOnWrite
    Tests run: 36, Failures: 0, Errors: 0, Skipped: 0, Time elapsed: 36.761 sec
    Running org.apache.hadoop.hbase.replication.regionserver.TestReplicationSourceManager
    Tests run: 1, Failures: 0, Errors: 0, Skipped: 0, Time elapsed: 1.052 sec
    Running org.apache.hadoop.hbase.avro.TestAvroServer
    Tests run: 3, Failures: 0, Errors: 0, Skipped: 0, Time elapsed: 25.901 sec
    Running org.apache.hadoop.hbase.replication.regionserver.TestReplicationSink
    Tests run: 5, Failures: 0, Errors: 0, Skipped: 0, Time elapsed: 13.774 sec
    Running org.apache.hadoop.hbase.replication.TestReplicationSource
    Tests run: 1, Failures: 0, Errors: 0, Skipped: 0, Time elapsed: 2.545 sec
    Running org.apache.hadoop.hbase.replication.TestReplicationPeer
    Tests run: 1, Failures: 0, Errors: 0, Skipped: 0, Time elapsed: 7.536 sec
    Running org.apache.hadoop.hbase.replication.TestReplicationZookeeper
    Tests run: 1, Failures: 0, Errors: 0, Skipped: 0, Time elapsed: 0.576 sec
    Running org.apache.hadoop.hbase.replication.TestMultiSlaveReplication
    Tests run: 1, Failures: 0, Errors: 0, Skipped: 0, Time elapsed: 40.875 sec
    Running org.apache.hadoop.hbase.ipc.TestDelayedRpc
    Tests run: 4, Failures: 0, Errors: 0, Skipped: 0, Time elapsed: 2.643 sec
    Running org.apache.hadoop.hbase.client.TestAdmin
    Tests run: 37, Failures: 0, Errors: 1, Skipped: 0, Time elapsed: 606.821 sec <<< FAILURE!
    Running org.apache.hadoop.hbase.replication.TestMasterReplication
    Tests run: 2, Failures: 0, Errors: 0, Skipped: 0, Time elapsed: 65.275 sec
    Running org.apache.hadoop.hbase.TestZooKeeper
    Tests run: 8, Failures: 0, Errors: 0, Skipped: 0, Time elapsed: 36.983 sec
    Running org.apache.hadoop.hbase.TestHBaseTestingUtility
    Tests run: 7, Failures: 0, Errors: 0, Skipped: 0, Time elapsed: 57.462 sec
    Running org.apache.hadoop.hbase.replication.TestReplication
    Tests run: 10, Failures: 0, Errors: 0, Skipped: 0, Time elapsed: 190.233 sec

    Results :

    Failed tests: testRebalanceOnRegionServerNumberChange(org.apache.hadoop.hbase.TestRegionRebalancing): After 5 attempts, region assignments were not balanced.

    Tests in error:
    testOnlineChangeTableSchema(org.apache.hadoop.hbase.client.TestAdmin): Retries exhausted, it took too long to wait for the table changeTableSchemaOnline to be deleted.

    Tests run: 922, Failures: 1, Errors: 1, Skipped: 9

    [INFO] ------------------------------------------------------------------------
    [INFO] BUILD FAILURE
    [INFO] ------------------------------------------------------------------------
    [INFO] Total time: 40:25.225s
    [INFO] Finished at: Thu May 10 17:56:34 UTC 2012
    [INFO] Final Memory: 45M/712M
    [INFO] ------------------------------------------------------------------------
    [ERROR] Failed to execute goal org.apache.maven.plugins:maven-surefire-plugin:2.12-TRUNK-HBASE-2:test (secondPartTestsExecution) on project hbase: There are test failures.
    [ERROR]
    [ERROR] Please refer to <https://builds.apache.org/job/HBase-0.94/ws/trunk/target/surefire-reports> for the individual test results.
    [ERROR] -> [Help 1]
    [ERROR]
    [ERROR] To see the full stack trace of the errors, re-run Maven with the -e switch.
    [ERROR] Re-run Maven using the -X switch to enable full debug logging.
    [ERROR]
    [ERROR] For more information about the errors and possible solutions, please read the following articles:
    [ERROR] [Help 1] http://cwiki.apache.org/confluence/display/MAVEN/MojoFailureException
    Build step 'Invoke top-level Maven targets' marked build as failure
    Archiving artifacts
    Updating HBASE-5973
    Recording test results
  • Apache Jenkins Server at May 10, 2012 at 10:03 pm

Related Discussions

Discussion Navigation
viewthread | post
Discussion Overview
groupdev @
categorieshbase, hadoop
postedMay 9, '12 at 8:20p
activeMay 10, '12 at 10:03p
posts3
users1
websitehbase.apache.org

1 user in discussion

Apache Jenkins Server: 3 posts

People

Translate

site design / logo © 2022 Grokbase