Grokbase Groups HBase dev May 2012
FAQ
See <https://builds.apache.org/job/HBase-TRUNK-security/196/changes>

Changes:

[stack] HBASE-5925 Issue with only using the old config param hbase.hstore.compactionThreshold but not the corresponding new one

------------------------------------------
[...truncated 8336 lines...]
Running org.apache.hadoop.hbase.coprocessor.TestRegionServerCoprocessorExceptionWithRemove
Tests run: 1, Failures: 0, Errors: 0, Skipped: 0, Time elapsed: 17.747 sec
Running org.apache.hadoop.hbase.coprocessor.TestRegionServerCoprocessorExceptionWithAbort
Tests run: 1, Failures: 0, Errors: 0, Skipped: 0, Time elapsed: 13.671 sec
Running org.apache.hadoop.hbase.regionserver.wal.TestHLogSplit
Tests run: 30, Failures: 0, Errors: 0, Skipped: 1, Time elapsed: 245.502 sec
Running org.apache.hadoop.hbase.coprocessor.TestMasterObserver
Tests run: 3, Failures: 0, Errors: 0, Skipped: 0, Time elapsed: 26.252 sec
Running org.apache.hadoop.hbase.coprocessor.TestWALObserver
Tests run: 3, Failures: 0, Errors: 0, Skipped: 0, Time elapsed: 14.543 sec
Running org.apache.hadoop.hbase.coprocessor.TestCoprocessorEndpoint
Tests run: 3, Failures: 0, Errors: 0, Skipped: 1, Time elapsed: 29.437 sec
Running org.apache.hadoop.hbase.coprocessor.TestMasterCoprocessorExceptionWithAbort
Tests run: 1, Failures: 0, Errors: 0, Skipped: 0, Time elapsed: 26.259 sec
Running org.apache.hadoop.hbase.coprocessor.TestRegionObserverInterface
Tests run: 6, Failures: 0, Errors: 0, Skipped: 0, Time elapsed: 31.303 sec
Running org.apache.hadoop.hbase.coprocessor.TestMasterCoprocessorExceptionWithRemove
Tests run: 1, Failures: 0, Errors: 0, Skipped: 0, Time elapsed: 16.148 sec
Running org.apache.hadoop.hbase.coprocessor.TestRegionObserverBypass
Tests run: 2, Failures: 0, Errors: 0, Skipped: 0, Time elapsed: 13.567 sec
Running org.apache.hadoop.hbase.mapred.TestTableInputFormat
Tests run: 6, Failures: 0, Errors: 0, Skipped: 0, Time elapsed: 23.269 sec
Running org.apache.hadoop.hbase.TestGlobalMemStoreSize
Tests run: 1, Failures: 0, Errors: 0, Skipped: 0, Time elapsed: 15.839 sec
Running org.apache.hadoop.hbase.mapred.TestTableMapReduce
Tests run: 1, Failures: 0, Errors: 0, Skipped: 0, Time elapsed: 81.781 sec
Running org.apache.hadoop.hbase.mapreduce.TestHLogRecordReader
Tests run: 2, Failures: 0, Errors: 0, Skipped: 0, Time elapsed: 5.469 sec
Running org.apache.hadoop.hbase.regionserver.wal.TestLogRolling
Tests run: 3, Failures: 0, Errors: 0, Skipped: 0, Time elapsed: 432.161 sec
Running org.apache.hadoop.hbase.mapreduce.TestTableMapReduce
Tests run: 1, Failures: 0, Errors: 0, Skipped: 0, Time elapsed: 108.822 sec
Running org.apache.hadoop.hbase.mapreduce.TestLoadIncrementalHFilesSplitRecovery
Tests run: 4, Failures: 0, Errors: 0, Skipped: 0, Time elapsed: 97.004 sec
Running org.apache.hadoop.hbase.mapreduce.TestWALPlayer
Tests run: 1, Failures: 0, Errors: 0, Skipped: 0, Time elapsed: 47.282 sec
Running org.apache.hadoop.hbase.mapreduce.TestImportTsv
Tests run: 9, Failures: 0, Errors: 0, Skipped: 0, Time elapsed: 134.605 sec
Running org.apache.hadoop.hbase.mapreduce.TestHFileOutputFormat
Tests run: 9, Failures: 0, Errors: 0, Skipped: 0, Time elapsed: 289.452 sec
Running org.apache.hadoop.hbase.mapreduce.TestMultithreadedTableMapper
Tests run: 1, Failures: 0, Errors: 0, Skipped: 0, Time elapsed: 111.313 sec
Running org.apache.hadoop.hbase.mapreduce.TestLoadIncrementalHFiles
Tests run: 6, Failures: 0, Errors: 0, Skipped: 0, Time elapsed: 31.935 sec
Running org.apache.hadoop.hbase.mapreduce.TestTimeRangeMapRed
Tests run: 1, Failures: 0, Errors: 0, Skipped: 0, Time elapsed: 42.449 sec
Running org.apache.hadoop.hbase.mapreduce.TestImportExport
Tests run: 2, Failures: 0, Errors: 0, Skipped: 0, Time elapsed: 47.265 sec
Running org.apache.hadoop.hbase.thrift2.TestThriftHBaseServiceHandler
Tests run: 12, Failures: 0, Errors: 0, Skipped: 0, Time elapsed: 12.326 sec
Running org.apache.hadoop.hbase.catalog.TestMetaReaderEditorNoCluster
Tests run: 1, Failures: 0, Errors: 0, Skipped: 0, Time elapsed: 4.497 sec
Running org.apache.hadoop.hbase.catalog.TestMetaReaderEditor
Tests run: 5, Failures: 0, Errors: 0, Skipped: 0, Time elapsed: 23.886 sec
Running org.apache.hadoop.hbase.TestAcidGuarantees
Tests run: 3, Failures: 0, Errors: 0, Skipped: 0, Time elapsed: 94.71 sec
Running org.apache.hadoop.hbase.catalog.TestCatalogTracker
Tests run: 9, Failures: 0, Errors: 0, Skipped: 1, Time elapsed: 5.748 sec
Running org.apache.hadoop.hbase.client.TestFromClientSide3
Tests run: 1, Failures: 0, Errors: 0, Skipped: 0, Time elapsed: 23.561 sec
Running org.apache.hadoop.hbase.client.TestTimestampsFilter
Tests run: 3, Failures: 0, Errors: 0, Skipped: 0, Time elapsed: 22.001 sec
Running org.apache.hadoop.hbase.catalog.TestCatalogTrackerOnCluster
Tests run: 1, Failures: 0, Errors: 0, Skipped: 0, Time elapsed: 77.642 sec
Running org.apache.hadoop.hbase.client.TestShell
Tests run: 1, Failures: 0, Errors: 0, Skipped: 0, Time elapsed: 104.995 sec
Running org.apache.hadoop.hbase.client.TestHCM
Tests run: 7, Failures: 0, Errors: 0, Skipped: 0, Time elapsed: 16.493 sec
Running org.apache.hadoop.hbase.mapreduce.TestTableInputFormatScan
Tests run: 12, Failures: 0, Errors: 0, Skipped: 0, Time elapsed: 556.104 sec
Running org.apache.hadoop.hbase.client.TestMetaScanner
Tests run: 1, Failures: 0, Errors: 0, Skipped: 0, Time elapsed: 12.779 sec
Running org.apache.hadoop.hbase.client.TestScannerTimeout
Tests run: 4, Failures: 0, Errors: 0, Skipped: 0, Time elapsed: 43.828 sec
Running org.apache.hadoop.hbase.client.TestHTableUtil
Tests run: 2, Failures: 0, Errors: 0, Skipped: 0, Time elapsed: 14.948 sec
Running org.apache.hadoop.hbase.client.TestFromClientSide
Tests run: 56, Failures: 0, Errors: 0, Skipped: 3, Time elapsed: 159.907 sec
Running org.apache.hadoop.hbase.client.TestMetaMigrationRemovingHTD
Tests run: 3, Failures: 0, Errors: 0, Skipped: 0, Time elapsed: 21.221 sec
Running org.apache.hadoop.hbase.client.TestHTablePool$TestHTableReusablePool
Tests run: 9, Failures: 0, Errors: 0, Skipped: 0, Time elapsed: 5.154 sec
Running org.apache.hadoop.hbase.client.replication.TestReplicationAdmin
Tests run: 1, Failures: 0, Errors: 0, Skipped: 0, Time elapsed: 0.88 sec
Running org.apache.hadoop.hbase.client.TestHTablePool$TestHTableThreadLocalPool
Tests run: 9, Failures: 0, Errors: 0, Skipped: 0, Time elapsed: 20.49 sec
Running org.apache.hadoop.hbase.client.TestMultipleTimestamps
Tests run: 8, Failures: 0, Errors: 0, Skipped: 0, Time elapsed: 30.198 sec
Running org.apache.hadoop.hbase.metrics.TestMetricsMBeanBase
Tests run: 2, Failures: 0, Errors: 0, Skipped: 0, Time elapsed: 1.147 sec
Running org.apache.hadoop.hbase.client.TestMultiParallel
Tests run: 11, Failures: 0, Errors: 0, Skipped: 0, Time elapsed: 32.836 sec
Running org.apache.hadoop.hbase.constraint.TestConstraint
Tests run: 5, Failures: 0, Errors: 0, Skipped: 0, Time elapsed: 27.402 sec
Running org.apache.hadoop.hbase.rest.TestGzipFilter
Tests run: 3, Failures: 0, Errors: 0, Skipped: 0, Time elapsed: 15.004 sec
Running org.apache.hadoop.hbase.rest.TestMultiRowResource
Tests run: 3, Failures: 0, Errors: 0, Skipped: 0, Time elapsed: 14.781 sec
Running org.apache.hadoop.hbase.rest.TestScannersWithFilters
Tests run: 10, Failures: 0, Errors: 0, Skipped: 0, Time elapsed: 17.725 sec
Running org.apache.hadoop.hbase.rest.TestRowResource
Tests run: 11, Failures: 0, Errors: 0, Skipped: 0, Time elapsed: 15.897 sec
Running org.apache.hadoop.hbase.rest.client.TestRemoteAdmin
Tests run: 1, Failures: 0, Errors: 0, Skipped: 0, Time elapsed: 15.698 sec
Running org.apache.hadoop.hbase.rest.client.TestRemoteTable
Tests run: 3, Failures: 0, Errors: 0, Skipped: 0, Time elapsed: 15.376 sec
Running org.apache.hadoop.hbase.rest.TestVersionResource
Tests run: 7, Failures: 0, Errors: 0, Skipped: 0, Time elapsed: 12.01 sec
Running org.apache.hadoop.hbase.rest.TestTableResource
Tests run: 8, Failures: 0, Errors: 0, Skipped: 0, Time elapsed: 24.144 sec
Running org.apache.hadoop.hbase.rest.TestScannerResource
Tests run: 5, Failures: 0, Errors: 0, Skipped: 0, Time elapsed: 27.939 sec
Running org.apache.hadoop.hbase.rest.TestStatusResource
Tests run: 2, Failures: 0, Errors: 0, Skipped: 0, Time elapsed: 10.456 sec
Running org.apache.hadoop.hbase.rest.TestSchemaResource
Tests run: 2, Failures: 0, Errors: 0, Skipped: 0, Time elapsed: 18.559 sec
Running org.apache.hadoop.hbase.client.TestAdmin
Tests run: 39, Failures: 0, Errors: 0, Skipped: 0, Time elapsed: 153.831 sec
Running org.apache.hadoop.hbase.io.encoding.TestLoadAndSwitchEncodeOnDisk
Tests run: 1, Failures: 0, Errors: 0, Skipped: 0, Time elapsed: 27.123 sec
Running org.apache.hadoop.hbase.thrift.TestThriftServer
Tests run: 1, Failures: 0, Errors: 0, Skipped: 0, Time elapsed: 64.626 sec
Running org.apache.hadoop.hbase.io.encoding.TestDataBlockEncoders
Tests run: 12, Failures: 0, Errors: 0, Skipped: 0, Time elapsed: 110.914 sec
Running org.apache.hadoop.hbase.io.encoding.TestUpgradeFromHFileV1ToEncoding
Tests run: 1, Failures: 0, Errors: 0, Skipped: 0, Time elapsed: 86.596 sec
Running org.apache.hadoop.hbase.io.hfile.TestHFileSeek
Tests run: 1, Failures: 0, Errors: 0, Skipped: 0, Time elapsed: 8.053 sec
Running org.apache.hadoop.hbase.io.encoding.TestChangingEncoding
Tests run: 4, Failures: 0, Errors: 0, Skipped: 0, Time elapsed: 239.537 sec
Running org.apache.hadoop.hbase.io.hfile.slab.TestSlabCache
Tests run: 7, Failures: 0, Errors: 0, Skipped: 0, Time elapsed: 19.657 sec
Running org.apache.hadoop.hbase.io.hfile.TestChecksum
Tests run: 3, Failures: 0, Errors: 0, Skipped: 0, Time elapsed: 1.774 sec
Running org.apache.hadoop.hbase.io.hfile.TestHFileBlockIndex
Tests run: 10, Failures: 0, Errors: 0, Skipped: 0, Time elapsed: 10.047 sec
Running org.apache.hadoop.hbase.io.hfile.TestLruBlockCache
Tests run: 16, Failures: 0, Errors: 0, Skipped: 0, Time elapsed: 0.755 sec
Running org.apache.hadoop.hbase.io.hfile.slab.TestSingleSizeCache
Tests run: 5, Failures: 0, Errors: 0, Skipped: 0, Time elapsed: 25.376 sec
Running org.apache.hadoop.hbase.io.hfile.TestFixedFileTrailer
Tests run: 2, Failures: 0, Errors: 0, Skipped: 0, Time elapsed: 0.561 sec
Running org.apache.hadoop.hbase.io.hfile.TestHFilePerformance
Tests run: 1, Failures: 0, Errors: 0, Skipped: 0, Time elapsed: 6.618 sec
Running org.apache.hadoop.hbase.io.hfile.TestHFileBlockCompatibility
Tests run: 10, Failures: 0, Errors: 0, Skipped: 0, Time elapsed: 1.128 sec
Running org.apache.hadoop.hbase.io.hfile.TestForceCacheImportantBlocks
Tests run: 4, Failures: 0, Errors: 0, Skipped: 0, Time elapsed: 50.672 sec
Running org.apache.hadoop.hbase.io.hfile.TestScannerSelectionUsingTTL
Tests run: 6, Failures: 0, Errors: 0, Skipped: 0, Time elapsed: 61.14 sec
Running org.apache.hadoop.hbase.io.hfile.TestHFileBlock
Tests run: 16, Failures: 0, Errors: 0, Skipped: 0, Time elapsed: 48.048 sec
Running org.apache.hadoop.hbase.io.hfile.TestCacheOnWrite
Tests run: 36, Failures: 0, Errors: 0, Skipped: 0, Time elapsed: 42.186 sec
Running org.apache.hadoop.hbase.TestClusterBootOrder
Tests run: 2, Failures: 0, Errors: 0, Skipped: 0, Time elapsed: 27.724 sec
Running org.apache.hadoop.hbase.thrift.TestThriftServerCmdLine
Tests run: 20, Failures: 0, Errors: 0, Skipped: 0, Time elapsed: 453.625 sec
Running org.apache.hadoop.hbase.replication.regionserver.TestReplicationSourceManager
Tests run: 1, Failures: 0, Errors: 0, Skipped: 0, Time elapsed: 0.997 sec
Running org.apache.hadoop.hbase.avro.TestAvroServer
Tests run: 3, Failures: 0, Errors: 0, Skipped: 0, Time elapsed: 28.232 sec
Running org.apache.hadoop.hbase.replication.regionserver.TestReplicationSink
Tests run: 5, Failures: 0, Errors: 0, Skipped: 0, Time elapsed: 30.427 sec
Running org.apache.hadoop.hbase.replication.TestReplicationSource
Tests run: 1, Failures: 0, Errors: 0, Skipped: 0, Time elapsed: 2.839 sec
Running org.apache.hadoop.hbase.replication.TestReplicationPeer
Tests run: 1, Failures: 0, Errors: 0, Skipped: 0, Time elapsed: 1.048 sec
Running org.apache.hadoop.hbase.replication.TestReplicationZookeeper
Tests run: 1, Failures: 0, Errors: 0, Skipped: 0, Time elapsed: 0.621 sec
Running org.apache.hadoop.hbase.replication.TestMasterReplication
Tests run: 2, Failures: 0, Errors: 0, Skipped: 0, Time elapsed: 65.46 sec
Running org.apache.hadoop.hbase.replication.TestMultiSlaveReplication
Tests run: 1, Failures: 0, Errors: 0, Skipped: 0, Time elapsed: 70.051 sec
Running org.apache.hadoop.hbase.ipc.TestPBOnWritableRpc
Tests run: 1, Failures: 0, Errors: 0, Skipped: 0, Time elapsed: 1.175 sec
Running org.apache.hadoop.hbase.ipc.TestDelayedRpc
Tests run: 4, Failures: 0, Errors: 0, Skipped: 0, Time elapsed: 2.323 sec
Running org.apache.hadoop.hbase.TestZooKeeper
Tests run: 9, Failures: 0, Errors: 0, Skipped: 0, Time elapsed: 26.147 sec
Running org.apache.hadoop.hbase.TestHBaseTestingUtility
Tests run: 7, Failures: 0, Errors: 0, Skipped: 0, Time elapsed: 61.209 sec
Running org.apache.hadoop.hbase.replication.TestReplication
Tests run: 10, Failures: 0, Errors: 0, Skipped: 0, Time elapsed: 141.283 sec

Results :

Failed tests: testNullCall(org.apache.hadoop.hbase.regionserver.TestServerCustomProtocol): Results should contain region test,bbb,1336540673842.b98e9e51c161c46665393a9fd293b21a. for row 'bbb'

Tests run: 980, Failures: 1, Errors: 0, Skipped: 9

[INFO] ------------------------------------------------------------------------
[INFO] BUILD FAILURE
[INFO] ------------------------------------------------------------------------
[INFO] Total time: 49:41.102s
[INFO] Finished at: Wed May 09 05:54:14 UTC 2012
[INFO] Final Memory: 56M/716M
[INFO] ------------------------------------------------------------------------
[ERROR] Failed to execute goal org.apache.maven.plugins:maven-surefire-plugin:2.12-TRUNK-HBASE-2:test (secondPartTestsExecution) on project hbase: There are test failures.
[ERROR]
[ERROR] Please refer to <https://builds.apache.org/job/HBase-TRUNK-security/ws/trunk/target/surefire-reports> for the individual test results.
[ERROR] -> [Help 1]
org.apache.maven.lifecycle.LifecycleExecutionException: Failed to execute goal org.apache.maven.plugins:maven-surefire-plugin:2.12-TRUNK-HBASE-2:test (secondPartTestsExecution) on project hbase: There are test failures.

Please refer to <https://builds.apache.org/job/HBase-TRUNK-security/ws/trunk/target/surefire-reports> for the individual test results.
at org.apache.maven.lifecycle.internal.MojoExecutor.execute(MojoExecutor.java:213)
at org.apache.maven.lifecycle.internal.MojoExecutor.execute(MojoExecutor.java:153)
at org.apache.maven.lifecycle.internal.MojoExecutor.execute(MojoExecutor.java:145)
at org.apache.maven.lifecycle.internal.MojoExecutor.executeForkedExecutions(MojoExecutor.java:365)
at org.apache.maven.lifecycle.internal.MojoExecutor.execute(MojoExecutor.java:199)
at org.apache.maven.lifecycle.internal.MojoExecutor.execute(MojoExecutor.java:153)
at org.apache.maven.lifecycle.internal.MojoExecutor.execute(MojoExecutor.java:145)
at org.apache.maven.lifecycle.internal.LifecycleModuleBuilder.buildProject(LifecycleModuleBuilder.java:84)
at org.apache.maven.lifecycle.internal.LifecycleModuleBuilder.buildProject(LifecycleModuleBuilder.java:59)
at org.apache.maven.lifecycle.internal.LifecycleStarter.singleThreadedBuild(LifecycleStarter.java:183)
at org.apache.maven.lifecycle.internal.LifecycleStarter.execute(LifecycleStarter.java:161)
at org.apache.maven.DefaultMaven.doExecute(DefaultMaven.java:319)
at org.apache.maven.DefaultMaven.execute(DefaultMaven.java:156)
at org.apache.maven.cli.MavenCli.execute(MavenCli.java:537)
at org.apache.maven.cli.MavenCli.doMain(MavenCli.java:196)
at org.apache.maven.cli.MavenCli.main(MavenCli.java:141)
at sun.reflect.NativeMethodAccessorImpl.invoke0(Native Method)
at sun.reflect.NativeMethodAccessorImpl.invoke(NativeMethodAccessorImpl.java:39)
at sun.reflect.DelegatingMethodAccessorImpl.invoke(DelegatingMethodAccessorImpl.java:25)
at java.lang.reflect.Method.invoke(Method.java:597)
at org.codehaus.plexus.classworlds.launcher.Launcher.launchEnhanced(Launcher.java:290)
at org.codehaus.plexus.classworlds.launcher.Launcher.launch(Launcher.java:230)
at org.codehaus.plexus.classworlds.launcher.Launcher.mainWithExitCode(Launcher.java:409)
at org.codehaus.plexus.classworlds.launcher.Launcher.main(Launcher.java:352)
Caused by: org.apache.maven.plugin.MojoFailureException: There are test failures.

Please refer to <https://builds.apache.org/job/HBase-TRUNK-security/ws/trunk/target/surefire-reports> for the individual test results.
at org.apache.maven.plugin.surefire.SurefireHelper.reportExecution(SurefireHelper.java:87)
at org.apache.maven.plugin.surefire.SurefirePlugin.writeSummary(SurefirePlugin.java:651)
at org.apache.maven.plugin.surefire.SurefirePlugin.handleSummary(SurefirePlugin.java:625)
at org.apache.maven.plugin.surefire.AbstractSurefireMojo.executeAfterPreconditionsChecked(AbstractSurefireMojo.java:137)
at org.apache.maven.plugin.surefire.AbstractSurefireMojo.execute(AbstractSurefireMojo.java:98)
at org.apache.maven.plugin.DefaultBuildPluginManager.executeMojo(DefaultBuildPluginManager.java:101)
at org.apache.maven.lifecycle.internal.MojoExecutor.execute(MojoExecutor.java:209)
... 23 more
[ERROR]
[ERROR] Re-run Maven using the -X switch to enable full debug logging.
[ERROR]
[ERROR] For more information about the errors and possible solutions, please read the following articles:
[ERROR] [Help 1] http://cwiki.apache.org/confluence/display/MAVEN/MojoFailureException
Build step 'Invoke top-level Maven targets' marked build as failure
Archiving artifacts
Updating HBASE-5925
Recording test results

Search Discussions

  • Apache Jenkins Server at May 10, 2012 at 6:10 am
    See <https://builds.apache.org/job/HBase-TRUNK-security/197/changes>

    Changes:

    [apurtell] HBASE-5964. HFileSystem: "No FileSystem for scheme: hdfs"

    [tedyu] HBASE-5963 ClassCastException: FileSystem$Cache$ClientFinalizer cannot be cast to Thread

    [tedyu] HBASE-5914 Bulk assign regions in the process of ServerShutdownHandler (Chunhui)

    [stack] HBASE-5944 Convert rs, shutdown, and table dir content to pb

    [tedyu] HBASE-5877 When a query fails because the region has moved, let the regionserver return the new address to the client (N Keywal)

    ------------------------------------------
    [...truncated 8376 lines...]
    Running org.apache.hadoop.hbase.master.TestMaster
    Running org.apache.hadoop.hbase.master.TestMasterNoCluster
    Tests run: 3, Failures: 0, Errors: 0, Skipped: 0, Time elapsed: 7.49 sec
    Tests run: 1, Failures: 0, Errors: 0, Skipped: 0, Time elapsed: 16.812 sec
    Running org.apache.hadoop.hbase.master.TestSplitLogManager
    Tests run: 12, Failures: 0, Errors: 0, Skipped: 0, Time elapsed: 14.891 sec
    Running org.apache.hadoop.hbase.master.TestMXBean
    Tests run: 1, Failures: 0, Errors: 0, Skipped: 0, Time elapsed: 12.931 sec
    Running org.apache.hadoop.hbase.master.TestMasterFailover
    Tests run: 4, Failures: 0, Errors: 0, Skipped: 0, Time elapsed: 64.855 sec
    Running org.apache.hadoop.hbase.master.TestMasterRestartAfterDisablingTable
    Tests run: 1, Failures: 0, Errors: 0, Skipped: 0, Time elapsed: 16.55 sec
    Running org.apache.hadoop.hbase.metrics.TestMetricsMBeanBase
    Tests run: 2, Failures: 0, Errors: 0, Skipped: 0, Time elapsed: 1.113 sec
    Running org.apache.hadoop.hbase.TestGlobalMemStoreSize
    Tests run: 1, Failures: 0, Errors: 0, Skipped: 0, Time elapsed: 15.231 sec
    Running org.apache.hadoop.hbase.TestFullLogReconstruction
    Tests run: 1, Failures: 0, Errors: 0, Skipped: 0, Time elapsed: 35.337 sec
    Running org.apache.hadoop.hbase.replication.TestReplicationZookeeper
    Tests run: 1, Failures: 0, Errors: 0, Skipped: 0, Time elapsed: 0.624 sec
    Running org.apache.hadoop.hbase.TestZooKeeper
    Tests run: 9, Failures: 0, Errors: 0, Skipped: 0, Time elapsed: 24.896 sec
    Running org.apache.hadoop.hbase.replication.TestReplicationSource
    Tests run: 1, Failures: 0, Errors: 0, Skipped: 0, Time elapsed: 2.802 sec
    Running org.apache.hadoop.hbase.master.TestDistributedLogSplitting
    Tests run: 4, Failures: 0, Errors: 0, Skipped: 0, Time elapsed: 95.89 sec
    Running org.apache.hadoop.hbase.replication.TestReplicationPeer
    Tests run: 1, Failures: 0, Errors: 0, Skipped: 0, Time elapsed: 1.118 sec
    Running org.apache.hadoop.hbase.replication.regionserver.TestReplicationSink
    Tests run: 5, Failures: 0, Errors: 0, Skipped: 0, Time elapsed: 31.517 sec
    Running org.apache.hadoop.hbase.replication.regionserver.TestReplicationSourceManager
    Tests run: 1, Failures: 0, Errors: 0, Skipped: 0, Time elapsed: 0.982 sec
    Running org.apache.hadoop.hbase.replication.TestMasterReplication
    Tests run: 2, Failures: 0, Errors: 0, Skipped: 0, Time elapsed: 64.279 sec
    Running org.apache.hadoop.hbase.replication.TestMultiSlaveReplication
    Tests run: 1, Failures: 0, Errors: 0, Skipped: 0, Time elapsed: 64.692 sec
    Running org.apache.hadoop.hbase.TestHBaseTestingUtility
    Tests run: 7, Failures: 0, Errors: 0, Skipped: 0, Time elapsed: 59.22 sec
    Running org.apache.hadoop.hbase.TestMultiVersions
    Tests run: 3, Failures: 0, Errors: 0, Skipped: 0, Time elapsed: 22.659 sec
    Running org.apache.hadoop.hbase.catalog.TestMetaReaderEditorNoCluster
    Tests run: 1, Failures: 0, Errors: 0, Skipped: 0, Time elapsed: 4.188 sec
    Running org.apache.hadoop.hbase.catalog.TestCatalogTracker
    Tests run: 9, Failures: 0, Errors: 0, Skipped: 1, Time elapsed: 5.415 sec
    Running org.apache.hadoop.hbase.catalog.TestMetaReaderEditor
    Tests run: 5, Failures: 0, Errors: 0, Skipped: 0, Time elapsed: 20.404 sec
    Running org.apache.hadoop.hbase.coprocessor.TestAggregateProtocol
    Tests run: 45, Failures: 0, Errors: 0, Skipped: 0, Time elapsed: 17.194 sec
    Running org.apache.hadoop.hbase.replication.TestReplication
    Tests run: 10, Failures: 1, Errors: 0, Skipped: 0, Time elapsed: 180.414 sec <<< FAILURE!
    Running org.apache.hadoop.hbase.coprocessor.TestRowProcessorEndpoint
    Tests run: 4, Failures: 0, Errors: 0, Skipped: 0, Time elapsed: 30.716 sec
    Running org.apache.hadoop.hbase.coprocessor.TestMasterObserver
    Tests run: 3, Failures: 0, Errors: 0, Skipped: 0, Time elapsed: 29.641 sec
    Running org.apache.hadoop.hbase.catalog.TestCatalogTrackerOnCluster
    Tests run: 1, Failures: 0, Errors: 0, Skipped: 0, Time elapsed: 78.062 sec
    Running org.apache.hadoop.hbase.coprocessor.TestCoprocessorEndpoint
    Tests run: 3, Failures: 0, Errors: 0, Skipped: 1, Time elapsed: 30.546 sec
    Running org.apache.hadoop.hbase.coprocessor.TestClassLoading
    Tests run: 6, Failures: 0, Errors: 0, Skipped: 0, Time elapsed: 29.27 sec
    Running org.apache.hadoop.hbase.coprocessor.TestMasterCoprocessorExceptionWithRemove
    Tests run: 1, Failures: 0, Errors: 0, Skipped: 0, Time elapsed: 15.606 sec
    Running org.apache.hadoop.hbase.coprocessor.TestRegionObserverInterface
    Tests run: 6, Failures: 0, Errors: 0, Skipped: 0, Time elapsed: 32.385 sec
    Running org.apache.hadoop.hbase.coprocessor.TestRegionServerCoprocessorExceptionWithRemove
    Tests run: 1, Failures: 0, Errors: 0, Skipped: 0, Time elapsed: 16.826 sec
    Running org.apache.hadoop.hbase.coprocessor.TestWALObserver
    Tests run: 3, Failures: 0, Errors: 0, Skipped: 0, Time elapsed: 15.262 sec
    Running org.apache.hadoop.hbase.coprocessor.TestRegionServerCoprocessorExceptionWithAbort
    Tests run: 1, Failures: 0, Errors: 0, Skipped: 0, Time elapsed: 14.334 sec
    Running org.apache.hadoop.hbase.coprocessor.TestMasterCoprocessorExceptionWithAbort
    Tests run: 1, Failures: 0, Errors: 0, Skipped: 0, Time elapsed: 25.016 sec
    Running org.apache.hadoop.hbase.coprocessor.TestRegionObserverBypass
    Tests run: 2, Failures: 0, Errors: 0, Skipped: 0, Time elapsed: 12.72 sec
    Running org.apache.hadoop.hbase.thrift2.TestThriftHBaseServiceHandler
    Tests run: 12, Failures: 0, Errors: 0, Skipped: 0, Time elapsed: 13.16 sec
    Running org.apache.hadoop.hbase.avro.TestAvroServer
    Tests run: 3, Failures: 0, Errors: 0, Skipped: 0, Time elapsed: 26.848 sec
    Running org.apache.hadoop.hbase.monitoring.TestTaskMonitor
    Tests run: 3, Failures: 0, Errors: 0, Skipped: 0, Time elapsed: 0.303 sec
    Running org.apache.hadoop.hbase.monitoring.TestMemoryBoundedLogMessageBuffer
    Tests run: 2, Failures: 0, Errors: 0, Skipped: 0, Time elapsed: 0.235 sec
    Running org.apache.hadoop.hbase.regionserver.TestHRegionOnCluster
    Tests run: 1, Failures: 0, Errors: 0, Skipped: 0, Time elapsed: 22.662 sec
    Running org.apache.hadoop.hbase.thrift.TestThriftServer
    Tests run: 1, Failures: 0, Errors: 0, Skipped: 0, Time elapsed: 62.327 sec
    Running org.apache.hadoop.hbase.regionserver.TestMasterAddressManager
    Tests run: 1, Failures: 0, Errors: 0, Skipped: 0, Time elapsed: 0.672 sec
    Running org.apache.hadoop.hbase.regionserver.TestHRegion
    Tests run: 62, Failures: 0, Errors: 0, Skipped: 0, Time elapsed: 38.698 sec
    Running org.apache.hadoop.hbase.regionserver.TestSplitLogWorker
    Tests run: 5, Failures: 0, Errors: 0, Skipped: 0, Time elapsed: 2.235 sec
    Running org.apache.hadoop.hbase.regionserver.TestServerCustomProtocol
    Tests run: 7, Failures: 0, Errors: 0, Skipped: 0, Time elapsed: 16.091 sec
    Running org.apache.hadoop.hbase.regionserver.TestStoreFileBlockCacheSummary
    Tests run: 1, Failures: 0, Errors: 0, Skipped: 0, Time elapsed: 15.685 sec
    Running org.apache.hadoop.hbase.regionserver.TestStore
    Tests run: 12, Failures: 0, Errors: 0, Skipped: 0, Time elapsed: 9.405 sec
    Running org.apache.hadoop.hbase.regionserver.TestRegionServerMetrics
    Tests run: 4, Failures: 0, Errors: 0, Skipped: 0, Time elapsed: 67.979 sec
    Running org.apache.hadoop.hbase.regionserver.TestBlocksRead
    Tests run: 4, Failures: 0, Errors: 0, Skipped: 0, Time elapsed: 1.668 sec
    Running org.apache.hadoop.hbase.regionserver.TestAtomicOperation
    Tests run: 5, Failures: 0, Errors: 0, Skipped: 0, Time elapsed: 26.508 sec
    Running org.apache.hadoop.hbase.regionserver.TestFSErrorsExposed
    Tests run: 3, Failures: 0, Errors: 0, Skipped: 0, Time elapsed: 29.16 sec
    Running org.apache.hadoop.hbase.regionserver.TestSeekOptimizations
    Tests run: 6, Failures: 0, Errors: 0, Skipped: 0, Time elapsed: 2.818 sec
    Running org.apache.hadoop.hbase.regionserver.TestRSKilledWhenMasterInitializing
    Tests run: 1, Failures: 0, Errors: 0, Skipped: 0, Time elapsed: 64.479 sec
    Running org.apache.hadoop.hbase.regionserver.handler.TestCloseRegionHandler
    Tests run: 3, Failures: 0, Errors: 0, Skipped: 0, Time elapsed: 1.276 sec
    Running org.apache.hadoop.hbase.regionserver.metrics.TestSchemaMetrics
    Running org.apache.hadoop.hbase.regionserver.handler.TestOpenRegionHandler
    Tests run: 3, Failures: 0, Errors: 0, Skipped: 0, Time elapsed: 1.083 sec
    Tests run: 6, Failures: 0, Errors: 0, Skipped: 0, Time elapsed: 14.934 sec
    Running org.apache.hadoop.hbase.regionserver.TestSplitTransactionOnCluster
    Tests run: 4, Failures: 1, Errors: 0, Skipped: 0, Time elapsed: 26.907 sec <<< FAILURE!
    Running org.apache.hadoop.hbase.regionserver.TestParallelPut
    Tests run: 2, Failures: 0, Errors: 0, Skipped: 0, Time elapsed: 5.378 sec
    Running org.apache.hadoop.hbase.regionserver.TestHRegionServerBulkLoad
    Tests run: 1, Failures: 0, Errors: 0, Skipped: 0, Time elapsed: 47.48 sec
    Running org.apache.hadoop.hbase.regionserver.wal.TestLogRollAbort
    Tests run: 1, Failures: 0, Errors: 0, Skipped: 0, Time elapsed: 156.344 sec
    Running org.apache.hadoop.hbase.thrift.TestThriftServerCmdLine
    Tests run: 20, Failures: 0, Errors: 0, Skipped: 0, Time elapsed: 464.601 sec
    Running org.apache.hadoop.hbase.regionserver.wal.TestHLog
    Tests run: 10, Failures: 0, Errors: 0, Skipped: 0, Time elapsed: 65.677 sec
    Running org.apache.hadoop.hbase.regionserver.wal.TestLogRollingNoCluster
    Tests run: 1, Failures: 0, Errors: 0, Skipped: 0, Time elapsed: 2.316 sec
    Running org.apache.hadoop.hbase.regionserver.wal.TestWALReplay
    Tests run: 5, Failures: 0, Errors: 0, Skipped: 0, Time elapsed: 30.444 sec
    Running org.apache.hadoop.hbase.regionserver.wal.TestWALReplayCompressed
    Tests run: 5, Failures: 0, Errors: 0, Skipped: 0, Time elapsed: 30.454 sec
    Running org.apache.hadoop.hbase.regionserver.wal.TestLogRolling
    Tests run: 3, Failures: 0, Errors: 0, Skipped: 0, Time elapsed: 403.193 sec
    Running org.apache.hadoop.hbase.regionserver.TestStoreScanner
    Tests run: 16, Failures: 0, Errors: 0, Skipped: 0, Time elapsed: 0.053 sec
    Running org.apache.hadoop.hbase.regionserver.TestEndToEndSplitTransaction
    Tests run: 1, Failures: 0, Errors: 0, Skipped: 0, Time elapsed: 40.32 sec
    Running org.apache.hadoop.hbase.regionserver.wal.TestHLogSplit
    Tests run: 30, Failures: 0, Errors: 0, Skipped: 1, Time elapsed: 240.995 sec
    Running org.apache.hadoop.hbase.regionserver.TestRpcMetrics
    Tests run: 1, Failures: 0, Errors: 0, Skipped: 0, Time elapsed: 1.821 sec
    Running org.apache.hadoop.hbase.regionserver.TestMXBean
    Tests run: 1, Failures: 0, Errors: 0, Skipped: 0, Time elapsed: 9.444 sec
    Running org.apache.hadoop.hbase.mapred.TestTableInputFormat
    Tests run: 6, Failures: 0, Errors: 0, Skipped: 0, Time elapsed: 23.324 sec
    Running org.apache.hadoop.hbase.regionserver.TestMultiColumnScanner
    Tests run: 12, Failures: 0, Errors: 0, Skipped: 0, Time elapsed: 41.516 sec
    Running org.apache.hadoop.hbase.TestDrainingServer
    Tests run: 2, Failures: 1, Errors: 0, Skipped: 0, Time elapsed: 18.577 sec <<< FAILURE!
    Running org.apache.hadoop.hbase.TestClusterBootOrder
    Tests run: 2, Failures: 0, Errors: 0, Skipped: 0, Time elapsed: 27.035 sec
    Running org.apache.hadoop.hbase.mapred.TestTableMapReduce
    Tests run: 1, Failures: 0, Errors: 0, Skipped: 0, Time elapsed: 80.169 sec
    Running org.apache.hadoop.hbase.mapreduce.TestTimeRangeMapRed
    Tests run: 1, Failures: 0, Errors: 0, Skipped: 0, Time elapsed: 41.011 sec
    Running org.apache.hadoop.hbase.mapreduce.TestImportTsv
    Tests run: 9, Failures: 0, Errors: 0, Skipped: 0, Time elapsed: 133.91 sec
    Running org.apache.hadoop.hbase.mapreduce.TestImportExport
    Tests run: 2, Failures: 0, Errors: 0, Skipped: 0, Time elapsed: 47.446 sec
    Running org.apache.hadoop.hbase.mapreduce.TestHFileOutputFormat
    Tests run: 9, Failures: 0, Errors: 0, Skipped: 0, Time elapsed: 225.988 sec
    Running org.apache.hadoop.hbase.mapreduce.TestWALPlayer
    Tests run: 1, Failures: 0, Errors: 0, Skipped: 0, Time elapsed: 47.654 sec
    Running org.apache.hadoop.hbase.mapreduce.TestMultithreadedTableMapper
    Tests run: 1, Failures: 0, Errors: 0, Skipped: 0, Time elapsed: 113.235 sec
    Running org.apache.hadoop.hbase.mapreduce.TestLoadIncrementalHFilesSplitRecovery
    Tests run: 4, Failures: 0, Errors: 0, Skipped: 0, Time elapsed: 106.793 sec
    Running org.apache.hadoop.hbase.mapreduce.TestLoadIncrementalHFiles
    Tests run: 6, Failures: 0, Errors: 0, Skipped: 0, Time elapsed: 34.112 sec
    Running org.apache.hadoop.hbase.mapreduce.TestHLogRecordReader
    Tests run: 2, Failures: 0, Errors: 0, Skipped: 0, Time elapsed: 6.021 sec
    Running org.apache.hadoop.hbase.mapreduce.TestTableMapReduce
    Tests run: 1, Failures: 0, Errors: 0, Skipped: 0, Time elapsed: 158.934 sec
    Running org.apache.hadoop.hbase.mapreduce.TestTableInputFormatScan
    Tests run: 12, Failures: 0, Errors: 0, Skipped: 0, Time elapsed: 616.971 sec

    Results :

    Failed tests: queueFailover(org.apache.hadoop.hbase.replication.TestReplication): Waited too much time for queueFailover replication. Waited 39782ms.
    testShutdownFixupWhenDaughterHasSplit(org.apache.hadoop.hbase.regionserver.TestSplitTransactionOnCluster)
    testDrainingServerWithAbort(org.apache.hadoop.hbase.TestDrainingServer): expected:<1> but was:<4>

    Tests run: 980, Failures: 3, Errors: 0, Skipped: 9

    [INFO] ------------------------------------------------------------------------
    [INFO] BUILD FAILURE
    [INFO] ------------------------------------------------------------------------
    [INFO] Total time: 50:54.560s
    [INFO] Finished at: Thu May 10 06:05:49 UTC 2012
    [INFO] Final Memory: 48M/565M
    [INFO] ------------------------------------------------------------------------
    [ERROR] Failed to execute goal org.apache.maven.plugins:maven-surefire-plugin:2.12-TRUNK-HBASE-2:test (secondPartTestsExecution) on project hbase: There are test failures.
    [ERROR]
    [ERROR] Please refer to <https://builds.apache.org/job/HBase-TRUNK-security/ws/trunk/target/surefire-reports> for the individual test results.
    [ERROR] -> [Help 1]
    org.apache.maven.lifecycle.LifecycleExecutionException: Failed to execute goal org.apache.maven.plugins:maven-surefire-plugin:2.12-TRUNK-HBASE-2:test (secondPartTestsExecution) on project hbase: There are test failures.

    Please refer to <https://builds.apache.org/job/HBase-TRUNK-security/ws/trunk/target/surefire-reports> for the individual test results.
    at org.apache.maven.lifecycle.internal.MojoExecutor.execute(MojoExecutor.java:213)
    at org.apache.maven.lifecycle.internal.MojoExecutor.execute(MojoExecutor.java:153)
    at org.apache.maven.lifecycle.internal.MojoExecutor.execute(MojoExecutor.java:145)
    at org.apache.maven.lifecycle.internal.MojoExecutor.executeForkedExecutions(MojoExecutor.java:365)
    at org.apache.maven.lifecycle.internal.MojoExecutor.execute(MojoExecutor.java:199)
    at org.apache.maven.lifecycle.internal.MojoExecutor.execute(MojoExecutor.java:153)
    at org.apache.maven.lifecycle.internal.MojoExecutor.execute(MojoExecutor.java:145)
    at org.apache.maven.lifecycle.internal.LifecycleModuleBuilder.buildProject(LifecycleModuleBuilder.java:84)
    at org.apache.maven.lifecycle.internal.LifecycleModuleBuilder.buildProject(LifecycleModuleBuilder.java:59)
    at org.apache.maven.lifecycle.internal.LifecycleStarter.singleThreadedBuild(LifecycleStarter.java:183)
    at org.apache.maven.lifecycle.internal.LifecycleStarter.execute(LifecycleStarter.java:161)
    at org.apache.maven.DefaultMaven.doExecute(DefaultMaven.java:319)
    at org.apache.maven.DefaultMaven.execute(DefaultMaven.java:156)
    at org.apache.maven.cli.MavenCli.execute(MavenCli.java:537)
    at org.apache.maven.cli.MavenCli.doMain(MavenCli.java:196)
    at org.apache.maven.cli.MavenCli.main(MavenCli.java:141)
    at sun.reflect.NativeMethodAccessorImpl.invoke0(Native Method)
    at sun.reflect.NativeMethodAccessorImpl.invoke(NativeMethodAccessorImpl.java:39)
    at sun.reflect.DelegatingMethodAccessorImpl.invoke(DelegatingMethodAccessorImpl.java:25)
    at java.lang.reflect.Method.invoke(Method.java:597)
    at org.codehaus.plexus.classworlds.launcher.Launcher.launchEnhanced(Launcher.java:290)
    at org.codehaus.plexus.classworlds.launcher.Launcher.launch(Launcher.java:230)
    at org.codehaus.plexus.classworlds.launcher.Launcher.mainWithExitCode(Launcher.java:409)
    at org.codehaus.plexus.classworlds.launcher.Launcher.main(Launcher.java:352)
    Caused by: org.apache.maven.plugin.MojoFailureException: There are test failures.

    Please refer to <https://builds.apache.org/job/HBase-TRUNK-security/ws/trunk/target/surefire-reports> for the individual test results.
    at org.apache.maven.plugin.surefire.SurefireHelper.reportExecution(SurefireHelper.java:87)
    at org.apache.maven.plugin.surefire.SurefirePlugin.writeSummary(SurefirePlugin.java:651)
    at org.apache.maven.plugin.surefire.SurefirePlugin.handleSummary(SurefirePlugin.java:625)
    at org.apache.maven.plugin.surefire.AbstractSurefireMojo.executeAfterPreconditionsChecked(AbstractSurefireMojo.java:137)
    at org.apache.maven.plugin.surefire.AbstractSurefireMojo.execute(AbstractSurefireMojo.java:98)
    at org.apache.maven.plugin.DefaultBuildPluginManager.executeMojo(DefaultBuildPluginManager.java:101)
    at org.apache.maven.lifecycle.internal.MojoExecutor.execute(MojoExecutor.java:209)
    ... 23 more
    [ERROR]
    [ERROR] Re-run Maven using the -X switch to enable full debug logging.
    [ERROR]
    [ERROR] For more information about the errors and possible solutions, please read the following articles:
    [ERROR] [Help 1] http://cwiki.apache.org/confluence/display/MAVEN/MojoFailureException
    Build step 'Invoke top-level Maven targets' marked build as failure
    Archiving artifacts
    Updating HBASE-5944
    Updating HBASE-5963
    Updating HBASE-5877
    Updating HBASE-5964
    Updating HBASE-5914
    Recording test results
  • Apache Jenkins Server at May 11, 2012 at 6:12 am
    See <https://builds.apache.org/job/HBase-TRUNK-security/198/changes>

    Changes:

    [tedyu] HBASE-5975 Failed suppression of fs shutdown hook with Hadoop 2.0.0 (Jimmy Xiang)

    [todd] HBASE-5973. Add ability for potentially long-running IPC calls to abort if client disconnects. Contributed by Todd Lipcon.

    ------------------------------------------
    [...truncated 8382 lines...]
    Running org.apache.hadoop.hbase.metrics.TestMetricsMBeanBase
    Tests run: 2, Failures: 0, Errors: 0, Skipped: 0, Time elapsed: 1.115 sec
    Running org.apache.hadoop.hbase.rest.TestScannersWithFilters
    Tests run: 10, Failures: 0, Errors: 0, Skipped: 0, Time elapsed: 16.598 sec
    Running org.apache.hadoop.hbase.TestInfoServers
    Tests run: 2, Failures: 0, Errors: 0, Skipped: 0, Time elapsed: 11.396 sec
    Running org.apache.hadoop.hbase.regionserver.TestServerCustomProtocol
    Tests run: 7, Failures: 1, Errors: 0, Skipped: 0, Time elapsed: 14.577 sec <<< FAILURE!
    Running org.apache.hadoop.hbase.regionserver.TestAtomicOperation
    Tests run: 5, Failures: 1, Errors: 0, Skipped: 0, Time elapsed: 31.099 sec <<< FAILURE!
    Running org.apache.hadoop.hbase.regionserver.TestHRegion
    Tests run: 62, Failures: 0, Errors: 0, Skipped: 0, Time elapsed: 36.791 sec
    Running org.apache.hadoop.hbase.regionserver.TestEndToEndSplitTransaction
    Tests run: 1, Failures: 0, Errors: 0, Skipped: 0, Time elapsed: 40.493 sec
    Running org.apache.hadoop.hbase.regionserver.wal.TestWALReplayCompressed
    Tests run: 5, Failures: 0, Errors: 0, Skipped: 0, Time elapsed: 30.598 sec
    Running org.apache.hadoop.hbase.regionserver.wal.TestLogRollAbort
    Tests run: 1, Failures: 0, Errors: 0, Skipped: 0, Time elapsed: 17.061 sec
    Running org.apache.hadoop.hbase.regionserver.wal.TestWALReplay
    Tests run: 5, Failures: 0, Errors: 0, Skipped: 0, Time elapsed: 28.759 sec
    Running org.apache.hadoop.hbase.regionserver.wal.TestHLog
    Tests run: 10, Failures: 0, Errors: 0, Skipped: 0, Time elapsed: 65.514 sec
    Running org.apache.hadoop.hbase.regionserver.wal.TestLogRollingNoCluster
    Tests run: 1, Failures: 0, Errors: 0, Skipped: 0, Time elapsed: 2.076 sec
    Running org.apache.hadoop.hbase.regionserver.TestStore
    Tests run: 12, Failures: 0, Errors: 0, Skipped: 0, Time elapsed: 9.347 sec
    Running org.apache.hadoop.hbase.regionserver.TestRpcMetrics
    Tests run: 1, Failures: 0, Errors: 0, Skipped: 0, Time elapsed: 1.797 sec
    Running org.apache.hadoop.hbase.regionserver.TestBlocksRead
    Tests run: 4, Failures: 0, Errors: 0, Skipped: 0, Time elapsed: 0.981 sec
    Running org.apache.hadoop.hbase.regionserver.TestRegionServerMetrics
    Tests run: 4, Failures: 0, Errors: 0, Skipped: 0, Time elapsed: 62.372 sec
    Running org.apache.hadoop.hbase.regionserver.TestHRegionOnCluster
    Tests run: 1, Failures: 0, Errors: 0, Skipped: 0, Time elapsed: 17.647 sec
    Running org.apache.hadoop.hbase.regionserver.metrics.TestSchemaMetrics
    Tests run: 6, Failures: 0, Errors: 0, Skipped: 0, Time elapsed: 15 sec
    Running org.apache.hadoop.hbase.regionserver.TestParallelPut
    Tests run: 2, Failures: 0, Errors: 0, Skipped: 0, Time elapsed: 5.12 sec
    Running org.apache.hadoop.hbase.regionserver.TestStoreScanner
    Tests run: 16, Failures: 0, Errors: 0, Skipped: 0, Time elapsed: 0.049 sec
    Running org.apache.hadoop.hbase.regionserver.TestSplitTransactionOnCluster
    Tests run: 4, Failures: 0, Errors: 0, Skipped: 0, Time elapsed: 44.025 sec
    Running org.apache.hadoop.hbase.regionserver.TestStoreFileBlockCacheSummary
    Tests run: 1, Failures: 0, Errors: 0, Skipped: 0, Time elapsed: 14.813 sec
    Running org.apache.hadoop.hbase.regionserver.TestMXBean
    Tests run: 1, Failures: 0, Errors: 0, Skipped: 0, Time elapsed: 10.265 sec
    Running org.apache.hadoop.hbase.regionserver.wal.TestHLogSplit
    Tests run: 30, Failures: 0, Errors: 0, Skipped: 1, Time elapsed: 239.975 sec
    Running org.apache.hadoop.hbase.regionserver.handler.TestCloseRegionHandler
    Tests run: 3, Failures: 0, Errors: 0, Skipped: 0, Time elapsed: 1.278 sec
    Running org.apache.hadoop.hbase.regionserver.handler.TestOpenRegionHandler
    Tests run: 3, Failures: 0, Errors: 0, Skipped: 0, Time elapsed: 1.025 sec
    Running org.apache.hadoop.hbase.regionserver.wal.TestLogRolling
    Tests run: 3, Failures: 0, Errors: 0, Skipped: 0, Time elapsed: 294.782 sec
    Running org.apache.hadoop.hbase.regionserver.TestMultiColumnScanner
    Tests run: 12, Failures: 0, Errors: 0, Skipped: 0, Time elapsed: 42.151 sec
    Running org.apache.hadoop.hbase.regionserver.TestMasterAddressManager
    Tests run: 1, Failures: 0, Errors: 0, Skipped: 0, Time elapsed: 0.702 sec
    Running org.apache.hadoop.hbase.regionserver.TestSplitLogWorker
    Tests run: 5, Failures: 0, Errors: 0, Skipped: 0, Time elapsed: 2.167 sec
    Running org.apache.hadoop.hbase.regionserver.TestRSKilledWhenMasterInitializing
    Tests run: 1, Failures: 0, Errors: 0, Skipped: 0, Time elapsed: 36.089 sec
    Running org.apache.hadoop.hbase.regionserver.TestSeekOptimizations
    Tests run: 6, Failures: 0, Errors: 0, Skipped: 0, Time elapsed: 3.1 sec
    Running org.apache.hadoop.hbase.regionserver.TestHRegionServerBulkLoad
    Tests run: 1, Failures: 0, Errors: 0, Skipped: 0, Time elapsed: 45.994 sec
    Running org.apache.hadoop.hbase.filter.TestColumnRangeFilter
    Tests run: 1, Failures: 0, Errors: 0, Skipped: 0, Time elapsed: 17.139 sec
    Running org.apache.hadoop.hbase.TestGlobalMemStoreSize
    Tests run: 1, Failures: 0, Errors: 0, Skipped: 0, Time elapsed: 16.824 sec
    Running org.apache.hadoop.hbase.regionserver.TestFSErrorsExposed
    Tests run: 3, Failures: 0, Errors: 0, Skipped: 0, Time elapsed: 30.296 sec
    Running org.apache.hadoop.hbase.security.token.TestTokenAuthentication
    Tests run: 1, Failures: 0, Errors: 0, Skipped: 0, Time elapsed: 8.702 sec
    Running org.apache.hadoop.hbase.security.token.TestZKSecretWatcher
    Tests run: 1, Failures: 0, Errors: 0, Skipped: 0, Time elapsed: 15.401 sec
    Running org.apache.hadoop.hbase.security.access.TestZKPermissionsWatcher
    Tests run: 1, Failures: 0, Errors: 0, Skipped: 0, Time elapsed: 10.818 sec
    Running org.apache.hadoop.hbase.security.access.TestAccessControlFilter
    Tests run: 1, Failures: 0, Errors: 0, Skipped: 0, Time elapsed: 14.103 sec
    Running org.apache.hadoop.hbase.TestHBaseTestingUtility
    Tests run: 7, Failures: 0, Errors: 0, Skipped: 0, Time elapsed: 54.622 sec
    Running org.apache.hadoop.hbase.security.access.TestTablePermissions
    Tests run: 4, Failures: 0, Errors: 0, Skipped: 0, Time elapsed: 25.828 sec
    Running org.apache.hadoop.hbase.security.access.TestAccessController
    Tests run: 21, Failures: 0, Errors: 0, Skipped: 0, Time elapsed: 24.928 sec
    Running org.apache.hadoop.hbase.TestMultiVersions
    Tests run: 3, Failures: 0, Errors: 0, Skipped: 0, Time elapsed: 20.255 sec
    Running org.apache.hadoop.hbase.TestRegionRebalancing
    Running org.apache.hadoop.hbase.thrift2.TestThriftHBaseServiceHandler
    Tests run: 1, Failures: 0, Errors: 0, Skipped: 0, Time elapsed: 19.313 sec
    Tests run: 12, Failures: 0, Errors: 0, Skipped: 0, Time elapsed: 12.96 sec
    Running org.apache.hadoop.hbase.replication.TestReplicationZookeeper
    Tests run: 1, Failures: 0, Errors: 0, Skipped: 0, Time elapsed: 0.615 sec
    Running org.apache.hadoop.hbase.replication.regionserver.TestReplicationSourceManager
    Tests run: 1, Failures: 0, Errors: 0, Skipped: 0, Time elapsed: 1.014 sec
    Running org.apache.hadoop.hbase.replication.regionserver.TestReplicationSink
    Tests run: 5, Failures: 0, Errors: 0, Skipped: 0, Time elapsed: 28.031 sec
    Running org.apache.hadoop.hbase.replication.TestReplicationPeer
    Tests run: 1, Failures: 0, Errors: 0, Skipped: 0, Time elapsed: 1.752 sec
    Running org.apache.hadoop.hbase.replication.TestMasterReplication
    Tests run: 2, Failures: 0, Errors: 0, Skipped: 0, Time elapsed: 61.16 sec
    Running org.apache.hadoop.hbase.replication.TestReplicationSource
    Tests run: 1, Failures: 0, Errors: 0, Skipped: 0, Time elapsed: 2.702 sec
    Running org.apache.hadoop.hbase.avro.TestAvroServer
    Tests run: 3, Failures: 0, Errors: 0, Skipped: 0, Time elapsed: 25.626 sec
    Running org.apache.hadoop.hbase.replication.TestMultiSlaveReplication
    Tests run: 1, Failures: 0, Errors: 0, Skipped: 0, Time elapsed: 64.46 sec
    Running org.apache.hadoop.hbase.coprocessor.TestRegionServerCoprocessorExceptionWithRemove
    Tests run: 1, Failures: 0, Errors: 0, Skipped: 0, Time elapsed: 15.305 sec
    Running org.apache.hadoop.hbase.replication.TestReplication
    Tests run: 10, Failures: 0, Errors: 0, Skipped: 0, Time elapsed: 141.124 sec
    Running org.apache.hadoop.hbase.coprocessor.TestRegionObserverInterface
    Tests run: 6, Failures: 0, Errors: 0, Skipped: 0, Time elapsed: 31.281 sec
    Running org.apache.hadoop.hbase.coprocessor.TestMasterObserver
    Tests run: 3, Failures: 0, Errors: 0, Skipped: 0, Time elapsed: 27.392 sec
    Running org.apache.hadoop.hbase.coprocessor.TestWALObserver
    Tests run: 3, Failures: 0, Errors: 0, Skipped: 0, Time elapsed: 14.325 sec
    Running org.apache.hadoop.hbase.coprocessor.TestCoprocessorEndpoint
    Tests run: 3, Failures: 0, Errors: 0, Skipped: 1, Time elapsed: 28.682 sec
    Running org.apache.hadoop.hbase.coprocessor.TestRegionObserverBypass
    Tests run: 2, Failures: 0, Errors: 0, Skipped: 0, Time elapsed: 12.382 sec
    Running org.apache.hadoop.hbase.TestAcidGuarantees
    Tests run: 3, Failures: 0, Errors: 0, Skipped: 0, Time elapsed: 96.08 sec
    Running org.apache.hadoop.hbase.coprocessor.TestMasterCoprocessorExceptionWithAbort
    Tests run: 1, Failures: 0, Errors: 0, Skipped: 0, Time elapsed: 23.658 sec
    Running org.apache.hadoop.hbase.coprocessor.TestAggregateProtocol
    Tests run: 45, Failures: 0, Errors: 0, Skipped: 0, Time elapsed: 16.277 sec
    Running org.apache.hadoop.hbase.coprocessor.TestMasterCoprocessorExceptionWithRemove
    Tests run: 1, Failures: 0, Errors: 0, Skipped: 0, Time elapsed: 14.126 sec
    Running org.apache.hadoop.hbase.coprocessor.TestClassLoading
    Tests run: 6, Failures: 0, Errors: 0, Skipped: 0, Time elapsed: 28.2 sec
    Running org.apache.hadoop.hbase.coprocessor.TestRowProcessorEndpoint
    Tests run: 4, Failures: 0, Errors: 0, Skipped: 0, Time elapsed: 31.227 sec
    Running org.apache.hadoop.hbase.coprocessor.TestRegionServerCoprocessorExceptionWithAbort
    Tests run: 1, Failures: 0, Errors: 0, Skipped: 0, Time elapsed: 72.589 sec
    Running org.apache.hadoop.hbase.constraint.TestConstraint
    Tests run: 5, Failures: 0, Errors: 0, Skipped: 0, Time elapsed: 27.368 sec
    Running org.apache.hadoop.hbase.master.TestOpenedRegionHandler
    Tests run: 2, Failures: 0, Errors: 0, Skipped: 0, Time elapsed: 14.637 sec
    Running org.apache.hadoop.hbase.master.TestAssignmentManager
    Tests run: 7, Failures: 0, Errors: 0, Skipped: 0, Time elapsed: 1.971 sec
    Running org.apache.hadoop.hbase.mapred.TestTableInputFormat
    Tests run: 6, Failures: 0, Errors: 0, Skipped: 0, Time elapsed: 20.796 sec
    Running org.apache.hadoop.hbase.master.TestActiveMasterManager
    Tests run: 2, Failures: 0, Errors: 0, Skipped: 0, Time elapsed: 0.934 sec
    Running org.apache.hadoop.hbase.master.TestMasterRestartAfterDisablingTable
    Tests run: 1, Failures: 0, Errors: 0, Skipped: 0, Time elapsed: 16.772 sec
    Running org.apache.hadoop.hbase.mapred.TestTableMapReduce
    Tests run: 1, Failures: 0, Errors: 0, Skipped: 0, Time elapsed: 81.744 sec
    Running org.apache.hadoop.hbase.master.TestRollingRestart
    Tests run: 1, Failures: 0, Errors: 0, Skipped: 0, Time elapsed: 38.649 sec
    Running org.apache.hadoop.hbase.master.TestMasterFailover
    Tests run: 4, Failures: 0, Errors: 0, Skipped: 0, Time elapsed: 59.373 sec
    Running org.apache.hadoop.hbase.master.TestMasterStatusServlet
    Tests run: 5, Failures: 0, Errors: 0, Skipped: 0, Time elapsed: 1.094 sec
    Running org.apache.hadoop.hbase.master.TestClockSkewDetection
    Tests run: 1, Failures: 0, Errors: 0, Skipped: 0, Time elapsed: 0.304 sec
    Running org.apache.hadoop.hbase.master.TestDefaultLoadBalancer
    Tests run: 4, Failures: 0, Errors: 0, Skipped: 0, Time elapsed: 1.506 sec
    Running org.apache.hadoop.hbase.master.TestHMasterRPCException
    Tests run: 1, Failures: 0, Errors: 0, Skipped: 0, Time elapsed: 1.207 sec
    Running org.apache.hadoop.hbase.master.TestMasterTransitions
    Tests run: 3, Failures: 0, Errors: 0, Skipped: 3, Time elapsed: 17.636 sec
    Running org.apache.hadoop.hbase.master.TestMXBean
    Tests run: 1, Failures: 0, Errors: 0, Skipped: 0, Time elapsed: 12.551 sec
    Running org.apache.hadoop.hbase.master.TestRestartCluster
    Tests run: 2, Failures: 0, Errors: 0, Skipped: 0, Time elapsed: 26.578 sec
    Running org.apache.hadoop.hbase.master.TestMaster
    Tests run: 1, Failures: 0, Errors: 0, Skipped: 0, Time elapsed: 15.381 sec
    Running org.apache.hadoop.hbase.master.TestMasterShutdown
    Tests run: 1, Failures: 0, Errors: 0, Skipped: 0, Time elapsed: 14.543 sec
    Running org.apache.hadoop.hbase.master.TestMasterNoCluster
    Tests run: 3, Failures: 0, Errors: 0, Skipped: 0, Time elapsed: 7.207 sec
    Running org.apache.hadoop.hbase.master.TestSplitLogManager
    Tests run: 12, Failures: 0, Errors: 0, Skipped: 0, Time elapsed: 14.501 sec
    Running org.apache.hadoop.hbase.master.TestLogsCleaner
    Tests run: 1, Failures: 0, Errors: 0, Skipped: 0, Time elapsed: 3.058 sec
    Running org.apache.hadoop.hbase.master.TestZKBasedOpenCloseRegion
    Tests run: 4, Failures: 0, Errors: 0, Skipped: 0, Time elapsed: 17.297 sec
    Running org.apache.hadoop.hbase.master.TestDistributedLogSplitting
    Tests run: 4, Failures: 0, Errors: 0, Skipped: 0, Time elapsed: 97.903 sec

    Results :

    Failed tests: testCompountCall(org.apache.hadoop.hbase.regionserver.TestServerCustomProtocol): Results should contain region test,bbb,1336715655482.27a1e074328f29ac11bcf06d58c46862. for row 'bbb'
    testMultiRowMutationMultiThreads(org.apache.hadoop.hbase.regionserver.TestAtomicOperation): expected:<0> but was:<1>

    Tests run: 980, Failures: 2, Errors: 0, Skipped: 9

    [INFO] ------------------------------------------------------------------------
    [INFO] BUILD FAILURE
    [INFO] ------------------------------------------------------------------------
    [INFO] Total time: 46:22.336s
    [INFO] Finished at: Fri May 11 06:10:43 UTC 2012
    [INFO] Final Memory: 53M/549M
    [INFO] ------------------------------------------------------------------------
    [ERROR] Failed to execute goal org.apache.maven.plugins:maven-surefire-plugin:2.12-TRUNK-HBASE-2:test (secondPartTestsExecution) on project hbase: There are test failures.
    [ERROR]
    [ERROR] Please refer to <https://builds.apache.org/job/HBase-TRUNK-security/ws/trunk/target/surefire-reports> for the individual test results.
    [ERROR] -> [Help 1]
    org.apache.maven.lifecycle.LifecycleExecutionException: Failed to execute goal org.apache.maven.plugins:maven-surefire-plugin:2.12-TRUNK-HBASE-2:test (secondPartTestsExecution) on project hbase: There are test failures.

    Please refer to <https://builds.apache.org/job/HBase-TRUNK-security/ws/trunk/target/surefire-reports> for the individual test results.
    at org.apache.maven.lifecycle.internal.MojoExecutor.execute(MojoExecutor.java:213)
    at org.apache.maven.lifecycle.internal.MojoExecutor.execute(MojoExecutor.java:153)
    at org.apache.maven.lifecycle.internal.MojoExecutor.execute(MojoExecutor.java:145)
    at org.apache.maven.lifecycle.internal.MojoExecutor.executeForkedExecutions(MojoExecutor.java:365)
    at org.apache.maven.lifecycle.internal.MojoExecutor.execute(MojoExecutor.java:199)
    at org.apache.maven.lifecycle.internal.MojoExecutor.execute(MojoExecutor.java:153)
    at org.apache.maven.lifecycle.internal.MojoExecutor.execute(MojoExecutor.java:145)
    at org.apache.maven.lifecycle.internal.LifecycleModuleBuilder.buildProject(LifecycleModuleBuilder.java:84)
    at org.apache.maven.lifecycle.internal.LifecycleModuleBuilder.buildProject(LifecycleModuleBuilder.java:59)
    at org.apache.maven.lifecycle.internal.LifecycleStarter.singleThreadedBuild(LifecycleStarter.java:183)
    at org.apache.maven.lifecycle.internal.LifecycleStarter.execute(LifecycleStarter.java:161)
    at org.apache.maven.DefaultMaven.doExecute(DefaultMaven.java:319)
    at org.apache.maven.DefaultMaven.execute(DefaultMaven.java:156)
    at org.apache.maven.cli.MavenCli.execute(MavenCli.java:537)
    at org.apache.maven.cli.MavenCli.doMain(MavenCli.java:196)
    at org.apache.maven.cli.MavenCli.main(MavenCli.java:141)
    at sun.reflect.NativeMethodAccessorImpl.invoke0(Native Method)
    at sun.reflect.NativeMethodAccessorImpl.invoke(NativeMethodAccessorImpl.java:39)
    at sun.reflect.DelegatingMethodAccessorImpl.invoke(DelegatingMethodAccessorImpl.java:25)
    at java.lang.reflect.Method.invoke(Method.java:597)
    at org.codehaus.plexus.classworlds.launcher.Launcher.launchEnhanced(Launcher.java:290)
    at org.codehaus.plexus.classworlds.launcher.Launcher.launch(Launcher.java:230)
    at org.codehaus.plexus.classworlds.launcher.Launcher.mainWithExitCode(Launcher.java:409)
    at org.codehaus.plexus.classworlds.launcher.Launcher.main(Launcher.java:352)
    Caused by: org.apache.maven.plugin.MojoFailureException: There are test failures.

    Please refer to <https://builds.apache.org/job/HBase-TRUNK-security/ws/trunk/target/surefire-reports> for the individual test results.
    at org.apache.maven.plugin.surefire.SurefireHelper.reportExecution(SurefireHelper.java:87)
    at org.apache.maven.plugin.surefire.SurefirePlugin.writeSummary(SurefirePlugin.java:651)
    at org.apache.maven.plugin.surefire.SurefirePlugin.handleSummary(SurefirePlugin.java:625)
    at org.apache.maven.plugin.surefire.AbstractSurefireMojo.executeAfterPreconditionsChecked(AbstractSurefireMojo.java:137)
    at org.apache.maven.plugin.surefire.AbstractSurefireMojo.execute(AbstractSurefireMojo.java:98)
    at org.apache.maven.plugin.DefaultBuildPluginManager.executeMojo(DefaultBuildPluginManager.java:101)
    at org.apache.maven.lifecycle.internal.MojoExecutor.execute(MojoExecutor.java:209)
    ... 23 more
    [ERROR]
    [ERROR] Re-run Maven using the -X switch to enable full debug logging.
    [ERROR]
    [ERROR] For more information about the errors and possible solutions, please read the following articles:
    [ERROR] [Help 1] http://cwiki.apache.org/confluence/display/MAVEN/MojoFailureException
    Build step 'Invoke top-level Maven targets' marked build as failure
    Archiving artifacts
    Updating HBASE-5975
    Updating HBASE-5973
    Recording test results
  • Apache Jenkins Server at May 11, 2012 at 9:00 am
    See <https://builds.apache.org/job/HBase-TRUNK-security/199/>

    ------------------------------------------
    [...truncated 8380 lines...]
    Tests run: 4, Failures: 0, Errors: 0, Skipped: 0, Time elapsed: 31.753 sec
    Running org.apache.hadoop.hbase.coprocessor.TestRegionServerCoprocessorExceptionWithRemove
    Tests run: 1, Failures: 0, Errors: 0, Skipped: 0, Time elapsed: 17.996 sec
    Running org.apache.hadoop.hbase.coprocessor.TestRegionServerCoprocessorExceptionWithAbort
    Tests run: 1, Failures: 0, Errors: 0, Skipped: 0, Time elapsed: 12.968 sec
    Running org.apache.hadoop.hbase.regionserver.wal.TestHLogSplit
    Tests run: 30, Failures: 0, Errors: 0, Skipped: 1, Time elapsed: 246.405 sec
    Running org.apache.hadoop.hbase.coprocessor.TestMasterObserver
    Tests run: 3, Failures: 0, Errors: 0, Skipped: 0, Time elapsed: 27.267 sec
    Running org.apache.hadoop.hbase.coprocessor.TestCoprocessorEndpoint
    Tests run: 3, Failures: 0, Errors: 0, Skipped: 1, Time elapsed: 29.433 sec
    Running org.apache.hadoop.hbase.coprocessor.TestWALObserver
    Tests run: 3, Failures: 0, Errors: 0, Skipped: 0, Time elapsed: 15.645 sec
    Running org.apache.hadoop.hbase.coprocessor.TestMasterCoprocessorExceptionWithAbort
    Tests run: 1, Failures: 0, Errors: 0, Skipped: 0, Time elapsed: 25.284 sec
    Running org.apache.hadoop.hbase.coprocessor.TestRegionObserverInterface
    Tests run: 6, Failures: 0, Errors: 0, Skipped: 0, Time elapsed: 33.28 sec
    Running org.apache.hadoop.hbase.coprocessor.TestMasterCoprocessorExceptionWithRemove
    Tests run: 1, Failures: 0, Errors: 0, Skipped: 0, Time elapsed: 15.512 sec
    Running org.apache.hadoop.hbase.regionserver.wal.TestLogRolling
    Tests run: 3, Failures: 0, Errors: 0, Skipped: 0, Time elapsed: 285.749 sec
    Running org.apache.hadoop.hbase.coprocessor.TestRegionObserverBypass
    Tests run: 2, Failures: 0, Errors: 0, Skipped: 0, Time elapsed: 11.814 sec
    Running org.apache.hadoop.hbase.TestGlobalMemStoreSize
    Tests run: 1, Failures: 0, Errors: 0, Skipped: 0, Time elapsed: 16.813 sec
    Running org.apache.hadoop.hbase.mapred.TestTableInputFormat
    Tests run: 6, Failures: 0, Errors: 0, Skipped: 0, Time elapsed: 22.919 sec
    Running org.apache.hadoop.hbase.mapreduce.TestHLogRecordReader
    Tests run: 2, Failures: 0, Errors: 0, Skipped: 0, Time elapsed: 5.187 sec
    Running org.apache.hadoop.hbase.mapred.TestTableMapReduce
    Tests run: 1, Failures: 0, Errors: 0, Skipped: 0, Time elapsed: 83.144 sec
    Running org.apache.hadoop.hbase.mapreduce.TestLoadIncrementalHFilesSplitRecovery
    Tests run: 4, Failures: 0, Errors: 0, Skipped: 0, Time elapsed: 102.479 sec
    Running org.apache.hadoop.hbase.mapreduce.TestTableMapReduce
    Tests run: 1, Failures: 0, Errors: 0, Skipped: 0, Time elapsed: 111.687 sec
    Running org.apache.hadoop.hbase.mapreduce.TestWALPlayer
    Tests run: 1, Failures: 0, Errors: 0, Skipped: 0, Time elapsed: 46.322 sec
    Running org.apache.hadoop.hbase.mapreduce.TestImportTsv
    Tests run: 9, Failures: 0, Errors: 0, Skipped: 0, Time elapsed: 137.142 sec
    Running org.apache.hadoop.hbase.mapreduce.TestHFileOutputFormat
    Tests run: 9, Failures: 0, Errors: 0, Skipped: 0, Time elapsed: 286.464 sec
    Running org.apache.hadoop.hbase.mapreduce.TestMultithreadedTableMapper
    Tests run: 1, Failures: 0, Errors: 0, Skipped: 0, Time elapsed: 115.557 sec
    Running org.apache.hadoop.hbase.mapreduce.TestTimeRangeMapRed
    Tests run: 1, Failures: 0, Errors: 0, Skipped: 0, Time elapsed: 41.78 sec
    Running org.apache.hadoop.hbase.mapreduce.TestLoadIncrementalHFiles
    Tests run: 6, Failures: 0, Errors: 0, Skipped: 0, Time elapsed: 34.14 sec
    Running org.apache.hadoop.hbase.mapreduce.TestImportExport
    Tests run: 2, Failures: 0, Errors: 0, Skipped: 0, Time elapsed: 48.231 sec
    Running org.apache.hadoop.hbase.thrift2.TestThriftHBaseServiceHandler
    Tests run: 12, Failures: 0, Errors: 0, Skipped: 0, Time elapsed: 14.496 sec
    Running org.apache.hadoop.hbase.catalog.TestMetaReaderEditorNoCluster
    Tests run: 1, Failures: 0, Errors: 0, Skipped: 0, Time elapsed: 4.091 sec
    Running org.apache.hadoop.hbase.catalog.TestMetaReaderEditor
    Tests run: 5, Failures: 0, Errors: 0, Skipped: 0, Time elapsed: 22.503 sec
    Running org.apache.hadoop.hbase.TestAcidGuarantees
    Tests run: 3, Failures: 0, Errors: 0, Skipped: 0, Time elapsed: 100.053 sec
    Running org.apache.hadoop.hbase.catalog.TestCatalogTracker
    Tests run: 9, Failures: 0, Errors: 0, Skipped: 1, Time elapsed: 5.382 sec
    Running org.apache.hadoop.hbase.client.TestFromClientSide3
    Tests run: 1, Failures: 0, Errors: 0, Skipped: 0, Time elapsed: 25.274 sec
    Running org.apache.hadoop.hbase.client.TestTimestampsFilter
    Tests run: 3, Failures: 0, Errors: 0, Skipped: 0, Time elapsed: 21.289 sec
    Running org.apache.hadoop.hbase.catalog.TestCatalogTrackerOnCluster
    Tests run: 1, Failures: 0, Errors: 0, Skipped: 0, Time elapsed: 80.225 sec
    Running org.apache.hadoop.hbase.client.TestShell
    Tests run: 1, Failures: 0, Errors: 0, Skipped: 0, Time elapsed: 102.273 sec
    Running org.apache.hadoop.hbase.client.TestHCM
    Tests run: 7, Failures: 0, Errors: 0, Skipped: 0, Time elapsed: 17.483 sec
    Running org.apache.hadoop.hbase.mapreduce.TestTableInputFormatScan
    Tests run: 12, Failures: 0, Errors: 0, Skipped: 0, Time elapsed: 559.035 sec
    Running org.apache.hadoop.hbase.client.TestScannerTimeout
    Tests run: 4, Failures: 0, Errors: 0, Skipped: 0, Time elapsed: 42.057 sec
    Running org.apache.hadoop.hbase.client.TestFromClientSide
    Tests run: 56, Failures: 0, Errors: 0, Skipped: 3, Time elapsed: 164.27 sec
    Running org.apache.hadoop.hbase.client.TestMetaScanner
    Tests run: 1, Failures: 0, Errors: 0, Skipped: 0, Time elapsed: 13.628 sec
    Running org.apache.hadoop.hbase.client.TestHTableUtil
    Tests run: 2, Failures: 0, Errors: 0, Skipped: 0, Time elapsed: 13.851 sec
    Running org.apache.hadoop.hbase.client.TestMetaMigrationRemovingHTD
    Tests run: 3, Failures: 0, Errors: 0, Skipped: 0, Time elapsed: 22.92 sec
    Running org.apache.hadoop.hbase.client.TestHTablePool$TestHTableReusablePool
    Tests run: 9, Failures: 0, Errors: 0, Skipped: 0, Time elapsed: 5.153 sec
    Running org.apache.hadoop.hbase.client.replication.TestReplicationAdmin
    Tests run: 1, Failures: 0, Errors: 0, Skipped: 0, Time elapsed: 0.863 sec
    Running org.apache.hadoop.hbase.client.TestHTablePool$TestHTableThreadLocalPool
    Tests run: 9, Failures: 0, Errors: 0, Skipped: 0, Time elapsed: 20.966 sec
    Running org.apache.hadoop.hbase.client.TestMultipleTimestamps
    Tests run: 8, Failures: 0, Errors: 0, Skipped: 0, Time elapsed: 33.391 sec
    Running org.apache.hadoop.hbase.metrics.TestMetricsMBeanBase
    Tests run: 2, Failures: 0, Errors: 0, Skipped: 0, Time elapsed: 1.115 sec
    Running org.apache.hadoop.hbase.client.TestMultiParallel
    Tests run: 11, Failures: 0, Errors: 0, Skipped: 0, Time elapsed: 38.357 sec
    Running org.apache.hadoop.hbase.rest.TestGzipFilter
    Tests run: 3, Failures: 0, Errors: 0, Skipped: 0, Time elapsed: 16.673 sec
    Running org.apache.hadoop.hbase.constraint.TestConstraint
    Tests run: 5, Failures: 0, Errors: 0, Skipped: 0, Time elapsed: 34.675 sec
    Running org.apache.hadoop.hbase.rest.TestMultiRowResource
    Tests run: 3, Failures: 0, Errors: 0, Skipped: 0, Time elapsed: 15.48 sec
    Running org.apache.hadoop.hbase.rest.TestScannersWithFilters
    Tests run: 10, Failures: 0, Errors: 0, Skipped: 0, Time elapsed: 18.84 sec
    Running org.apache.hadoop.hbase.rest.TestRowResource
    Tests run: 11, Failures: 0, Errors: 0, Skipped: 0, Time elapsed: 18.503 sec
    Running org.apache.hadoop.hbase.rest.client.TestRemoteAdmin
    Tests run: 1, Failures: 0, Errors: 0, Skipped: 0, Time elapsed: 17.41 sec
    Running org.apache.hadoop.hbase.rest.TestVersionResource
    Tests run: 7, Failures: 0, Errors: 0, Skipped: 0, Time elapsed: 12.831 sec
    Running org.apache.hadoop.hbase.rest.client.TestRemoteTable
    Tests run: 3, Failures: 0, Errors: 0, Skipped: 0, Time elapsed: 16.41 sec
    Running org.apache.hadoop.hbase.rest.TestTableResource
    Tests run: 8, Failures: 0, Errors: 0, Skipped: 0, Time elapsed: 27.969 sec
    Running org.apache.hadoop.hbase.rest.TestScannerResource
    Tests run: 5, Failures: 0, Errors: 0, Skipped: 0, Time elapsed: 33.018 sec
    Running org.apache.hadoop.hbase.rest.TestStatusResource
    Tests run: 2, Failures: 0, Errors: 0, Skipped: 0, Time elapsed: 11.64 sec
    Running org.apache.hadoop.hbase.rest.TestSchemaResource
    Tests run: 2, Failures: 0, Errors: 0, Skipped: 0, Time elapsed: 22.26 sec
    Running org.apache.hadoop.hbase.client.TestAdmin
    Tests run: 39, Failures: 0, Errors: 0, Skipped: 0, Time elapsed: 162.986 sec
    Running org.apache.hadoop.hbase.io.encoding.TestLoadAndSwitchEncodeOnDisk
    Tests run: 1, Failures: 0, Errors: 0, Skipped: 0, Time elapsed: 31.764 sec
    Running org.apache.hadoop.hbase.thrift.TestThriftServer
    Tests run: 1, Failures: 0, Errors: 0, Skipped: 0, Time elapsed: 70.536 sec
    Running org.apache.hadoop.hbase.io.encoding.TestDataBlockEncoders
    Tests run: 12, Failures: 0, Errors: 0, Skipped: 0, Time elapsed: 111.136 sec
    Running org.apache.hadoop.hbase.io.encoding.TestUpgradeFromHFileV1ToEncoding
    Tests run: 1, Failures: 0, Errors: 0, Skipped: 0, Time elapsed: 87.196 sec
    Running org.apache.hadoop.hbase.io.hfile.TestHFileSeek
    Tests run: 1, Failures: 0, Errors: 0, Skipped: 0, Time elapsed: 8.22 sec
    Running org.apache.hadoop.hbase.io.hfile.slab.TestSlabCache
    Tests run: 7, Failures: 0, Errors: 0, Skipped: 0, Time elapsed: 19.252 sec
    Running org.apache.hadoop.hbase.io.encoding.TestChangingEncoding
    Tests run: 4, Failures: 0, Errors: 0, Skipped: 0, Time elapsed: 263.845 sec
    Running org.apache.hadoop.hbase.io.hfile.TestChecksum
    Tests run: 3, Failures: 0, Errors: 0, Skipped: 0, Time elapsed: 1.352 sec
    Running org.apache.hadoop.hbase.io.hfile.TestHFileBlockIndex
    Tests run: 10, Failures: 0, Errors: 0, Skipped: 0, Time elapsed: 10.774 sec
    Running org.apache.hadoop.hbase.io.hfile.TestLruBlockCache
    Tests run: 16, Failures: 0, Errors: 0, Skipped: 0, Time elapsed: 0.761 sec
    Running org.apache.hadoop.hbase.io.hfile.TestHFilePerformance
    Tests run: 1, Failures: 0, Errors: 0, Skipped: 0, Time elapsed: 6.557 sec
    Running org.apache.hadoop.hbase.io.hfile.slab.TestSingleSizeCache
    Tests run: 5, Failures: 0, Errors: 0, Skipped: 0, Time elapsed: 25.617 sec
    Running org.apache.hadoop.hbase.io.hfile.TestFixedFileTrailer
    Tests run: 2, Failures: 0, Errors: 0, Skipped: 0, Time elapsed: 0.493 sec
    Running org.apache.hadoop.hbase.io.hfile.TestHFileBlockCompatibility
    Tests run: 10, Failures: 0, Errors: 0, Skipped: 0, Time elapsed: 1.109 sec
    Running org.apache.hadoop.hbase.io.hfile.TestForceCacheImportantBlocks
    Tests run: 4, Failures: 0, Errors: 0, Skipped: 0, Time elapsed: 50.518 sec
    Running org.apache.hadoop.hbase.io.hfile.TestScannerSelectionUsingTTL
    Tests run: 6, Failures: 0, Errors: 0, Skipped: 0, Time elapsed: 61.179 sec
    Running org.apache.hadoop.hbase.io.hfile.TestHFileBlock
    Tests run: 16, Failures: 0, Errors: 0, Skipped: 0, Time elapsed: 47.919 sec
    Running org.apache.hadoop.hbase.io.hfile.TestCacheOnWrite
    Tests run: 36, Failures: 0, Errors: 0, Skipped: 0, Time elapsed: 44.144 sec
    Running org.apache.hadoop.hbase.TestClusterBootOrder
    Tests run: 2, Failures: 0, Errors: 0, Skipped: 0, Time elapsed: 29.576 sec
    Running org.apache.hadoop.hbase.avro.TestAvroServer
    Tests run: 3, Failures: 0, Errors: 0, Skipped: 0, Time elapsed: 30.05 sec
    Running org.apache.hadoop.hbase.replication.regionserver.TestReplicationSourceManager
    Tests run: 1, Failures: 0, Errors: 0, Skipped: 0, Time elapsed: 0.981 sec
    Running org.apache.hadoop.hbase.thrift.TestThriftServerCmdLine
    Tests run: 20, Failures: 0, Errors: 0, Skipped: 0, Time elapsed: 501.876 sec
    Running org.apache.hadoop.hbase.replication.regionserver.TestReplicationSink
    Tests run: 5, Failures: 0, Errors: 0, Skipped: 0, Time elapsed: 26.722 sec
    Running org.apache.hadoop.hbase.replication.TestReplicationSource
    Tests run: 1, Failures: 0, Errors: 0, Skipped: 0, Time elapsed: 2.578 sec
    Running org.apache.hadoop.hbase.replication.TestReplicationPeer
    Tests run: 1, Failures: 0, Errors: 0, Skipped: 0, Time elapsed: 0.965 sec
    Running org.apache.hadoop.hbase.replication.TestReplicationZookeeper
    Tests run: 1, Failures: 0, Errors: 0, Skipped: 0, Time elapsed: 0.549 sec
    Running org.apache.hadoop.hbase.replication.TestMultiSlaveReplication
    Tests run: 1, Failures: 0, Errors: 0, Skipped: 0, Time elapsed: 68.768 sec
    Running org.apache.hadoop.hbase.ipc.TestDelayedRpc
    Tests run: 4, Failures: 0, Errors: 0, Skipped: 0, Time elapsed: 2.307 sec
    Running org.apache.hadoop.hbase.ipc.TestPBOnWritableRpc
    Tests run: 1, Failures: 0, Errors: 0, Skipped: 0, Time elapsed: 1.22 sec
    Running org.apache.hadoop.hbase.replication.TestMasterReplication
    Tests run: 2, Failures: 0, Errors: 0, Skipped: 0, Time elapsed: 63.445 sec
    Running org.apache.hadoop.hbase.TestZooKeeper
    Tests run: 9, Failures: 0, Errors: 0, Skipped: 0, Time elapsed: 25.806 sec
    Running org.apache.hadoop.hbase.TestHBaseTestingUtility
    Tests run: 7, Failures: 0, Errors: 0, Skipped: 0, Time elapsed: 59.515 sec
    Running org.apache.hadoop.hbase.replication.TestReplication
    Tests run: 10, Failures: 0, Errors: 0, Skipped: 0, Time elapsed: 130.45 sec

    Results :

    Failed tests: testDrainingServerWithAbort(org.apache.hadoop.hbase.TestDrainingServer): expected:<1> but was:<5>

    Tests run: 980, Failures: 1, Errors: 0, Skipped: 9

    [INFO] ------------------------------------------------------------------------
    [INFO] BUILD FAILURE
    [INFO] ------------------------------------------------------------------------
    [INFO] Total time: 48:18.418s
    [INFO] Finished at: Fri May 11 08:58:59 UTC 2012
    [INFO] Final Memory: 55M/477M
    [INFO] ------------------------------------------------------------------------
    [ERROR] Failed to execute goal org.apache.maven.plugins:maven-surefire-plugin:2.12-TRUNK-HBASE-2:test (secondPartTestsExecution) on project hbase: There are test failures.
    [ERROR]
    [ERROR] Please refer to <https://builds.apache.org/job/HBase-TRUNK-security/ws/trunk/target/surefire-reports> for the individual test results.
    [ERROR] -> [Help 1]
    org.apache.maven.lifecycle.LifecycleExecutionException: Failed to execute goal org.apache.maven.plugins:maven-surefire-plugin:2.12-TRUNK-HBASE-2:test (secondPartTestsExecution) on project hbase: There are test failures.

    Please refer to <https://builds.apache.org/job/HBase-TRUNK-security/ws/trunk/target/surefire-reports> for the individual test results.
    at org.apache.maven.lifecycle.internal.MojoExecutor.execute(MojoExecutor.java:213)
    at org.apache.maven.lifecycle.internal.MojoExecutor.execute(MojoExecutor.java:153)
    at org.apache.maven.lifecycle.internal.MojoExecutor.execute(MojoExecutor.java:145)
    at org.apache.maven.lifecycle.internal.MojoExecutor.executeForkedExecutions(MojoExecutor.java:365)
    at org.apache.maven.lifecycle.internal.MojoExecutor.execute(MojoExecutor.java:199)
    at org.apache.maven.lifecycle.internal.MojoExecutor.execute(MojoExecutor.java:153)
    at org.apache.maven.lifecycle.internal.MojoExecutor.execute(MojoExecutor.java:145)
    at org.apache.maven.lifecycle.internal.LifecycleModuleBuilder.buildProject(LifecycleModuleBuilder.java:84)
    at org.apache.maven.lifecycle.internal.LifecycleModuleBuilder.buildProject(LifecycleModuleBuilder.java:59)
    at org.apache.maven.lifecycle.internal.LifecycleStarter.singleThreadedBuild(LifecycleStarter.java:183)
    at org.apache.maven.lifecycle.internal.LifecycleStarter.execute(LifecycleStarter.java:161)
    at org.apache.maven.DefaultMaven.doExecute(DefaultMaven.java:319)
    at org.apache.maven.DefaultMaven.execute(DefaultMaven.java:156)
    at org.apache.maven.cli.MavenCli.execute(MavenCli.java:537)
    at org.apache.maven.cli.MavenCli.doMain(MavenCli.java:196)
    at org.apache.maven.cli.MavenCli.main(MavenCli.java:141)
    at sun.reflect.NativeMethodAccessorImpl.invoke0(Native Method)
    at sun.reflect.NativeMethodAccessorImpl.invoke(NativeMethodAccessorImpl.java:39)
    at sun.reflect.DelegatingMethodAccessorImpl.invoke(DelegatingMethodAccessorImpl.java:25)
    at java.lang.reflect.Method.invoke(Method.java:597)
    at org.codehaus.plexus.classworlds.launcher.Launcher.launchEnhanced(Launcher.java:290)
    at org.codehaus.plexus.classworlds.launcher.Launcher.launch(Launcher.java:230)
    at org.codehaus.plexus.classworlds.launcher.Launcher.mainWithExitCode(Launcher.java:409)
    at org.codehaus.plexus.classworlds.launcher.Launcher.main(Launcher.java:352)
    Caused by: org.apache.maven.plugin.MojoFailureException: There are test failures.

    Please refer to <https://builds.apache.org/job/HBase-TRUNK-security/ws/trunk/target/surefire-reports> for the individual test results.
    at org.apache.maven.plugin.surefire.SurefireHelper.reportExecution(SurefireHelper.java:87)
    at org.apache.maven.plugin.surefire.SurefirePlugin.writeSummary(SurefirePlugin.java:651)
    at org.apache.maven.plugin.surefire.SurefirePlugin.handleSummary(SurefirePlugin.java:625)
    at org.apache.maven.plugin.surefire.AbstractSurefireMojo.executeAfterPreconditionsChecked(AbstractSurefireMojo.java:137)
    at org.apache.maven.plugin.surefire.AbstractSurefireMojo.execute(AbstractSurefireMojo.java:98)
    at org.apache.maven.plugin.DefaultBuildPluginManager.executeMojo(DefaultBuildPluginManager.java:101)
    at org.apache.maven.lifecycle.internal.MojoExecutor.execute(MojoExecutor.java:209)
    ... 23 more
    [ERROR]
    [ERROR] Re-run Maven using the -X switch to enable full debug logging.
    [ERROR]
    [ERROR] For more information about the errors and possible solutions, please read the following articles:
    [ERROR] [Help 1] http://cwiki.apache.org/confluence/display/MAVEN/MojoFailureException
    Build step 'Invoke top-level Maven targets' marked build as failure
    Archiving artifacts
    Recording test results
  • Apache Jenkins Server at May 11, 2012 at 3:47 pm
    See <https://builds.apache.org/job/HBase-TRUNK-security/200/changes>

    Changes:

    [tedyu] HBASE-5985 TestMetaMigrationRemovingHTD failed with HADOOP 2.0.0 (Jimmy Xiang)

    ------------------------------------------
    [...truncated 8363 lines...]
    Tests run: 1, Failures: 0, Errors: 0, Skipped: 0, Time elapsed: 17.625 sec
    Running org.apache.hadoop.hbase.coprocessor.TestRegionServerCoprocessorExceptionWithAbort
    Tests run: 1, Failures: 0, Errors: 0, Skipped: 0, Time elapsed: 14.05 sec
    Running org.apache.hadoop.hbase.regionserver.wal.TestHLogSplit
    Tests run: 30, Failures: 0, Errors: 0, Skipped: 1, Time elapsed: 246.09 sec
    Running org.apache.hadoop.hbase.coprocessor.TestMasterObserver
    Tests run: 3, Failures: 0, Errors: 0, Skipped: 0, Time elapsed: 27.762 sec
    Running org.apache.hadoop.hbase.coprocessor.TestWALObserver
    Tests run: 3, Failures: 0, Errors: 0, Skipped: 0, Time elapsed: 14.422 sec
    Running org.apache.hadoop.hbase.coprocessor.TestCoprocessorEndpoint
    Tests run: 3, Failures: 0, Errors: 0, Skipped: 1, Time elapsed: 29.223 sec
    Running org.apache.hadoop.hbase.coprocessor.TestMasterCoprocessorExceptionWithAbort
    Tests run: 1, Failures: 0, Errors: 0, Skipped: 0, Time elapsed: 25.677 sec
    Running org.apache.hadoop.hbase.coprocessor.TestRegionObserverInterface
    Tests run: 6, Failures: 0, Errors: 0, Skipped: 0, Time elapsed: 30.071 sec
    Running org.apache.hadoop.hbase.coprocessor.TestMasterCoprocessorExceptionWithRemove
    Tests run: 1, Failures: 0, Errors: 0, Skipped: 0, Time elapsed: 14.773 sec
    Running org.apache.hadoop.hbase.coprocessor.TestRegionObserverBypass
    Tests run: 2, Failures: 0, Errors: 0, Skipped: 0, Time elapsed: 13.541 sec
    Running org.apache.hadoop.hbase.mapred.TestTableInputFormat
    Tests run: 6, Failures: 0, Errors: 0, Skipped: 0, Time elapsed: 23.394 sec
    Running org.apache.hadoop.hbase.TestGlobalMemStoreSize
    Tests run: 1, Failures: 0, Errors: 0, Skipped: 0, Time elapsed: 15.327 sec
    Running org.apache.hadoop.hbase.mapred.TestTableMapReduce
    Tests run: 1, Failures: 0, Errors: 0, Skipped: 0, Time elapsed: 83.626 sec
    Running org.apache.hadoop.hbase.mapreduce.TestHLogRecordReader
    Tests run: 2, Failures: 0, Errors: 0, Skipped: 0, Time elapsed: 5.779 sec
    Running org.apache.hadoop.hbase.mapreduce.TestTableMapReduce
    Tests run: 1, Failures: 0, Errors: 0, Skipped: 0, Time elapsed: 109.368 sec
    Running org.apache.hadoop.hbase.mapreduce.TestLoadIncrementalHFilesSplitRecovery
    Tests run: 4, Failures: 0, Errors: 0, Skipped: 0, Time elapsed: 101.119 sec
    Running org.apache.hadoop.hbase.mapreduce.TestWALPlayer
    Tests run: 1, Failures: 0, Errors: 0, Skipped: 0, Time elapsed: 47.16 sec
    Running org.apache.hadoop.hbase.regionserver.wal.TestLogRolling
    Tests run: 3, Failures: 0, Errors: 0, Skipped: 0, Time elapsed: 537.401 sec
    Running org.apache.hadoop.hbase.mapreduce.TestImportTsv
    Tests run: 9, Failures: 0, Errors: 0, Skipped: 0, Time elapsed: 138.856 sec
    Running org.apache.hadoop.hbase.mapreduce.TestHFileOutputFormat
    Tests run: 9, Failures: 0, Errors: 0, Skipped: 0, Time elapsed: 286.659 sec
    Running org.apache.hadoop.hbase.mapreduce.TestTimeRangeMapRed
    Running org.apache.hadoop.hbase.mapreduce.TestMultithreadedTableMapper
    Tests run: 1, Failures: 0, Errors: 0, Skipped: 0, Time elapsed: 44.178 sec
    Tests run: 1, Failures: 0, Errors: 0, Skipped: 0, Time elapsed: 114.269 sec
    Running org.apache.hadoop.hbase.mapreduce.TestLoadIncrementalHFiles
    Tests run: 6, Failures: 0, Errors: 0, Skipped: 0, Time elapsed: 34.487 sec
    Running org.apache.hadoop.hbase.mapreduce.TestImportExport
    Tests run: 2, Failures: 0, Errors: 0, Skipped: 0, Time elapsed: 47.618 sec
    Running org.apache.hadoop.hbase.thrift2.TestThriftHBaseServiceHandler
    Tests run: 12, Failures: 0, Errors: 0, Skipped: 0, Time elapsed: 14.786 sec
    Running org.apache.hadoop.hbase.catalog.TestMetaReaderEditorNoCluster
    Tests run: 1, Failures: 0, Errors: 0, Skipped: 0, Time elapsed: 4.153 sec
    Running org.apache.hadoop.hbase.catalog.TestMetaReaderEditor
    Tests run: 5, Failures: 0, Errors: 0, Skipped: 0, Time elapsed: 23.734 sec
    Running org.apache.hadoop.hbase.TestAcidGuarantees
    Tests run: 3, Failures: 0, Errors: 0, Skipped: 0, Time elapsed: 95.126 sec
    Running org.apache.hadoop.hbase.catalog.TestCatalogTracker
    Tests run: 9, Failures: 0, Errors: 0, Skipped: 1, Time elapsed: 5.371 sec
    Running org.apache.hadoop.hbase.client.TestFromClientSide3
    Tests run: 1, Failures: 0, Errors: 0, Skipped: 0, Time elapsed: 25.104 sec
    Running org.apache.hadoop.hbase.catalog.TestCatalogTrackerOnCluster
    Tests run: 1, Failures: 0, Errors: 0, Skipped: 0, Time elapsed: 76.323 sec
    Running org.apache.hadoop.hbase.client.TestTimestampsFilter
    Tests run: 3, Failures: 0, Errors: 0, Skipped: 0, Time elapsed: 21.646 sec
    Running org.apache.hadoop.hbase.mapreduce.TestTableInputFormatScan
    Tests run: 12, Failures: 0, Errors: 0, Skipped: 0, Time elapsed: 498.374 sec
    Running org.apache.hadoop.hbase.client.TestHCM
    Tests run: 7, Failures: 0, Errors: 0, Skipped: 0, Time elapsed: 17.471 sec
    Running org.apache.hadoop.hbase.client.TestShell
    Tests run: 1, Failures: 0, Errors: 0, Skipped: 0, Time elapsed: 102.09 sec
    Running org.apache.hadoop.hbase.client.TestMetaScanner
    Tests run: 1, Failures: 0, Errors: 0, Skipped: 0, Time elapsed: 14.008 sec
    Running org.apache.hadoop.hbase.client.TestHTableUtil
    Tests run: 2, Failures: 0, Errors: 0, Skipped: 0, Time elapsed: 15.606 sec
    Running org.apache.hadoop.hbase.client.TestScannerTimeout
    Tests run: 4, Failures: 0, Errors: 0, Skipped: 0, Time elapsed: 40.775 sec
    Running org.apache.hadoop.hbase.client.TestHTablePool$TestHTableReusablePool
    Tests run: 9, Failures: 0, Errors: 0, Skipped: 0, Time elapsed: 5.12 sec
    Running org.apache.hadoop.hbase.client.TestMetaMigrationRemovingHTD
    Tests run: 3, Failures: 0, Errors: 0, Skipped: 0, Time elapsed: 24.585 sec
    Running org.apache.hadoop.hbase.client.TestHTablePool$TestHTableThreadLocalPool
    Tests run: 9, Failures: 0, Errors: 0, Skipped: 0, Time elapsed: 24.258 sec
    Running org.apache.hadoop.hbase.client.replication.TestReplicationAdmin
    Tests run: 1, Failures: 0, Errors: 0, Skipped: 0, Time elapsed: 0.795 sec
    Running org.apache.hadoop.hbase.client.TestMultipleTimestamps
    Tests run: 8, Failures: 0, Errors: 0, Skipped: 0, Time elapsed: 28.22 sec
    Running org.apache.hadoop.hbase.client.TestFromClientSide
    Tests run: 56, Failures: 0, Errors: 0, Skipped: 3, Time elapsed: 174.779 sec
    Running org.apache.hadoop.hbase.metrics.TestMetricsMBeanBase
    Tests run: 2, Failures: 0, Errors: 0, Skipped: 0, Time elapsed: 1.127 sec
    Running org.apache.hadoop.hbase.client.TestMultiParallel
    Tests run: 11, Failures: 0, Errors: 0, Skipped: 0, Time elapsed: 33.247 sec
    Running org.apache.hadoop.hbase.rest.TestGzipFilter
    Tests run: 3, Failures: 0, Errors: 0, Skipped: 0, Time elapsed: 13.968 sec
    Running org.apache.hadoop.hbase.constraint.TestConstraint
    Tests run: 5, Failures: 0, Errors: 0, Skipped: 0, Time elapsed: 30.253 sec
    Running org.apache.hadoop.hbase.rest.TestMultiRowResource
    Tests run: 3, Failures: 0, Errors: 0, Skipped: 0, Time elapsed: 13.228 sec
    Running org.apache.hadoop.hbase.rest.TestScannersWithFilters
    Tests run: 10, Failures: 0, Errors: 0, Skipped: 0, Time elapsed: 17.008 sec
    Running org.apache.hadoop.hbase.rest.TestRowResource
    Tests run: 11, Failures: 0, Errors: 0, Skipped: 0, Time elapsed: 16.382 sec
    Running org.apache.hadoop.hbase.rest.client.TestRemoteAdmin
    Tests run: 1, Failures: 0, Errors: 0, Skipped: 0, Time elapsed: 15.71 sec
    Running org.apache.hadoop.hbase.rest.client.TestRemoteTable
    Tests run: 3, Failures: 0, Errors: 0, Skipped: 0, Time elapsed: 14.216 sec
    Running org.apache.hadoop.hbase.rest.TestVersionResource
    Tests run: 7, Failures: 0, Errors: 0, Skipped: 0, Time elapsed: 12.634 sec
    Running org.apache.hadoop.hbase.rest.TestScannerResource
    Tests run: 5, Failures: 0, Errors: 0, Skipped: 0, Time elapsed: 29.3 sec
    Running org.apache.hadoop.hbase.rest.TestTableResource
    Tests run: 8, Failures: 0, Errors: 0, Skipped: 0, Time elapsed: 22.287 sec
    Running org.apache.hadoop.hbase.rest.TestStatusResource
    Tests run: 2, Failures: 0, Errors: 0, Skipped: 0, Time elapsed: 11.485 sec
    Running org.apache.hadoop.hbase.rest.TestSchemaResource
    Tests run: 2, Failures: 0, Errors: 0, Skipped: 0, Time elapsed: 18.726 sec
    Running org.apache.hadoop.hbase.client.TestAdmin
    Tests run: 39, Failures: 0, Errors: 0, Skipped: 0, Time elapsed: 152.445 sec
    Running org.apache.hadoop.hbase.io.encoding.TestLoadAndSwitchEncodeOnDisk
    Tests run: 1, Failures: 0, Errors: 0, Skipped: 0, Time elapsed: 28.462 sec
    Running org.apache.hadoop.hbase.thrift.TestThriftServer
    Tests run: 1, Failures: 0, Errors: 0, Skipped: 0, Time elapsed: 64.173 sec
    Running org.apache.hadoop.hbase.io.encoding.TestDataBlockEncoders
    Tests run: 12, Failures: 0, Errors: 0, Skipped: 0, Time elapsed: 110.826 sec
    Running org.apache.hadoop.hbase.io.encoding.TestUpgradeFromHFileV1ToEncoding
    Tests run: 1, Failures: 0, Errors: 0, Skipped: 0, Time elapsed: 82.94 sec
    Running org.apache.hadoop.hbase.io.hfile.TestHFileSeek
    Tests run: 1, Failures: 0, Errors: 0, Skipped: 0, Time elapsed: 7.816 sec
    Running org.apache.hadoop.hbase.io.hfile.slab.TestSlabCache
    Tests run: 7, Failures: 0, Errors: 0, Skipped: 0, Time elapsed: 19.135 sec
    Running org.apache.hadoop.hbase.io.encoding.TestChangingEncoding
    Tests run: 4, Failures: 0, Errors: 0, Skipped: 0, Time elapsed: 242.246 sec
    Running org.apache.hadoop.hbase.io.hfile.TestChecksum
    Tests run: 3, Failures: 0, Errors: 0, Skipped: 0, Time elapsed: 0.819 sec
    Running org.apache.hadoop.hbase.io.hfile.TestHFileBlockIndex
    Tests run: 10, Failures: 0, Errors: 0, Skipped: 0, Time elapsed: 10.077 sec
    Running org.apache.hadoop.hbase.io.hfile.slab.TestSingleSizeCache
    Tests run: 5, Failures: 0, Errors: 0, Skipped: 0, Time elapsed: 25.497 sec
    Running org.apache.hadoop.hbase.io.hfile.TestLruBlockCache
    Tests run: 16, Failures: 0, Errors: 0, Skipped: 0, Time elapsed: 0.737 sec
    Running org.apache.hadoop.hbase.io.hfile.TestFixedFileTrailer
    Tests run: 2, Failures: 0, Errors: 0, Skipped: 0, Time elapsed: 0.498 sec
    Running org.apache.hadoop.hbase.io.hfile.TestHFileBlockCompatibility
    Tests run: 10, Failures: 0, Errors: 0, Skipped: 0, Time elapsed: 1.106 sec
    Running org.apache.hadoop.hbase.io.hfile.TestHFilePerformance
    Tests run: 1, Failures: 0, Errors: 0, Skipped: 0, Time elapsed: 6.427 sec
    Running org.apache.hadoop.hbase.io.hfile.TestForceCacheImportantBlocks
    Tests run: 4, Failures: 0, Errors: 0, Skipped: 0, Time elapsed: 50.52 sec
    Running org.apache.hadoop.hbase.io.hfile.TestScannerSelectionUsingTTL
    Tests run: 6, Failures: 0, Errors: 0, Skipped: 0, Time elapsed: 61.206 sec
    Running org.apache.hadoop.hbase.io.hfile.TestHFileBlock
    Tests run: 16, Failures: 0, Errors: 0, Skipped: 0, Time elapsed: 47.785 sec
    Running org.apache.hadoop.hbase.io.hfile.TestCacheOnWrite
    Tests run: 36, Failures: 0, Errors: 0, Skipped: 0, Time elapsed: 42.873 sec
    Running org.apache.hadoop.hbase.TestClusterBootOrder
    Tests run: 2, Failures: 0, Errors: 0, Skipped: 0, Time elapsed: 28.186 sec
    Running org.apache.hadoop.hbase.avro.TestAvroServer
    Tests run: 3, Failures: 0, Errors: 0, Skipped: 0, Time elapsed: 27.747 sec
    Running org.apache.hadoop.hbase.replication.regionserver.TestReplicationSourceManager
    Tests run: 1, Failures: 0, Errors: 0, Skipped: 0, Time elapsed: 0.947 sec
    Running org.apache.hadoop.hbase.thrift.TestThriftServerCmdLine
    Tests run: 20, Failures: 0, Errors: 0, Skipped: 0, Time elapsed: 468.064 sec
    Running org.apache.hadoop.hbase.replication.regionserver.TestReplicationSink
    Tests run: 5, Failures: 0, Errors: 0, Skipped: 0, Time elapsed: 29.703 sec
    Running org.apache.hadoop.hbase.replication.TestReplicationSource
    Tests run: 1, Failures: 0, Errors: 0, Skipped: 0, Time elapsed: 2.565 sec
    Running org.apache.hadoop.hbase.replication.TestReplicationPeer
    Tests run: 1, Failures: 0, Errors: 0, Skipped: 0, Time elapsed: 1.73 sec
    Running org.apache.hadoop.hbase.replication.TestReplicationZookeeper
    Tests run: 1, Failures: 0, Errors: 0, Skipped: 0, Time elapsed: 0.561 sec
    Running org.apache.hadoop.hbase.replication.TestMultiSlaveReplication
    Tests run: 1, Failures: 0, Errors: 0, Skipped: 0, Time elapsed: 66.349 sec
    Running org.apache.hadoop.hbase.replication.TestMasterReplication
    Tests run: 2, Failures: 0, Errors: 0, Skipped: 0, Time elapsed: 61.246 sec
    Running org.apache.hadoop.hbase.ipc.TestDelayedRpc
    Tests run: 4, Failures: 0, Errors: 0, Skipped: 0, Time elapsed: 2.336 sec
    Running org.apache.hadoop.hbase.ipc.TestPBOnWritableRpc
    Tests run: 1, Failures: 0, Errors: 0, Skipped: 0, Time elapsed: 1.16 sec
    Running org.apache.hadoop.hbase.TestZooKeeper
    Tests run: 9, Failures: 0, Errors: 0, Skipped: 0, Time elapsed: 24.378 sec
    Running org.apache.hadoop.hbase.TestHBaseTestingUtility
    Tests run: 7, Failures: 0, Errors: 0, Skipped: 0, Time elapsed: 57.328 sec
    Running org.apache.hadoop.hbase.replication.TestReplication
    Tests run: 10, Failures: 0, Errors: 0, Skipped: 0, Time elapsed: 139.119 sec

    Results :

    Failed tests: testDrainingServerWithAbort(org.apache.hadoop.hbase.TestDrainingServer): expected:<1> but was:<5>
    testHBase3810(org.apache.hadoop.hbase.coprocessor.TestClassLoading): Class TestCP1 was missing on a region

    Tests run: 980, Failures: 2, Errors: 0, Skipped: 9

    [INFO] ------------------------------------------------------------------------
    [INFO] BUILD FAILURE
    [INFO] ------------------------------------------------------------------------
    [INFO] Total time: 49:16.518s
    [INFO] Finished at: Fri May 11 15:46:18 UTC 2012
    [INFO] Final Memory: 48M/536M
    [INFO] ------------------------------------------------------------------------
    [ERROR] Failed to execute goal org.apache.maven.plugins:maven-surefire-plugin:2.12-TRUNK-HBASE-2:test (secondPartTestsExecution) on project hbase: There are test failures.
    [ERROR]
    [ERROR] Please refer to <https://builds.apache.org/job/HBase-TRUNK-security/ws/trunk/target/surefire-reports> for the individual test results.
    [ERROR] -> [Help 1]
    org.apache.maven.lifecycle.LifecycleExecutionException: Failed to execute goal org.apache.maven.plugins:maven-surefire-plugin:2.12-TRUNK-HBASE-2:test (secondPartTestsExecution) on project hbase: There are test failures.

    Please refer to <https://builds.apache.org/job/HBase-TRUNK-security/ws/trunk/target/surefire-reports> for the individual test results.
    at org.apache.maven.lifecycle.internal.MojoExecutor.execute(MojoExecutor.java:213)
    at org.apache.maven.lifecycle.internal.MojoExecutor.execute(MojoExecutor.java:153)
    at org.apache.maven.lifecycle.internal.MojoExecutor.execute(MojoExecutor.java:145)
    at org.apache.maven.lifecycle.internal.MojoExecutor.executeForkedExecutions(MojoExecutor.java:365)
    at org.apache.maven.lifecycle.internal.MojoExecutor.execute(MojoExecutor.java:199)
    at org.apache.maven.lifecycle.internal.MojoExecutor.execute(MojoExecutor.java:153)
    at org.apache.maven.lifecycle.internal.MojoExecutor.execute(MojoExecutor.java:145)
    at org.apache.maven.lifecycle.internal.LifecycleModuleBuilder.buildProject(LifecycleModuleBuilder.java:84)
    at org.apache.maven.lifecycle.internal.LifecycleModuleBuilder.buildProject(LifecycleModuleBuilder.java:59)
    at org.apache.maven.lifecycle.internal.LifecycleStarter.singleThreadedBuild(LifecycleStarter.java:183)
    at org.apache.maven.lifecycle.internal.LifecycleStarter.execute(LifecycleStarter.java:161)
    at org.apache.maven.DefaultMaven.doExecute(DefaultMaven.java:319)
    at org.apache.maven.DefaultMaven.execute(DefaultMaven.java:156)
    at org.apache.maven.cli.MavenCli.execute(MavenCli.java:537)
    at org.apache.maven.cli.MavenCli.doMain(MavenCli.java:196)
    at org.apache.maven.cli.MavenCli.main(MavenCli.java:141)
    at sun.reflect.NativeMethodAccessorImpl.invoke0(Native Method)
    at sun.reflect.NativeMethodAccessorImpl.invoke(NativeMethodAccessorImpl.java:39)
    at sun.reflect.DelegatingMethodAccessorImpl.invoke(DelegatingMethodAccessorImpl.java:25)
    at java.lang.reflect.Method.invoke(Method.java:597)
    at org.codehaus.plexus.classworlds.launcher.Launcher.launchEnhanced(Launcher.java:290)
    at org.codehaus.plexus.classworlds.launcher.Launcher.launch(Launcher.java:230)
    at org.codehaus.plexus.classworlds.launcher.Launcher.mainWithExitCode(Launcher.java:409)
    at org.codehaus.plexus.classworlds.launcher.Launcher.main(Launcher.java:352)
    Caused by: org.apache.maven.plugin.MojoFailureException: There are test failures.

    Please refer to <https://builds.apache.org/job/HBase-TRUNK-security/ws/trunk/target/surefire-reports> for the individual test results.
    at org.apache.maven.plugin.surefire.SurefireHelper.reportExecution(SurefireHelper.java:87)
    at org.apache.maven.plugin.surefire.SurefirePlugin.writeSummary(SurefirePlugin.java:651)
    at org.apache.maven.plugin.surefire.SurefirePlugin.handleSummary(SurefirePlugin.java:625)
    at org.apache.maven.plugin.surefire.AbstractSurefireMojo.executeAfterPreconditionsChecked(AbstractSurefireMojo.java:137)
    at org.apache.maven.plugin.surefire.AbstractSurefireMojo.execute(AbstractSurefireMojo.java:98)
    at org.apache.maven.plugin.DefaultBuildPluginManager.executeMojo(DefaultBuildPluginManager.java:101)
    at org.apache.maven.lifecycle.internal.MojoExecutor.execute(MojoExecutor.java:209)
    ... 23 more
    [ERROR]
    [ERROR] Re-run Maven using the -X switch to enable full debug logging.
    [ERROR]
    [ERROR] For more information about the errors and possible solutions, please read the following articles:
    [ERROR] [Help 1] http://cwiki.apache.org/confluence/display/MAVEN/MojoFailureException
    Build step 'Invoke top-level Maven targets' marked build as failure
    Archiving artifacts
    Updating HBASE-5985
    Recording test results

Related Discussions

Discussion Navigation
viewthread | post
Discussion Overview
groupdev @
categorieshbase, hadoop
postedMay 9, '12 at 5:55a
activeMay 11, '12 at 3:47p
posts5
users1
websitehbase.apache.org

1 user in discussion

Apache Jenkins Server: 5 posts

People

Translate

site design / logo © 2022 Grokbase