FAQ
See <https://builds.apache.org/job/HBase-0.92/304/changes>

Changes:

[stack] HBASE-5351 hbase completebulkload to a new table fails in a race

------------------------------------------
[...truncated 6706 lines...]
Forking command line: /bin/sh -c cd <https://builds.apache.org/job/HBase-0.92/ws/trunk> && /home/jenkins/tools/java/jdk1.6.0_27-32/jre/bin/java -enableassertions -Xmx1400m -Djava.security.egd=file:/dev/./urandom -jar <https://builds.apache.org/job/HBase-0.92/ws/trunk/target/surefire/surefirebooter4453073120552854923.jar> <https://builds.apache.org/job/HBase-0.92/ws/trunk/target/surefire/surefire3108479066743977612tmp> <https://builds.apache.org/job/HBase-0.92/ws/trunk/target/surefire/surefire5431871749844057224tmp>
Running org.apache.hadoop.hbase.client.TestScan
Tests run: 2, Failures: 0, Errors: 0, Skipped: 0, Time elapsed: 0.14 sec
Forking command line: /bin/sh -c cd <https://builds.apache.org/job/HBase-0.92/ws/trunk> && /home/jenkins/tools/java/jdk1.6.0_27-32/jre/bin/java -enableassertions -Xmx1400m -Djava.security.egd=file:/dev/./urandom -jar <https://builds.apache.org/job/HBase-0.92/ws/trunk/target/surefire/surefirebooter5517335216917319702.jar> <https://builds.apache.org/job/HBase-0.92/ws/trunk/target/surefire/surefire794910370836072186tmp> <https://builds.apache.org/job/HBase-0.92/ws/trunk/target/surefire/surefire7268721239722221036tmp>
Running org.apache.hadoop.hbase.TestHServerInfo
Tests run: 6, Failures: 0, Errors: 0, Skipped: 0, Time elapsed: 0.148 sec
Forking command line: /bin/sh -c cd <https://builds.apache.org/job/HBase-0.92/ws/trunk> && /home/jenkins/tools/java/jdk1.6.0_27-32/jre/bin/java -enableassertions -Xmx1400m -Djava.security.egd=file:/dev/./urandom -jar <https://builds.apache.org/job/HBase-0.92/ws/trunk/target/surefire/surefirebooter1960677456247810939.jar> <https://builds.apache.org/job/HBase-0.92/ws/trunk/target/surefire/surefire4072241769407399043tmp> <https://builds.apache.org/job/HBase-0.92/ws/trunk/target/surefire/surefire6915720176534030966tmp>
Running org.apache.hadoop.hbase.metrics.TestMetricsMBeanBase
Tests run: 2, Failures: 0, Errors: 0, Skipped: 0, Time elapsed: 1.154 sec
Forking command line: /bin/sh -c cd <https://builds.apache.org/job/HBase-0.92/ws/trunk> && /home/jenkins/tools/java/jdk1.6.0_27-32/jre/bin/java -enableassertions -Xmx1400m -Djava.security.egd=file:/dev/./urandom -jar <https://builds.apache.org/job/HBase-0.92/ws/trunk/target/surefire/surefirebooter6268877935100874542.jar> <https://builds.apache.org/job/HBase-0.92/ws/trunk/target/surefire/surefire1642776451314328301tmp> <https://builds.apache.org/job/HBase-0.92/ws/trunk/target/surefire/surefire2159193092943923881tmp>
Running org.apache.hadoop.hbase.executor.TestExecutorService
Tests run: 1, Failures: 0, Errors: 0, Skipped: 0, Time elapsed: 2.441 sec
Forking command line: /bin/sh -c cd <https://builds.apache.org/job/HBase-0.92/ws/trunk> && /home/jenkins/tools/java/jdk1.6.0_27-32/jre/bin/java -enableassertions -Xmx1400m -Djava.security.egd=file:/dev/./urandom -jar <https://builds.apache.org/job/HBase-0.92/ws/trunk/target/surefire/surefirebooter5211721989612814098.jar> <https://builds.apache.org/job/HBase-0.92/ws/trunk/target/surefire/surefire7538576621459758507tmp> <https://builds.apache.org/job/HBase-0.92/ws/trunk/target/surefire/surefire2394417181130854764tmp>
Running org.apache.hadoop.hbase.rest.TestGzipFilter
Tests run: 3, Failures: 0, Errors: 0, Skipped: 0, Time elapsed: 21.642 sec
Forking command line: /bin/sh -c cd <https://builds.apache.org/job/HBase-0.92/ws/trunk> && /home/jenkins/tools/java/jdk1.6.0_27-32/jre/bin/java -enableassertions -Xmx1400m -Djava.security.egd=file:/dev/./urandom -jar <https://builds.apache.org/job/HBase-0.92/ws/trunk/target/surefire/surefirebooter9029610757134599499.jar> <https://builds.apache.org/job/HBase-0.92/ws/trunk/target/surefire/surefire8169590157733176172tmp> <https://builds.apache.org/job/HBase-0.92/ws/trunk/target/surefire/surefire1045910191779562505tmp>
Running org.apache.hadoop.hbase.rest.TestMultiRowResource
Tests run: 3, Failures: 0, Errors: 0, Skipped: 0, Time elapsed: 21.368 sec
Forking command line: /bin/sh -c cd <https://builds.apache.org/job/HBase-0.92/ws/trunk> && /home/jenkins/tools/java/jdk1.6.0_27-32/jre/bin/java -enableassertions -Xmx1400m -Djava.security.egd=file:/dev/./urandom -jar <https://builds.apache.org/job/HBase-0.92/ws/trunk/target/surefire/surefirebooter447817936699116189.jar> <https://builds.apache.org/job/HBase-0.92/ws/trunk/target/surefire/surefire8562566659320758145tmp> <https://builds.apache.org/job/HBase-0.92/ws/trunk/target/surefire/surefire3754474568545447565tmp>
Running org.apache.hadoop.hbase.rest.TestScannersWithFilters
Tests run: 10, Failures: 0, Errors: 0, Skipped: 0, Time elapsed: 22.667 sec
Forking command line: /bin/sh -c cd <https://builds.apache.org/job/HBase-0.92/ws/trunk> && /home/jenkins/tools/java/jdk1.6.0_27-32/jre/bin/java -enableassertions -Xmx1400m -Djava.security.egd=file:/dev/./urandom -jar <https://builds.apache.org/job/HBase-0.92/ws/trunk/target/surefire/surefirebooter3126352618611700514.jar> <https://builds.apache.org/job/HBase-0.92/ws/trunk/target/surefire/surefire6943916130495159249tmp> <https://builds.apache.org/job/HBase-0.92/ws/trunk/target/surefire/surefire4820391532249285089tmp>
Running org.apache.hadoop.hbase.rest.TestRowResource
Tests run: 11, Failures: 0, Errors: 0, Skipped: 0, Time elapsed: 23.2 sec
Forking command line: /bin/sh -c cd <https://builds.apache.org/job/HBase-0.92/ws/trunk> && /home/jenkins/tools/java/jdk1.6.0_27-32/jre/bin/java -enableassertions -Xmx1400m -Djava.security.egd=file:/dev/./urandom -jar <https://builds.apache.org/job/HBase-0.92/ws/trunk/target/surefire/surefirebooter3091323660255290523.jar> <https://builds.apache.org/job/HBase-0.92/ws/trunk/target/surefire/surefire7951408996139625896tmp> <https://builds.apache.org/job/HBase-0.92/ws/trunk/target/surefire/surefire6097318476650252199tmp>
Running org.apache.hadoop.hbase.rest.model.TestCellModel
Tests run: 3, Failures: 0, Errors: 0, Skipped: 0, Time elapsed: 0.372 sec
Forking command line: /bin/sh -c cd <https://builds.apache.org/job/HBase-0.92/ws/trunk> && /home/jenkins/tools/java/jdk1.6.0_27-32/jre/bin/java -enableassertions -Xmx1400m -Djava.security.egd=file:/dev/./urandom -jar <https://builds.apache.org/job/HBase-0.92/ws/trunk/target/surefire/surefirebooter2475632853253333891.jar> <https://builds.apache.org/job/HBase-0.92/ws/trunk/target/surefire/surefire7749092138310416716tmp> <https://builds.apache.org/job/HBase-0.92/ws/trunk/target/surefire/surefire7986994551052851600tmp>
Running org.apache.hadoop.hbase.rest.model.TestCellSetModel
Tests run: 3, Failures: 0, Errors: 0, Skipped: 0, Time elapsed: 0.411 sec
Forking command line: /bin/sh -c cd <https://builds.apache.org/job/HBase-0.92/ws/trunk> && /home/jenkins/tools/java/jdk1.6.0_27-32/jre/bin/java -enableassertions -Xmx1400m -Djava.security.egd=file:/dev/./urandom -jar <https://builds.apache.org/job/HBase-0.92/ws/trunk/target/surefire/surefirebooter950137026413659995.jar> <https://builds.apache.org/job/HBase-0.92/ws/trunk/target/surefire/surefire8019116374017643302tmp> <https://builds.apache.org/job/HBase-0.92/ws/trunk/target/surefire/surefire8132297716805707549tmp>
Running org.apache.hadoop.hbase.rest.model.TestTableListModel
Tests run: 3, Failures: 0, Errors: 0, Skipped: 0, Time elapsed: 0.387 sec
Forking command line: /bin/sh -c cd <https://builds.apache.org/job/HBase-0.92/ws/trunk> && /home/jenkins/tools/java/jdk1.6.0_27-32/jre/bin/java -enableassertions -Xmx1400m -Djava.security.egd=file:/dev/./urandom -jar <https://builds.apache.org/job/HBase-0.92/ws/trunk/target/surefire/surefirebooter1431914037119605876.jar> <https://builds.apache.org/job/HBase-0.92/ws/trunk/target/surefire/surefire4428452732555487760tmp> <https://builds.apache.org/job/HBase-0.92/ws/trunk/target/surefire/surefire5168888144969048847tmp>
Running org.apache.hadoop.hbase.rest.model.TestVersionModel
Tests run: 3, Failures: 0, Errors: 0, Skipped: 0, Time elapsed: 0.371 sec
Forking command line: /bin/sh -c cd <https://builds.apache.org/job/HBase-0.92/ws/trunk> && /home/jenkins/tools/java/jdk1.6.0_27-32/jre/bin/java -enableassertions -Xmx1400m -Djava.security.egd=file:/dev/./urandom -jar <https://builds.apache.org/job/HBase-0.92/ws/trunk/target/surefire/surefirebooter7810615807215974557.jar> <https://builds.apache.org/job/HBase-0.92/ws/trunk/target/surefire/surefire3527766617226060631tmp> <https://builds.apache.org/job/HBase-0.92/ws/trunk/target/surefire/surefire5473941024809327270tmp>
Running org.apache.hadoop.hbase.rest.model.TestColumnSchemaModel
Tests run: 2, Failures: 0, Errors: 0, Skipped: 0, Time elapsed: 0.277 sec
Forking command line: /bin/sh -c cd <https://builds.apache.org/job/HBase-0.92/ws/trunk> && /home/jenkins/tools/java/jdk1.6.0_27-32/jre/bin/java -enableassertions -Xmx1400m -Djava.security.egd=file:/dev/./urandom -jar <https://builds.apache.org/job/HBase-0.92/ws/trunk/target/surefire/surefirebooter8681049123365544906.jar> <https://builds.apache.org/job/HBase-0.92/ws/trunk/target/surefire/surefire1736690141397365152tmp> <https://builds.apache.org/job/HBase-0.92/ws/trunk/target/surefire/surefire9042751391939106783tmp>
Running org.apache.hadoop.hbase.rest.model.TestTableInfoModel
Tests run: 3, Failures: 0, Errors: 0, Skipped: 0, Time elapsed: 0.402 sec
Forking command line: /bin/sh -c cd <https://builds.apache.org/job/HBase-0.92/ws/trunk> && /home/jenkins/tools/java/jdk1.6.0_27-32/jre/bin/java -enableassertions -Xmx1400m -Djava.security.egd=file:/dev/./urandom -jar <https://builds.apache.org/job/HBase-0.92/ws/trunk/target/surefire/surefirebooter1452695327361401847.jar> <https://builds.apache.org/job/HBase-0.92/ws/trunk/target/surefire/surefire4075358157038308856tmp> <https://builds.apache.org/job/HBase-0.92/ws/trunk/target/surefire/surefire9216553382587668374tmp>
Running org.apache.hadoop.hbase.rest.model.TestRowModel
Tests run: 2, Failures: 0, Errors: 0, Skipped: 0, Time elapsed: 0.371 sec
Forking command line: /bin/sh -c cd <https://builds.apache.org/job/HBase-0.92/ws/trunk> && /home/jenkins/tools/java/jdk1.6.0_27-32/jre/bin/java -enableassertions -Xmx1400m -Djava.security.egd=file:/dev/./urandom -jar <https://builds.apache.org/job/HBase-0.92/ws/trunk/target/surefire/surefirebooter6975211466004253087.jar> <https://builds.apache.org/job/HBase-0.92/ws/trunk/target/surefire/surefire5221159560377378240tmp> <https://builds.apache.org/job/HBase-0.92/ws/trunk/target/surefire/surefire181177901104894934tmp>
Running org.apache.hadoop.hbase.rest.model.TestTableSchemaModel
Tests run: 3, Failures: 0, Errors: 0, Skipped: 0, Time elapsed: 0.407 sec
Forking command line: /bin/sh -c cd <https://builds.apache.org/job/HBase-0.92/ws/trunk> && /home/jenkins/tools/java/jdk1.6.0_27-32/jre/bin/java -enableassertions -Xmx1400m -Djava.security.egd=file:/dev/./urandom -jar <https://builds.apache.org/job/HBase-0.92/ws/trunk/target/surefire/surefirebooter8651107506106294037.jar> <https://builds.apache.org/job/HBase-0.92/ws/trunk/target/surefire/surefire2458927799802322878tmp> <https://builds.apache.org/job/HBase-0.92/ws/trunk/target/surefire/surefire6077064623871429961tmp>
Running org.apache.hadoop.hbase.rest.model.TestStorageClusterVersionModel
Tests run: 2, Failures: 0, Errors: 0, Skipped: 0, Time elapsed: 0.273 sec
Forking command line: /bin/sh -c cd <https://builds.apache.org/job/HBase-0.92/ws/trunk> && /home/jenkins/tools/java/jdk1.6.0_27-32/jre/bin/java -enableassertions -Xmx1400m -Djava.security.egd=file:/dev/./urandom -jar <https://builds.apache.org/job/HBase-0.92/ws/trunk/target/surefire/surefirebooter6591030010397481223.jar> <https://builds.apache.org/job/HBase-0.92/ws/trunk/target/surefire/surefire345124235416872602tmp> <https://builds.apache.org/job/HBase-0.92/ws/trunk/target/surefire/surefire681792091640731641tmp>
Running org.apache.hadoop.hbase.rest.model.TestTableRegionModel
Tests run: 4, Failures: 0, Errors: 0, Skipped: 0, Time elapsed: 0.463 sec
Forking command line: /bin/sh -c cd <https://builds.apache.org/job/HBase-0.92/ws/trunk> && /home/jenkins/tools/java/jdk1.6.0_27-32/jre/bin/java -enableassertions -Xmx1400m -Djava.security.egd=file:/dev/./urandom -jar <https://builds.apache.org/job/HBase-0.92/ws/trunk/target/surefire/surefirebooter1229606784507880475.jar> <https://builds.apache.org/job/HBase-0.92/ws/trunk/target/surefire/surefire1048291133398523239tmp> <https://builds.apache.org/job/HBase-0.92/ws/trunk/target/surefire/surefire1109692340444423548tmp>
Running org.apache.hadoop.hbase.rest.model.TestStorageClusterStatusModel
Tests run: 3, Failures: 0, Errors: 0, Skipped: 0, Time elapsed: 0.453 sec
Forking command line: /bin/sh -c cd <https://builds.apache.org/job/HBase-0.92/ws/trunk> && /home/jenkins/tools/java/jdk1.6.0_27-32/jre/bin/java -enableassertions -Xmx1400m -Djava.security.egd=file:/dev/./urandom -jar <https://builds.apache.org/job/HBase-0.92/ws/trunk/target/surefire/surefirebooter4921517609021224530.jar> <https://builds.apache.org/job/HBase-0.92/ws/trunk/target/surefire/surefire4580173803478445015tmp> <https://builds.apache.org/job/HBase-0.92/ws/trunk/target/surefire/surefire4028199304068656935tmp>
Running org.apache.hadoop.hbase.rest.model.TestScannerModel
Tests run: 3, Failures: 0, Errors: 0, Skipped: 0, Time elapsed: 0.407 sec
Forking command line: /bin/sh -c cd <https://builds.apache.org/job/HBase-0.92/ws/trunk> && /home/jenkins/tools/java/jdk1.6.0_27-32/jre/bin/java -enableassertions -Xmx1400m -Djava.security.egd=file:/dev/./urandom -jar <https://builds.apache.org/job/HBase-0.92/ws/trunk/target/surefire/surefirebooter1939038123702563088.jar> <https://builds.apache.org/job/HBase-0.92/ws/trunk/target/surefire/surefire3393115411926692700tmp> <https://builds.apache.org/job/HBase-0.92/ws/trunk/target/surefire/surefire5994653564392091966tmp>
Running org.apache.hadoop.hbase.rest.client.TestRemoteAdmin
Tests run: 1, Failures: 0, Errors: 0, Skipped: 0, Time elapsed: 22.21 sec
Forking command line: /bin/sh -c cd <https://builds.apache.org/job/HBase-0.92/ws/trunk> && /home/jenkins/tools/java/jdk1.6.0_27-32/jre/bin/java -enableassertions -Xmx1400m -Djava.security.egd=file:/dev/./urandom -jar <https://builds.apache.org/job/HBase-0.92/ws/trunk/target/surefire/surefirebooter5944787152384531727.jar> <https://builds.apache.org/job/HBase-0.92/ws/trunk/target/surefire/surefire2920888284927317176tmp> <https://builds.apache.org/job/HBase-0.92/ws/trunk/target/surefire/surefire4525657439701282238tmp>
Running org.apache.hadoop.hbase.rest.client.TestRemoteTable
Tests run: 3, Failures: 0, Errors: 0, Skipped: 0, Time elapsed: 20.072 sec
Forking command line: /bin/sh -c cd <https://builds.apache.org/job/HBase-0.92/ws/trunk> && /home/jenkins/tools/java/jdk1.6.0_27-32/jre/bin/java -enableassertions -Xmx1400m -Djava.security.egd=file:/dev/./urandom -jar <https://builds.apache.org/job/HBase-0.92/ws/trunk/target/surefire/surefirebooter1806312241472636920.jar> <https://builds.apache.org/job/HBase-0.92/ws/trunk/target/surefire/surefire422536073834803104tmp> <https://builds.apache.org/job/HBase-0.92/ws/trunk/target/surefire/surefire6886872790875596179tmp>
Running org.apache.hadoop.hbase.rest.TestVersionResource
Tests run: 7, Failures: 0, Errors: 0, Skipped: 0, Time elapsed: 18.171 sec
Forking command line: /bin/sh -c cd <https://builds.apache.org/job/HBase-0.92/ws/trunk> && /home/jenkins/tools/java/jdk1.6.0_27-32/jre/bin/java -enableassertions -Xmx1400m -Djava.security.egd=file:/dev/./urandom -jar <https://builds.apache.org/job/HBase-0.92/ws/trunk/target/surefire/surefirebooter2993782386388129785.jar> <https://builds.apache.org/job/HBase-0.92/ws/trunk/target/surefire/surefire4919865153847968344tmp> <https://builds.apache.org/job/HBase-0.92/ws/trunk/target/surefire/surefire5494375883254541211tmp>
Running org.apache.hadoop.hbase.rest.TestScannerResource
Tests run: 5, Failures: 0, Errors: 0, Skipped: 0, Time elapsed: 33.176 sec
Forking command line: /bin/sh -c cd <https://builds.apache.org/job/HBase-0.92/ws/trunk> && /home/jenkins/tools/java/jdk1.6.0_27-32/jre/bin/java -enableassertions -Xmx1400m -Djava.security.egd=file:/dev/./urandom -jar <https://builds.apache.org/job/HBase-0.92/ws/trunk/target/surefire/surefirebooter7120581859384943979.jar> <https://builds.apache.org/job/HBase-0.92/ws/trunk/target/surefire/surefire771397739781786744tmp> <https://builds.apache.org/job/HBase-0.92/ws/trunk/target/surefire/surefire3969258825266106870tmp>
Running org.apache.hadoop.hbase.rest.TestTableResource
Tests run: 8, Failures: 0, Errors: 0, Skipped: 0, Time elapsed: 29.025 sec
Forking command line: /bin/sh -c cd <https://builds.apache.org/job/HBase-0.92/ws/trunk> && /home/jenkins/tools/java/jdk1.6.0_27-32/jre/bin/java -enableassertions -Xmx1400m -Djava.security.egd=file:/dev/./urandom -jar <https://builds.apache.org/job/HBase-0.92/ws/trunk/target/surefire/surefirebooter7031203293711179280.jar> <https://builds.apache.org/job/HBase-0.92/ws/trunk/target/surefire/surefire2842839885834019972tmp> <https://builds.apache.org/job/HBase-0.92/ws/trunk/target/surefire/surefire5592338907887363905tmp>
Running org.apache.hadoop.hbase.rest.TestStatusResource
Tests run: 2, Failures: 0, Errors: 0, Skipped: 0, Time elapsed: 18.579 sec
Forking command line: /bin/sh -c cd <https://builds.apache.org/job/HBase-0.92/ws/trunk> && /home/jenkins/tools/java/jdk1.6.0_27-32/jre/bin/java -enableassertions -Xmx1400m -Djava.security.egd=file:/dev/./urandom -jar <https://builds.apache.org/job/HBase-0.92/ws/trunk/target/surefire/surefirebooter5279117374589721958.jar> <https://builds.apache.org/job/HBase-0.92/ws/trunk/target/surefire/surefire7323105499857592441tmp> <https://builds.apache.org/job/HBase-0.92/ws/trunk/target/surefire/surefire8821419144717730051tmp>
Running org.apache.hadoop.hbase.rest.TestSchemaResource
Tests run: 2, Failures: 0, Errors: 0, Skipped: 0, Time elapsed: 25.34 sec
Forking command line: /bin/sh -c cd <https://builds.apache.org/job/HBase-0.92/ws/trunk> && /home/jenkins/tools/java/jdk1.6.0_27-32/jre/bin/java -enableassertions -Xmx1400m -Djava.security.egd=file:/dev/./urandom -jar <https://builds.apache.org/job/HBase-0.92/ws/trunk/target/surefire/surefirebooter8829291515266140439.jar> <https://builds.apache.org/job/HBase-0.92/ws/trunk/target/surefire/surefire986571796458793523tmp> <https://builds.apache.org/job/HBase-0.92/ws/trunk/target/surefire/surefire1499620062604026946tmp>
Running org.apache.hadoop.hbase.thrift.TestThriftServer
Tests run: 1, Failures: 0, Errors: 0, Skipped: 0, Time elapsed: 24.052 sec
Forking command line: /bin/sh -c cd <https://builds.apache.org/job/HBase-0.92/ws/trunk> && /home/jenkins/tools/java/jdk1.6.0_27-32/jre/bin/java -enableassertions -Xmx1400m -Djava.security.egd=file:/dev/./urandom -jar <https://builds.apache.org/job/HBase-0.92/ws/trunk/target/surefire/surefirebooter5609030659410529695.jar> <https://builds.apache.org/job/HBase-0.92/ws/trunk/target/surefire/surefire2151281502049427820tmp> <https://builds.apache.org/job/HBase-0.92/ws/trunk/target/surefire/surefire3206708488246351678tmp>
Running org.apache.hadoop.hbase.io.TestHeapSize
Tests run: 2, Failures: 0, Errors: 0, Skipped: 0, Time elapsed: 0.157 sec
Forking command line: /bin/sh -c cd <https://builds.apache.org/job/HBase-0.92/ws/trunk> && /home/jenkins/tools/java/jdk1.6.0_27-32/jre/bin/java -enableassertions -Xmx1400m -Djava.security.egd=file:/dev/./urandom -jar <https://builds.apache.org/job/HBase-0.92/ws/trunk/target/surefire/surefirebooter6618138608950818680.jar> <https://builds.apache.org/job/HBase-0.92/ws/trunk/target/surefire/surefire556416607734461892tmp> <https://builds.apache.org/job/HBase-0.92/ws/trunk/target/surefire/surefire5890453671227619667tmp>
Running org.apache.hadoop.hbase.io.hfile.TestHFileSeek
Tests run: 1, Failures: 0, Errors: 0, Skipped: 0, Time elapsed: 5.714 sec
Forking command line: /bin/sh -c cd <https://builds.apache.org/job/HBase-0.92/ws/trunk> && /home/jenkins/tools/java/jdk1.6.0_27-32/jre/bin/java -enableassertions -Xmx1400m -Djava.security.egd=file:/dev/./urandom -jar <https://builds.apache.org/job/HBase-0.92/ws/trunk/target/surefire/surefirebooter3268177115590850716.jar> <https://builds.apache.org/job/HBase-0.92/ws/trunk/target/surefire/surefire3346579226418963376tmp> <https://builds.apache.org/job/HBase-0.92/ws/trunk/target/surefire/surefire7047690896866412419tmp>
Running org.apache.hadoop.hbase.io.hfile.slab.TestSlab
Tests run: 1, Failures: 0, Errors: 0, Skipped: 0, Time elapsed: 0.145 sec
Forking command line: /bin/sh -c cd <https://builds.apache.org/job/HBase-0.92/ws/trunk> && /home/jenkins/tools/java/jdk1.6.0_27-32/jre/bin/java -enableassertions -Xmx1400m -Djava.security.egd=file:/dev/./urandom -jar <https://builds.apache.org/job/HBase-0.92/ws/trunk/target/surefire/surefirebooter4374053364652590536.jar> <https://builds.apache.org/job/HBase-0.92/ws/trunk/target/surefire/surefire8594602523056851000tmp> <https://builds.apache.org/job/HBase-0.92/ws/trunk/target/surefire/surefire4788402831188993045tmp>
Running org.apache.hadoop.hbase.io.hfile.slab.TestSlabCache
Tests run: 7, Failures: 0, Errors: 0, Skipped: 0, Time elapsed: 19.809 sec
Forking command line: /bin/sh -c cd <https://builds.apache.org/job/HBase-0.92/ws/trunk> && /home/jenkins/tools/java/jdk1.6.0_27-32/jre/bin/java -enableassertions -Xmx1400m -Djava.security.egd=file:/dev/./urandom -jar <https://builds.apache.org/job/HBase-0.92/ws/trunk/target/surefire/surefirebooter2031676474455510503.jar> <https://builds.apache.org/job/HBase-0.92/ws/trunk/target/surefire/surefire6514911529788722932tmp> <https://builds.apache.org/job/HBase-0.92/ws/trunk/target/surefire/surefire8656120023099933137tmp>
Running org.apache.hadoop.hbase.io.hfile.slab.TestSingleSizeCache
Tests run: 5, Failures: 0, Errors: 0, Skipped: 0, Time elapsed: 24.616 sec
Forking command line: /bin/sh -c cd <https://builds.apache.org/job/HBase-0.92/ws/trunk> && /home/jenkins/tools/java/jdk1.6.0_27-32/jre/bin/java -enableassertions -Xmx1400m -Djava.security.egd=file:/dev/./urandom -jar <https://builds.apache.org/job/HBase-0.92/ws/trunk/target/surefire/surefirebooter8602891146874030861.jar> <https://builds.apache.org/job/HBase-0.92/ws/trunk/target/surefire/surefire8235190992993068856tmp> <https://builds.apache.org/job/HBase-0.92/ws/trunk/target/surefire/surefire101002137707340852tmp>
Running org.apache.hadoop.hbase.io.hfile.TestCachedBlockQueue
Tests run: 2, Failures: 0, Errors: 0, Skipped: 0, Time elapsed: 0.105 sec
Forking command line: /bin/sh -c cd <https://builds.apache.org/job/HBase-0.92/ws/trunk> && /home/jenkins/tools/java/jdk1.6.0_27-32/jre/bin/java -enableassertions -Xmx1400m -Djava.security.egd=file:/dev/./urandom -jar <https://builds.apache.org/job/HBase-0.92/ws/trunk/target/surefire/surefirebooter7634249615825149551.jar> <https://builds.apache.org/job/HBase-0.92/ws/trunk/target/surefire/surefire3357827631674700254tmp> <https://builds.apache.org/job/HBase-0.92/ws/trunk/target/surefire/surefire57720091507321307tmp>
Running org.apache.hadoop.hbase.io.hfile.TestHFileBlockIndex
Tests run: 10, Failures: 0, Errors: 0, Skipped: 0, Time elapsed: 9.915 sec
Forking command line: /bin/sh -c cd <https://builds.apache.org/job/HBase-0.92/ws/trunk> && /home/jenkins/tools/java/jdk1.6.0_27-32/jre/bin/java -enableassertions -Xmx1400m -Djava.security.egd=file:/dev/./urandom -jar <https://builds.apache.org/job/HBase-0.92/ws/trunk/target/surefire/surefirebooter6328355389272836942.jar> <https://builds.apache.org/job/HBase-0.92/ws/trunk/target/surefire/surefire1823652861646461614tmp> <https://builds.apache.org/job/HBase-0.92/ws/trunk/target/surefire/surefire701958554746684586tmp>
Running org.apache.hadoop.hbase.io.hfile.TestLruBlockCache
Tests run: 7, Failures: 0, Errors: 0, Skipped: 0, Time elapsed: 0.345 sec
Forking command line: /bin/sh -c cd <https://builds.apache.org/job/HBase-0.92/ws/trunk> && /home/jenkins/tools/java/jdk1.6.0_27-32/jre/bin/java -enableassertions -Xmx1400m -Djava.security.egd=file:/dev/./urandom -jar <https://builds.apache.org/job/HBase-0.92/ws/trunk/target/surefire/surefirebooter3776567630364204269.jar> <https://builds.apache.org/job/HBase-0.92/ws/trunk/target/surefire/surefire7007596862126723865tmp> <https://builds.apache.org/job/HBase-0.92/ws/trunk/target/surefire/surefire6489110463608520285tmp>
Running org.apache.hadoop.hbase.io.hfile.TestHFilePerformance
Tests run: 1, Failures: 0, Errors: 0, Skipped: 0, Time elapsed: 5.964 sec
Forking command line: /bin/sh -c cd <https://builds.apache.org/job/HBase-0.92/ws/trunk> && /home/jenkins/tools/java/jdk1.6.0_27-32/jre/bin/java -enableassertions -Xmx1400m -Djava.security.egd=file:/dev/./urandom -jar <https://builds.apache.org/job/HBase-0.92/ws/trunk/target/surefire/surefirebooter6807162796756273700.jar> <https://builds.apache.org/job/HBase-0.92/ws/trunk/target/surefire/surefire7978558767770884569tmp> <https://builds.apache.org/job/HBase-0.92/ws/trunk/target/surefire/surefire3681905451219516708tmp>
Running org.apache.hadoop.hbase.io.hfile.TestFixedFileTrailer
Tests run: 2, Failures: 0, Errors: 0, Skipped: 0, Time elapsed: 0.678 sec
Forking command line: /bin/sh -c cd <https://builds.apache.org/job/HBase-0.92/ws/trunk> && /home/jenkins/tools/java/jdk1.6.0_27-32/jre/bin/java -enableassertions -Xmx1400m -Djava.security.egd=file:/dev/./urandom -jar <https://builds.apache.org/job/HBase-0.92/ws/trunk/target/surefire/surefirebooter8665028499491718590.jar> <https://builds.apache.org/job/HBase-0.92/ws/trunk/target/surefire/surefire2618917721747562836tmp> <https://builds.apache.org/job/HBase-0.92/ws/trunk/target/surefire/surefire2428889977123888558tmp>
Running org.apache.hadoop.hbase.io.hfile.TestHFileWriterV2
Tests run: 1, Failures: 0, Errors: 0, Skipped: 0, Time elapsed: 1.094 sec
Forking command line: /bin/sh -c cd <https://builds.apache.org/job/HBase-0.92/ws/trunk> && /home/jenkins/tools/java/jdk1.6.0_27-32/jre/bin/java -enableassertions -Xmx1400m -Djava.security.egd=file:/dev/./urandom -jar <https://builds.apache.org/job/HBase-0.92/ws/trunk/target/surefire/surefirebooter1879204264072168814.jar> <https://builds.apache.org/job/HBase-0.92/ws/trunk/target/surefire/surefire826660013051274901tmp> <https://builds.apache.org/job/HBase-0.92/ws/trunk/target/surefire/surefire8735860200578783203tmp>
Running org.apache.hadoop.hbase.io.hfile.TestBlockCacheColumnFamilySummary
Tests run: 4, Failures: 0, Errors: 0, Skipped: 0, Time elapsed: 0.058 sec
Forking command line: /bin/sh -c cd <https://builds.apache.org/job/HBase-0.92/ws/trunk> && /home/jenkins/tools/java/jdk1.6.0_27-32/jre/bin/java -enableassertions -Xmx1400m -Djava.security.egd=file:/dev/./urandom -jar <https://builds.apache.org/job/HBase-0.92/ws/trunk/target/surefire/surefirebooter2147130466186022401.jar> <https://builds.apache.org/job/HBase-0.92/ws/trunk/target/surefire/surefire2691247682164267002tmp> <https://builds.apache.org/job/HBase-0.92/ws/trunk/target/surefire/surefire210122551386142166tmp>
Running org.apache.hadoop.hbase.io.hfile.TestHFileReaderV1
Tests run: 1, Failures: 0, Errors: 0, Skipped: 0, Time elapsed: 0.569 sec
Forking command line: /bin/sh -c cd <https://builds.apache.org/job/HBase-0.92/ws/trunk> && /home/jenkins/tools/java/jdk1.6.0_27-32/jre/bin/java -enableassertions -Xmx1400m -Djava.security.egd=file:/dev/./urandom -jar <https://builds.apache.org/job/HBase-0.92/ws/trunk/target/surefire/surefirebooter9073388831401455823.jar> <https://builds.apache.org/job/HBase-0.92/ws/trunk/target/surefire/surefire7022901353652713673tmp> <https://builds.apache.org/job/HBase-0.92/ws/trunk/target/surefire/surefire8825180420814010491tmp>
Running org.apache.hadoop.hbase.io.hfile.TestHFile
Tests run: 6, Failures: 0, Errors: 0, Skipped: 0, Time elapsed: 0.873 sec
Forking command line: /bin/sh -c cd <https://builds.apache.org/job/HBase-0.92/ws/trunk> && /home/jenkins/tools/java/jdk1.6.0_27-32/jre/bin/java -enableassertions -Xmx1400m -Djava.security.egd=file:/dev/./urandom -jar <https://builds.apache.org/job/HBase-0.92/ws/trunk/target/surefire/surefirebooter7229645222211159961.jar> <https://builds.apache.org/job/HBase-0.92/ws/trunk/target/surefire/surefire4398370996971236998tmp> <https://builds.apache.org/job/HBase-0.92/ws/trunk/target/surefire/surefire1536424502546589476tmp>
Running org.apache.hadoop.hbase.io.hfile.TestReseekTo
Tests run: 1, Failures: 0, Errors: 0, Skipped: 0, Time elapsed: 0.763 sec
Forking command line: /bin/sh -c cd <https://builds.apache.org/job/HBase-0.92/ws/trunk> && /home/jenkins/tools/java/jdk1.6.0_27-32/jre/bin/java -enableassertions -Xmx1400m -Djava.security.egd=file:/dev/./urandom -jar <https://builds.apache.org/job/HBase-0.92/ws/trunk/target/surefire/surefirebooter4582844064353355167.jar> <https://builds.apache.org/job/HBase-0.92/ws/trunk/target/surefire/surefire2649165715470643509tmp> <https://builds.apache.org/job/HBase-0.92/ws/trunk/target/surefire/surefire7838215028083188678tmp>
Running org.apache.hadoop.hbase.io.hfile.TestHFileBlock
Tests run: 7, Failures: 0, Errors: 0, Skipped: 0, Time elapsed: 25.422 sec
Forking command line: /bin/sh -c cd <https://builds.apache.org/job/HBase-0.92/ws/trunk> && /home/jenkins/tools/java/jdk1.6.0_27-32/jre/bin/java -enableassertions -Xmx1400m -Djava.security.egd=file:/dev/./urandom -jar <https://builds.apache.org/job/HBase-0.92/ws/trunk/target/surefire/surefirebooter1092096618219889246.jar> <https://builds.apache.org/job/HBase-0.92/ws/trunk/target/surefire/surefire3218544391836297230tmp> <https://builds.apache.org/job/HBase-0.92/ws/trunk/target/surefire/surefire4077057155502457885tmp>
Running org.apache.hadoop.hbase.io.hfile.TestSeekTo
Tests run: 3, Failures: 0, Errors: 0, Skipped: 0, Time elapsed: 0.648 sec
Forking command line: /bin/sh -c cd <https://builds.apache.org/job/HBase-0.92/ws/trunk> && /home/jenkins/tools/java/jdk1.6.0_27-32/jre/bin/java -enableassertions -Xmx1400m -Djava.security.egd=file:/dev/./urandom -jar <https://builds.apache.org/job/HBase-0.92/ws/trunk/target/surefire/surefirebooter7200091635011685509.jar> <https://builds.apache.org/job/HBase-0.92/ws/trunk/target/surefire/surefire483193712079880223tmp> <https://builds.apache.org/job/HBase-0.92/ws/trunk/target/surefire/surefire5368278201150158242tmp>
Running org.apache.hadoop.hbase.io.hfile.TestCacheOnWrite
Tests run: 6, Failures: 0, Errors: 0, Skipped: 0, Time elapsed: 7.53 sec
Forking command line: /bin/sh -c cd <https://builds.apache.org/job/HBase-0.92/ws/trunk> && /home/jenkins/tools/java/jdk1.6.0_27-32/jre/bin/java -enableassertions -Xmx1400m -Djava.security.egd=file:/dev/./urandom -jar <https://builds.apache.org/job/HBase-0.92/ws/trunk/target/surefire/surefirebooter5402258062773687556.jar> <https://builds.apache.org/job/HBase-0.92/ws/trunk/target/surefire/surefire3018751847857557158tmp> <https://builds.apache.org/job/HBase-0.92/ws/trunk/target/surefire/surefire4936296415918169555tmp>
Running org.apache.hadoop.hbase.io.TestHbaseObjectWritable
Tests run: 4, Failures: 0, Errors: 0, Skipped: 0, Time elapsed: 0.462 sec
Forking command line: /bin/sh -c cd <https://builds.apache.org/job/HBase-0.92/ws/trunk> && /home/jenkins/tools/java/jdk1.6.0_27-32/jre/bin/java -enableassertions -Xmx1400m -Djava.security.egd=file:/dev/./urandom -jar <https://builds.apache.org/job/HBase-0.92/ws/trunk/target/surefire/surefirebooter5210020206313577516.jar> <https://builds.apache.org/job/HBase-0.92/ws/trunk/target/surefire/surefire1251231576534038215tmp> <https://builds.apache.org/job/HBase-0.92/ws/trunk/target/surefire/surefire4036368267958616077tmp>
Running org.apache.hadoop.hbase.io.TestImmutableBytesWritable
Tests run: 3, Failures: 0, Errors: 0, Skipped: 0, Time elapsed: 0.11 sec
Forking command line: /bin/sh -c cd <https://builds.apache.org/job/HBase-0.92/ws/trunk> && /home/jenkins/tools/java/jdk1.6.0_27-32/jre/bin/java -enableassertions -Xmx1400m -Djava.security.egd=file:/dev/./urandom -jar <https://builds.apache.org/job/HBase-0.92/ws/trunk/target/surefire/surefirebooter47900584800614320.jar> <https://builds.apache.org/job/HBase-0.92/ws/trunk/target/surefire/surefire4133795777125879215tmp> <https://builds.apache.org/job/HBase-0.92/ws/trunk/target/surefire/surefire7012725983967686658tmp>
Running org.apache.hadoop.hbase.io.TestHalfStoreFileReader
Tests run: 1, Failures: 0, Errors: 0, Skipped: 0, Time elapsed: 0.793 sec
Forking command line: /bin/sh -c cd <https://builds.apache.org/job/HBase-0.92/ws/trunk> && /home/jenkins/tools/java/jdk1.6.0_27-32/jre/bin/java -enableassertions -Xmx1400m -Djava.security.egd=file:/dev/./urandom -jar <https://builds.apache.org/job/HBase-0.92/ws/trunk/target/surefire/surefirebooter3621542725010934974.jar> <https://builds.apache.org/job/HBase-0.92/ws/trunk/target/surefire/surefire1393198428942609108tmp> <https://builds.apache.org/job/HBase-0.92/ws/trunk/target/surefire/surefire4778584688002888650tmp>
Running org.apache.hadoop.hbase.migration.TestMigrationFrom090To092
Tests run: 1, Failures: 0, Errors: 0, Skipped: 0, Time elapsed: 0.272 sec
Forking command line: /bin/sh -c cd <https://builds.apache.org/job/HBase-0.92/ws/trunk> && /home/jenkins/tools/java/jdk1.6.0_27-32/jre/bin/java -enableassertions -Xmx1400m -Djava.security.egd=file:/dev/./urandom -jar <https://builds.apache.org/job/HBase-0.92/ws/trunk/target/surefire/surefirebooter866408474541249963.jar> <https://builds.apache.org/job/HBase-0.92/ws/trunk/target/surefire/surefire4977338137010431806tmp> <https://builds.apache.org/job/HBase-0.92/ws/trunk/target/surefire/surefire3964224834036667461tmp>
Running org.apache.hadoop.hbase.TestFSTableDescriptorForceCreation
Tests run: 3, Failures: 0, Errors: 0, Skipped: 0, Time elapsed: 0.676 sec
Forking command line: /bin/sh -c cd <https://builds.apache.org/job/HBase-0.92/ws/trunk> && /home/jenkins/tools/java/jdk1.6.0_27-32/jre/bin/java -enableassertions -Xmx1400m -Djava.security.egd=file:/dev/./urandom -jar <https://builds.apache.org/job/HBase-0.92/ws/trunk/target/surefire/surefirebooter7670035889729254296.jar> <https://builds.apache.org/job/HBase-0.92/ws/trunk/target/surefire/surefire6995497705539821489tmp> <https://builds.apache.org/job/HBase-0.92/ws/trunk/target/surefire/surefire1816921710319806494tmp>
Running org.apache.hadoop.hbase.avro.TestAvroUtil
Tests run: 1, Failures: 0, Errors: 0, Skipped: 0, Time elapsed: 0.641 sec
Forking command line: /bin/sh -c cd <https://builds.apache.org/job/HBase-0.92/ws/trunk> && /home/jenkins/tools/java/jdk1.6.0_27-32/jre/bin/java -enableassertions -Xmx1400m -Djava.security.egd=file:/dev/./urandom -jar <https://builds.apache.org/job/HBase-0.92/ws/trunk/target/surefire/surefirebooter1150735873964098385.jar> <https://builds.apache.org/job/HBase-0.92/ws/trunk/target/surefire/surefire380098634439740656tmp> <https://builds.apache.org/job/HBase-0.92/ws/trunk/target/surefire/surefire6544941621447346170tmp>
Running org.apache.hadoop.hbase.avro.TestAvroServer
Tests run: 3, Failures: 0, Errors: 0, Skipped: 0, Time elapsed: 32.991 sec
Forking command line: /bin/sh -c cd <https://builds.apache.org/job/HBase-0.92/ws/trunk> && /home/jenkins/tools/java/jdk1.6.0_27-32/jre/bin/java -enableassertions -Xmx1400m -Djava.security.egd=file:/dev/./urandom -jar <https://builds.apache.org/job/HBase-0.92/ws/trunk/target/surefire/surefirebooter7559862038103013941.jar> <https://builds.apache.org/job/HBase-0.92/ws/trunk/target/surefire/surefire3160195813998456235tmp> <https://builds.apache.org/job/HBase-0.92/ws/trunk/target/surefire/surefire9078968656944932707tmp>
Running org.apache.hadoop.hbase.TestKeyValue
Tests run: 12, Failures: 0, Errors: 0, Skipped: 0, Time elapsed: 0.13 sec
Forking command line: /bin/sh -c cd <https://builds.apache.org/job/HBase-0.92/ws/trunk> && /home/jenkins/tools/java/jdk1.6.0_27-32/jre/bin/java -enableassertions -Xmx1400m -Djava.security.egd=file:/dev/./urandom -jar <https://builds.apache.org/job/HBase-0.92/ws/trunk/target/surefire/surefirebooter4755054468659184003.jar> <https://builds.apache.org/job/HBase-0.92/ws/trunk/target/surefire/surefire2364054902588618802tmp> <https://builds.apache.org/job/HBase-0.92/ws/trunk/target/surefire/surefire9138931880726117054tmp>
Running org.apache.hadoop.hbase.replication.TestMultiSlaveReplication
Tests run: 1, Failures: 0, Errors: 0, Skipped: 0, Time elapsed: 60.934 sec
Forking command line: /bin/sh -c cd <https://builds.apache.org/job/HBase-0.92/ws/trunk> && /home/jenkins/tools/java/jdk1.6.0_27-32/jre/bin/java -enableassertions -Xmx1400m -Djava.security.egd=file:/dev/./urandom -jar <https://builds.apache.org/job/HBase-0.92/ws/trunk/target/surefire/surefirebooter5276184504116672751.jar> <https://builds.apache.org/job/HBase-0.92/ws/trunk/target/surefire/surefire2764557659677127092tmp> <https://builds.apache.org/job/HBase-0.92/ws/trunk/target/surefire/surefire3174676074146001481tmp>
Running org.apache.hadoop.hbase.replication.regionserver.TestReplicationSourceManager
Tests run: 1, Failures: 0, Errors: 0, Skipped: 0, Time elapsed: 1.064 sec
Forking command line: /bin/sh -c cd <https://builds.apache.org/job/HBase-0.92/ws/trunk> && /home/jenkins/tools/java/jdk1.6.0_27-32/jre/bin/java -enableassertions -Xmx1400m -Djava.security.egd=file:/dev/./urandom -jar <https://builds.apache.org/job/HBase-0.92/ws/trunk/target/surefire/surefirebooter293951040451944405.jar> <https://builds.apache.org/job/HBase-0.92/ws/trunk/target/surefire/surefire556354057265876196tmp> <https://builds.apache.org/job/HBase-0.92/ws/trunk/target/surefire/surefire7939541491425263239tmp>
Running org.apache.hadoop.hbase.replication.regionserver.TestReplicationSink
Tests run: 5, Failures: 0, Errors: 0, Skipped: 0, Time elapsed: 22.222 sec
Forking command line: /bin/sh -c cd <https://builds.apache.org/job/HBase-0.92/ws/trunk> && /home/jenkins/tools/java/jdk1.6.0_27-32/jre/bin/java -enableassertions -Xmx1400m -Djava.security.egd=file:/dev/./urandom -jar <https://builds.apache.org/job/HBase-0.92/ws/trunk/target/surefire/surefirebooter7386960125097149170.jar> <https://builds.apache.org/job/HBase-0.92/ws/trunk/target/surefire/surefire7376375757825575669tmp> <https://builds.apache.org/job/HBase-0.92/ws/trunk/target/surefire/surefire316471653198375341tmp>
Running org.apache.hadoop.hbase.replication.TestMasterReplication
Tests run: 2, Failures: 0, Errors: 0, Skipped: 0, Time elapsed: 89.082 sec
Forking command line: /bin/sh -c cd <https://builds.apache.org/job/HBase-0.92/ws/trunk> && /home/jenkins/tools/java/jdk1.6.0_27-32/jre/bin/java -enableassertions -Xmx1400m -Djava.security.egd=file:/dev/./urandom -jar <https://builds.apache.org/job/HBase-0.92/ws/trunk/target/surefire/surefirebooter303827658724363390.jar> <https://builds.apache.org/job/HBase-0.92/ws/trunk/target/surefire/surefire3770495309051860257tmp> <https://builds.apache.org/job/HBase-0.92/ws/trunk/target/surefire/surefire176870250828233065tmp>
Running org.apache.hadoop.hbase.replication.TestReplicationSource
Tests run: 1, Failures: 0, Errors: 0, Skipped: 0, Time elapsed: 2.73 sec
Forking command line: /bin/sh -c cd <https://builds.apache.org/job/HBase-0.92/ws/trunk> && /home/jenkins/tools/java/jdk1.6.0_27-32/jre/bin/java -enableassertions -Xmx1400m -Djava.security.egd=file:/dev/./urandom -jar <https://builds.apache.org/job/HBase-0.92/ws/trunk/target/surefire/surefirebooter5017585460820756055.jar> <https://builds.apache.org/job/HBase-0.92/ws/trunk/target/surefire/surefire6512996941089641480tmp> <https://builds.apache.org/job/HBase-0.92/ws/trunk/target/surefire/surefire3814087762689549415tmp>
Running org.apache.hadoop.hbase.replication.TestReplicationPeer
Tests run: 1, Failures: 0, Errors: 0, Skipped: 0, Time elapsed: 25.679 sec
Forking command line: /bin/sh -c cd <https://builds.apache.org/job/HBase-0.92/ws/trunk> && /home/jenkins/tools/java/jdk1.6.0_27-32/jre/bin/java -enableassertions -Xmx1400m -Djava.security.egd=file:/dev/./urandom -jar <https://builds.apache.org/job/HBase-0.92/ws/trunk/target/surefire/surefirebooter993265459091834539.jar> <https://builds.apache.org/job/HBase-0.92/ws/trunk/target/surefire/surefire5236820410506614078tmp> <https://builds.apache.org/job/HBase-0.92/ws/trunk/target/surefire/surefire4398190625344432012tmp>
Running org.apache.hadoop.hbase.replication.TestReplication
Tests run: 8, Failures: 0, Errors: 0, Skipped: 0, Time elapsed: 122.123 sec
Forking command line: /bin/sh -c cd <https://builds.apache.org/job/HBase-0.92/ws/trunk> && /home/jenkins/tools/java/jdk1.6.0_27-32/jre/bin/java -enableassertions -Xmx1400m -Djava.security.egd=file:/dev/./urandom -jar <https://builds.apache.org/job/HBase-0.92/ws/trunk/target/surefire/surefirebooter4845714085151049373.jar> <https://builds.apache.org/job/HBase-0.92/ws/trunk/target/surefire/surefire5290998267470328928tmp> <https://builds.apache.org/job/HBase-0.92/ws/trunk/target/surefire/surefire78657397747583560tmp>
Running org.apache.hadoop.hbase.ipc.TestDelayedRpc
Tests run: 4, Failures: 0, Errors: 0, Skipped: 0, Time elapsed: 2.607 sec
Forking command line: /bin/sh -c cd <https://builds.apache.org/job/HBase-0.92/ws/trunk> && /home/jenkins/tools/java/jdk1.6.0_27-32/jre/bin/java -enableassertions -Xmx1400m -Djava.security.egd=file:/dev/./urandom -jar <https://builds.apache.org/job/HBase-0.92/ws/trunk/target/surefire/surefirebooter4097953224191560982.jar> <https://builds.apache.org/job/HBase-0.92/ws/trunk/target/surefire/surefire3397037821167058023tmp> <https://builds.apache.org/job/HBase-0.92/ws/trunk/target/surefire/surefire5310272951825130904tmp>
Running org.apache.hadoop.hbase.TestCompare
Tests run: 1, Failures: 0, Errors: 0, Skipped: 0, Time elapsed: 0.234 sec
Forking command line: /bin/sh -c cd <https://builds.apache.org/job/HBase-0.92/ws/trunk> && /home/jenkins/tools/java/jdk1.6.0_27-32/jre/bin/java -enableassertions -Xmx1400m -Djava.security.egd=file:/dev/./urandom -jar <https://builds.apache.org/job/HBase-0.92/ws/trunk/target/surefire/surefirebooter4769965945601698841.jar> <https://builds.apache.org/job/HBase-0.92/ws/trunk/target/surefire/surefire3401570327358729978tmp> <https://builds.apache.org/job/HBase-0.92/ws/trunk/target/surefire/surefire7404636422599956146tmp>
Running org.apache.hadoop.hbase.TestZooKeeper
Tests run: 7, Failures: 0, Errors: 0, Skipped: 0, Time elapsed: 86.917 sec
Forking command line: /bin/sh -c cd <https://builds.apache.org/job/HBase-0.92/ws/trunk> && /home/jenkins/tools/java/jdk1.6.0_27-32/jre/bin/java -enableassertions -Xmx1400m -Djava.security.egd=file:/dev/./urandom -jar <https://builds.apache.org/job/HBase-0.92/ws/trunk/target/surefire/surefirebooter8077631531845429686.jar> <https://builds.apache.org/job/HBase-0.92/ws/trunk/target/surefire/surefire4371436349375250346tmp> <https://builds.apache.org/job/HBase-0.92/ws/trunk/target/surefire/surefire6663716043991673562tmp>
Running org.apache.hadoop.hbase.TestHBaseTestingUtility
Tests run: 7, Failures: 0, Errors: 0, Skipped: 0, Time elapsed: 95.602 sec

Results :

Tests run: 1079, Failures: 0, Errors: 0, Skipped: 8

[INFO] ------------------------------------------------------------------------
[INFO] BUILD FAILURE
[INFO] ------------------------------------------------------------------------
[INFO] Total time: 2:08:59.270s
[INFO] Finished at: Sat Feb 25 02:41:25 UTC 2012
[INFO] Final Memory: 48M/486M
[INFO] ------------------------------------------------------------------------
[ERROR] Failed to execute goal org.apache.maven.plugins:maven-surefire-plugin:2.10:test (default-test) on project hbase: Failure or timeout -> [Help 1]
org.apache.maven.lifecycle.LifecycleExecutionException: Failed to execute goal org.apache.maven.plugins:maven-surefire-plugin:2.10:test (default-test) on project hbase: Failure or timeout
at org.apache.maven.lifecycle.internal.MojoExecutor.execute(MojoExecutor.java:217)
at org.apache.maven.lifecycle.internal.MojoExecutor.execute(MojoExecutor.java:153)
at org.apache.maven.lifecycle.internal.MojoExecutor.execute(MojoExecutor.java:145)
at org.apache.maven.lifecycle.internal.MojoExecutor.executeForkedExecutions(MojoExecutor.java:365)
at org.apache.maven.lifecycle.internal.MojoExecutor.execute(MojoExecutor.java:199)
at org.apache.maven.lifecycle.internal.MojoExecutor.execute(MojoExecutor.java:153)
at org.apache.maven.lifecycle.internal.MojoExecutor.execute(MojoExecutor.java:145)
at org.apache.maven.lifecycle.internal.LifecycleModuleBuilder.buildProject(LifecycleModuleBuilder.java:84)
at org.apache.maven.lifecycle.internal.LifecycleModuleBuilder.buildProject(LifecycleModuleBuilder.java:59)
at org.apache.maven.lifecycle.internal.LifecycleStarter.singleThreadedBuild(LifecycleStarter.java:183)
at org.apache.maven.lifecycle.internal.LifecycleStarter.execute(LifecycleStarter.java:161)
at org.apache.maven.DefaultMaven.doExecute(DefaultMaven.java:319)
at org.apache.maven.DefaultMaven.execute(DefaultMaven.java:156)
at org.apache.maven.cli.MavenCli.execute(MavenCli.java:537)
at org.apache.maven.cli.MavenCli.doMain(MavenCli.java:196)
at org.apache.maven.cli.MavenCli.main(MavenCli.java:141)
at sun.reflect.NativeMethodAccessorImpl.invoke0(Native Method)
at sun.reflect.NativeMethodAccessorImpl.invoke(NativeMethodAccessorImpl.java:39)
at sun.reflect.DelegatingMethodAccessorImpl.invoke(DelegatingMethodAccessorImpl.java:25)
at java.lang.reflect.Method.invoke(Method.java:597)
at org.codehaus.plexus.classworlds.launcher.Launcher.launchEnhanced(Launcher.java:290)
at org.codehaus.plexus.classworlds.launcher.Launcher.launch(Launcher.java:230)
at org.codehaus.plexus.classworlds.launcher.Launcher.mainWithExitCode(Launcher.java:409)
at org.codehaus.plexus.classworlds.launcher.Launcher.main(Launcher.java:352)
Caused by: org.apache.maven.plugin.MojoExecutionException: Failure or timeout
at org.apache.maven.plugin.surefire.SurefirePlugin.assertNoFailureOrTimeout(SurefirePlugin.java:633)
at org.apache.maven.plugin.surefire.SurefirePlugin.handleSummary(SurefirePlugin.java:614)
at org.apache.maven.plugin.surefire.AbstractSurefireMojo.executeAfterPreconditionsChecked(AbstractSurefireMojo.java:137)
at org.apache.maven.plugin.surefire.AbstractSurefireMojo.execute(AbstractSurefireMojo.java:98)
at org.apache.maven.plugin.DefaultBuildPluginManager.executeMojo(DefaultBuildPluginManager.java:101)
at org.apache.maven.lifecycle.internal.MojoExecutor.execute(MojoExecutor.java:209)
... 23 more
[ERROR]
[ERROR]
[ERROR] For more information about the errors and possible solutions, please read the following articles:
[ERROR] [Help 1] http://cwiki.apache.org/confluence/display/MAVEN/MojoExecutionException
Build step 'Invoke top-level Maven targets' marked build as failure
Archiving artifacts
Updating HBASE-5351
Recording test results

Search Discussions

  • Ted Yu at Feb 25, 2012 at 3:15 am
    TestMetaReaderEditor hung:

    Running org.apache.hadoop.hbase.catalog.TestMetaReaderEditor
    Running org.apache.hadoop.hbase.catalog.TestCatalogTrackerOnCluster
    Tests run: 1, Failures: 0, Errors: 0, Skipped: 0, Time elapsed: 149.104 sec
    On Fri, Feb 24, 2012 at 6:41 PM, Apache Jenkins Server wrote:

    See <https://builds.apache.org/job/HBase-0.92/304/changes>

    Changes:

    [stack] HBASE-5351 hbase completebulkload to a new table fails in a race
  • Apache Jenkins Server at Feb 25, 2012 at 5:17 am
    See <https://builds.apache.org/job/HBase-0.92/305/changes>

    Changes:

    [stack] HBASE-5473 Metrics does not push pread time

    ------------------------------------------
    [...truncated 5558 lines...]
    Setting project property: maven.dependency.org.apache.mina.mina-core.jar.path -> /home/jenkins/.m2/repository/org/apache/mina/mina-core/2.0.0-M5/mina-core-2.0.0-M5.jar
    Setting project property: maven.dependency.org.apache.ftpserver.ftpserver-core.jar.path -> /home/jenkins/.m2/repository/org/apache/ftpserver/ftpserver-core/1.0.0/ftpserver-core-1.0.0.jar
    Setting project property: maven.dependency.org.apache.ftpserver.ftpserver-deprecated.jar.path -> /home/jenkins/.m2/repository/org/apache/ftpserver/ftpserver-deprecated/1.0.0-M2/ftpserver-deprecated-1.0.0-M2.jar
    [INFO] Executing tasks
    Build sequence for target(s) `main' is [main]
    Complete build sequence is [main, ]

    main:
    [replace] Replacing in <https://builds.apache.org/job/HBase-0.92/ws/trunk/target/classes/hbase-default.xml>: @@@VERSION@@@ --> 0.92.1-SNAPSHOT
    [mkdir] Created dir: <https://builds.apache.org/job/HBase-0.92/ws/trunk/target/nativelib>
    [exec] Current OS is Linux
    [exec] Executing 'tar' with arguments:
    [exec] 'xf'
    [exec] 'hadoop-snappy-nativelibs.tar'
    [exec]
    [exec] The ' characters around the executable and arguments are
    [exec] not part of the command.
    Execute:Java13CommandLauncher: Executing 'tar' with arguments:
    'xf'
    'hadoop-snappy-nativelibs.tar'

    The ' characters around the executable and arguments are
    not part of the command.
    [exec] tar: hadoop-snappy-nativelibs.tar: Cannot open: No such file or directory
    [exec] tar: Error is not recoverable: exiting now
    [exec] Result: 2
    [INFO] Executed tasks
    [INFO]
    [INFO] --- maven-compiler-plugin:2.0.2:compile (default-compile) @ hbase ---
    [DEBUG] org.apache.maven.plugins:maven-compiler-plugin:jar:2.0.2:
    [DEBUG] org.apache.maven:maven-plugin-api:jar:2.0:compile
    [DEBUG] org.codehaus.plexus:plexus-utils:jar:1.0.4:compile
    [DEBUG] org.codehaus.plexus:plexus-compiler-api:jar:1.5.3:compile
    [DEBUG] org.codehaus.plexus:plexus-container-default:jar:1.0-alpha-8:compile
    [DEBUG] junit:junit:jar:3.8.1:compile
    [DEBUG] classworlds:classworlds:jar:1.1-alpha-2:compile
    [DEBUG] org.codehaus.plexus:plexus-compiler-manager:jar:1.5.3:compile
    [DEBUG] org.codehaus.plexus:plexus-compiler-javac:jar:1.5.3:runtime
    [DEBUG] org.apache.maven:maven-artifact:jar:2.0:compile
    [DEBUG] Created new class realm plugin>org.apache.maven.plugins:maven-compiler-plugin:2.0.2
    [DEBUG] Importing foreign packages into class realm plugin>org.apache.maven.plugins:maven-compiler-plugin:2.0.2
    [DEBUG] Imported: < maven.api
    [DEBUG] Populating class realm plugin>org.apache.maven.plugins:maven-compiler-plugin:2.0.2
    [DEBUG] Included: org.apache.maven.plugins:maven-compiler-plugin:jar:2.0.2
    [DEBUG] Included: org.codehaus.plexus:plexus-utils:jar:1.0.4
    [DEBUG] Included: org.codehaus.plexus:plexus-compiler-api:jar:1.5.3
    [DEBUG] Included: junit:junit:jar:3.8.1
    [DEBUG] Included: org.codehaus.plexus:plexus-compiler-manager:jar:1.5.3
    [DEBUG] Included: org.codehaus.plexus:plexus-compiler-javac:jar:1.5.3
    [DEBUG] Excluded: org.apache.maven:maven-plugin-api:jar:2.0
    [DEBUG] Excluded: org.codehaus.plexus:plexus-container-default:jar:1.0-alpha-8
    [DEBUG] Excluded: classworlds:classworlds:jar:1.1-alpha-2
    [DEBUG] Excluded: org.apache.maven:maven-artifact:jar:2.0
    [DEBUG] Configuring mojo org.apache.maven.plugins:maven-compiler-plugin:2.0.2:compile from plugin realm ClassRealm[plugin>org.apache.maven.plugins:maven-compiler-plugin:2.0.2, parent: sun.misc.Launcher$AppClassLoader@6b97fd]
    [DEBUG] Configuring mojo 'org.apache.maven.plugins:maven-compiler-plugin:2.0.2:compile' with basic configurator -->
    [DEBUG] (f) basedir = <https://builds.apache.org/job/HBase-0.92/ws/trunk>
    [DEBUG] (f) buildDirectory = <https://builds.apache.org/job/HBase-0.92/ws/trunk/target>
    [DEBUG] (f) classpathElements = [<https://builds.apache.org/job/HBase-0.92/ws/trunk/target/classes,> /home/jenkins/.m2/repository/com/google/guava/guava/r09/guava-r09.jar, /home/jenkins/.m2/repository/commons-cli/commons-cli/1.2/commons-cli-1.2.jar, /home/jenkins/.m2/repository/commons-configuration/commons-configuration/1.6/commons-configuration-1.6.jar, /home/jenkins/.m2/repository/commons-collections/commons-collections/3.2.1/commons-collections-3.2.1.jar, /home/jenkins/.m2/repository/commons-digester/commons-digester/1.8/commons-digester-1.8.jar, /home/jenkins/.m2/repository/commons-beanutils/commons-beanutils/1.7.0/commons-beanutils-1.7.0.jar, /home/jenkins/.m2/repository/commons-beanutils/commons-beanutils-core/1.8.0/commons-beanutils-core-1.8.0.jar, /home/jenkins/.m2/repository/com/github/stephenc/high-scale-lib/high-scale-lib/1.1.1/high-scale-lib-1.1.1.jar, /home/jenkins/.m2/repository/commons-codec/commons-codec/1.4/commons-codec-1.4.jar, /home/jenkins/.m2/repository/commons-httpclient/commons-httpclient/3.1/commons-httpclient-3.1.jar, /home/jenkins/.m2/repository/commons-lang/commons-lang/2.5/commons-lang-2.5.jar, /home/jenkins/.m2/repository/commons-logging/commons-logging/1.1.1/commons-logging-1.1.1.jar, /home/jenkins/.m2/repository/log4j/log4j/1.2.16/log4j-1.2.16.jar, /home/jenkins/.m2/repository/org/apache/avro/avro/1.5.3/avro-1.5.3.jar, /home/jenkins/.m2/repository/org/xerial/snappy/snappy-java/1.0.3.2/snappy-java-1.0.3.2.jar, /home/jenkins/.m2/repository/org/apache/avro/avro-ipc/1.5.3/avro-ipc-1.5.3.jar, /home/jenkins/.m2/repository/org/jboss/netty/netty/3.2.4.Final/netty-3.2.4.Final.jar, /home/jenkins/.m2/repository/org/apache/velocity/velocity/1.7/velocity-1.7.jar, /home/jenkins/.m2/repository/org/apache/zookeeper/zookeeper/3.4.3/zookeeper-3.4.3.jar, /home/jenkins/.m2/repository/org/apache/thrift/libthrift/0.7.0/libthrift-0.7.0.jar, /home/jenkins/.m2/repository/javax/servlet/servlet-api/2.5/servlet-api-2.5.jar, /home/jenkins/.m2/repository/org/apache/httpcomponents/httpclient/4.0.1/httpclient-4.0.1.jar, /home/jenkins/.m2/repository/org/apache/httpcomponents/httpcore/4.0.1/httpcore-4.0.1.jar, /home/jenkins/.m2/repository/org/jruby/jruby-complete/1.6.5/jruby-complete-1.6.5.jar, /home/jenkins/.m2/repository/org/mortbay/jetty/jetty/6.1.26/jetty-6.1.26.jar, /home/jenkins/.m2/repository/org/mortbay/jetty/jetty-util/6.1.26/jetty-util-6.1.26.jar, /home/jenkins/.m2/repository/org/mortbay/jetty/jsp-2.1/6.1.14/jsp-2.1-6.1.14.jar, /home/jenkins/.m2/repository/org/eclipse/jdt/core/3.1.1/core-3.1.1.jar, /home/jenkins/.m2/repository/org/mortbay/jetty/jsp-api-2.1/6.1.14/jsp-api-2.1-6.1.14.jar, /home/jenkins/.m2/repository/org/mortbay/jetty/servlet-api-2.5/6.1.14/servlet-api-2.5-6.1.14.jar, /home/jenkins/.m2/repository/org/codehaus/jackson/jackson-core-asl/1.5.5/jackson-core-asl-1.5.5.jar, /home/jenkins/.m2/repository/org/codehaus/jackson/jackson-mapper-asl/1.5.5/jackson-mapper-asl-1.5.5.jar, /home/jenkins/.m2/repository/org/codehaus/jackson/jackson-jaxrs/1.5.5/jackson-jaxrs-1.5.5.jar, /home/jenkins/.m2/repository/org/codehaus/jackson/jackson-xc/1.5.5/jackson-xc-1.5.5.jar, /home/jenkins/.m2/repository/org/slf4j/slf4j-api/1.5.8/slf4j-api-1.5.8.jar, /home/jenkins/.m2/repository/org/slf4j/slf4j-log4j12/1.5.8/slf4j-log4j12-1.5.8.jar, /home/jenkins/.m2/repository/commons-el/commons-el/1.0/commons-el-1.0.jar, /home/jenkins/.m2/repository/org/jamon/jamon-runtime/2.3.1/jamon-runtime-2.3.1.jar, /home/jenkins/.m2/repository/com/google/protobuf/protobuf-java/2.4.0a/protobuf-java-2.4.0a.jar, /home/jenkins/.m2/repository/com/sun/jersey/jersey-core/1.4/jersey-core-1.4.jar, /home/jenkins/.m2/repository/com/sun/jersey/jersey-json/1.4/jersey-json-1.4.jar, /home/jenkins/.m2/repository/org/codehaus/jettison/jettison/1.1/jettison-1.1.jar, /home/jenkins/.m2/repository/com/sun/xml/bind/jaxb-impl/2.1.12/jaxb-impl-2.1.12.jar, /home/jenkins/.m2/repository/com/sun/jersey/jersey-server/1.4/jersey-server-1.4.jar, /home/jenkins/.m2/repository/asm/asm/3.1/asm-3.1.jar, /home/jenkins/.m2/repository/javax/xml/bind/jaxb-api/2.1/jaxb-api-2.1.jar, /home/jenkins/.m2/repository/javax/activation/activation/1.1/activation-1.1.jar, /home/jenkins/.m2/repository/stax/stax-api/1.0.1/stax-api-1.0.1.jar, /home/jenkins/.m2/repository/org/apache/hadoop/hadoop-core/1.0.0/hadoop-core-1.0.0.jar, /home/jenkins/.m2/repository/xmlenc/xmlenc/0.52/xmlenc-0.52.jar, /home/jenkins/.m2/repository/commons-net/commons-net/1.4.1/commons-net-1.4.1.jar]
    [DEBUG] (f) compileSourceRoots = [<https://builds.apache.org/job/HBase-0.92/ws/trunk/src/main/java,> <https://builds.apache.org/job/HBase-0.92/ws/trunk/target/generated-sources/java,> <https://builds.apache.org/job/HBase-0.92/ws/trunk/target/generated-jamon]>
    [DEBUG] (f) compilerId = javac
    [DEBUG] (f) debug = true
    [DEBUG] (f) encoding = UTF-8
    [DEBUG] (f) failOnError = true
    [DEBUG] (f) fork = false
    [DEBUG] (f) optimize = false
    [DEBUG] (f) outputDirectory = <https://builds.apache.org/job/HBase-0.92/ws/trunk/target/classes>
    [DEBUG] (f) outputFileName = hbase-0.92.1-SNAPSHOT
    [DEBUG] (f) projectArtifact = org.apache.hbase:hbase:jar:0.92.1-SNAPSHOT
    [DEBUG] (f) showDeprecation = false
    [DEBUG] (f) showWarnings = true
    [DEBUG] (f) source = 1.6
    [DEBUG] (f) staleMillis = 0
    [DEBUG] (f) target = 1.6
    [DEBUG] (f) verbose = false
    [DEBUG] -- end configuration --
    [DEBUG] Using compiler 'javac'.
    [DEBUG] Source directories: [<https://builds.apache.org/job/HBase-0.92/ws/trunk/src/main/java>
    <https://builds.apache.org/job/HBase-0.92/ws/trunk/target/generated-sources/java>
    <https://builds.apache.org/job/HBase-0.92/ws/trunk/target/generated-jamon]>
    [DEBUG] Classpath: [<https://builds.apache.org/job/HBase-0.92/ws/trunk/target/classes>
    /home/jenkins/.m2/repository/com/google/guava/guava/r09/guava-r09.jar
    /home/jenkins/.m2/repository/commons-cli/commons-cli/1.2/commons-cli-1.2.jar
    /home/jenkins/.m2/repository/commons-configuration/commons-configuration/1.6/commons-configuration-1.6.jar
    /home/jenkins/.m2/repository/commons-collections/commons-collections/3.2.1/commons-collections-3.2.1.jar
    /home/jenkins/.m2/repository/commons-digester/commons-digester/1.8/commons-digester-1.8.jar
    /home/jenkins/.m2/repository/commons-beanutils/commons-beanutils/1.7.0/commons-beanutils-1.7.0.jar
    /home/jenkins/.m2/repository/commons-beanutils/commons-beanutils-core/1.8.0/commons-beanutils-core-1.8.0.jar
    /home/jenkins/.m2/repository/com/github/stephenc/high-scale-lib/high-scale-lib/1.1.1/high-scale-lib-1.1.1.jar
    /home/jenkins/.m2/repository/commons-codec/commons-codec/1.4/commons-codec-1.4.jar
    /home/jenkins/.m2/repository/commons-httpclient/commons-httpclient/3.1/commons-httpclient-3.1.jar
    /home/jenkins/.m2/repository/commons-lang/commons-lang/2.5/commons-lang-2.5.jar
    /home/jenkins/.m2/repository/commons-logging/commons-logging/1.1.1/commons-logging-1.1.1.jar
    /home/jenkins/.m2/repository/log4j/log4j/1.2.16/log4j-1.2.16.jar
    /home/jenkins/.m2/repository/org/apache/avro/avro/1.5.3/avro-1.5.3.jar
    /home/jenkins/.m2/repository/org/xerial/snappy/snappy-java/1.0.3.2/snappy-java-1.0.3.2.jar
    /home/jenkins/.m2/repository/org/apache/avro/avro-ipc/1.5.3/avro-ipc-1.5.3.jar
    /home/jenkins/.m2/repository/org/jboss/netty/netty/3.2.4.Final/netty-3.2.4.Final.jar
    /home/jenkins/.m2/repository/org/apache/velocity/velocity/1.7/velocity-1.7.jar
    /home/jenkins/.m2/repository/org/apache/zookeeper/zookeeper/3.4.3/zookeeper-3.4.3.jar
    /home/jenkins/.m2/repository/org/apache/thrift/libthrift/0.7.0/libthrift-0.7.0.jar
    /home/jenkins/.m2/repository/javax/servlet/servlet-api/2.5/servlet-api-2.5.jar
    /home/jenkins/.m2/repository/org/apache/httpcomponents/httpclient/4.0.1/httpclient-4.0.1.jar
    /home/jenkins/.m2/repository/org/apache/httpcomponents/httpcore/4.0.1/httpcore-4.0.1.jar
    /home/jenkins/.m2/repository/org/jruby/jruby-complete/1.6.5/jruby-complete-1.6.5.jar
    /home/jenkins/.m2/repository/org/mortbay/jetty/jetty/6.1.26/jetty-6.1.26.jar
    /home/jenkins/.m2/repository/org/mortbay/jetty/jetty-util/6.1.26/jetty-util-6.1.26.jar
    /home/jenkins/.m2/repository/org/mortbay/jetty/jsp-2.1/6.1.14/jsp-2.1-6.1.14.jar
    /home/jenkins/.m2/repository/org/eclipse/jdt/core/3.1.1/core-3.1.1.jar
    /home/jenkins/.m2/repository/org/mortbay/jetty/jsp-api-2.1/6.1.14/jsp-api-2.1-6.1.14.jar
    /home/jenkins/.m2/repository/org/mortbay/jetty/servlet-api-2.5/6.1.14/servlet-api-2.5-6.1.14.jar
    /home/jenkins/.m2/repository/org/codehaus/jackson/jackson-core-asl/1.5.5/jackson-core-asl-1.5.5.jar
    /home/jenkins/.m2/repository/org/codehaus/jackson/jackson-mapper-asl/1.5.5/jackson-mapper-asl-1.5.5.jar
    /home/jenkins/.m2/repository/org/codehaus/jackson/jackson-jaxrs/1.5.5/jackson-jaxrs-1.5.5.jar
    /home/jenkins/.m2/repository/org/codehaus/jackson/jackson-xc/1.5.5/jackson-xc-1.5.5.jar
    /home/jenkins/.m2/repository/org/slf4j/slf4j-api/1.5.8/slf4j-api-1.5.8.jar
    /home/jenkins/.m2/repository/org/slf4j/slf4j-log4j12/1.5.8/slf4j-log4j12-1.5.8.jar
    /home/jenkins/.m2/repository/commons-el/commons-el/1.0/commons-el-1.0.jar
    /home/jenkins/.m2/repository/org/jamon/jamon-runtime/2.3.1/jamon-runtime-2.3.1.jar
    /home/jenkins/.m2/repository/com/google/protobuf/protobuf-java/2.4.0a/protobuf-java-2.4.0a.jar
    /home/jenkins/.m2/repository/com/sun/jersey/jersey-core/1.4/jersey-core-1.4.jar
    /home/jenkins/.m2/repository/com/sun/jersey/jersey-json/1.4/jersey-json-1.4.jar
    /home/jenkins/.m2/repository/org/codehaus/jettison/jettison/1.1/jettison-1.1.jar
    /home/jenkins/.m2/repository/com/sun/xml/bind/jaxb-impl/2.1.12/jaxb-impl-2.1.12.jar
    /home/jenkins/.m2/repository/com/sun/jersey/jersey-server/1.4/jersey-server-1.4.jar
    /home/jenkins/.m2/repository/asm/asm/3.1/asm-3.1.jar
    /home/jenkins/.m2/repository/javax/xml/bind/jaxb-api/2.1/jaxb-api-2.1.jar
    /home/jenkins/.m2/repository/javax/activation/activation/1.1/activation-1.1.jar
    /home/jenkins/.m2/repository/stax/stax-api/1.0.1/stax-api-1.0.1.jar
    /home/jenkins/.m2/repository/org/apache/hadoop/hadoop-core/1.0.0/hadoop-core-1.0.0.jar
    /home/jenkins/.m2/repository/xmlenc/xmlenc/0.52/xmlenc-0.52.jar
    /home/jenkins/.m2/repository/commons-net/commons-net/1.4.1/commons-net-1.4.1.jar]
    [DEBUG] Output directory: <https://builds.apache.org/job/HBase-0.92/ws/trunk/target/classes>
    [DEBUG] Classpath:
    [DEBUG] <https://builds.apache.org/job/HBase-0.92/ws/trunk/target/classes>
    [DEBUG] /home/jenkins/.m2/repository/com/google/guava/guava/r09/guava-r09.jar
    [DEBUG] /home/jenkins/.m2/repository/commons-cli/commons-cli/1.2/commons-cli-1.2.jar
    [DEBUG] /home/jenkins/.m2/repository/commons-configuration/commons-configuration/1.6/commons-configuration-1.6.jar
    [DEBUG] /home/jenkins/.m2/repository/commons-collections/commons-collections/3.2.1/commons-collections-3.2.1.jar
    [DEBUG] /home/jenkins/.m2/repository/commons-digester/commons-digester/1.8/commons-digester-1.8.jar
    [DEBUG] /home/jenkins/.m2/repository/commons-beanutils/commons-beanutils/1.7.0/commons-beanutils-1.7.0.jar
    [DEBUG] /home/jenkins/.m2/repository/commons-beanutils/commons-beanutils-core/1.8.0/commons-beanutils-core-1.8.0.jar
    [DEBUG] /home/jenkins/.m2/repository/com/github/stephenc/high-scale-lib/high-scale-lib/1.1.1/high-scale-lib-1.1.1.jar
    [DEBUG] /home/jenkins/.m2/repository/commons-codec/commons-codec/1.4/commons-codec-1.4.jar
    [DEBUG] /home/jenkins/.m2/repository/commons-httpclient/commons-httpclient/3.1/commons-httpclient-3.1.jar
    [DEBUG] /home/jenkins/.m2/repository/commons-lang/commons-lang/2.5/commons-lang-2.5.jar
    [DEBUG] /home/jenkins/.m2/repository/commons-logging/commons-logging/1.1.1/commons-logging-1.1.1.jar
    [DEBUG] /home/jenkins/.m2/repository/log4j/log4j/1.2.16/log4j-1.2.16.jar
    [DEBUG] /home/jenkins/.m2/repository/org/apache/avro/avro/1.5.3/avro-1.5.3.jar
    [DEBUG] /home/jenkins/.m2/repository/org/xerial/snappy/snappy-java/1.0.3.2/snappy-java-1.0.3.2.jar
    [DEBUG] /home/jenkins/.m2/repository/org/apache/avro/avro-ipc/1.5.3/avro-ipc-1.5.3.jar
    [DEBUG] /home/jenkins/.m2/repository/org/jboss/netty/netty/3.2.4.Final/netty-3.2.4.Final.jar
    [DEBUG] /home/jenkins/.m2/repository/org/apache/velocity/velocity/1.7/velocity-1.7.jar
    [DEBUG] /home/jenkins/.m2/repository/org/apache/zookeeper/zookeeper/3.4.3/zookeeper-3.4.3.jar
    [DEBUG] /home/jenkins/.m2/repository/org/apache/thrift/libthrift/0.7.0/libthrift-0.7.0.jar
    [DEBUG] /home/jenkins/.m2/repository/javax/servlet/servlet-api/2.5/servlet-api-2.5.jar
    [DEBUG] /home/jenkins/.m2/repository/org/apache/httpcomponents/httpclient/4.0.1/httpclient-4.0.1.jar
    [DEBUG] /home/jenkins/.m2/repository/org/apache/httpcomponents/httpcore/4.0.1/httpcore-4.0.1.jar
    [DEBUG] /home/jenkins/.m2/repository/org/jruby/jruby-complete/1.6.5/jruby-complete-1.6.5.jar
    [DEBUG] /home/jenkins/.m2/repository/org/mortbay/jetty/jetty/6.1.26/jetty-6.1.26.jar
    [DEBUG] /home/jenkins/.m2/repository/org/mortbay/jetty/jetty-util/6.1.26/jetty-util-6.1.26.jar
    [DEBUG] /home/jenkins/.m2/repository/org/mortbay/jetty/jsp-2.1/6.1.14/jsp-2.1-6.1.14.jar
    [DEBUG] /home/jenkins/.m2/repository/org/eclipse/jdt/core/3.1.1/core-3.1.1.jar
    [DEBUG] /home/jenkins/.m2/repository/org/mortbay/jetty/jsp-api-2.1/6.1.14/jsp-api-2.1-6.1.14.jar
    [DEBUG] /home/jenkins/.m2/repository/org/mortbay/jetty/servlet-api-2.5/6.1.14/servlet-api-2.5-6.1.14.jar
    [DEBUG] /home/jenkins/.m2/repository/org/codehaus/jackson/jackson-core-asl/1.5.5/jackson-core-asl-1.5.5.jar
    [DEBUG] /home/jenkins/.m2/repository/org/codehaus/jackson/jackson-mapper-asl/1.5.5/jackson-mapper-asl-1.5.5.jar
    [DEBUG] /home/jenkins/.m2/repository/org/codehaus/jackson/jackson-jaxrs/1.5.5/jackson-jaxrs-1.5.5.jar
    [DEBUG] /home/jenkins/.m2/repository/org/codehaus/jackson/jackson-xc/1.5.5/jackson-xc-1.5.5.jar
    [DEBUG] /home/jenkins/.m2/repository/org/slf4j/slf4j-api/1.5.8/slf4j-api-1.5.8.jar
    [DEBUG] /home/jenkins/.m2/repository/org/slf4j/slf4j-log4j12/1.5.8/slf4j-log4j12-1.5.8.jar
    [DEBUG] /home/jenkins/.m2/repository/commons-el/commons-el/1.0/commons-el-1.0.jar
    [DEBUG] /home/jenkins/.m2/repository/org/jamon/jamon-runtime/2.3.1/jamon-runtime-2.3.1.jar
    [DEBUG] /home/jenkins/.m2/repository/com/google/protobuf/protobuf-java/2.4.0a/protobuf-java-2.4.0a.jar
    [DEBUG] /home/jenkins/.m2/repository/com/sun/jersey/jersey-core/1.4/jersey-core-1.4.jar
    [DEBUG] /home/jenkins/.m2/repository/com/sun/jersey/jersey-json/1.4/jersey-json-1.4.jar
    [DEBUG] /home/jenkins/.m2/repository/org/codehaus/jettison/jettison/1.1/jettison-1.1.jar
    [DEBUG] /home/jenkins/.m2/repository/com/sun/xml/bind/jaxb-impl/2.1.12/jaxb-impl-2.1.12.jar
    [DEBUG] /home/jenkins/.m2/repository/com/sun/jersey/jersey-server/1.4/jersey-server-1.4.jar
    [DEBUG] /home/jenkins/.m2/repository/asm/asm/3.1/asm-3.1.jar
    [DEBUG] /home/jenkins/.m2/repository/javax/xml/bind/jaxb-api/2.1/jaxb-api-2.1.jar
    [DEBUG] /home/jenkins/.m2/repository/javax/activation/activation/1.1/activation-1.1.jar
    [DEBUG] /home/jenkins/.m2/repository/stax/stax-api/1.0.1/stax-api-1.0.1.jar
    [DEBUG] /home/jenkins/.m2/repository/org/apache/hadoop/hadoop-core/1.0.0/hadoop-core-1.0.0.jar
    [DEBUG] /home/jenkins/.m2/repository/xmlenc/xmlenc/0.52/xmlenc-0.52.jar
    [DEBUG] /home/jenkins/.m2/repository/commons-net/commons-net/1.4.1/commons-net-1.4.1.jar
    [DEBUG] Source roots:
    [DEBUG] <https://builds.apache.org/job/HBase-0.92/ws/trunk/src/main/java>
    [DEBUG] <https://builds.apache.org/job/HBase-0.92/ws/trunk/target/generated-sources/java>
    [DEBUG] <https://builds.apache.org/job/HBase-0.92/ws/trunk/target/generated-jamon>
    [INFO] Compiling 612 source files to <https://builds.apache.org/job/HBase-0.92/ws/trunk/target/classes>
    [INFO] ------------------------------------------------------------------------
    [INFO] BUILD FAILURE
    [INFO] ------------------------------------------------------------------------
    [INFO] Total time: 41.670s
    [INFO] Finished at: Sat Feb 25 05:16:58 UTC 2012
    [INFO] Final Memory: 39M/694M
    [INFO] ------------------------------------------------------------------------
    [ERROR] Failed to execute goal org.apache.maven.plugins:maven-compiler-plugin:2.0.2:compile (default-compile) on project hbase: Compilation failure: Compilation failure:
    [ERROR] <https://builds.apache.org/job/HBase-0.92/ws/trunk/src/main/java/org/apache/hadoop/hbase/util/Bytes.java>:[44,15] sun.misc.Unsafe is Sun proprietary API and may be removed in a future release
    [ERROR]
    [ERROR] <https://builds.apache.org/job/HBase-0.92/ws/trunk/src/main/java/org/apache/hadoop/hbase/util/Bytes.java>:[1035,19] sun.misc.Unsafe is Sun proprietary API and may be removed in a future release
    [ERROR]
    [ERROR] <https://builds.apache.org/job/HBase-0.92/ws/trunk/src/main/java/org/apache/hadoop/hbase/regionserver/metrics/RegionServerMetrics.java>:[313,10] cannot find symbol
    [ERROR] symbol : variable fsPreadLatency
    [ERROR] location: class org.apache.hadoop.hbase.regionserver.metrics.RegionServerMetrics
    [ERROR]
    [ERROR] <https://builds.apache.org/job/HBase-0.92/ws/trunk/src/main/java/org/apache/hadoop/hbase/util/Bytes.java>:[1041,21] sun.misc.Unsafe is Sun proprietary API and may be removed in a future release
    [ERROR]
    [ERROR] <https://builds.apache.org/job/HBase-0.92/ws/trunk/src/main/java/org/apache/hadoop/hbase/util/Bytes.java>:[1046,28] sun.misc.Unsafe is Sun proprietary API and may be removed in a future release
    [ERROR] -> [Help 1]
    org.apache.maven.lifecycle.LifecycleExecutionException: Failed to execute goal org.apache.maven.plugins:maven-compiler-plugin:2.0.2:compile (default-compile) on project hbase: Compilation failure
    at org.apache.maven.lifecycle.internal.MojoExecutor.execute(MojoExecutor.java:213)
    at org.apache.maven.lifecycle.internal.MojoExecutor.execute(MojoExecutor.java:153)
    at org.apache.maven.lifecycle.internal.MojoExecutor.execute(MojoExecutor.java:145)
    at org.apache.maven.lifecycle.internal.MojoExecutor.executeForkedExecutions(MojoExecutor.java:365)
    at org.apache.maven.lifecycle.internal.MojoExecutor.execute(MojoExecutor.java:199)
    at org.apache.maven.lifecycle.internal.MojoExecutor.execute(MojoExecutor.java:153)
    at org.apache.maven.lifecycle.internal.MojoExecutor.execute(MojoExecutor.java:145)
    at org.apache.maven.lifecycle.internal.LifecycleModuleBuilder.buildProject(LifecycleModuleBuilder.java:84)
    at org.apache.maven.lifecycle.internal.LifecycleModuleBuilder.buildProject(LifecycleModuleBuilder.java:59)
    at org.apache.maven.lifecycle.internal.LifecycleStarter.singleThreadedBuild(LifecycleStarter.java:183)
    at org.apache.maven.lifecycle.internal.LifecycleStarter.execute(LifecycleStarter.java:161)
    at org.apache.maven.DefaultMaven.doExecute(DefaultMaven.java:319)
    at org.apache.maven.DefaultMaven.execute(DefaultMaven.java:156)
    at org.apache.maven.cli.MavenCli.execute(MavenCli.java:537)
    at org.apache.maven.cli.MavenCli.doMain(MavenCli.java:196)
    at org.apache.maven.cli.MavenCli.main(MavenCli.java:141)
    at sun.reflect.NativeMethodAccessorImpl.invoke0(Native Method)
    at sun.reflect.NativeMethodAccessorImpl.invoke(NativeMethodAccessorImpl.java:39)
    at sun.reflect.DelegatingMethodAccessorImpl.invoke(DelegatingMethodAccessorImpl.java:25)
    at java.lang.reflect.Method.invoke(Method.java:597)
    at org.codehaus.plexus.classworlds.launcher.Launcher.launchEnhanced(Launcher.java:290)
    at org.codehaus.plexus.classworlds.launcher.Launcher.launch(Launcher.java:230)
    at org.codehaus.plexus.classworlds.launcher.Launcher.mainWithExitCode(Launcher.java:409)
    at org.codehaus.plexus.classworlds.launcher.Launcher.main(Launcher.java:352)
    Caused by: org.apache.maven.plugin.CompilationFailureException: Compilation failure
    at org.apache.maven.plugin.AbstractCompilerMojo.execute(AbstractCompilerMojo.java:516)
    at org.apache.maven.plugin.CompilerMojo.execute(CompilerMojo.java:114)
    at org.apache.maven.plugin.DefaultBuildPluginManager.executeMojo(DefaultBuildPluginManager.java:101)
    at org.apache.maven.lifecycle.internal.MojoExecutor.execute(MojoExecutor.java:209)
    ... 23 more
    [ERROR]
    [ERROR]
    [ERROR] For more information about the errors and possible solutions, please read the following articles:
    [ERROR] [Help 1] http://cwiki.apache.org/confluence/display/MAVEN/MojoFailureException
    Build step 'Invoke top-level Maven targets' marked build as failure
    Archiving artifacts
    Updating HBASE-5473
    Recording test results
  • Apache Jenkins Server at Feb 27, 2012 at 6:18 pm

Related Discussions

Discussion Navigation
viewthread | post
Discussion Overview
groupdev @
categorieshbase, hadoop
postedFeb 25, '12 at 2:42a
activeFeb 27, '12 at 6:18p
posts4
users2
websitehbase.apache.org

2 users in discussion

Apache Jenkins Server: 3 posts Ted Yu: 1 post

People

Translate

site design / logo © 2022 Grokbase