FAQ
See <https://builds.apache.org/job/HBase-0.92/212/changes>

Changes:

[tedyu] HBASE-5055 Build against hadoop 0.22 broken - remove import of DFSClient.DFSInputStream (Ming Ma)

[tedyu] HBASE-5103 Fix improper master znode deserialization (Jonathan Hsieh)

------------------------------------------
[...truncated 6555 lines...]
Forking command line: /bin/sh -c cd <https://builds.apache.org/job/HBase-0.92/ws/trunk> && /home/jenkins/tools/java/jdk1.6.0_27-32/jre/bin/java -enableassertions -Xmx1400m -Djava.security.egd=file:/dev/./urandom -jar <https://builds.apache.org/job/HBase-0.92/ws/trunk/target/surefire/surefirebooter4849307280566566614.jar> <https://builds.apache.org/job/HBase-0.92/ws/trunk/target/surefire/surefire8447513251722955442tmp> <https://builds.apache.org/job/HBase-0.92/ws/trunk/target/surefire/surefire5333295147820802600tmp>
Running org.apache.hadoop.hbase.executor.TestExecutorService
Tests run: 1, Failures: 0, Errors: 0, Skipped: 0, Time elapsed: 2.441 sec
Forking command line: /bin/sh -c cd <https://builds.apache.org/job/HBase-0.92/ws/trunk> && /home/jenkins/tools/java/jdk1.6.0_27-32/jre/bin/java -enableassertions -Xmx1400m -Djava.security.egd=file:/dev/./urandom -jar <https://builds.apache.org/job/HBase-0.92/ws/trunk/target/surefire/surefirebooter3168458255586701315.jar> <https://builds.apache.org/job/HBase-0.92/ws/trunk/target/surefire/surefire7016374708784922784tmp> <https://builds.apache.org/job/HBase-0.92/ws/trunk/target/surefire/surefire4931011831707060931tmp>
Running org.apache.hadoop.hbase.rest.TestGzipFilter
Tests run: 3, Failures: 0, Errors: 0, Skipped: 0, Time elapsed: 21.225 sec
Forking command line: /bin/sh -c cd <https://builds.apache.org/job/HBase-0.92/ws/trunk> && /home/jenkins/tools/java/jdk1.6.0_27-32/jre/bin/java -enableassertions -Xmx1400m -Djava.security.egd=file:/dev/./urandom -jar <https://builds.apache.org/job/HBase-0.92/ws/trunk/target/surefire/surefirebooter6811526360957636043.jar> <https://builds.apache.org/job/HBase-0.92/ws/trunk/target/surefire/surefire6917390233821519648tmp> <https://builds.apache.org/job/HBase-0.92/ws/trunk/target/surefire/surefire2425949572960545726tmp>
Running org.apache.hadoop.hbase.rest.TestMultiRowResource
Tests run: 3, Failures: 0, Errors: 0, Skipped: 0, Time elapsed: 20.606 sec
Forking command line: /bin/sh -c cd <https://builds.apache.org/job/HBase-0.92/ws/trunk> && /home/jenkins/tools/java/jdk1.6.0_27-32/jre/bin/java -enableassertions -Xmx1400m -Djava.security.egd=file:/dev/./urandom -jar <https://builds.apache.org/job/HBase-0.92/ws/trunk/target/surefire/surefirebooter5191281291419066718.jar> <https://builds.apache.org/job/HBase-0.92/ws/trunk/target/surefire/surefire2429483675224566235tmp> <https://builds.apache.org/job/HBase-0.92/ws/trunk/target/surefire/surefire8100389397932940377tmp>
Running org.apache.hadoop.hbase.rest.TestScannersWithFilters
Tests run: 10, Failures: 0, Errors: 0, Skipped: 0, Time elapsed: 23.067 sec
Forking command line: /bin/sh -c cd <https://builds.apache.org/job/HBase-0.92/ws/trunk> && /home/jenkins/tools/java/jdk1.6.0_27-32/jre/bin/java -enableassertions -Xmx1400m -Djava.security.egd=file:/dev/./urandom -jar <https://builds.apache.org/job/HBase-0.92/ws/trunk/target/surefire/surefirebooter1278204996167114954.jar> <https://builds.apache.org/job/HBase-0.92/ws/trunk/target/surefire/surefire1206694612917930063tmp> <https://builds.apache.org/job/HBase-0.92/ws/trunk/target/surefire/surefire6134427263299939935tmp>
Running org.apache.hadoop.hbase.rest.TestRowResource
Tests run: 11, Failures: 0, Errors: 0, Skipped: 0, Time elapsed: 21.12 sec
Forking command line: /bin/sh -c cd <https://builds.apache.org/job/HBase-0.92/ws/trunk> && /home/jenkins/tools/java/jdk1.6.0_27-32/jre/bin/java -enableassertions -Xmx1400m -Djava.security.egd=file:/dev/./urandom -jar <https://builds.apache.org/job/HBase-0.92/ws/trunk/target/surefire/surefirebooter692740690656666773.jar> <https://builds.apache.org/job/HBase-0.92/ws/trunk/target/surefire/surefire7046938849233019398tmp> <https://builds.apache.org/job/HBase-0.92/ws/trunk/target/surefire/surefire8645070666385970249tmp>
Running org.apache.hadoop.hbase.rest.model.TestCellModel
Tests run: 3, Failures: 0, Errors: 0, Skipped: 0, Time elapsed: 0.372 sec
Forking command line: /bin/sh -c cd <https://builds.apache.org/job/HBase-0.92/ws/trunk> && /home/jenkins/tools/java/jdk1.6.0_27-32/jre/bin/java -enableassertions -Xmx1400m -Djava.security.egd=file:/dev/./urandom -jar <https://builds.apache.org/job/HBase-0.92/ws/trunk/target/surefire/surefirebooter9188469137651876069.jar> <https://builds.apache.org/job/HBase-0.92/ws/trunk/target/surefire/surefire3957674342594407283tmp> <https://builds.apache.org/job/HBase-0.92/ws/trunk/target/surefire/surefire4205841928426906462tmp>
Running org.apache.hadoop.hbase.rest.model.TestCellSetModel
Tests run: 3, Failures: 0, Errors: 0, Skipped: 0, Time elapsed: 0.411 sec
Forking command line: /bin/sh -c cd <https://builds.apache.org/job/HBase-0.92/ws/trunk> && /home/jenkins/tools/java/jdk1.6.0_27-32/jre/bin/java -enableassertions -Xmx1400m -Djava.security.egd=file:/dev/./urandom -jar <https://builds.apache.org/job/HBase-0.92/ws/trunk/target/surefire/surefirebooter1791288877441535697.jar> <https://builds.apache.org/job/HBase-0.92/ws/trunk/target/surefire/surefire6226911810160994535tmp> <https://builds.apache.org/job/HBase-0.92/ws/trunk/target/surefire/surefire7243963955191985707tmp>
Running org.apache.hadoop.hbase.rest.model.TestTableListModel
Tests run: 3, Failures: 0, Errors: 0, Skipped: 0, Time elapsed: 0.393 sec
Forking command line: /bin/sh -c cd <https://builds.apache.org/job/HBase-0.92/ws/trunk> && /home/jenkins/tools/java/jdk1.6.0_27-32/jre/bin/java -enableassertions -Xmx1400m -Djava.security.egd=file:/dev/./urandom -jar <https://builds.apache.org/job/HBase-0.92/ws/trunk/target/surefire/surefirebooter8909462240906027658.jar> <https://builds.apache.org/job/HBase-0.92/ws/trunk/target/surefire/surefire1466614161522320081tmp> <https://builds.apache.org/job/HBase-0.92/ws/trunk/target/surefire/surefire6383305273710484518tmp>
Running org.apache.hadoop.hbase.rest.model.TestVersionModel
Tests run: 3, Failures: 0, Errors: 0, Skipped: 0, Time elapsed: 0.37 sec
Forking command line: /bin/sh -c cd <https://builds.apache.org/job/HBase-0.92/ws/trunk> && /home/jenkins/tools/java/jdk1.6.0_27-32/jre/bin/java -enableassertions -Xmx1400m -Djava.security.egd=file:/dev/./urandom -jar <https://builds.apache.org/job/HBase-0.92/ws/trunk/target/surefire/surefirebooter5895865692595809642.jar> <https://builds.apache.org/job/HBase-0.92/ws/trunk/target/surefire/surefire1891781345312615501tmp> <https://builds.apache.org/job/HBase-0.92/ws/trunk/target/surefire/surefire4330318852050662483tmp>
Running org.apache.hadoop.hbase.rest.model.TestColumnSchemaModel
Tests run: 2, Failures: 0, Errors: 0, Skipped: 0, Time elapsed: 0.305 sec
Forking command line: /bin/sh -c cd <https://builds.apache.org/job/HBase-0.92/ws/trunk> && /home/jenkins/tools/java/jdk1.6.0_27-32/jre/bin/java -enableassertions -Xmx1400m -Djava.security.egd=file:/dev/./urandom -jar <https://builds.apache.org/job/HBase-0.92/ws/trunk/target/surefire/surefirebooter3153601651154424059.jar> <https://builds.apache.org/job/HBase-0.92/ws/trunk/target/surefire/surefire1365004747434664043tmp> <https://builds.apache.org/job/HBase-0.92/ws/trunk/target/surefire/surefire169970858078801087tmp>
Running org.apache.hadoop.hbase.rest.model.TestTableInfoModel
Tests run: 3, Failures: 0, Errors: 0, Skipped: 0, Time elapsed: 0.412 sec
Forking command line: /bin/sh -c cd <https://builds.apache.org/job/HBase-0.92/ws/trunk> && /home/jenkins/tools/java/jdk1.6.0_27-32/jre/bin/java -enableassertions -Xmx1400m -Djava.security.egd=file:/dev/./urandom -jar <https://builds.apache.org/job/HBase-0.92/ws/trunk/target/surefire/surefirebooter2138349776931007969.jar> <https://builds.apache.org/job/HBase-0.92/ws/trunk/target/surefire/surefire6189513102210795157tmp> <https://builds.apache.org/job/HBase-0.92/ws/trunk/target/surefire/surefire822391667909003076tmp>
Running org.apache.hadoop.hbase.rest.model.TestRowModel
Tests run: 2, Failures: 0, Errors: 0, Skipped: 0, Time elapsed: 0.372 sec
Forking command line: /bin/sh -c cd <https://builds.apache.org/job/HBase-0.92/ws/trunk> && /home/jenkins/tools/java/jdk1.6.0_27-32/jre/bin/java -enableassertions -Xmx1400m -Djava.security.egd=file:/dev/./urandom -jar <https://builds.apache.org/job/HBase-0.92/ws/trunk/target/surefire/surefirebooter5614017549887430908.jar> <https://builds.apache.org/job/HBase-0.92/ws/trunk/target/surefire/surefire1353317938103441835tmp> <https://builds.apache.org/job/HBase-0.92/ws/trunk/target/surefire/surefire1361563426933968757tmp>
Running org.apache.hadoop.hbase.rest.model.TestTableSchemaModel
Tests run: 3, Failures: 0, Errors: 0, Skipped: 0, Time elapsed: 0.409 sec
Forking command line: /bin/sh -c cd <https://builds.apache.org/job/HBase-0.92/ws/trunk> && /home/jenkins/tools/java/jdk1.6.0_27-32/jre/bin/java -enableassertions -Xmx1400m -Djava.security.egd=file:/dev/./urandom -jar <https://builds.apache.org/job/HBase-0.92/ws/trunk/target/surefire/surefirebooter7076704623267698568.jar> <https://builds.apache.org/job/HBase-0.92/ws/trunk/target/surefire/surefire4366229823563618104tmp> <https://builds.apache.org/job/HBase-0.92/ws/trunk/target/surefire/surefire8388501900047701443tmp>
Running org.apache.hadoop.hbase.rest.model.TestStorageClusterVersionModel
Tests run: 2, Failures: 0, Errors: 0, Skipped: 0, Time elapsed: 0.277 sec
Forking command line: /bin/sh -c cd <https://builds.apache.org/job/HBase-0.92/ws/trunk> && /home/jenkins/tools/java/jdk1.6.0_27-32/jre/bin/java -enableassertions -Xmx1400m -Djava.security.egd=file:/dev/./urandom -jar <https://builds.apache.org/job/HBase-0.92/ws/trunk/target/surefire/surefirebooter2717262670509326282.jar> <https://builds.apache.org/job/HBase-0.92/ws/trunk/target/surefire/surefire4354225772345117196tmp> <https://builds.apache.org/job/HBase-0.92/ws/trunk/target/surefire/surefire616140711542983647tmp>
Running org.apache.hadoop.hbase.rest.model.TestTableRegionModel
Tests run: 4, Failures: 0, Errors: 0, Skipped: 0, Time elapsed: 0.477 sec
Forking command line: /bin/sh -c cd <https://builds.apache.org/job/HBase-0.92/ws/trunk> && /home/jenkins/tools/java/jdk1.6.0_27-32/jre/bin/java -enableassertions -Xmx1400m -Djava.security.egd=file:/dev/./urandom -jar <https://builds.apache.org/job/HBase-0.92/ws/trunk/target/surefire/surefirebooter8871648993521725313.jar> <https://builds.apache.org/job/HBase-0.92/ws/trunk/target/surefire/surefire4133507393533886550tmp> <https://builds.apache.org/job/HBase-0.92/ws/trunk/target/surefire/surefire5392945667725130662tmp>
Running org.apache.hadoop.hbase.rest.model.TestStorageClusterStatusModel
Tests run: 3, Failures: 0, Errors: 0, Skipped: 0, Time elapsed: 0.453 sec
Forking command line: /bin/sh -c cd <https://builds.apache.org/job/HBase-0.92/ws/trunk> && /home/jenkins/tools/java/jdk1.6.0_27-32/jre/bin/java -enableassertions -Xmx1400m -Djava.security.egd=file:/dev/./urandom -jar <https://builds.apache.org/job/HBase-0.92/ws/trunk/target/surefire/surefirebooter411241776486135612.jar> <https://builds.apache.org/job/HBase-0.92/ws/trunk/target/surefire/surefire9009228347910992243tmp> <https://builds.apache.org/job/HBase-0.92/ws/trunk/target/surefire/surefire8761651954179936266tmp>
Running org.apache.hadoop.hbase.rest.model.TestScannerModel
Tests run: 3, Failures: 0, Errors: 0, Skipped: 0, Time elapsed: 0.409 sec
Forking command line: /bin/sh -c cd <https://builds.apache.org/job/HBase-0.92/ws/trunk> && /home/jenkins/tools/java/jdk1.6.0_27-32/jre/bin/java -enableassertions -Xmx1400m -Djava.security.egd=file:/dev/./urandom -jar <https://builds.apache.org/job/HBase-0.92/ws/trunk/target/surefire/surefirebooter3799120406214307809.jar> <https://builds.apache.org/job/HBase-0.92/ws/trunk/target/surefire/surefire2758893912313167464tmp> <https://builds.apache.org/job/HBase-0.92/ws/trunk/target/surefire/surefire7640682894854116093tmp>
Running org.apache.hadoop.hbase.rest.client.TestRemoteAdmin
Tests run: 1, Failures: 0, Errors: 0, Skipped: 0, Time elapsed: 21.555 sec
Forking command line: /bin/sh -c cd <https://builds.apache.org/job/HBase-0.92/ws/trunk> && /home/jenkins/tools/java/jdk1.6.0_27-32/jre/bin/java -enableassertions -Xmx1400m -Djava.security.egd=file:/dev/./urandom -jar <https://builds.apache.org/job/HBase-0.92/ws/trunk/target/surefire/surefirebooter8352948203973286876.jar> <https://builds.apache.org/job/HBase-0.92/ws/trunk/target/surefire/surefire9019175419585738475tmp> <https://builds.apache.org/job/HBase-0.92/ws/trunk/target/surefire/surefire3692067627049766665tmp>
Running org.apache.hadoop.hbase.rest.client.TestRemoteTable
Tests run: 3, Failures: 0, Errors: 0, Skipped: 0, Time elapsed: 20.497 sec
Forking command line: /bin/sh -c cd <https://builds.apache.org/job/HBase-0.92/ws/trunk> && /home/jenkins/tools/java/jdk1.6.0_27-32/jre/bin/java -enableassertions -Xmx1400m -Djava.security.egd=file:/dev/./urandom -jar <https://builds.apache.org/job/HBase-0.92/ws/trunk/target/surefire/surefirebooter4150597168135814479.jar> <https://builds.apache.org/job/HBase-0.92/ws/trunk/target/surefire/surefire4464584602988070562tmp> <https://builds.apache.org/job/HBase-0.92/ws/trunk/target/surefire/surefire3499372342495183454tmp>
Running org.apache.hadoop.hbase.rest.TestVersionResource
Tests run: 7, Failures: 0, Errors: 0, Skipped: 0, Time elapsed: 18.361 sec
Forking command line: /bin/sh -c cd <https://builds.apache.org/job/HBase-0.92/ws/trunk> && /home/jenkins/tools/java/jdk1.6.0_27-32/jre/bin/java -enableassertions -Xmx1400m -Djava.security.egd=file:/dev/./urandom -jar <https://builds.apache.org/job/HBase-0.92/ws/trunk/target/surefire/surefirebooter2835893461587889492.jar> <https://builds.apache.org/job/HBase-0.92/ws/trunk/target/surefire/surefire1279487489058407124tmp> <https://builds.apache.org/job/HBase-0.92/ws/trunk/target/surefire/surefire7920674664010971914tmp>
Running org.apache.hadoop.hbase.rest.TestScannerResource
Tests run: 5, Failures: 0, Errors: 0, Skipped: 0, Time elapsed: 33.324 sec
Forking command line: /bin/sh -c cd <https://builds.apache.org/job/HBase-0.92/ws/trunk> && /home/jenkins/tools/java/jdk1.6.0_27-32/jre/bin/java -enableassertions -Xmx1400m -Djava.security.egd=file:/dev/./urandom -jar <https://builds.apache.org/job/HBase-0.92/ws/trunk/target/surefire/surefirebooter1394338698087602207.jar> <https://builds.apache.org/job/HBase-0.92/ws/trunk/target/surefire/surefire8462580620132946957tmp> <https://builds.apache.org/job/HBase-0.92/ws/trunk/target/surefire/surefire4910944859694348803tmp>
Running org.apache.hadoop.hbase.rest.TestTransform
Tests run: 1, Failures: 0, Errors: 0, Skipped: 0, Time elapsed: 21.245 sec
Forking command line: /bin/sh -c cd <https://builds.apache.org/job/HBase-0.92/ws/trunk> && /home/jenkins/tools/java/jdk1.6.0_27-32/jre/bin/java -enableassertions -Xmx1400m -Djava.security.egd=file:/dev/./urandom -jar <https://builds.apache.org/job/HBase-0.92/ws/trunk/target/surefire/surefirebooter713603546647136715.jar> <https://builds.apache.org/job/HBase-0.92/ws/trunk/target/surefire/surefire2029601248929477314tmp> <https://builds.apache.org/job/HBase-0.92/ws/trunk/target/surefire/surefire5667931199503781135tmp>
Running org.apache.hadoop.hbase.rest.TestTableResource
Tests run: 8, Failures: 0, Errors: 0, Skipped: 0, Time elapsed: 27.56 sec
Forking command line: /bin/sh -c cd <https://builds.apache.org/job/HBase-0.92/ws/trunk> && /home/jenkins/tools/java/jdk1.6.0_27-32/jre/bin/java -enableassertions -Xmx1400m -Djava.security.egd=file:/dev/./urandom -jar <https://builds.apache.org/job/HBase-0.92/ws/trunk/target/surefire/surefirebooter8013895173555530080.jar> <https://builds.apache.org/job/HBase-0.92/ws/trunk/target/surefire/surefire3334617924131436236tmp> <https://builds.apache.org/job/HBase-0.92/ws/trunk/target/surefire/surefire8118640120621562879tmp>
Running org.apache.hadoop.hbase.rest.TestStatusResource
Tests run: 2, Failures: 0, Errors: 0, Skipped: 0, Time elapsed: 17.49 sec
Forking command line: /bin/sh -c cd <https://builds.apache.org/job/HBase-0.92/ws/trunk> && /home/jenkins/tools/java/jdk1.6.0_27-32/jre/bin/java -enableassertions -Xmx1400m -Djava.security.egd=file:/dev/./urandom -jar <https://builds.apache.org/job/HBase-0.92/ws/trunk/target/surefire/surefirebooter9056154831397853341.jar> <https://builds.apache.org/job/HBase-0.92/ws/trunk/target/surefire/surefire2342839554295347625tmp> <https://builds.apache.org/job/HBase-0.92/ws/trunk/target/surefire/surefire807125178542825724tmp>
Running org.apache.hadoop.hbase.rest.TestSchemaResource
Tests run: 2, Failures: 0, Errors: 0, Skipped: 0, Time elapsed: 26.403 sec
Forking command line: /bin/sh -c cd <https://builds.apache.org/job/HBase-0.92/ws/trunk> && /home/jenkins/tools/java/jdk1.6.0_27-32/jre/bin/java -enableassertions -Xmx1400m -Djava.security.egd=file:/dev/./urandom -jar <https://builds.apache.org/job/HBase-0.92/ws/trunk/target/surefire/surefirebooter463083605240686246.jar> <https://builds.apache.org/job/HBase-0.92/ws/trunk/target/surefire/surefire8106551270741431647tmp> <https://builds.apache.org/job/HBase-0.92/ws/trunk/target/surefire/surefire1427044135299215259tmp>
Running org.apache.hadoop.hbase.thrift.TestThriftServer
Tests run: 1, Failures: 0, Errors: 0, Skipped: 0, Time elapsed: 24.684 sec
Forking command line: /bin/sh -c cd <https://builds.apache.org/job/HBase-0.92/ws/trunk> && /home/jenkins/tools/java/jdk1.6.0_27-32/jre/bin/java -enableassertions -Xmx1400m -Djava.security.egd=file:/dev/./urandom -jar <https://builds.apache.org/job/HBase-0.92/ws/trunk/target/surefire/surefirebooter8179371741614963852.jar> <https://builds.apache.org/job/HBase-0.92/ws/trunk/target/surefire/surefire2312623243428106060tmp> <https://builds.apache.org/job/HBase-0.92/ws/trunk/target/surefire/surefire3385810739168988821tmp>
Running org.apache.hadoop.hbase.io.TestHeapSize
Tests run: 2, Failures: 0, Errors: 0, Skipped: 0, Time elapsed: 0.159 sec
Forking command line: /bin/sh -c cd <https://builds.apache.org/job/HBase-0.92/ws/trunk> && /home/jenkins/tools/java/jdk1.6.0_27-32/jre/bin/java -enableassertions -Xmx1400m -Djava.security.egd=file:/dev/./urandom -jar <https://builds.apache.org/job/HBase-0.92/ws/trunk/target/surefire/surefirebooter4178916452453704040.jar> <https://builds.apache.org/job/HBase-0.92/ws/trunk/target/surefire/surefire328717813486860691tmp> <https://builds.apache.org/job/HBase-0.92/ws/trunk/target/surefire/surefire7458173018248225969tmp>
Running org.apache.hadoop.hbase.io.hfile.TestHFileSeek
Tests run: 1, Failures: 0, Errors: 0, Skipped: 0, Time elapsed: 5.736 sec
Forking command line: /bin/sh -c cd <https://builds.apache.org/job/HBase-0.92/ws/trunk> && /home/jenkins/tools/java/jdk1.6.0_27-32/jre/bin/java -enableassertions -Xmx1400m -Djava.security.egd=file:/dev/./urandom -jar <https://builds.apache.org/job/HBase-0.92/ws/trunk/target/surefire/surefirebooter174150008679619100.jar> <https://builds.apache.org/job/HBase-0.92/ws/trunk/target/surefire/surefire2355490806409856126tmp> <https://builds.apache.org/job/HBase-0.92/ws/trunk/target/surefire/surefire238346222742732371tmp>
Running org.apache.hadoop.hbase.io.hfile.slab.TestSlab
Tests run: 1, Failures: 0, Errors: 0, Skipped: 0, Time elapsed: 0.146 sec
Forking command line: /bin/sh -c cd <https://builds.apache.org/job/HBase-0.92/ws/trunk> && /home/jenkins/tools/java/jdk1.6.0_27-32/jre/bin/java -enableassertions -Xmx1400m -Djava.security.egd=file:/dev/./urandom -jar <https://builds.apache.org/job/HBase-0.92/ws/trunk/target/surefire/surefirebooter6243291160134873772.jar> <https://builds.apache.org/job/HBase-0.92/ws/trunk/target/surefire/surefire4953983761708358053tmp> <https://builds.apache.org/job/HBase-0.92/ws/trunk/target/surefire/surefire3158080703746582325tmp>
Running org.apache.hadoop.hbase.io.hfile.slab.TestSlabCache
Tests run: 7, Failures: 0, Errors: 0, Skipped: 0, Time elapsed: 20.536 sec
Forking command line: /bin/sh -c cd <https://builds.apache.org/job/HBase-0.92/ws/trunk> && /home/jenkins/tools/java/jdk1.6.0_27-32/jre/bin/java -enableassertions -Xmx1400m -Djava.security.egd=file:/dev/./urandom -jar <https://builds.apache.org/job/HBase-0.92/ws/trunk/target/surefire/surefirebooter2134969399852225992.jar> <https://builds.apache.org/job/HBase-0.92/ws/trunk/target/surefire/surefire5905189343802624625tmp> <https://builds.apache.org/job/HBase-0.92/ws/trunk/target/surefire/surefire3194051542014703772tmp>
Running org.apache.hadoop.hbase.io.hfile.slab.TestSingleSizeCache
Tests run: 5, Failures: 0, Errors: 0, Skipped: 0, Time elapsed: 24.731 sec
Forking command line: /bin/sh -c cd <https://builds.apache.org/job/HBase-0.92/ws/trunk> && /home/jenkins/tools/java/jdk1.6.0_27-32/jre/bin/java -enableassertions -Xmx1400m -Djava.security.egd=file:/dev/./urandom -jar <https://builds.apache.org/job/HBase-0.92/ws/trunk/target/surefire/surefirebooter7723934977699148391.jar> <https://builds.apache.org/job/HBase-0.92/ws/trunk/target/surefire/surefire6503618661624973490tmp> <https://builds.apache.org/job/HBase-0.92/ws/trunk/target/surefire/surefire9097866807799831342tmp>
Running org.apache.hadoop.hbase.io.hfile.TestCachedBlockQueue
Tests run: 2, Failures: 0, Errors: 0, Skipped: 0, Time elapsed: 0.106 sec
Forking command line: /bin/sh -c cd <https://builds.apache.org/job/HBase-0.92/ws/trunk> && /home/jenkins/tools/java/jdk1.6.0_27-32/jre/bin/java -enableassertions -Xmx1400m -Djava.security.egd=file:/dev/./urandom -jar <https://builds.apache.org/job/HBase-0.92/ws/trunk/target/surefire/surefirebooter8226478308617548521.jar> <https://builds.apache.org/job/HBase-0.92/ws/trunk/target/surefire/surefire9219075121665792339tmp> <https://builds.apache.org/job/HBase-0.92/ws/trunk/target/surefire/surefire1556128966840888576tmp>
Running org.apache.hadoop.hbase.io.hfile.TestHFileBlockIndex
Tests run: 10, Failures: 0, Errors: 0, Skipped: 0, Time elapsed: 10.004 sec
Forking command line: /bin/sh -c cd <https://builds.apache.org/job/HBase-0.92/ws/trunk> && /home/jenkins/tools/java/jdk1.6.0_27-32/jre/bin/java -enableassertions -Xmx1400m -Djava.security.egd=file:/dev/./urandom -jar <https://builds.apache.org/job/HBase-0.92/ws/trunk/target/surefire/surefirebooter7124854685848783587.jar> <https://builds.apache.org/job/HBase-0.92/ws/trunk/target/surefire/surefire5396741190117562951tmp> <https://builds.apache.org/job/HBase-0.92/ws/trunk/target/surefire/surefire2723040362938522068tmp>
Running org.apache.hadoop.hbase.io.hfile.TestLruBlockCache
Tests run: 7, Failures: 0, Errors: 0, Skipped: 0, Time elapsed: 0.344 sec
Forking command line: /bin/sh -c cd <https://builds.apache.org/job/HBase-0.92/ws/trunk> && /home/jenkins/tools/java/jdk1.6.0_27-32/jre/bin/java -enableassertions -Xmx1400m -Djava.security.egd=file:/dev/./urandom -jar <https://builds.apache.org/job/HBase-0.92/ws/trunk/target/surefire/surefirebooter173873796103319931.jar> <https://builds.apache.org/job/HBase-0.92/ws/trunk/target/surefire/surefire9039766423365099291tmp> <https://builds.apache.org/job/HBase-0.92/ws/trunk/target/surefire/surefire4688133495659387884tmp>
Running org.apache.hadoop.hbase.io.hfile.TestHFilePerformance
Tests run: 1, Failures: 0, Errors: 0, Skipped: 0, Time elapsed: 6.03 sec
Forking command line: /bin/sh -c cd <https://builds.apache.org/job/HBase-0.92/ws/trunk> && /home/jenkins/tools/java/jdk1.6.0_27-32/jre/bin/java -enableassertions -Xmx1400m -Djava.security.egd=file:/dev/./urandom -jar <https://builds.apache.org/job/HBase-0.92/ws/trunk/target/surefire/surefirebooter8089498582995772126.jar> <https://builds.apache.org/job/HBase-0.92/ws/trunk/target/surefire/surefire9081647076533894495tmp> <https://builds.apache.org/job/HBase-0.92/ws/trunk/target/surefire/surefire6957338106113495182tmp>
Running org.apache.hadoop.hbase.io.hfile.TestFixedFileTrailer
Tests run: 2, Failures: 0, Errors: 0, Skipped: 0, Time elapsed: 0.691 sec
Forking command line: /bin/sh -c cd <https://builds.apache.org/job/HBase-0.92/ws/trunk> && /home/jenkins/tools/java/jdk1.6.0_27-32/jre/bin/java -enableassertions -Xmx1400m -Djava.security.egd=file:/dev/./urandom -jar <https://builds.apache.org/job/HBase-0.92/ws/trunk/target/surefire/surefirebooter330072078375928922.jar> <https://builds.apache.org/job/HBase-0.92/ws/trunk/target/surefire/surefire35461894820461581tmp> <https://builds.apache.org/job/HBase-0.92/ws/trunk/target/surefire/surefire4883853839851332650tmp>
Running org.apache.hadoop.hbase.io.hfile.TestHFileWriterV2
Tests run: 1, Failures: 0, Errors: 0, Skipped: 0, Time elapsed: 1.153 sec
Forking command line: /bin/sh -c cd <https://builds.apache.org/job/HBase-0.92/ws/trunk> && /home/jenkins/tools/java/jdk1.6.0_27-32/jre/bin/java -enableassertions -Xmx1400m -Djava.security.egd=file:/dev/./urandom -jar <https://builds.apache.org/job/HBase-0.92/ws/trunk/target/surefire/surefirebooter6243784682149531306.jar> <https://builds.apache.org/job/HBase-0.92/ws/trunk/target/surefire/surefire1723964961441238733tmp> <https://builds.apache.org/job/HBase-0.92/ws/trunk/target/surefire/surefire1878420320922427262tmp>
Running org.apache.hadoop.hbase.io.hfile.TestBlockCacheColumnFamilySummary
Tests run: 4, Failures: 0, Errors: 0, Skipped: 0, Time elapsed: 0.058 sec
Forking command line: /bin/sh -c cd <https://builds.apache.org/job/HBase-0.92/ws/trunk> && /home/jenkins/tools/java/jdk1.6.0_27-32/jre/bin/java -enableassertions -Xmx1400m -Djava.security.egd=file:/dev/./urandom -jar <https://builds.apache.org/job/HBase-0.92/ws/trunk/target/surefire/surefirebooter774547542010582233.jar> <https://builds.apache.org/job/HBase-0.92/ws/trunk/target/surefire/surefire5349976847748184896tmp> <https://builds.apache.org/job/HBase-0.92/ws/trunk/target/surefire/surefire4316436485815036307tmp>
Running org.apache.hadoop.hbase.io.hfile.TestHFileReaderV1
Tests run: 1, Failures: 0, Errors: 0, Skipped: 0, Time elapsed: 0.573 sec
Forking command line: /bin/sh -c cd <https://builds.apache.org/job/HBase-0.92/ws/trunk> && /home/jenkins/tools/java/jdk1.6.0_27-32/jre/bin/java -enableassertions -Xmx1400m -Djava.security.egd=file:/dev/./urandom -jar <https://builds.apache.org/job/HBase-0.92/ws/trunk/target/surefire/surefirebooter7975305831484702414.jar> <https://builds.apache.org/job/HBase-0.92/ws/trunk/target/surefire/surefire6626791677883372533tmp> <https://builds.apache.org/job/HBase-0.92/ws/trunk/target/surefire/surefire6635202994574637827tmp>
Running org.apache.hadoop.hbase.io.hfile.TestHFile
Tests run: 6, Failures: 0, Errors: 0, Skipped: 0, Time elapsed: 0.852 sec
Forking command line: /bin/sh -c cd <https://builds.apache.org/job/HBase-0.92/ws/trunk> && /home/jenkins/tools/java/jdk1.6.0_27-32/jre/bin/java -enableassertions -Xmx1400m -Djava.security.egd=file:/dev/./urandom -jar <https://builds.apache.org/job/HBase-0.92/ws/trunk/target/surefire/surefirebooter8990867762937281585.jar> <https://builds.apache.org/job/HBase-0.92/ws/trunk/target/surefire/surefire8637695195489694825tmp> <https://builds.apache.org/job/HBase-0.92/ws/trunk/target/surefire/surefire3746442855729545632tmp>
Running org.apache.hadoop.hbase.io.hfile.TestReseekTo
Tests run: 1, Failures: 0, Errors: 0, Skipped: 0, Time elapsed: 0.767 sec
Forking command line: /bin/sh -c cd <https://builds.apache.org/job/HBase-0.92/ws/trunk> && /home/jenkins/tools/java/jdk1.6.0_27-32/jre/bin/java -enableassertions -Xmx1400m -Djava.security.egd=file:/dev/./urandom -jar <https://builds.apache.org/job/HBase-0.92/ws/trunk/target/surefire/surefirebooter7622653931513234820.jar> <https://builds.apache.org/job/HBase-0.92/ws/trunk/target/surefire/surefire7845826660959670776tmp> <https://builds.apache.org/job/HBase-0.92/ws/trunk/target/surefire/surefire1182085862725732910tmp>
Running org.apache.hadoop.hbase.io.hfile.TestHFileBlock
Tests run: 7, Failures: 0, Errors: 0, Skipped: 0, Time elapsed: 25.453 sec
Forking command line: /bin/sh -c cd <https://builds.apache.org/job/HBase-0.92/ws/trunk> && /home/jenkins/tools/java/jdk1.6.0_27-32/jre/bin/java -enableassertions -Xmx1400m -Djava.security.egd=file:/dev/./urandom -jar <https://builds.apache.org/job/HBase-0.92/ws/trunk/target/surefire/surefirebooter6554185851527592071.jar> <https://builds.apache.org/job/HBase-0.92/ws/trunk/target/surefire/surefire984783839061382176tmp> <https://builds.apache.org/job/HBase-0.92/ws/trunk/target/surefire/surefire964387335431729461tmp>
Running org.apache.hadoop.hbase.io.hfile.TestSeekTo
Tests run: 3, Failures: 0, Errors: 0, Skipped: 0, Time elapsed: 0.661 sec
Forking command line: /bin/sh -c cd <https://builds.apache.org/job/HBase-0.92/ws/trunk> && /home/jenkins/tools/java/jdk1.6.0_27-32/jre/bin/java -enableassertions -Xmx1400m -Djava.security.egd=file:/dev/./urandom -jar <https://builds.apache.org/job/HBase-0.92/ws/trunk/target/surefire/surefirebooter4447283216523203092.jar> <https://builds.apache.org/job/HBase-0.92/ws/trunk/target/surefire/surefire2370036260762630283tmp> <https://builds.apache.org/job/HBase-0.92/ws/trunk/target/surefire/surefire1875787097843047907tmp>
Running org.apache.hadoop.hbase.io.hfile.TestCacheOnWrite
Tests run: 6, Failures: 0, Errors: 0, Skipped: 0, Time elapsed: 7.476 sec
Forking command line: /bin/sh -c cd <https://builds.apache.org/job/HBase-0.92/ws/trunk> && /home/jenkins/tools/java/jdk1.6.0_27-32/jre/bin/java -enableassertions -Xmx1400m -Djava.security.egd=file:/dev/./urandom -jar <https://builds.apache.org/job/HBase-0.92/ws/trunk/target/surefire/surefirebooter719795713821979901.jar> <https://builds.apache.org/job/HBase-0.92/ws/trunk/target/surefire/surefire1815225911353723061tmp> <https://builds.apache.org/job/HBase-0.92/ws/trunk/target/surefire/surefire4906360365009597513tmp>
Running org.apache.hadoop.hbase.io.TestHbaseObjectWritable
Tests run: 4, Failures: 0, Errors: 0, Skipped: 0, Time elapsed: 0.469 sec
Forking command line: /bin/sh -c cd <https://builds.apache.org/job/HBase-0.92/ws/trunk> && /home/jenkins/tools/java/jdk1.6.0_27-32/jre/bin/java -enableassertions -Xmx1400m -Djava.security.egd=file:/dev/./urandom -jar <https://builds.apache.org/job/HBase-0.92/ws/trunk/target/surefire/surefirebooter3542425573268068302.jar> <https://builds.apache.org/job/HBase-0.92/ws/trunk/target/surefire/surefire3186363200623598720tmp> <https://builds.apache.org/job/HBase-0.92/ws/trunk/target/surefire/surefire7896242853774700613tmp>
Running org.apache.hadoop.hbase.io.TestImmutableBytesWritable
Tests run: 3, Failures: 0, Errors: 0, Skipped: 0, Time elapsed: 0.111 sec
Forking command line: /bin/sh -c cd <https://builds.apache.org/job/HBase-0.92/ws/trunk> && /home/jenkins/tools/java/jdk1.6.0_27-32/jre/bin/java -enableassertions -Xmx1400m -Djava.security.egd=file:/dev/./urandom -jar <https://builds.apache.org/job/HBase-0.92/ws/trunk/target/surefire/surefirebooter1466381198486768990.jar> <https://builds.apache.org/job/HBase-0.92/ws/trunk/target/surefire/surefire1057507904589396408tmp> <https://builds.apache.org/job/HBase-0.92/ws/trunk/target/surefire/surefire1237902171567450177tmp>
Running org.apache.hadoop.hbase.io.TestHalfStoreFileReader
Tests run: 1, Failures: 0, Errors: 0, Skipped: 0, Time elapsed: 0.788 sec
Forking command line: /bin/sh -c cd <https://builds.apache.org/job/HBase-0.92/ws/trunk> && /home/jenkins/tools/java/jdk1.6.0_27-32/jre/bin/java -enableassertions -Xmx1400m -Djava.security.egd=file:/dev/./urandom -jar <https://builds.apache.org/job/HBase-0.92/ws/trunk/target/surefire/surefirebooter3160465202127338865.jar> <https://builds.apache.org/job/HBase-0.92/ws/trunk/target/surefire/surefire6974048326801850488tmp> <https://builds.apache.org/job/HBase-0.92/ws/trunk/target/surefire/surefire2638755595180344369tmp>
Running org.apache.hadoop.hbase.migration.TestMigrationFrom090To092
Tests run: 1, Failures: 0, Errors: 0, Skipped: 0, Time elapsed: 0.272 sec
Forking command line: /bin/sh -c cd <https://builds.apache.org/job/HBase-0.92/ws/trunk> && /home/jenkins/tools/java/jdk1.6.0_27-32/jre/bin/java -enableassertions -Xmx1400m -Djava.security.egd=file:/dev/./urandom -jar <https://builds.apache.org/job/HBase-0.92/ws/trunk/target/surefire/surefirebooter317229684936139103.jar> <https://builds.apache.org/job/HBase-0.92/ws/trunk/target/surefire/surefire8582782781382414387tmp> <https://builds.apache.org/job/HBase-0.92/ws/trunk/target/surefire/surefire3422205506014373084tmp>
Running org.apache.hadoop.hbase.TestFSTableDescriptorForceCreation
Tests run: 3, Failures: 0, Errors: 0, Skipped: 0, Time elapsed: 0.683 sec
Forking command line: /bin/sh -c cd <https://builds.apache.org/job/HBase-0.92/ws/trunk> && /home/jenkins/tools/java/jdk1.6.0_27-32/jre/bin/java -enableassertions -Xmx1400m -Djava.security.egd=file:/dev/./urandom -jar <https://builds.apache.org/job/HBase-0.92/ws/trunk/target/surefire/surefirebooter9201369273067857257.jar> <https://builds.apache.org/job/HBase-0.92/ws/trunk/target/surefire/surefire5306030970111571042tmp> <https://builds.apache.org/job/HBase-0.92/ws/trunk/target/surefire/surefire4796698309609214249tmp>
Running org.apache.hadoop.hbase.avro.TestAvroUtil
Tests run: 1, Failures: 0, Errors: 0, Skipped: 0, Time elapsed: 0.631 sec
Forking command line: /bin/sh -c cd <https://builds.apache.org/job/HBase-0.92/ws/trunk> && /home/jenkins/tools/java/jdk1.6.0_27-32/jre/bin/java -enableassertions -Xmx1400m -Djava.security.egd=file:/dev/./urandom -jar <https://builds.apache.org/job/HBase-0.92/ws/trunk/target/surefire/surefirebooter1412875333213514901.jar> <https://builds.apache.org/job/HBase-0.92/ws/trunk/target/surefire/surefire1178740081156906684tmp> <https://builds.apache.org/job/HBase-0.92/ws/trunk/target/surefire/surefire9026048697483440513tmp>
Running org.apache.hadoop.hbase.avro.TestAvroServer
Tests run: 3, Failures: 0, Errors: 0, Skipped: 0, Time elapsed: 33.918 sec
Forking command line: /bin/sh -c cd <https://builds.apache.org/job/HBase-0.92/ws/trunk> && /home/jenkins/tools/java/jdk1.6.0_27-32/jre/bin/java -enableassertions -Xmx1400m -Djava.security.egd=file:/dev/./urandom -jar <https://builds.apache.org/job/HBase-0.92/ws/trunk/target/surefire/surefirebooter3703363414749311622.jar> <https://builds.apache.org/job/HBase-0.92/ws/trunk/target/surefire/surefire4360213196723805051tmp> <https://builds.apache.org/job/HBase-0.92/ws/trunk/target/surefire/surefire9023465547755244987tmp>
Running org.apache.hadoop.hbase.TestKeyValue
Tests run: 11, Failures: 0, Errors: 0, Skipped: 0, Time elapsed: 0.131 sec
Forking command line: /bin/sh -c cd <https://builds.apache.org/job/HBase-0.92/ws/trunk> && /home/jenkins/tools/java/jdk1.6.0_27-32/jre/bin/java -enableassertions -Xmx1400m -Djava.security.egd=file:/dev/./urandom -jar <https://builds.apache.org/job/HBase-0.92/ws/trunk/target/surefire/surefirebooter1128823239831300062.jar> <https://builds.apache.org/job/HBase-0.92/ws/trunk/target/surefire/surefire1070035842102263802tmp> <https://builds.apache.org/job/HBase-0.92/ws/trunk/target/surefire/surefire6983230433956908989tmp>
Running org.apache.hadoop.hbase.replication.TestMultiSlaveReplication
Tests run: 1, Failures: 0, Errors: 0, Skipped: 0, Time elapsed: 58.575 sec
Forking command line: /bin/sh -c cd <https://builds.apache.org/job/HBase-0.92/ws/trunk> && /home/jenkins/tools/java/jdk1.6.0_27-32/jre/bin/java -enableassertions -Xmx1400m -Djava.security.egd=file:/dev/./urandom -jar <https://builds.apache.org/job/HBase-0.92/ws/trunk/target/surefire/surefirebooter2883986964917094534.jar> <https://builds.apache.org/job/HBase-0.92/ws/trunk/target/surefire/surefire5881932008970141395tmp> <https://builds.apache.org/job/HBase-0.92/ws/trunk/target/surefire/surefire8857574477607554268tmp>
Running org.apache.hadoop.hbase.replication.regionserver.TestReplicationSourceManager
Tests run: 1, Failures: 0, Errors: 0, Skipped: 0, Time elapsed: 1.057 sec
Forking command line: /bin/sh -c cd <https://builds.apache.org/job/HBase-0.92/ws/trunk> && /home/jenkins/tools/java/jdk1.6.0_27-32/jre/bin/java -enableassertions -Xmx1400m -Djava.security.egd=file:/dev/./urandom -jar <https://builds.apache.org/job/HBase-0.92/ws/trunk/target/surefire/surefirebooter6099696606209192692.jar> <https://builds.apache.org/job/HBase-0.92/ws/trunk/target/surefire/surefire6313983540899188444tmp> <https://builds.apache.org/job/HBase-0.92/ws/trunk/target/surefire/surefire5194600304887619694tmp>
Running org.apache.hadoop.hbase.replication.regionserver.TestReplicationSink
Tests run: 5, Failures: 0, Errors: 0, Skipped: 0, Time elapsed: 22.929 sec
Forking command line: /bin/sh -c cd <https://builds.apache.org/job/HBase-0.92/ws/trunk> && /home/jenkins/tools/java/jdk1.6.0_27-32/jre/bin/java -enableassertions -Xmx1400m -Djava.security.egd=file:/dev/./urandom -jar <https://builds.apache.org/job/HBase-0.92/ws/trunk/target/surefire/surefirebooter2727191629413331255.jar> <https://builds.apache.org/job/HBase-0.92/ws/trunk/target/surefire/surefire8237098475319539292tmp> <https://builds.apache.org/job/HBase-0.92/ws/trunk/target/surefire/surefire8053252560368235730tmp>
Running org.apache.hadoop.hbase.replication.TestMasterReplication
Tests run: 2, Failures: 0, Errors: 0, Skipped: 0, Time elapsed: 96.962 sec
Forking command line: /bin/sh -c cd <https://builds.apache.org/job/HBase-0.92/ws/trunk> && /home/jenkins/tools/java/jdk1.6.0_27-32/jre/bin/java -enableassertions -Xmx1400m -Djava.security.egd=file:/dev/./urandom -jar <https://builds.apache.org/job/HBase-0.92/ws/trunk/target/surefire/surefirebooter5495383118360187104.jar> <https://builds.apache.org/job/HBase-0.92/ws/trunk/target/surefire/surefire7255419739373298355tmp> <https://builds.apache.org/job/HBase-0.92/ws/trunk/target/surefire/surefire3101095266094742333tmp>
Running org.apache.hadoop.hbase.replication.TestReplicationSource
Tests run: 1, Failures: 0, Errors: 0, Skipped: 0, Time elapsed: 2.744 sec
Forking command line: /bin/sh -c cd <https://builds.apache.org/job/HBase-0.92/ws/trunk> && /home/jenkins/tools/java/jdk1.6.0_27-32/jre/bin/java -enableassertions -Xmx1400m -Djava.security.egd=file:/dev/./urandom -jar <https://builds.apache.org/job/HBase-0.92/ws/trunk/target/surefire/surefirebooter7255870667782147993.jar> <https://builds.apache.org/job/HBase-0.92/ws/trunk/target/surefire/surefire446935652417541798tmp> <https://builds.apache.org/job/HBase-0.92/ws/trunk/target/surefire/surefire641779148473520836tmp>
Running org.apache.hadoop.hbase.replication.TestReplicationPeer
Tests run: 1, Failures: 0, Errors: 0, Skipped: 0, Time elapsed: 25.656 sec
Forking command line: /bin/sh -c cd <https://builds.apache.org/job/HBase-0.92/ws/trunk> && /home/jenkins/tools/java/jdk1.6.0_27-32/jre/bin/java -enableassertions -Xmx1400m -Djava.security.egd=file:/dev/./urandom -jar <https://builds.apache.org/job/HBase-0.92/ws/trunk/target/surefire/surefirebooter6665969121063938110.jar> <https://builds.apache.org/job/HBase-0.92/ws/trunk/target/surefire/surefire2328864559238651370tmp> <https://builds.apache.org/job/HBase-0.92/ws/trunk/target/surefire/surefire420489409230534379tmp>
Running org.apache.hadoop.hbase.replication.TestReplication
Tests run: 8, Failures: 1, Errors: 0, Skipped: 0, Time elapsed: 155.335 sec <<< FAILURE!
Forking command line: /bin/sh -c cd <https://builds.apache.org/job/HBase-0.92/ws/trunk> && /home/jenkins/tools/java/jdk1.6.0_27-32/jre/bin/java -enableassertions -Xmx1400m -Djava.security.egd=file:/dev/./urandom -jar <https://builds.apache.org/job/HBase-0.92/ws/trunk/target/surefire/surefirebooter5247905678771573079.jar> <https://builds.apache.org/job/HBase-0.92/ws/trunk/target/surefire/surefire8735336663967938402tmp> <https://builds.apache.org/job/HBase-0.92/ws/trunk/target/surefire/surefire3301625440128375328tmp>
Running org.apache.hadoop.hbase.ipc.TestDelayedRpc
Tests run: 4, Failures: 0, Errors: 0, Skipped: 0, Time elapsed: 2.622 sec
Forking command line: /bin/sh -c cd <https://builds.apache.org/job/HBase-0.92/ws/trunk> && /home/jenkins/tools/java/jdk1.6.0_27-32/jre/bin/java -enableassertions -Xmx1400m -Djava.security.egd=file:/dev/./urandom -jar <https://builds.apache.org/job/HBase-0.92/ws/trunk/target/surefire/surefirebooter7969452903256579439.jar> <https://builds.apache.org/job/HBase-0.92/ws/trunk/target/surefire/surefire7352066991421741444tmp> <https://builds.apache.org/job/HBase-0.92/ws/trunk/target/surefire/surefire1520583148798968747tmp>
Running org.apache.hadoop.hbase.TestCompare
Tests run: 1, Failures: 0, Errors: 0, Skipped: 0, Time elapsed: 0.24 sec
Forking command line: /bin/sh -c cd <https://builds.apache.org/job/HBase-0.92/ws/trunk> && /home/jenkins/tools/java/jdk1.6.0_27-32/jre/bin/java -enableassertions -Xmx1400m -Djava.security.egd=file:/dev/./urandom -jar <https://builds.apache.org/job/HBase-0.92/ws/trunk/target/surefire/surefirebooter1766358469535306487.jar> <https://builds.apache.org/job/HBase-0.92/ws/trunk/target/surefire/surefire7296983027068059266tmp> <https://builds.apache.org/job/HBase-0.92/ws/trunk/target/surefire/surefire5998729949117309218tmp>
Running org.apache.hadoop.hbase.TestZooKeeper
Tests run: 7, Failures: 0, Errors: 0, Skipped: 0, Time elapsed: 85.569 sec
Forking command line: /bin/sh -c cd <https://builds.apache.org/job/HBase-0.92/ws/trunk> && /home/jenkins/tools/java/jdk1.6.0_27-32/jre/bin/java -enableassertions -Xmx1400m -Djava.security.egd=file:/dev/./urandom -jar <https://builds.apache.org/job/HBase-0.92/ws/trunk/target/surefire/surefirebooter824136187395436272.jar> <https://builds.apache.org/job/HBase-0.92/ws/trunk/target/surefire/surefire4731552044226000939tmp> <https://builds.apache.org/job/HBase-0.92/ws/trunk/target/surefire/surefire4989171092500153163tmp>
Running org.apache.hadoop.hbase.TestHBaseTestingUtility
Tests run: 7, Failures: 0, Errors: 0, Skipped: 0, Time elapsed: 97.164 sec

Results :

Failed tests: testcomputeHDFSBlocksDistribution(org.apache.hadoop.hbase.util.TestFSUtils)
queueFailover(org.apache.hadoop.hbase.replication.TestReplication): Waited too much time for queueFailover replication

Tests run: 1069, Failures: 2, Errors: 0, Skipped: 8

[INFO] ------------------------------------------------------------------------
[INFO] BUILD FAILURE
[INFO] ------------------------------------------------------------------------
[INFO] Total time: 2:02:46.311s
[INFO] Finished at: Thu Dec 29 23:22:32 UTC 2011
[INFO] Final Memory: 54M/836M
[INFO] ------------------------------------------------------------------------
[ERROR] Failed to execute goal org.apache.maven.plugins:maven-surefire-plugin:2.10:test (default-test) on project hbase: Failure or timeout -> [Help 1]
org.apache.maven.lifecycle.LifecycleExecutionException: Failed to execute goal org.apache.maven.plugins:maven-surefire-plugin:2.10:test (default-test) on project hbase: Failure or timeout
at org.apache.maven.lifecycle.internal.MojoExecutor.execute(MojoExecutor.java:217)
at org.apache.maven.lifecycle.internal.MojoExecutor.execute(MojoExecutor.java:153)
at org.apache.maven.lifecycle.internal.MojoExecutor.execute(MojoExecutor.java:145)
at org.apache.maven.lifecycle.internal.MojoExecutor.executeForkedExecutions(MojoExecutor.java:365)
at org.apache.maven.lifecycle.internal.MojoExecutor.execute(MojoExecutor.java:199)
at org.apache.maven.lifecycle.internal.MojoExecutor.execute(MojoExecutor.java:153)
at org.apache.maven.lifecycle.internal.MojoExecutor.execute(MojoExecutor.java:145)
at org.apache.maven.lifecycle.internal.LifecycleModuleBuilder.buildProject(LifecycleModuleBuilder.java:84)
at org.apache.maven.lifecycle.internal.LifecycleModuleBuilder.buildProject(LifecycleModuleBuilder.java:59)
at org.apache.maven.lifecycle.internal.LifecycleStarter.singleThreadedBuild(LifecycleStarter.java:183)
at org.apache.maven.lifecycle.internal.LifecycleStarter.execute(LifecycleStarter.java:161)
at org.apache.maven.DefaultMaven.doExecute(DefaultMaven.java:319)
at org.apache.maven.DefaultMaven.execute(DefaultMaven.java:156)
at org.apache.maven.cli.MavenCli.execute(MavenCli.java:537)
at org.apache.maven.cli.MavenCli.doMain(MavenCli.java:196)
at org.apache.maven.cli.MavenCli.main(MavenCli.java:141)
at sun.reflect.NativeMethodAccessorImpl.invoke0(Native Method)
at sun.reflect.NativeMethodAccessorImpl.invoke(NativeMethodAccessorImpl.java:39)
at sun.reflect.DelegatingMethodAccessorImpl.invoke(DelegatingMethodAccessorImpl.java:25)
at java.lang.reflect.Method.invoke(Method.java:597)
at org.codehaus.plexus.classworlds.launcher.Launcher.launchEnhanced(Launcher.java:290)
at org.codehaus.plexus.classworlds.launcher.Launcher.launch(Launcher.java:230)
at org.codehaus.plexus.classworlds.launcher.Launcher.mainWithExitCode(Launcher.java:409)
at org.codehaus.plexus.classworlds.launcher.Launcher.main(Launcher.java:352)
Caused by: org.apache.maven.plugin.MojoExecutionException: Failure or timeout
at org.apache.maven.plugin.surefire.SurefirePlugin.assertNoFailureOrTimeout(SurefirePlugin.java:633)
at org.apache.maven.plugin.surefire.SurefirePlugin.handleSummary(SurefirePlugin.java:614)
at org.apache.maven.plugin.surefire.AbstractSurefireMojo.executeAfterPreconditionsChecked(AbstractSurefireMojo.java:137)
at org.apache.maven.plugin.surefire.AbstractSurefireMojo.execute(AbstractSurefireMojo.java:98)
at org.apache.maven.plugin.DefaultBuildPluginManager.executeMojo(DefaultBuildPluginManager.java:101)
at org.apache.maven.lifecycle.internal.MojoExecutor.execute(MojoExecutor.java:209)
... 23 more
[ERROR]
[ERROR]
[ERROR] For more information about the errors and possible solutions, please read the following articles:
[ERROR] [Help 1] http://cwiki.apache.org/confluence/display/MAVEN/MojoExecutionException
Build step 'Invoke top-level Maven targets' marked build as failure
[locks-and-latches] Releasing all the locks
[locks-and-latches] All the locks released
Archiving artifacts
Recording test results
Updating HBASE-5055
Updating HBASE-5103

Search Discussions

  • Apache Jenkins Server at Dec 30, 2011 at 3:43 am
    See <https://builds.apache.org/job/HBase-0.92/213/>

    ------------------------------------------
    [...truncated 11235 lines...]
    [DEBUG] commons-cli:commons-cli:jar:1.2:compile (selected for compile)
    [DEBUG] commons-configuration:commons-configuration:jar:1.6:compile (selected for compile)
    [DEBUG] commons-collections:commons-collections:jar:3.2.1:compile (selected for compile)
    [DEBUG] commons-lang:commons-lang:jar:2.4:compile (applying version: 2.5)
    [DEBUG] commons-lang:commons-lang:jar:2.5:compile (selected for compile)
    [DEBUG] commons-logging:commons-logging:jar:1.1.1:compile (selected for compile)
    [DEBUG] commons-digester:commons-digester:jar:1.8:compile (selected for compile)
    [DEBUG] commons-beanutils:commons-beanutils:jar:1.7.0:compile (selected for compile)
    [DEBUG] commons-logging:commons-logging:jar:1.0.3:compile (applying version: 1.1.1)
    [DEBUG] commons-logging:commons-logging:jar:1.1:compile (applying version: 1.1.1)
    [DEBUG] commons-beanutils:commons-beanutils-core:jar:1.8.0:compile (selected for compile)
    [DEBUG] com.github.stephenc.high-scale-lib:high-scale-lib:jar:1.1.1:compile (selected for compile)
    [DEBUG] commons-codec:commons-codec:jar:1.4:compile (selected for compile)
    [DEBUG] commons-httpclient:commons-httpclient:jar:3.1:compile (selected for compile)
    [DEBUG] commons-logging:commons-logging:jar:1.0.4:compile (applying version: 1.1.1)
    [DEBUG] commons-codec:commons-codec:jar:1.2:compile (applying version: 1.4)
    [DEBUG] commons-lang:commons-lang:jar:2.5:compile (selected for compile)
    [DEBUG] commons-logging:commons-logging:jar:1.1.1:compile (selected for compile)
    [DEBUG] log4j:log4j:jar:1.2.16:compile (selected for compile)
    [DEBUG] org.apache.avro:avro:jar:1.5.3:compile (selected for compile)
    [DEBUG] org.codehaus.jackson:jackson-mapper-asl:jar:1.7.3:compile (applying version: 1.5.5)
    [DEBUG] org.codehaus.jackson:jackson-mapper-asl:jar:1.5.5:compile (selected for compile)
    [DEBUG] org.codehaus.jackson:jackson-core-asl:jar:1.5.5:compile (selected for compile)
    [DEBUG] org.xerial.snappy:snappy-java:jar:1.0.3.2:compile (selected for compile)
    [DEBUG] org.slf4j:slf4j-api:jar:1.6.1:compile (applying version: 1.5.8)
    [DEBUG] org.slf4j:slf4j-api:jar:1.5.8:compile (selected for compile)
    [DEBUG] org.apache.avro:avro-ipc:jar:1.5.3:compile (selected for compile)
    [DEBUG] org.mortbay.jetty:jetty:jar:6.1.26:compile (selected for compile)
    [DEBUG] org.mortbay.jetty:jetty-util:jar:6.1.26:compile (selected for compile)
    [DEBUG] org.jboss.netty:netty:jar:3.2.4.Final:compile (selected for compile)
    [DEBUG] org.apache.velocity:velocity:jar:1.7:compile (selected for compile)
    [DEBUG] commons-lang:commons-lang:jar:2.4:compile (applying version: 2.5)
    [DEBUG] org.slf4j:slf4j-api:jar:1.6.1:compile (applying version: 1.5.8)
    [DEBUG] org.apache.zookeeper:zookeeper:jar:3.4.2rc0:compile (selected for compile)
    [DEBUG] org.apache.thrift:libthrift:jar:0.7.0:compile (selected for compile)
    [DEBUG] javax.servlet:servlet-api:jar:2.5:compile (selected for compile)
    [DEBUG] org.apache.httpcomponents:httpclient:jar:4.0.1:compile (selected for compile)
    [DEBUG] org.apache.httpcomponents:httpcore:jar:4.0.1:compile (selected for compile)
    [DEBUG] commons-codec:commons-codec:jar:1.3:compile (applying version: 1.4)
    [DEBUG] org.jruby:jruby-complete:jar:1.6.5:compile (selected for compile)
    [DEBUG] org.mortbay.jetty:jetty:jar:6.1.26:compile (selected for compile)
    [DEBUG] org.mortbay.jetty:jetty-util:jar:6.1.26:compile (selected for compile)
    [DEBUG] org.mortbay.jetty:jetty-util:jar:6.1.26:compile (selected for compile)
    [DEBUG] org.mortbay.jetty:jsp-2.1:jar:6.1.14:compile (selected for compile)
    [DEBUG] org.eclipse.jdt:core:jar:3.1.1:compile (selected for compile)
    [DEBUG] org.mortbay.jetty:jsp-api-2.1:jar:6.1.14:compile (selected for compile)
    [DEBUG] org.mortbay.jetty:servlet-api-2.5:jar:6.1.14:compile (selected for compile)
    [DEBUG] org.mortbay.jetty:jsp-api-2.1:jar:6.1.14:compile (selected for compile)
    [DEBUG] org.mortbay.jetty:servlet-api-2.5:jar:6.1.14:compile (selected for compile)
    [DEBUG] org.mortbay.jetty:servlet-api-2.5:jar:6.1.14:compile (selected for compile)
    [DEBUG] org.codehaus.jackson:jackson-core-asl:jar:1.5.5:compile (selected for compile)
    [DEBUG] org.codehaus.jackson:jackson-mapper-asl:jar:1.5.5:compile (selected for compile)
    [DEBUG] org.codehaus.jackson:jackson-jaxrs:jar:1.5.5:compile (selected for compile)
    [DEBUG] org.codehaus.jackson:jackson-xc:jar:1.5.5:compile (selected for compile)
    [DEBUG] org.slf4j:slf4j-api:jar:1.5.8:compile (selected for compile)
    [DEBUG] org.slf4j:slf4j-log4j12:jar:1.5.8:compile (selected for compile)
    [DEBUG] log4j:log4j:jar:1.2.14:compile (applying version: 1.2.16)
    [DEBUG] tomcat:jasper-compiler:jar:5.5.23:runtime (selected for runtime)
    [DEBUG] tomcat:jasper-runtime:jar:5.5.23:runtime (selected for runtime)
    [DEBUG] commons-el:commons-el:jar:1.0:runtime (selected for runtime)
    [DEBUG] commons-logging:commons-logging:jar:1.0.3:runtime (applying version: 1.1.1)
    [DEBUG] commons-logging:commons-logging:jar:1.1.1:runtime (applying artifactScope: compile)
    [DEBUG] org.jamon:jamon-runtime:jar:2.3.1:compile (selected for compile)
    [DEBUG] com.google.protobuf:protobuf-java:jar:2.4.0a:compile (selected for compile)
    [DEBUG] com.sun.jersey:jersey-core:jar:1.4:compile (selected for compile)
    [DEBUG] com.sun.jersey:jersey-json:jar:1.4:compile (selected for compile)
    [DEBUG] org.codehaus.jettison:jettison:jar:1.1:compile (selected for compile)
    [DEBUG] stax:stax-api:jar:1.0.1:compile (selected for compile)
    [DEBUG] com.sun.xml.bind:jaxb-impl:jar:2.1.12:compile (selected for compile)
    [DEBUG] javax.xml.bind:jaxb-api:jar:2.1:compile (selected for compile)
    [DEBUG] javax.activation:activation:jar:1.1:compile (selected for compile)
    [DEBUG] com.sun.jersey:jersey-server:jar:1.4:compile (selected for compile)
    [DEBUG] asm:asm:jar:3.1:compile (selected for compile)
    [DEBUG] javax.xml.bind:jaxb-api:jar:2.1:compile (selected for compile)
    [DEBUG] javax.activation:activation:jar:1.1:compile (selected for compile)
    [DEBUG] stax:stax-api:jar:1.0.1:compile (selected for compile)
    [DEBUG] org.apache.hadoop:hadoop-core:jar:1.0.0rc3:compile (selected for compile)
    [DEBUG] While resolving dependencies of org.apache.hbase:hbase:jar:0.92.0:
    [DEBUG] Statistics for Scope filter [null-scope=true, compile=true, runtime=true, test=false, provided=false, system=false]

    [DEBUG] The following scope filters were not used:
    o Provided
    o System
    [DEBUG] The following artifacts were removed by this filter:
    junit:junit:jar:4.10
    org.mockito:mockito-all:jar:1.8.5
    org.apache.commons:commons-math:jar:2.1
    org.apache.hadoop:hadoop-test:jar:1.0.0rc3
    [DEBUG] Filtering dependency artifacts WITHOUT transitive dependency path information.
    [DEBUG] org.apache.hbase:hbase:jar:0.92.0 was removed by one or more filters.
    [DEBUG] Statistics for Excludes filter:
    o 'org.apache.hbase:hbase'

    [DEBUG] The following artifacts were removed by this artifact exclusion filter:
    org.apache.hbase:hbase:jar:0.92.0
    [DEBUG] Adding 51 dependency artifacts.
    [DEBUG] Adding artifact: com.google.guava:guava:jar:r09 with file: /home/jenkins/.m2/repository/com/google/guava/guava/r09/guava-r09.jar to assembly location: lib/guava-r09.jar.
    [DEBUG] Adding file: /home/jenkins/.m2/repository/com/google/guava/guava/r09/guava-r09.jar to archive location: hbase-0.92.0/lib/guava-r09.jar
    [DEBUG] Adding artifact: commons-cli:commons-cli:jar:1.2 with file: /home/jenkins/.m2/repository/commons-cli/commons-cli/1.2/commons-cli-1.2.jar to assembly location: lib/commons-cli-1.2.jar.
    [DEBUG] Adding file: /home/jenkins/.m2/repository/commons-cli/commons-cli/1.2/commons-cli-1.2.jar to archive location: hbase-0.92.0/lib/commons-cli-1.2.jar
    [DEBUG] Adding artifact: commons-configuration:commons-configuration:jar:1.6 with file: /home/jenkins/.m2/repository/commons-configuration/commons-configuration/1.6/commons-configuration-1.6.jar to assembly location: lib/commons-configuration-1.6.jar.
    [DEBUG] Adding file: /home/jenkins/.m2/repository/commons-configuration/commons-configuration/1.6/commons-configuration-1.6.jar to archive location: hbase-0.92.0/lib/commons-configuration-1.6.jar
    [DEBUG] Adding artifact: commons-collections:commons-collections:jar:3.2.1 with file: /home/jenkins/.m2/repository/commons-collections/commons-collections/3.2.1/commons-collections-3.2.1.jar to assembly location: lib/commons-collections-3.2.1.jar.
    [DEBUG] Adding file: /home/jenkins/.m2/repository/commons-collections/commons-collections/3.2.1/commons-collections-3.2.1.jar to archive location: hbase-0.92.0/lib/commons-collections-3.2.1.jar
    [DEBUG] Adding artifact: commons-lang:commons-lang:jar:2.5 with file: /home/jenkins/.m2/repository/commons-lang/commons-lang/2.5/commons-lang-2.5.jar to assembly location: lib/commons-lang-2.5.jar.
    [DEBUG] Adding file: /home/jenkins/.m2/repository/commons-lang/commons-lang/2.5/commons-lang-2.5.jar to archive location: hbase-0.92.0/lib/commons-lang-2.5.jar
    [DEBUG] Adding artifact: commons-logging:commons-logging:jar:1.1.1 with file: /home/jenkins/.m2/repository/commons-logging/commons-logging/1.1.1/commons-logging-1.1.1.jar to assembly location: lib/commons-logging-1.1.1.jar.
    [DEBUG] Adding file: /home/jenkins/.m2/repository/commons-logging/commons-logging/1.1.1/commons-logging-1.1.1.jar to archive location: hbase-0.92.0/lib/commons-logging-1.1.1.jar
    [DEBUG] Adding artifact: commons-digester:commons-digester:jar:1.8 with file: /home/jenkins/.m2/repository/commons-digester/commons-digester/1.8/commons-digester-1.8.jar to assembly location: lib/commons-digester-1.8.jar.
    [DEBUG] Adding file: /home/jenkins/.m2/repository/commons-digester/commons-digester/1.8/commons-digester-1.8.jar to archive location: hbase-0.92.0/lib/commons-digester-1.8.jar
    [DEBUG] Adding artifact: commons-beanutils:commons-beanutils:jar:1.7.0 with file: /home/jenkins/.m2/repository/commons-beanutils/commons-beanutils/1.7.0/commons-beanutils-1.7.0.jar to assembly location: lib/commons-beanutils-1.7.0.jar.
    [DEBUG] Adding file: /home/jenkins/.m2/repository/commons-beanutils/commons-beanutils/1.7.0/commons-beanutils-1.7.0.jar to archive location: hbase-0.92.0/lib/commons-beanutils-1.7.0.jar
    [DEBUG] Adding artifact: commons-beanutils:commons-beanutils-core:jar:1.8.0 with file: /home/jenkins/.m2/repository/commons-beanutils/commons-beanutils-core/1.8.0/commons-beanutils-core-1.8.0.jar to assembly location: lib/commons-beanutils-core-1.8.0.jar.
    [DEBUG] Adding file: /home/jenkins/.m2/repository/commons-beanutils/commons-beanutils-core/1.8.0/commons-beanutils-core-1.8.0.jar to archive location: hbase-0.92.0/lib/commons-beanutils-core-1.8.0.jar
    [DEBUG] Adding artifact: com.github.stephenc.high-scale-lib:high-scale-lib:jar:1.1.1 with file: /home/jenkins/.m2/repository/com/github/stephenc/high-scale-lib/high-scale-lib/1.1.1/high-scale-lib-1.1.1.jar to assembly location: lib/high-scale-lib-1.1.1.jar.
    [DEBUG] Adding file: /home/jenkins/.m2/repository/com/github/stephenc/high-scale-lib/high-scale-lib/1.1.1/high-scale-lib-1.1.1.jar to archive location: hbase-0.92.0/lib/high-scale-lib-1.1.1.jar
    [DEBUG] Adding artifact: commons-codec:commons-codec:jar:1.4 with file: /home/jenkins/.m2/repository/commons-codec/commons-codec/1.4/commons-codec-1.4.jar to assembly location: lib/commons-codec-1.4.jar.
    [DEBUG] Adding file: /home/jenkins/.m2/repository/commons-codec/commons-codec/1.4/commons-codec-1.4.jar to archive location: hbase-0.92.0/lib/commons-codec-1.4.jar
    [DEBUG] Adding artifact: commons-httpclient:commons-httpclient:jar:3.1 with file: /home/jenkins/.m2/repository/commons-httpclient/commons-httpclient/3.1/commons-httpclient-3.1.jar to assembly location: lib/commons-httpclient-3.1.jar.
    [DEBUG] Adding file: /home/jenkins/.m2/repository/commons-httpclient/commons-httpclient/3.1/commons-httpclient-3.1.jar to archive location: hbase-0.92.0/lib/commons-httpclient-3.1.jar
    [DEBUG] Adding artifact: log4j:log4j:jar:1.2.16 with file: /home/jenkins/.m2/repository/log4j/log4j/1.2.16/log4j-1.2.16.jar to assembly location: lib/log4j-1.2.16.jar.
    [DEBUG] Adding file: /home/jenkins/.m2/repository/log4j/log4j/1.2.16/log4j-1.2.16.jar to archive location: hbase-0.92.0/lib/log4j-1.2.16.jar
    [DEBUG] Adding artifact: org.apache.avro:avro:jar:1.5.3 with file: /home/jenkins/.m2/repository/org/apache/avro/avro/1.5.3/avro-1.5.3.jar to assembly location: lib/avro-1.5.3.jar.
    [DEBUG] Adding file: /home/jenkins/.m2/repository/org/apache/avro/avro/1.5.3/avro-1.5.3.jar to archive location: hbase-0.92.0/lib/avro-1.5.3.jar
    [DEBUG] Adding artifact: org.codehaus.jackson:jackson-mapper-asl:jar:1.5.5 with file: /home/jenkins/.m2/repository/org/codehaus/jackson/jackson-mapper-asl/1.5.5/jackson-mapper-asl-1.5.5.jar to assembly location: lib/jackson-mapper-asl-1.5.5.jar.
    [DEBUG] Adding file: /home/jenkins/.m2/repository/org/codehaus/jackson/jackson-mapper-asl/1.5.5/jackson-mapper-asl-1.5.5.jar to archive location: hbase-0.92.0/lib/jackson-mapper-asl-1.5.5.jar
    [DEBUG] Adding artifact: org.codehaus.jackson:jackson-core-asl:jar:1.5.5 with file: /home/jenkins/.m2/repository/org/codehaus/jackson/jackson-core-asl/1.5.5/jackson-core-asl-1.5.5.jar to assembly location: lib/jackson-core-asl-1.5.5.jar.
    [DEBUG] Adding file: /home/jenkins/.m2/repository/org/codehaus/jackson/jackson-core-asl/1.5.5/jackson-core-asl-1.5.5.jar to archive location: hbase-0.92.0/lib/jackson-core-asl-1.5.5.jar
    [DEBUG] Adding artifact: org.xerial.snappy:snappy-java:jar:1.0.3.2 with file: /home/jenkins/.m2/repository/org/xerial/snappy/snappy-java/1.0.3.2/snappy-java-1.0.3.2.jar to assembly location: lib/snappy-java-1.0.3.2.jar.
    [DEBUG] Adding file: /home/jenkins/.m2/repository/org/xerial/snappy/snappy-java/1.0.3.2/snappy-java-1.0.3.2.jar to archive location: hbase-0.92.0/lib/snappy-java-1.0.3.2.jar
    [DEBUG] Adding artifact: org.slf4j:slf4j-api:jar:1.5.8 with file: /home/jenkins/.m2/repository/org/slf4j/slf4j-api/1.5.8/slf4j-api-1.5.8.jar to assembly location: lib/slf4j-api-1.5.8.jar.
    [DEBUG] Adding file: /home/jenkins/.m2/repository/org/slf4j/slf4j-api/1.5.8/slf4j-api-1.5.8.jar to archive location: hbase-0.92.0/lib/slf4j-api-1.5.8.jar
    [DEBUG] Adding artifact: org.apache.avro:avro-ipc:jar:1.5.3 with file: /home/jenkins/.m2/repository/org/apache/avro/avro-ipc/1.5.3/avro-ipc-1.5.3.jar to assembly location: lib/avro-ipc-1.5.3.jar.
    [DEBUG] Adding file: /home/jenkins/.m2/repository/org/apache/avro/avro-ipc/1.5.3/avro-ipc-1.5.3.jar to archive location: hbase-0.92.0/lib/avro-ipc-1.5.3.jar
    [DEBUG] Adding artifact: org.mortbay.jetty:jetty:jar:6.1.26 with file: /home/jenkins/.m2/repository/org/mortbay/jetty/jetty/6.1.26/jetty-6.1.26.jar to assembly location: lib/jetty-6.1.26.jar.
    [DEBUG] Adding file: /home/jenkins/.m2/repository/org/mortbay/jetty/jetty/6.1.26/jetty-6.1.26.jar to archive location: hbase-0.92.0/lib/jetty-6.1.26.jar
    [DEBUG] Adding artifact: org.mortbay.jetty:jetty-util:jar:6.1.26 with file: /home/jenkins/.m2/repository/org/mortbay/jetty/jetty-util/6.1.26/jetty-util-6.1.26.jar to assembly location: lib/jetty-util-6.1.26.jar.
    [DEBUG] Adding file: /home/jenkins/.m2/repository/org/mortbay/jetty/jetty-util/6.1.26/jetty-util-6.1.26.jar to archive location: hbase-0.92.0/lib/jetty-util-6.1.26.jar
    [DEBUG] Adding artifact: org.jboss.netty:netty:jar:3.2.4.Final with file: /home/jenkins/.m2/repository/org/jboss/netty/netty/3.2.4.Final/netty-3.2.4.Final.jar to assembly location: lib/netty-3.2.4.Final.jar.
    [DEBUG] Adding file: /home/jenkins/.m2/repository/org/jboss/netty/netty/3.2.4.Final/netty-3.2.4.Final.jar to archive location: hbase-0.92.0/lib/netty-3.2.4.Final.jar
    [DEBUG] Adding artifact: org.apache.velocity:velocity:jar:1.7 with file: /home/jenkins/.m2/repository/org/apache/velocity/velocity/1.7/velocity-1.7.jar to assembly location: lib/velocity-1.7.jar.
    [DEBUG] Adding file: /home/jenkins/.m2/repository/org/apache/velocity/velocity/1.7/velocity-1.7.jar to archive location: hbase-0.92.0/lib/velocity-1.7.jar
    [DEBUG] Adding artifact: org.apache.zookeeper:zookeeper:jar:3.4.2rc0 with file: /home/jenkins/.m2/repository/org/apache/zookeeper/zookeeper/3.4.2rc0/zookeeper-3.4.2rc0.jar to assembly location: lib/zookeeper-3.4.2rc0.jar.
    [DEBUG] Adding file: /home/jenkins/.m2/repository/org/apache/zookeeper/zookeeper/3.4.2rc0/zookeeper-3.4.2rc0.jar to archive location: hbase-0.92.0/lib/zookeeper-3.4.2rc0.jar
    [DEBUG] Adding artifact: org.apache.thrift:libthrift:jar:0.7.0 with file: /home/jenkins/.m2/repository/org/apache/thrift/libthrift/0.7.0/libthrift-0.7.0.jar to assembly location: lib/libthrift-0.7.0.jar.
    [DEBUG] Adding file: /home/jenkins/.m2/repository/org/apache/thrift/libthrift/0.7.0/libthrift-0.7.0.jar to archive location: hbase-0.92.0/lib/libthrift-0.7.0.jar
    [DEBUG] Adding artifact: javax.servlet:servlet-api:jar:2.5 with file: /home/jenkins/.m2/repository/javax/servlet/servlet-api/2.5/servlet-api-2.5.jar to assembly location: lib/servlet-api-2.5.jar.
    [DEBUG] Adding file: /home/jenkins/.m2/repository/javax/servlet/servlet-api/2.5/servlet-api-2.5.jar to archive location: hbase-0.92.0/lib/servlet-api-2.5.jar
    [DEBUG] Adding artifact: org.apache.httpcomponents:httpclient:jar:4.0.1 with file: /home/jenkins/.m2/repository/org/apache/httpcomponents/httpclient/4.0.1/httpclient-4.0.1.jar to assembly location: lib/httpclient-4.0.1.jar.
    [DEBUG] Adding file: /home/jenkins/.m2/repository/org/apache/httpcomponents/httpclient/4.0.1/httpclient-4.0.1.jar to archive location: hbase-0.92.0/lib/httpclient-4.0.1.jar
    [DEBUG] Adding artifact: org.apache.httpcomponents:httpcore:jar:4.0.1 with file: /home/jenkins/.m2/repository/org/apache/httpcomponents/httpcore/4.0.1/httpcore-4.0.1.jar to assembly location: lib/httpcore-4.0.1.jar.
    [DEBUG] Adding file: /home/jenkins/.m2/repository/org/apache/httpcomponents/httpcore/4.0.1/httpcore-4.0.1.jar to archive location: hbase-0.92.0/lib/httpcore-4.0.1.jar
    [DEBUG] Adding artifact: org.jruby:jruby-complete:jar:1.6.5 with file: /home/jenkins/.m2/repository/org/jruby/jruby-complete/1.6.5/jruby-complete-1.6.5.jar to assembly location: lib/jruby-complete-1.6.5.jar.
    [DEBUG] Adding file: /home/jenkins/.m2/repository/org/jruby/jruby-complete/1.6.5/jruby-complete-1.6.5.jar to archive location: hbase-0.92.0/lib/jruby-complete-1.6.5.jar
    [DEBUG] Adding artifact: org.mortbay.jetty:jsp-2.1:jar:6.1.14 with file: /home/jenkins/.m2/repository/org/mortbay/jetty/jsp-2.1/6.1.14/jsp-2.1-6.1.14.jar to assembly location: lib/jsp-2.1-6.1.14.jar.
    [DEBUG] Adding file: /home/jenkins/.m2/repository/org/mortbay/jetty/jsp-2.1/6.1.14/jsp-2.1-6.1.14.jar to archive location: hbase-0.92.0/lib/jsp-2.1-6.1.14.jar
    [DEBUG] Adding artifact: org.eclipse.jdt:core:jar:3.1.1 with file: /home/jenkins/.m2/repository/org/eclipse/jdt/core/3.1.1/core-3.1.1.jar to assembly location: lib/core-3.1.1.jar.
    [DEBUG] Adding file: /home/jenkins/.m2/repository/org/eclipse/jdt/core/3.1.1/core-3.1.1.jar to archive location: hbase-0.92.0/lib/core-3.1.1.jar
    [DEBUG] Adding artifact: org.mortbay.jetty:jsp-api-2.1:jar:6.1.14 with file: /home/jenkins/.m2/repository/org/mortbay/jetty/jsp-api-2.1/6.1.14/jsp-api-2.1-6.1.14.jar to assembly location: lib/jsp-api-2.1-6.1.14.jar.
    [DEBUG] Adding file: /home/jenkins/.m2/repository/org/mortbay/jetty/jsp-api-2.1/6.1.14/jsp-api-2.1-6.1.14.jar to archive location: hbase-0.92.0/lib/jsp-api-2.1-6.1.14.jar
    [DEBUG] Adding artifact: org.mortbay.jetty:servlet-api-2.5:jar:6.1.14 with file: /home/jenkins/.m2/repository/org/mortbay/jetty/servlet-api-2.5/6.1.14/servlet-api-2.5-6.1.14.jar to assembly location: lib/servlet-api-2.5-6.1.14.jar.
    [DEBUG] Adding file: /home/jenkins/.m2/repository/org/mortbay/jetty/servlet-api-2.5/6.1.14/servlet-api-2.5-6.1.14.jar to archive location: hbase-0.92.0/lib/servlet-api-2.5-6.1.14.jar
    [DEBUG] Adding artifact: org.codehaus.jackson:jackson-jaxrs:jar:1.5.5 with file: /home/jenkins/.m2/repository/org/codehaus/jackson/jackson-jaxrs/1.5.5/jackson-jaxrs-1.5.5.jar to assembly location: lib/jackson-jaxrs-1.5.5.jar.
    [DEBUG] Adding file: /home/jenkins/.m2/repository/org/codehaus/jackson/jackson-jaxrs/1.5.5/jackson-jaxrs-1.5.5.jar to archive location: hbase-0.92.0/lib/jackson-jaxrs-1.5.5.jar
    [DEBUG] Adding artifact: org.codehaus.jackson:jackson-xc:jar:1.5.5 with file: /home/jenkins/.m2/repository/org/codehaus/jackson/jackson-xc/1.5.5/jackson-xc-1.5.5.jar to assembly location: lib/jackson-xc-1.5.5.jar.
    [DEBUG] Adding file: /home/jenkins/.m2/repository/org/codehaus/jackson/jackson-xc/1.5.5/jackson-xc-1.5.5.jar to archive location: hbase-0.92.0/lib/jackson-xc-1.5.5.jar
    [DEBUG] Adding artifact: org.slf4j:slf4j-log4j12:jar:1.5.8 with file: /home/jenkins/.m2/repository/org/slf4j/slf4j-log4j12/1.5.8/slf4j-log4j12-1.5.8.jar to assembly location: lib/slf4j-log4j12-1.5.8.jar.
    [DEBUG] Adding file: /home/jenkins/.m2/repository/org/slf4j/slf4j-log4j12/1.5.8/slf4j-log4j12-1.5.8.jar to archive location: hbase-0.92.0/lib/slf4j-log4j12-1.5.8.jar
    [DEBUG] Adding artifact: tomcat:jasper-compiler:jar:5.5.23 with file: /home/jenkins/.m2/repository/tomcat/jasper-compiler/5.5.23/jasper-compiler-5.5.23.jar to assembly location: lib/jasper-compiler-5.5.23.jar.
    [DEBUG] Adding file: /home/jenkins/.m2/repository/tomcat/jasper-compiler/5.5.23/jasper-compiler-5.5.23.jar to archive location: hbase-0.92.0/lib/jasper-compiler-5.5.23.jar
    [DEBUG] Adding artifact: tomcat:jasper-runtime:jar:5.5.23 with file: /home/jenkins/.m2/repository/tomcat/jasper-runtime/5.5.23/jasper-runtime-5.5.23.jar to assembly location: lib/jasper-runtime-5.5.23.jar.
    [DEBUG] Adding file: /home/jenkins/.m2/repository/tomcat/jasper-runtime/5.5.23/jasper-runtime-5.5.23.jar to archive location: hbase-0.92.0/lib/jasper-runtime-5.5.23.jar
    [DEBUG] Adding artifact: commons-el:commons-el:jar:1.0 with file: /home/jenkins/.m2/repository/commons-el/commons-el/1.0/commons-el-1.0.jar to assembly location: lib/commons-el-1.0.jar.
    [DEBUG] Adding file: /home/jenkins/.m2/repository/commons-el/commons-el/1.0/commons-el-1.0.jar to archive location: hbase-0.92.0/lib/commons-el-1.0.jar
    [DEBUG] Adding artifact: org.jamon:jamon-runtime:jar:2.3.1 with file: /home/jenkins/.m2/repository/org/jamon/jamon-runtime/2.3.1/jamon-runtime-2.3.1.jar to assembly location: lib/jamon-runtime-2.3.1.jar.
    [DEBUG] Adding file: /home/jenkins/.m2/repository/org/jamon/jamon-runtime/2.3.1/jamon-runtime-2.3.1.jar to archive location: hbase-0.92.0/lib/jamon-runtime-2.3.1.jar
    [DEBUG] Adding artifact: com.google.protobuf:protobuf-java:jar:2.4.0a with file: /home/jenkins/.m2/repository/com/google/protobuf/protobuf-java/2.4.0a/protobuf-java-2.4.0a.jar to assembly location: lib/protobuf-java-2.4.0a.jar.
    [DEBUG] Adding file: /home/jenkins/.m2/repository/com/google/protobuf/protobuf-java/2.4.0a/protobuf-java-2.4.0a.jar to archive location: hbase-0.92.0/lib/protobuf-java-2.4.0a.jar
    [DEBUG] Adding artifact: com.sun.jersey:jersey-core:jar:1.4 with file: /home/jenkins/.m2/repository/com/sun/jersey/jersey-core/1.4/jersey-core-1.4.jar to assembly location: lib/jersey-core-1.4.jar.
    [DEBUG] Adding file: /home/jenkins/.m2/repository/com/sun/jersey/jersey-core/1.4/jersey-core-1.4.jar to archive location: hbase-0.92.0/lib/jersey-core-1.4.jar
    [DEBUG] Adding artifact: com.sun.jersey:jersey-json:jar:1.4 with file: /home/jenkins/.m2/repository/com/sun/jersey/jersey-json/1.4/jersey-json-1.4.jar to assembly location: lib/jersey-json-1.4.jar.
    [DEBUG] Adding file: /home/jenkins/.m2/repository/com/sun/jersey/jersey-json/1.4/jersey-json-1.4.jar to archive location: hbase-0.92.0/lib/jersey-json-1.4.jar
    [DEBUG] Adding artifact: org.codehaus.jettison:jettison:jar:1.1 with file: /home/jenkins/.m2/repository/org/codehaus/jettison/jettison/1.1/jettison-1.1.jar to assembly location: lib/jettison-1.1.jar.
    [DEBUG] Adding file: /home/jenkins/.m2/repository/org/codehaus/jettison/jettison/1.1/jettison-1.1.jar to archive location: hbase-0.92.0/lib/jettison-1.1.jar
    [DEBUG] Adding artifact: stax:stax-api:jar:1.0.1 with file: /home/jenkins/.m2/repository/stax/stax-api/1.0.1/stax-api-1.0.1.jar to assembly location: lib/stax-api-1.0.1.jar.
    [DEBUG] Adding file: /home/jenkins/.m2/repository/stax/stax-api/1.0.1/stax-api-1.0.1.jar to archive location: hbase-0.92.0/lib/stax-api-1.0.1.jar
    [DEBUG] Adding artifact: com.sun.xml.bind:jaxb-impl:jar:2.1.12 with file: /home/jenkins/.m2/repository/com/sun/xml/bind/jaxb-impl/2.1.12/jaxb-impl-2.1.12.jar to assembly location: lib/jaxb-impl-2.1.12.jar.
    [DEBUG] Adding file: /home/jenkins/.m2/repository/com/sun/xml/bind/jaxb-impl/2.1.12/jaxb-impl-2.1.12.jar to archive location: hbase-0.92.0/lib/jaxb-impl-2.1.12.jar
    [DEBUG] Adding artifact: javax.xml.bind:jaxb-api:jar:2.1 with file: /home/jenkins/.m2/repository/javax/xml/bind/jaxb-api/2.1/jaxb-api-2.1.jar to assembly location: lib/jaxb-api-2.1.jar.
    [DEBUG] Adding file: /home/jenkins/.m2/repository/javax/xml/bind/jaxb-api/2.1/jaxb-api-2.1.jar to archive location: hbase-0.92.0/lib/jaxb-api-2.1.jar
    [DEBUG] Adding artifact: javax.activation:activation:jar:1.1 with file: /home/jenkins/.m2/repository/javax/activation/activation/1.1/activation-1.1.jar to assembly location: lib/activation-1.1.jar.
    [DEBUG] Adding file: /home/jenkins/.m2/repository/javax/activation/activation/1.1/activation-1.1.jar to archive location: hbase-0.92.0/lib/activation-1.1.jar
    [DEBUG] Adding artifact: com.sun.jersey:jersey-server:jar:1.4 with file: /home/jenkins/.m2/repository/com/sun/jersey/jersey-server/1.4/jersey-server-1.4.jar to assembly location: lib/jersey-server-1.4.jar.
    [DEBUG] Adding file: /home/jenkins/.m2/repository/com/sun/jersey/jersey-server/1.4/jersey-server-1.4.jar to archive location: hbase-0.92.0/lib/jersey-server-1.4.jar
    [DEBUG] Adding artifact: asm:asm:jar:3.1 with file: /home/jenkins/.m2/repository/asm/asm/3.1/asm-3.1.jar to assembly location: lib/asm-3.1.jar.
    [DEBUG] Adding file: /home/jenkins/.m2/repository/asm/asm/3.1/asm-3.1.jar to archive location: hbase-0.92.0/lib/asm-3.1.jar
    [DEBUG] Adding artifact: org.apache.hadoop:hadoop-core:jar:1.0.0rc3 with file: /home/jenkins/.m2/repository/org/apache/hadoop/hadoop-core/1.0.0rc3/hadoop-core-1.0.0rc3.jar to assembly location: lib/hadoop-core-1.0.0rc3.jar.
    [DEBUG] Adding file: /home/jenkins/.m2/repository/org/apache/hadoop/hadoop-core/1.0.0rc3/hadoop-core-1.0.0rc3.jar to archive location: hbase-0.92.0/lib/hadoop-core-1.0.0rc3.jar
    [INFO] Copying files to <https://builds.apache.org/job/HBase-0.92/ws/trunk/target/hbase-0.92.0>
    [WARNING] Assembly file: <https://builds.apache.org/job/HBase-0.92/ws/trunk/target/hbase-0.92.0> is not a regular file (it may be a directory). It cannot be attached to the project build for installation or deployment.
    [INFO] ------------------------------------------------------------------------
    [INFO] BUILD SUCCESS
    [INFO] ------------------------------------------------------------------------
    [INFO] Total time: 1:56:02.736s
    [INFO] Finished at: Fri Dec 30 03:04:54 UTC 2011
    [INFO] Final Memory: 42M/858M
    [INFO] ------------------------------------------------------------------------
    [locks-and-latches] Releasing all the locks
    [locks-and-latches] All the locks released
    Archiving artifacts
    ERROR: Publisher hudson.tasks.ArtifactArchiver aborted due to exception
    java.lang.InterruptedException
    at java.lang.Object.wait(Native Method)
    at hudson.remoting.Request$1.get(Request.java:246)
    at hudson.remoting.Request$1.get(Request.java:184)
    at hudson.remoting.FutureAdapter.get(FutureAdapter.java:59)
    at hudson.FilePath.copyRecursiveTo(FilePath.java:1619)
    at hudson.tasks.ArtifactArchiver.perform(ArtifactArchiver.java:116)
    at hudson.tasks.BuildStepMonitor$1.perform(BuildStepMonitor.java:19)
    at hudson.model.AbstractBuild$AbstractRunner.perform(AbstractBuild.java:695)
    at hudson.model.AbstractBuild$AbstractRunner.performAllBuildSteps(AbstractBuild.java:670)
    at hudson.model.AbstractBuild$AbstractRunner.performAllBuildSteps(AbstractBuild.java:648)
    at hudson.model.Build$RunnerImpl.post2(Build.java:162)
    at hudson.model.AbstractBuild$AbstractRunner.post(AbstractBuild.java:617)
    at hudson.model.Run.run(Run.java:1429)
    at hudson.model.FreeStyleBuild.run(FreeStyleBuild.java:46)
    at hudson.model.ResourceController.execute(ResourceController.java:88)
    at hudson.model.Executor.run(Executor.java:238)
    Recording test results
    ERROR: Publisher hudson.tasks.junit.JUnitResultArchiver aborted due to exception
    java.lang.InterruptedException
    at java.lang.Object.wait(Native Method)
    at hudson.remoting.Request.call(Request.java:127)
    at hudson.remoting.Channel.call(Channel.java:681)
    at hudson.EnvVars.getRemote(EnvVars.java:202)
    at hudson.model.Computer.getEnvironment(Computer.java:828)
    at hudson.model.Run.getEnvironment(Run.java:1831)
    at hudson.model.AbstractBuild.getEnvironment(AbstractBuild.java:814)
    at hudson.tasks.junit.JUnitResultArchiver.perform(JUnitResultArchiver.java:131)
    at hudson.tasks.BuildStepMonitor$1.perform(BuildStepMonitor.java:19)
    at hudson.model.AbstractBuild$AbstractRunner.perform(AbstractBuild.java:695)
    at hudson.model.AbstractBuild$AbstractRunner.performAllBuildSteps(AbstractBuild.java:670)
    at hudson.model.AbstractBuild$AbstractRunner.performAllBuildSteps(AbstractBuild.java:648)
    at hudson.model.Build$RunnerImpl.post2(Build.java:162)
    at hudson.model.AbstractBuild$AbstractRunner.post(AbstractBuild.java:617)
    at hudson.model.Run.run(Run.java:1429)
    at hudson.model.FreeStyleBuild.run(FreeStyleBuild.java:46)
    at hudson.model.ResourceController.execute(ResourceController.java:88)
    at hudson.model.Executor.run(Executor.java:238)
  • Apache Jenkins Server at Dec 30, 2011 at 7:28 am

Related Discussions

Discussion Navigation
viewthread | post
Discussion Overview
groupdev @
categorieshbase, hadoop
postedDec 29, '11 at 11:23p
activeDec 30, '11 at 7:28a
posts3
users1
websitehbase.apache.org

1 user in discussion

Apache Jenkins Server: 3 posts

People

Translate

site design / logo © 2022 Grokbase