Grokbase Groups HBase dev July 2011
FAQ
See <https://builds.apache.org/job/HBase-TRUNK/2026/changes>

Changes:

[stack] Fix broken TestScanMultipleVersions test -- needed .tableinfo defined before test started... part of the repercussions from hbase-451

------------------------------------------
[...truncated 1444 lines...]
Running org.apache.hadoop.hbase.rest.model.TestTableListModel
Tests run: 3, Failures: 0, Errors: 0, Skipped: 0, Time elapsed: 0.126 sec
Running org.apache.hadoop.hbase.rest.model.TestColumnSchemaModel
Tests run: 2, Failures: 0, Errors: 0, Skipped: 0, Time elapsed: 0.03 sec
Running org.apache.hadoop.hbase.regionserver.TestStoreFile
Tests run: 8, Failures: 0, Errors: 0, Skipped: 0, Time elapsed: 56.703 sec
Running org.apache.hadoop.hbase.zookeeper.TestZooKeeperNodeTracker
Tests run: 2, Failures: 0, Errors: 0, Skipped: 0, Time elapsed: 0.318 sec
Running org.apache.hadoop.hbase.master.TestSplitLogManager
Tests run: 9, Failures: 0, Errors: 0, Skipped: 0, Time elapsed: 12.92 sec
Running org.apache.hadoop.hbase.regionserver.wal.TestHLogMethods
Tests run: 3, Failures: 0, Errors: 0, Skipped: 0, Time elapsed: 0.415 sec
Running org.apache.hadoop.hbase.rest.model.TestScannerModel
Tests run: 3, Failures: 0, Errors: 0, Skipped: 0, Time elapsed: 0.131 sec
Running org.apache.hadoop.hbase.rest.TestVersionResource
Tests run: 7, Failures: 0, Errors: 0, Skipped: 0, Time elapsed: 30.447 sec
Running org.apache.hadoop.hbase.filter.TestFilter
Tests run: 18, Failures: 0, Errors: 0, Skipped: 0, Time elapsed: 4.167 sec
Running org.apache.hadoop.hbase.TestServerName
Tests run: 2, Failures: 0, Errors: 0, Skipped: 0, Time elapsed: 0.017 sec
Running org.apache.hadoop.hbase.regionserver.TestWideScanner
Tests run: 1, Failures: 0, Errors: 0, Skipped: 0, Time elapsed: 19.887 sec
Running org.apache.hadoop.hbase.regionserver.TestSplitTransaction
Tests run: 5, Failures: 0, Errors: 0, Skipped: 0, Time elapsed: 3.373 sec
Running org.apache.hadoop.hbase.util.TestFSTableDescriptors
Tests run: 5, Failures: 0, Errors: 0, Skipped: 0, Time elapsed: 1.594 sec
Running org.apache.hadoop.hbase.replication.regionserver.TestReplicationSink
Tests run: 5, Failures: 0, Errors: 0, Skipped: 0, Time elapsed: 38.933 sec
Running org.apache.hadoop.hbase.regionserver.TestGetClosestAtOrBefore
Tests run: 3, Failures: 0, Errors: 0, Skipped: 0, Time elapsed: 25.287 sec
Running org.apache.hadoop.hbase.regionserver.TestReadWriteConsistencyControl
Tests run: 1, Failures: 0, Errors: 0, Skipped: 0, Time elapsed: 10.02 sec
Running org.apache.hadoop.hbase.util.TestMergeTable
Tests run: 1, Failures: 0, Errors: 0, Skipped: 0, Time elapsed: 56.811 sec
Running org.apache.hadoop.hbase.coprocessor.TestMasterObserver
Tests run: 3, Failures: 0, Errors: 0, Skipped: 0, Time elapsed: 27.553 sec
Running org.apache.hadoop.hbase.rest.model.TestVersionModel
Tests run: 3, Failures: 0, Errors: 0, Skipped: 0, Time elapsed: 0.131 sec
Running org.apache.hadoop.hbase.rest.model.TestCellSetModel
Tests run: 3, Failures: 0, Errors: 0, Skipped: 0, Time elapsed: 0.134 sec
Running org.apache.hadoop.hbase.rest.client.TestRemoteTable
Tests run: 3, Failures: 0, Errors: 0, Skipped: 0, Time elapsed: 22.167 sec
Running org.apache.hadoop.hbase.rest.model.TestStorageClusterStatusModel
Tests run: 3, Failures: 0, Errors: 0, Skipped: 0, Time elapsed: 0.137 sec
Running org.apache.hadoop.hbase.monitoring.TestTaskMonitor
Tests run: 3, Failures: 0, Errors: 0, Skipped: 0, Time elapsed: 0.219 sec
Running org.apache.hadoop.hbase.avro.TestAvroServer
Tests run: 3, Failures: 0, Errors: 0, Skipped: 0, Time elapsed: 43.837 sec
Running org.apache.hadoop.hbase.TestFullLogReconstruction
Tests run: 1, Failures: 0, Errors: 0, Skipped: 0, Time elapsed: 60.324 sec
Running org.apache.hadoop.hbase.TestSerialization
Tests run: 18, Failures: 0, Errors: 0, Skipped: 0, Time elapsed: 0.055 sec
Running org.apache.hadoop.hbase.regionserver.TestKeyValueHeap
Tests run: 3, Failures: 0, Errors: 0, Skipped: 0, Time elapsed: 0.101 sec
Running org.apache.hadoop.hbase.regionserver.TestStoreScanner
Tests run: 14, Failures: 0, Errors: 0, Skipped: 0, Time elapsed: 0.032 sec
Running org.apache.hadoop.hbase.io.hfile.TestReseekTo
Tests run: 1, Failures: 0, Errors: 0, Skipped: 0, Time elapsed: 0.2 sec
Running org.apache.hadoop.hbase.regionserver.TestHRegionInfo
Tests run: 2, Failures: 0, Errors: 0, Skipped: 0, Time elapsed: 0.018 sec
Running org.apache.hadoop.hbase.regionserver.TestScanner
Tests run: 6, Failures: 0, Errors: 0, Skipped: 0, Time elapsed: 72.869 sec
Running org.apache.hadoop.hbase.util.TestKeying
Tests run: 1, Failures: 0, Errors: 0, Skipped: 0, Time elapsed: 0.016 sec
Running org.apache.hadoop.hbase.util.TestIncrementingEnvironmentEdge
Tests run: 1, Failures: 0, Errors: 0, Skipped: 0, Time elapsed: 0.017 sec
Running org.apache.hadoop.hbase.util.TestHBaseFsck
Tests run: 2, Failures: 0, Errors: 0, Skipped: 0, Time elapsed: 47.538 sec
Running org.apache.hadoop.hbase.master.TestRestartCluster
Tests run: 2, Failures: 0, Errors: 0, Skipped: 0, Time elapsed: 71.712 sec
Running org.apache.hadoop.hbase.client.TestShell
Tests run: 1, Failures: 0, Errors: 0, Skipped: 0, Time elapsed: 42.48 sec
Running org.apache.hadoop.hbase.rest.model.TestTableInfoModel
Tests run: 3, Failures: 0, Errors: 0, Skipped: 0, Time elapsed: 0.129 sec
Running org.apache.hadoop.hbase.TestInfoServers
Tests run: 2, Failures: 0, Errors: 0, Skipped: 0, Time elapsed: 34.539 sec
Running org.apache.hadoop.hbase.master.TestLogsCleaner
Tests run: 1, Failures: 0, Errors: 0, Skipped: 0, Time elapsed: 1.18 sec
Running org.apache.hadoop.hbase.client.TestAttributes
Tests run: 3, Failures: 0, Errors: 0, Skipped: 0, Time elapsed: 0.02 sec
Running org.apache.hadoop.hbase.regionserver.TestMasterAddressManager
Tests run: 1, Failures: 0, Errors: 0, Skipped: 0, Time elapsed: 0.297 sec
Running org.apache.hadoop.hbase.master.TestMasterStatusServlet
Tests run: 4, Failures: 0, Errors: 0, Skipped: 0, Time elapsed: 0.522 sec
Running org.apache.hadoop.hbase.catalog.TestCatalogTrackerOnCluster
Tests run: 1, Failures: 0, Errors: 0, Skipped: 0, Time elapsed: 229.886 sec
Running org.apache.hadoop.hbase.regionserver.TestQueryMatcher
Tests run: 4, Failures: 0, Errors: 0, Skipped: 0, Time elapsed: 0.105 sec
Running org.apache.hadoop.hbase.zookeeper.TestZKTable
Tests run: 1, Failures: 0, Errors: 0, Skipped: 0, Time elapsed: 0.302 sec
Running org.apache.hadoop.hbase.client.TestAdmin
Tests run: 20, Failures: 0, Errors: 0, Skipped: 0, Time elapsed: 287.276 sec
Running org.apache.hadoop.hbase.util.TestSortedCopyOnWriteSet
Tests run: 2, Failures: 0, Errors: 0, Skipped: 0, Time elapsed: 0.025 sec
Running org.apache.hadoop.hbase.util.TestMergeTool
Tests run: 1, Failures: 0, Errors: 0, Skipped: 0, Time elapsed: 26.963 sec
Running org.apache.hadoop.hbase.TestAcidGuarantees
Tests run: 3, Failures: 0, Errors: 0, Skipped: 3, Time elapsed: 0.015 sec
Running org.apache.hadoop.hbase.TestHRegionLocation
Tests run: 3, Failures: 0, Errors: 0, Skipped: 0, Time elapsed: 0.019 sec
Running org.apache.hadoop.hbase.client.TestHTableUtil
Tests run: 2, Failures: 0, Errors: 0, Skipped: 0, Time elapsed: 27.329 sec
Running org.apache.hadoop.hbase.filter.TestMultipleColumnPrefixFilter
Tests run: 3, Failures: 0, Errors: 0, Skipped: 0, Time elapsed: 3.239 sec
Running org.apache.hadoop.hbase.util.TestBase64
Tests run: 1, Failures: 0, Errors: 0, Skipped: 0, Time elapsed: 0.018 sec
Running org.apache.hadoop.hbase.coprocessor.TestRegionObserverStacking
Tests run: 1, Failures: 0, Errors: 0, Skipped: 0, Time elapsed: 0.247 sec
Running org.apache.hadoop.hbase.regionserver.TestMemStore
Tests run: 21, Failures: 0, Errors: 0, Skipped: 0, Time elapsed: 30.962 sec
Running org.apache.hadoop.hbase.rest.TestScannerResource
Tests run: 5, Failures: 0, Errors: 0, Skipped: 0, Time elapsed: 71.087 sec
Running org.apache.hadoop.hbase.io.hfile.TestLruBlockCache
Tests run: 7, Failures: 0, Errors: 0, Skipped: 0, Time elapsed: 1.053 sec
Running org.apache.hadoop.hbase.master.TestDeadServer
Tests run: 1, Failures: 0, Errors: 0, Skipped: 0, Time elapsed: 0.018 sec
Running org.apache.hadoop.hbase.rest.TestGzipFilter
Tests run: 2, Failures: 0, Errors: 0, Skipped: 0, Time elapsed: 52.773 sec
Running org.apache.hadoop.hbase.mapreduce.TestTableMapReduce
Tests run: 2, Failures: 0, Errors: 0, Skipped: 0, Time elapsed: 98.127 sec
Running org.apache.hadoop.hbase.TestKeyValue
Tests run: 9, Failures: 0, Errors: 0, Skipped: 0, Time elapsed: 0.025 sec
Running org.apache.hadoop.hbase.filter.TestColumnRangeFilter
Tests run: 1, Failures: 0, Errors: 0, Skipped: 0, Time elapsed: 40.675 sec
Running org.apache.hadoop.hbase.client.TestMultiParallel
Tests run: 10, Failures: 0, Errors: 0, Skipped: 0, Time elapsed: 33.15 sec
Running org.apache.hadoop.hbase.master.TestMaster
Tests run: 1, Failures: 0, Errors: 0, Skipped: 0, Time elapsed: 79.996 sec
Running org.apache.hadoop.hbase.master.TestRollingRestart
Tests run: 1, Failures: 0, Errors: 0, Skipped: 0, Time elapsed: 118.726 sec
Running org.apache.hadoop.hbase.client.TestResult
Tests run: 2, Failures: 0, Errors: 0, Skipped: 0, Time elapsed: 0.043 sec
Running org.apache.hadoop.hbase.client.TestHTablePool
Tests run: 18, Failures: 0, Errors: 0, Skipped: 0, Time elapsed: 331.255 sec
Running org.apache.hadoop.hbase.regionserver.TestRSStatusServlet
Tests run: 2, Failures: 0, Errors: 0, Skipped: 0, Time elapsed: 0.277 sec
Running org.apache.hadoop.hbase.regionserver.TestCompactSelection
Tests run: 1, Failures: 0, Errors: 0, Skipped: 0, Time elapsed: 0.244 sec
Running org.apache.hadoop.hbase.util.TestByteBloomFilter
Tests run: 3, Failures: 0, Errors: 0, Skipped: 0, Time elapsed: 1.566 sec
Running org.apache.hadoop.hbase.rest.model.TestTableSchemaModel
Tests run: 3, Failures: 0, Errors: 0, Skipped: 0, Time elapsed: 0.134 sec
Running org.apache.hadoop.hbase.mapreduce.TestTableInputFormatScan
Tests run: 11, Failures: 0, Errors: 0, Skipped: 0, Time elapsed: 374.504 sec
Running org.apache.hadoop.hbase.filter.TestFilterList
Tests run: 4, Failures: 0, Errors: 0, Skipped: 0, Time elapsed: 0.042 sec
Running org.apache.hadoop.hbase.regionserver.TestHRegion
Tests run: 55, Failures: 0, Errors: 0, Skipped: 0, Time elapsed: 34.005 sec
Running org.apache.hadoop.hbase.master.TestMasterFailover
Tests run: 3, Failures: 0, Errors: 2, Skipped: 0, Time elapsed: 386.708 sec <<< FAILURE!
Running org.apache.hadoop.hbase.client.TestScan
Tests run: 2, Failures: 0, Errors: 0, Skipped: 0, Time elapsed: 0.02 sec
Running org.apache.hadoop.hbase.rest.model.TestTableRegionModel
Tests run: 4, Failures: 0, Errors: 0, Skipped: 0, Time elapsed: 0.032 sec
Running org.apache.hadoop.hbase.client.TestTimestampsFilter
Tests run: 3, Failures: 0, Errors: 0, Skipped: 0, Time elapsed: 52.198 sec
Running org.apache.hadoop.hbase.master.TestLoadBalancer
Tests run: 5, Failures: 0, Errors: 0, Skipped: 0, Time elapsed: 1.979 sec
Running org.apache.hadoop.hbase.util.TestRootPath
Tests run: 1, Failures: 0, Errors: 0, Skipped: 0, Time elapsed: 0.022 sec
Running org.apache.hadoop.hbase.client.TestScannerTimeout
Tests run: 4, Failures: 0, Errors: 0, Skipped: 0, Time elapsed: 75.723 sec
Running org.apache.hadoop.hbase.regionserver.wal.TestWALObserver
Tests run: 1, Failures: 0, Errors: 0, Skipped: 0, Time elapsed: 0.315 sec
Running org.apache.hadoop.hbase.mapred.TestTableMapReduce
Tests run: 1, Failures: 0, Errors: 0, Skipped: 0, Time elapsed: 77.426 sec
Running org.apache.hadoop.hbase.coprocessor.TestAggregateProtocol
Tests run: 44, Failures: 0, Errors: 0, Skipped: 0, Time elapsed: 35.339 sec
Running org.apache.hadoop.hbase.master.TestActiveMasterManager
Tests run: 2, Failures: 0, Errors: 0, Skipped: 0, Time elapsed: 1.461 sec
Running org.apache.hadoop.hbase.util.TestBytes
Tests run: 10, Failures: 0, Errors: 0, Skipped: 0, Time elapsed: 0.022 sec
Running org.apache.hadoop.hbase.filter.TestRandomRowFilter
Tests run: 2, Failures: 0, Errors: 0, Skipped: 0, Time elapsed: 0.432 sec
Running org.apache.hadoop.hbase.replication.regionserver.TestReplicationSourceManager
Tests run: 1, Failures: 0, Errors: 0, Skipped: 0, Time elapsed: 2.12 sec
Running org.apache.hadoop.hbase.util.TestCompressionTest
Tests run: 1, Failures: 0, Errors: 0, Skipped: 0, Time elapsed: 0.026 sec
Running org.apache.hadoop.hbase.client.TestMetaMigration
Tests run: 4, Failures: 0, Errors: 0, Skipped: 0, Time elapsed: 49.69 sec
Running org.apache.hadoop.hbase.client.TestGetRowVersions
Tests run: 1, Failures: 0, Errors: 0, Skipped: 0, Time elapsed: 35.792 sec
Running org.apache.hadoop.hbase.filter.TestDependentColumnFilter
Tests run: 2, Failures: 0, Errors: 0, Skipped: 0, Time elapsed: 0.371 sec
Running org.apache.hadoop.hbase.rest.model.TestCellModel
Tests run: 3, Failures: 0, Errors: 0, Skipped: 0, Time elapsed: 0.128 sec
Running org.apache.hadoop.hbase.master.TestCatalogJanitor
Tests run: 2, Failures: 0, Errors: 0, Skipped: 0, Time elapsed: 0.576 sec
Running org.apache.hadoop.hbase.catalog.TestCatalogTracker
Tests run: 8, Failures: 0, Errors: 0, Skipped: 0, Time elapsed: 3.462 sec
Running org.apache.hadoop.hbase.replication.TestReplicationSource
Tests run: 1, Failures: 0, Errors: 0, Skipped: 0, Time elapsed: 9.872 sec
Running org.apache.hadoop.hbase.coprocessor.TestWALObserver
Tests run: 3, Failures: 0, Errors: 0, Skipped: 0, Time elapsed: 30.259 sec
Running org.apache.hadoop.hbase.rest.TestRowResource
Tests run: 10, Failures: 0, Errors: 0, Skipped: 0, Time elapsed: 33.214 sec
Running org.apache.hadoop.hbase.io.hfile.TestHFile
Tests run: 7, Failures: 0, Errors: 0, Skipped: 0, Time elapsed: 0.317 sec
Running org.apache.hadoop.hbase.catalog.TestMetaReaderEditor
Tests run: 4, Failures: 0, Errors: 0, Skipped: 0, Time elapsed: 38.331 sec
Running org.apache.hadoop.hbase.mapreduce.TestImportTsv
Tests run: 8, Failures: 0, Errors: 0, Skipped: 0, Time elapsed: 50.222 sec
Running org.apache.hadoop.hbase.rest.client.TestRemoteAdmin
Tests run: 2, Failures: 0, Errors: 0, Skipped: 0, Time elapsed: 27.381 sec
Running org.apache.hadoop.hbase.regionserver.wal.TestHLog
Tests run: 9, Failures: 0, Errors: 0, Skipped: 0, Time elapsed: 92.533 sec
Running org.apache.hadoop.hbase.client.TestTimestamp
Tests run: 1, Failures: 0, Errors: 0, Skipped: 0, Time elapsed: 27.885 sec
Running org.apache.hadoop.hbase.TestScanMultipleVersions
Tests run: 1, Failures: 0, Errors: 0, Skipped: 0, Time elapsed: 19.379 sec
Running org.apache.hadoop.hbase.util.TestPoolMap
Tests run: 9, Failures: 0, Errors: 0, Skipped: 0, Time elapsed: 0.03 sec
Running org.apache.hadoop.hbase.TestGlobalMemStoreSize
Tests run: 1, Failures: 0, Errors: 0, Skipped: 0, Time elapsed: 24.679 sec
Running org.apache.hadoop.hbase.rest.model.TestStorageClusterVersionModel
Tests run: 2, Failures: 0, Errors: 0, Skipped: 0, Time elapsed: 0.031 sec
Running org.apache.hadoop.hbase.client.TestHCM
Tests run: 3, Failures: 0, Errors: 0, Skipped: 0, Time elapsed: 28.993 sec

Results :

Failed tests:

Tests in error:

Tests run: 828, Failures: 1, Errors: 2, Skipped: 9

[INFO] ------------------------------------------------------------------------
[INFO] BUILD FAILURE
[INFO] ------------------------------------------------------------------------
[INFO] Total time: 1:55:25.660s
[INFO] Finished at: Wed Jul 13 21:11:20 UTC 2011
[INFO] Final Memory: 35M/436M
[INFO] ------------------------------------------------------------------------
[ERROR] Failed to execute goal org.apache.maven.plugins:maven-surefire-plugin:2.4.3:test (default-test) on project hbase: There are test failures.
[ERROR]
[ERROR] Please refer to <https://builds.apache.org/job/HBase-TRUNK/ws/trunk/target/surefire-reports> for the individual test results.
[ERROR] -> [Help 1]
[ERROR]
[ERROR] To see the full stack trace of the errors, re-run Maven with the -e switch.
[ERROR] Re-run Maven using the -X switch to enable full debug logging.
[ERROR]
[ERROR] For more information about the errors and possible solutions, please read the following articles:
[ERROR] [Help 1] http://cwiki.apache.org/confluence/display/MAVEN/MojoFailureException
[locks-and-latches] Releasing all the locks
[locks-and-latches] All the locks released
Archiving artifacts
Recording test results
Updating HBASE-451

Search Discussions

  • Apache Jenkins Server at Jul 14, 2011 at 4:01 am
    See <https://builds.apache.org/job/HBase-TRUNK/2027/changes>

    Changes:

    [stack] Fix broken TestMasterFailover test -- needed .tableinfo defined before test started... part of the repercussions from hbase-451; I don't this fixes all TestMasterFailover failures but at least a few obvious failures

    ------------------------------------------
    [...truncated 1427 lines...]
    Running org.apache.hadoop.hbase.regionserver.TestKeyValueScanFixture
    Tests run: 1, Failures: 0, Errors: 0, Skipped: 0, Time elapsed: 0.012 sec
    Running org.apache.hadoop.hbase.rest.model.TestTableListModel
    Tests run: 3, Failures: 0, Errors: 0, Skipped: 0, Time elapsed: 0.095 sec
    Running org.apache.hadoop.hbase.rest.model.TestColumnSchemaModel
    Tests run: 2, Failures: 0, Errors: 0, Skipped: 0, Time elapsed: 0.023 sec
    Running org.apache.hadoop.hbase.regionserver.TestStoreFile
    Tests run: 8, Failures: 0, Errors: 0, Skipped: 0, Time elapsed: 29.463 sec
    Running org.apache.hadoop.hbase.zookeeper.TestZooKeeperNodeTracker
    Tests run: 2, Failures: 0, Errors: 0, Skipped: 0, Time elapsed: 0.229 sec
    Running org.apache.hadoop.hbase.rest.model.TestScannerModel
    Tests run: 3, Failures: 0, Errors: 0, Skipped: 0, Time elapsed: 0.096 sec
    Running org.apache.hadoop.hbase.master.TestSplitLogManager
    Tests run: 9, Failures: 0, Errors: 0, Skipped: 0, Time elapsed: 11.624 sec
    Running org.apache.hadoop.hbase.regionserver.wal.TestHLogMethods
    Tests run: 3, Failures: 0, Errors: 0, Skipped: 0, Time elapsed: 0.336 sec
    Running org.apache.hadoop.hbase.rest.TestVersionResource
    Tests run: 7, Failures: 0, Errors: 0, Skipped: 0, Time elapsed: 30.383 sec
    Running org.apache.hadoop.hbase.filter.TestFilter
    Tests run: 18, Failures: 0, Errors: 0, Skipped: 0, Time elapsed: 3.331 sec
    Running org.apache.hadoop.hbase.TestServerName
    Tests run: 2, Failures: 0, Errors: 0, Skipped: 0, Time elapsed: 0.013 sec
    Running org.apache.hadoop.hbase.regionserver.TestWideScanner
    Tests run: 1, Failures: 0, Errors: 0, Skipped: 0, Time elapsed: 30.463 sec
    Running org.apache.hadoop.hbase.regionserver.TestSplitTransaction
    Tests run: 5, Failures: 0, Errors: 0, Skipped: 0, Time elapsed: 2.444 sec
    Running org.apache.hadoop.hbase.util.TestFSTableDescriptors
    Tests run: 5, Failures: 1, Errors: 0, Skipped: 0, Time elapsed: 1.391 sec <<< FAILURE!
    Running org.apache.hadoop.hbase.replication.regionserver.TestReplicationSink
    Tests run: 5, Failures: 0, Errors: 0, Skipped: 0, Time elapsed: 39.204 sec
    Running org.apache.hadoop.hbase.util.TestMergeTable
    Tests run: 1, Failures: 0, Errors: 0, Skipped: 0, Time elapsed: 60.681 sec
    Running org.apache.hadoop.hbase.regionserver.TestReadWriteConsistencyControl
    Tests run: 1, Failures: 0, Errors: 0, Skipped: 0, Time elapsed: 10.021 sec
    Running org.apache.hadoop.hbase.regionserver.TestGetClosestAtOrBefore
    Tests run: 3, Failures: 0, Errors: 0, Skipped: 0, Time elapsed: 21.923 sec
    Running org.apache.hadoop.hbase.coprocessor.TestMasterObserver
    Tests run: 3, Failures: 0, Errors: 0, Skipped: 0, Time elapsed: 37.033 sec
    Running org.apache.hadoop.hbase.rest.model.TestVersionModel
    Tests run: 3, Failures: 0, Errors: 0, Skipped: 0, Time elapsed: 0.095 sec
    Running org.apache.hadoop.hbase.rest.model.TestCellSetModel
    Tests run: 3, Failures: 0, Errors: 0, Skipped: 0, Time elapsed: 0.1 sec
    Running org.apache.hadoop.hbase.rest.model.TestStorageClusterStatusModel
    Tests run: 3, Failures: 0, Errors: 0, Skipped: 0, Time elapsed: 0.1 sec
    Running org.apache.hadoop.hbase.rest.client.TestRemoteTable
    Tests run: 3, Failures: 0, Errors: 0, Skipped: 0, Time elapsed: 19.716 sec
    Running org.apache.hadoop.hbase.monitoring.TestTaskMonitor
    Tests run: 3, Failures: 0, Errors: 0, Skipped: 0, Time elapsed: 0.258 sec
    Running org.apache.hadoop.hbase.avro.TestAvroServer
    Tests run: 3, Failures: 0, Errors: 0, Skipped: 0, Time elapsed: 48.015 sec
    Running org.apache.hadoop.hbase.TestFullLogReconstruction
    Tests run: 1, Failures: 0, Errors: 0, Skipped: 0, Time elapsed: 67.828 sec
    Running org.apache.hadoop.hbase.TestSerialization
    Tests run: 18, Failures: 0, Errors: 0, Skipped: 0, Time elapsed: 0.043 sec
    Running org.apache.hadoop.hbase.regionserver.TestKeyValueHeap
    Tests run: 3, Failures: 0, Errors: 0, Skipped: 0, Time elapsed: 0.092 sec
    Running org.apache.hadoop.hbase.regionserver.TestStoreScanner
    Tests run: 14, Failures: 0, Errors: 0, Skipped: 0, Time elapsed: 0.025 sec
    Running org.apache.hadoop.hbase.io.hfile.TestReseekTo
    Tests run: 1, Failures: 0, Errors: 0, Skipped: 0, Time elapsed: 0.146 sec
    Running org.apache.hadoop.hbase.util.TestIncrementingEnvironmentEdge
    Tests run: 1, Failures: 0, Errors: 0, Skipped: 0, Time elapsed: 0.012 sec
    Running org.apache.hadoop.hbase.util.TestKeying
    Tests run: 1, Failures: 0, Errors: 0, Skipped: 0, Time elapsed: 0.012 sec
    Running org.apache.hadoop.hbase.regionserver.TestScanner
    Tests run: 6, Failures: 0, Errors: 0, Skipped: 0, Time elapsed: 66.79 sec
    Running org.apache.hadoop.hbase.regionserver.TestHRegionInfo
    Tests run: 2, Failures: 0, Errors: 0, Skipped: 0, Time elapsed: 0.014 sec
    Running org.apache.hadoop.hbase.util.TestHBaseFsck
    Tests run: 2, Failures: 0, Errors: 0, Skipped: 0, Time elapsed: 51.496 sec
    Running org.apache.hadoop.hbase.client.TestShell
    Tests run: 1, Failures: 0, Errors: 0, Skipped: 0, Time elapsed: 55.171 sec
    Running org.apache.hadoop.hbase.master.TestRestartCluster
    Tests run: 2, Failures: 0, Errors: 0, Skipped: 0, Time elapsed: 63.528 sec
    Running org.apache.hadoop.hbase.rest.model.TestTableInfoModel
    Tests run: 3, Failures: 0, Errors: 0, Skipped: 0, Time elapsed: 0.099 sec
    Running org.apache.hadoop.hbase.TestInfoServers
    Tests run: 2, Failures: 0, Errors: 0, Skipped: 0, Time elapsed: 30.511 sec
    Running org.apache.hadoop.hbase.regionserver.TestMasterAddressManager
    Tests run: 1, Failures: 0, Errors: 0, Skipped: 0, Time elapsed: 0.203 sec
    Running org.apache.hadoop.hbase.client.TestAttributes
    Tests run: 3, Failures: 0, Errors: 0, Skipped: 0, Time elapsed: 0.016 sec
    Running org.apache.hadoop.hbase.master.TestLogsCleaner
    Tests run: 1, Failures: 0, Errors: 0, Skipped: 0, Time elapsed: 0.834 sec
    Running org.apache.hadoop.hbase.master.TestMasterStatusServlet
    Tests run: 4, Failures: 0, Errors: 0, Skipped: 0, Time elapsed: 0.376 sec
    Running org.apache.hadoop.hbase.catalog.TestCatalogTrackerOnCluster
    Tests run: 1, Failures: 0, Errors: 0, Skipped: 0, Time elapsed: 224.235 sec
    Running org.apache.hadoop.hbase.regionserver.TestQueryMatcher
    Tests run: 4, Failures: 0, Errors: 0, Skipped: 0, Time elapsed: 0.089 sec
    Running org.apache.hadoop.hbase.zookeeper.TestZKTable
    Tests run: 1, Failures: 0, Errors: 0, Skipped: 0, Time elapsed: 0.205 sec
    Running org.apache.hadoop.hbase.client.TestAdmin
    Tests run: 20, Failures: 0, Errors: 0, Skipped: 0, Time elapsed: 220.098 sec
    Running org.apache.hadoop.hbase.util.TestSortedCopyOnWriteSet
    Tests run: 2, Failures: 0, Errors: 0, Skipped: 0, Time elapsed: 0.019 sec
    Running org.apache.hadoop.hbase.util.TestMergeTool
    Tests run: 1, Failures: 0, Errors: 0, Skipped: 0, Time elapsed: 17.767 sec
    Running org.apache.hadoop.hbase.TestAcidGuarantees
    Tests run: 3, Failures: 0, Errors: 0, Skipped: 3, Time elapsed: 0.011 sec
    Running org.apache.hadoop.hbase.TestHRegionLocation
    Tests run: 3, Failures: 0, Errors: 0, Skipped: 0, Time elapsed: 0.014 sec
    Running org.apache.hadoop.hbase.filter.TestMultipleColumnPrefixFilter
    Tests run: 3, Failures: 0, Errors: 0, Skipped: 0, Time elapsed: 2.74 sec
    Running org.apache.hadoop.hbase.client.TestHTableUtil
    Tests run: 2, Failures: 0, Errors: 0, Skipped: 0, Time elapsed: 33.914 sec
    Running org.apache.hadoop.hbase.util.TestBase64
    Tests run: 1, Failures: 0, Errors: 0, Skipped: 0, Time elapsed: 0.013 sec
    Running org.apache.hadoop.hbase.coprocessor.TestRegionObserverStacking
    Tests run: 1, Failures: 0, Errors: 0, Skipped: 0, Time elapsed: 0.178 sec
    Running org.apache.hadoop.hbase.regionserver.TestMemStore
    Tests run: 21, Failures: 0, Errors: 0, Skipped: 0, Time elapsed: 20.026 sec
    Running org.apache.hadoop.hbase.rest.TestScannerResource
    Tests run: 5, Failures: 0, Errors: 0, Skipped: 0, Time elapsed: 75.069 sec
    Running org.apache.hadoop.hbase.io.hfile.TestLruBlockCache
    Tests run: 7, Failures: 0, Errors: 0, Skipped: 0, Time elapsed: 1.047 sec
    Running org.apache.hadoop.hbase.master.TestDeadServer
    Tests run: 1, Failures: 0, Errors: 0, Skipped: 0, Time elapsed: 0.014 sec
    Running org.apache.hadoop.hbase.rest.TestGzipFilter
    Tests run: 2, Failures: 0, Errors: 0, Skipped: 0, Time elapsed: 20.849 sec
    Running org.apache.hadoop.hbase.TestKeyValue
    Tests run: 9, Failures: 0, Errors: 0, Skipped: 0, Time elapsed: 0.019 sec
    Running org.apache.hadoop.hbase.mapreduce.TestTableMapReduce
    Tests run: 2, Failures: 0, Errors: 0, Skipped: 0, Time elapsed: 82.542 sec
    Running org.apache.hadoop.hbase.filter.TestColumnRangeFilter
    Tests run: 1, Failures: 0, Errors: 0, Skipped: 0, Time elapsed: 23.84 sec
    Running org.apache.hadoop.hbase.client.TestMultiParallel
    Tests run: 10, Failures: 0, Errors: 0, Skipped: 0, Time elapsed: 43.716 sec
    Running org.apache.hadoop.hbase.master.TestMaster
    Tests run: 1, Failures: 0, Errors: 0, Skipped: 0, Time elapsed: 88.977 sec
    Running org.apache.hadoop.hbase.client.TestResult
    Tests run: 2, Failures: 0, Errors: 0, Skipped: 0, Time elapsed: 0.033 sec
    Running org.apache.hadoop.hbase.master.TestRollingRestart
    Tests run: 1, Failures: 0, Errors: 0, Skipped: 0, Time elapsed: 55.026 sec
    Running org.apache.hadoop.hbase.client.TestHTablePool
    Tests run: 18, Failures: 0, Errors: 0, Skipped: 0, Time elapsed: 290.617 sec
    Running org.apache.hadoop.hbase.regionserver.TestRSStatusServlet
    Tests run: 2, Failures: 0, Errors: 0, Skipped: 0, Time elapsed: 0.213 sec
    Running org.apache.hadoop.hbase.util.TestByteBloomFilter
    Tests run: 3, Failures: 0, Errors: 0, Skipped: 0, Time elapsed: 1.014 sec
    Running org.apache.hadoop.hbase.rest.model.TestTableSchemaModel
    Tests run: 3, Failures: 0, Errors: 0, Skipped: 0, Time elapsed: 0.101 sec
    Running org.apache.hadoop.hbase.regionserver.TestCompactSelection
    Tests run: 1, Failures: 0, Errors: 0, Skipped: 0, Time elapsed: 0.183 sec
    Running org.apache.hadoop.hbase.filter.TestFilterList
    Tests run: 4, Failures: 0, Errors: 0, Skipped: 0, Time elapsed: 0.031 sec
    Running org.apache.hadoop.hbase.mapreduce.TestTableInputFormatScan
    Tests run: 11, Failures: 0, Errors: 0, Skipped: 0, Time elapsed: 332.633 sec
    Running org.apache.hadoop.hbase.regionserver.TestHRegion
    Tests run: 55, Failures: 0, Errors: 0, Skipped: 0, Time elapsed: 26.515 sec
    Running org.apache.hadoop.hbase.rest.model.TestTableRegionModel
    Tests run: 4, Failures: 0, Errors: 0, Skipped: 0, Time elapsed: 0.025 sec
    Running org.apache.hadoop.hbase.client.TestScan
    Tests run: 2, Failures: 0, Errors: 0, Skipped: 0, Time elapsed: 0.015 sec
    Running org.apache.hadoop.hbase.master.TestMasterFailover
    Tests run: 3, Failures: 0, Errors: 0, Skipped: 0, Time elapsed: 85.172 sec
    Running org.apache.hadoop.hbase.client.TestTimestampsFilter
    Tests run: 3, Failures: 0, Errors: 0, Skipped: 0, Time elapsed: 36.121 sec
    Running org.apache.hadoop.hbase.util.TestRootPath
    Tests run: 1, Failures: 0, Errors: 0, Skipped: 0, Time elapsed: 0.016 sec
    Running org.apache.hadoop.hbase.master.TestLoadBalancer
    Tests run: 5, Failures: 0, Errors: 0, Skipped: 0, Time elapsed: 1.405 sec
    Running org.apache.hadoop.hbase.mapred.TestTableMapReduce
    Tests run: 1, Failures: 0, Errors: 0, Skipped: 0, Time elapsed: 46.256 sec
    Running org.apache.hadoop.hbase.client.TestScannerTimeout
    Tests run: 4, Failures: 0, Errors: 0, Skipped: 0, Time elapsed: 48.352 sec
    Running org.apache.hadoop.hbase.regionserver.wal.TestWALObserver
    Tests run: 1, Failures: 0, Errors: 0, Skipped: 0, Time elapsed: 0.215 sec
    Running org.apache.hadoop.hbase.coprocessor.TestAggregateProtocol
    Tests run: 44, Failures: 0, Errors: 0, Skipped: 0, Time elapsed: 20.617 sec
    Running org.apache.hadoop.hbase.util.TestBytes
    Tests run: 10, Failures: 0, Errors: 0, Skipped: 0, Time elapsed: 0.017 sec
    Running org.apache.hadoop.hbase.replication.regionserver.TestReplicationSourceManager
    Tests run: 1, Failures: 0, Errors: 0, Skipped: 0, Time elapsed: 0.373 sec
    Running org.apache.hadoop.hbase.filter.TestRandomRowFilter
    Tests run: 2, Failures: 0, Errors: 0, Skipped: 0, Time elapsed: 0.298 sec
    Running org.apache.hadoop.hbase.master.TestActiveMasterManager
    Tests run: 2, Failures: 0, Errors: 0, Skipped: 0, Time elapsed: 0.334 sec
    Running org.apache.hadoop.hbase.util.TestCompressionTest
    Tests run: 1, Failures: 0, Errors: 0, Skipped: 0, Time elapsed: 0.021 sec
    Running org.apache.hadoop.hbase.client.TestMetaMigration
    Tests run: 4, Failures: 0, Errors: 0, Skipped: 0, Time elapsed: 15.249 sec
    Running org.apache.hadoop.hbase.filter.TestDependentColumnFilter
    Tests run: 2, Failures: 0, Errors: 0, Skipped: 0, Time elapsed: 0.261 sec
    Running org.apache.hadoop.hbase.client.TestGetRowVersions
    Tests run: 1, Failures: 0, Errors: 0, Skipped: 0, Time elapsed: 41.584 sec
    Running org.apache.hadoop.hbase.rest.model.TestCellModel
    Tests run: 3, Failures: 0, Errors: 0, Skipped: 0, Time elapsed: 0.097 sec
    Running org.apache.hadoop.hbase.replication.TestReplicationSource
    Tests run: 1, Failures: 0, Errors: 0, Skipped: 0, Time elapsed: 1.092 sec
    Running org.apache.hadoop.hbase.coprocessor.TestWALObserver
    Tests run: 3, Failures: 0, Errors: 0, Skipped: 0, Time elapsed: 40.368 sec
    Running org.apache.hadoop.hbase.master.TestCatalogJanitor
    Tests run: 2, Failures: 0, Errors: 0, Skipped: 0, Time elapsed: 0.522 sec
    Running org.apache.hadoop.hbase.catalog.TestCatalogTracker
    Tests run: 8, Failures: 0, Errors: 0, Skipped: 0, Time elapsed: 2.624 sec
    Running org.apache.hadoop.hbase.rest.TestRowResource
    Tests run: 10, Failures: 0, Errors: 0, Skipped: 0, Time elapsed: 20.843 sec
    Running org.apache.hadoop.hbase.io.hfile.TestHFile
    Tests run: 7, Failures: 0, Errors: 0, Skipped: 0, Time elapsed: 0.354 sec
    Running org.apache.hadoop.hbase.catalog.TestMetaReaderEditor
    Tests run: 4, Failures: 0, Errors: 0, Skipped: 0, Time elapsed: 21.471 sec
    Running org.apache.hadoop.hbase.mapreduce.TestImportTsv
    Tests run: 8, Failures: 0, Errors: 0, Skipped: 0, Time elapsed: 48.69 sec
    Running org.apache.hadoop.hbase.rest.client.TestRemoteAdmin
    Tests run: 2, Failures: 0, Errors: 0, Skipped: 0, Time elapsed: 23.714 sec
    Running org.apache.hadoop.hbase.regionserver.wal.TestHLog
    Tests run: 9, Failures: 0, Errors: 0, Skipped: 0, Time elapsed: 89.62 sec
    Running org.apache.hadoop.hbase.client.TestTimestamp
    Tests run: 1, Failures: 0, Errors: 0, Skipped: 0, Time elapsed: 16.4 sec
    Running org.apache.hadoop.hbase.util.TestPoolMap
    Tests run: 9, Failures: 0, Errors: 0, Skipped: 0, Time elapsed: 0.023 sec
    Running org.apache.hadoop.hbase.TestScanMultipleVersions
    Tests run: 1, Failures: 0, Errors: 0, Skipped: 0, Time elapsed: 23.517 sec
    Running org.apache.hadoop.hbase.rest.model.TestStorageClusterVersionModel
    Tests run: 2, Failures: 0, Errors: 0, Skipped: 0, Time elapsed: 0.022 sec
    Running org.apache.hadoop.hbase.TestGlobalMemStoreSize
    Tests run: 1, Failures: 0, Errors: 0, Skipped: 0, Time elapsed: 22.653 sec
    Running org.apache.hadoop.hbase.client.TestHCM
    Tests run: 3, Failures: 0, Errors: 0, Skipped: 0, Time elapsed: 18.998 sec

    Results :

    Failed tests:

    Tests run: 828, Failures: 1, Errors: 0, Skipped: 9

    [INFO] ------------------------------------------------------------------------
    [INFO] BUILD FAILURE
    [INFO] ------------------------------------------------------------------------
    [INFO] Total time: 1:40:16.893s
    [INFO] Finished at: Thu Jul 14 00:36:27 UTC 2011
    [INFO] Final Memory: 35M/638M
    [INFO] ------------------------------------------------------------------------
    [ERROR] Failed to execute goal org.apache.maven.plugins:maven-surefire-plugin:2.4.3:test (default-test) on project hbase: There are test failures.
    [ERROR]
    [ERROR] Please refer to /x1/jenkins/jenkins-slave/workspace/HBase-TRUNK/trunk/target/surefire-reports for the individual test results.
    [ERROR] -> [Help 1]
    [ERROR]
    [ERROR] To see the full stack trace of the errors, re-run Maven with the -e switch.
    [ERROR] Re-run Maven using the -X switch to enable full debug logging.
    [ERROR]
    [ERROR] For more information about the errors and possible solutions, please read the following articles:
    [ERROR] [Help 1] http://cwiki.apache.org/confluence/display/MAVEN/MojoFailureException
    [locks-and-latches] Releasing all the locks
    [locks-and-latches] All the locks released
    Archiving artifacts
    Recording test results
    Updating HBASE-451
  • Apache Jenkins Server at Jul 14, 2011 at 3:44 am
    See <https://builds.apache.org/job/HBase-TRUNK/2028/changes>

    Changes:

    [stack] HBASE-3872 Hole in split transaction rollback; edits to .META. need to be rolled back even if it seems like they didn't make it

    [stack] HBASE-3872 Hole in split transaction rollback; edits to .META. need to be rolled back even if it seems like they didn't make it

    ------------------------------------------
    [...truncated 1445 lines...]
    Running org.apache.hadoop.hbase.rest.model.TestTableListModel
    Tests run: 3, Failures: 0, Errors: 0, Skipped: 0, Time elapsed: 0.095 sec
    Running org.apache.hadoop.hbase.rest.model.TestColumnSchemaModel
    Tests run: 2, Failures: 0, Errors: 0, Skipped: 0, Time elapsed: 0.023 sec
    Running org.apache.hadoop.hbase.regionserver.TestStoreFile
    Tests run: 8, Failures: 0, Errors: 0, Skipped: 0, Time elapsed: 28.034 sec
    Running org.apache.hadoop.hbase.zookeeper.TestZooKeeperNodeTracker
    Tests run: 2, Failures: 0, Errors: 0, Skipped: 0, Time elapsed: 0.186 sec
    Running org.apache.hadoop.hbase.rest.model.TestScannerModel
    Tests run: 3, Failures: 0, Errors: 0, Skipped: 0, Time elapsed: 0.095 sec
    Running org.apache.hadoop.hbase.master.TestSplitLogManager
    Tests run: 9, Failures: 0, Errors: 0, Skipped: 0, Time elapsed: 11.498 sec
    Running org.apache.hadoop.hbase.regionserver.wal.TestHLogMethods
    Tests run: 3, Failures: 0, Errors: 0, Skipped: 0, Time elapsed: 0.289 sec
    Running org.apache.hadoop.hbase.rest.TestVersionResource
    Tests run: 7, Failures: 0, Errors: 0, Skipped: 0, Time elapsed: 17.374 sec
    Running org.apache.hadoop.hbase.filter.TestFilter
    Tests run: 18, Failures: 0, Errors: 0, Skipped: 0, Time elapsed: 2.796 sec
    Running org.apache.hadoop.hbase.TestServerName
    Tests run: 2, Failures: 0, Errors: 0, Skipped: 0, Time elapsed: 0.013 sec
    Running org.apache.hadoop.hbase.regionserver.TestWideScanner
    Tests run: 1, Failures: 0, Errors: 0, Skipped: 0, Time elapsed: 20.876 sec
    Running org.apache.hadoop.hbase.regionserver.TestSplitTransaction
    Tests run: 6, Failures: 0, Errors: 0, Skipped: 0, Time elapsed: 2.693 sec
    Running org.apache.hadoop.hbase.util.TestFSTableDescriptors
    Tests run: 5, Failures: 1, Errors: 0, Skipped: 0, Time elapsed: 1.325 sec <<< FAILURE!
    Running org.apache.hadoop.hbase.replication.regionserver.TestReplicationSink
    Tests run: 5, Failures: 0, Errors: 0, Skipped: 0, Time elapsed: 32.813 sec
    Running org.apache.hadoop.hbase.util.TestMergeTable
    Tests run: 1, Failures: 0, Errors: 0, Skipped: 0, Time elapsed: 34.685 sec
    Running org.apache.hadoop.hbase.regionserver.TestReadWriteConsistencyControl
    Tests run: 1, Failures: 0, Errors: 0, Skipped: 0, Time elapsed: 10.021 sec
    Running org.apache.hadoop.hbase.regionserver.TestGetClosestAtOrBefore
    Tests run: 3, Failures: 0, Errors: 0, Skipped: 0, Time elapsed: 23.445 sec
    Running org.apache.hadoop.hbase.coprocessor.TestMasterObserver
    Tests run: 3, Failures: 0, Errors: 0, Skipped: 0, Time elapsed: 27.617 sec
    Running org.apache.hadoop.hbase.rest.model.TestVersionModel
    Tests run: 3, Failures: 0, Errors: 0, Skipped: 0, Time elapsed: 0.098 sec
    Running org.apache.hadoop.hbase.rest.model.TestCellSetModel
    Tests run: 3, Failures: 0, Errors: 0, Skipped: 0, Time elapsed: 0.098 sec
    Running org.apache.hadoop.hbase.rest.model.TestStorageClusterStatusModel
    Tests run: 3, Failures: 0, Errors: 0, Skipped: 0, Time elapsed: 0.1 sec
    Running org.apache.hadoop.hbase.rest.client.TestRemoteTable
    Tests run: 3, Failures: 0, Errors: 0, Skipped: 0, Time elapsed: 25.722 sec
    Running org.apache.hadoop.hbase.monitoring.TestTaskMonitor
    Tests run: 3, Failures: 0, Errors: 0, Skipped: 0, Time elapsed: 0.226 sec
    Running org.apache.hadoop.hbase.avro.TestAvroServer
    Tests run: 3, Failures: 0, Errors: 0, Skipped: 0, Time elapsed: 29.552 sec
    Running org.apache.hadoop.hbase.TestFullLogReconstruction
    Tests run: 1, Failures: 0, Errors: 0, Skipped: 0, Time elapsed: 54.16 sec
    Running org.apache.hadoop.hbase.TestSerialization
    Tests run: 18, Failures: 0, Errors: 0, Skipped: 0, Time elapsed: 0.046 sec
    Running org.apache.hadoop.hbase.regionserver.TestKeyValueHeap
    Tests run: 3, Failures: 0, Errors: 0, Skipped: 0, Time elapsed: 0.065 sec
    Running org.apache.hadoop.hbase.regionserver.TestStoreScanner
    Tests run: 14, Failures: 0, Errors: 0, Skipped: 0, Time elapsed: 0.024 sec
    Running org.apache.hadoop.hbase.io.hfile.TestReseekTo
    Tests run: 1, Failures: 0, Errors: 0, Skipped: 0, Time elapsed: 0.144 sec
    Running org.apache.hadoop.hbase.util.TestIncrementingEnvironmentEdge
    Tests run: 1, Failures: 0, Errors: 0, Skipped: 0, Time elapsed: 0.014 sec
    Running org.apache.hadoop.hbase.util.TestKeying
    Tests run: 1, Failures: 0, Errors: 0, Skipped: 0, Time elapsed: 0.012 sec
    Running org.apache.hadoop.hbase.regionserver.TestScanner
    Tests run: 6, Failures: 0, Errors: 0, Skipped: 0, Time elapsed: 48.537 sec
    Running org.apache.hadoop.hbase.regionserver.TestHRegionInfo
    Tests run: 2, Failures: 0, Errors: 0, Skipped: 0, Time elapsed: 0.014 sec
    Running org.apache.hadoop.hbase.util.TestHBaseFsck
    Tests run: 2, Failures: 0, Errors: 0, Skipped: 0, Time elapsed: 35.077 sec
    Running org.apache.hadoop.hbase.client.TestShell
    Tests run: 1, Failures: 0, Errors: 0, Skipped: 0, Time elapsed: 36.023 sec
    Running org.apache.hadoop.hbase.master.TestRestartCluster
    Tests run: 2, Failures: 0, Errors: 0, Skipped: 0, Time elapsed: 49.168 sec
    Running org.apache.hadoop.hbase.rest.model.TestTableInfoModel
    Tests run: 3, Failures: 0, Errors: 0, Skipped: 0, Time elapsed: 0.108 sec
    Running org.apache.hadoop.hbase.TestInfoServers
    Tests run: 2, Failures: 0, Errors: 0, Skipped: 0, Time elapsed: 30.054 sec
    Running org.apache.hadoop.hbase.regionserver.TestMasterAddressManager
    Tests run: 1, Failures: 0, Errors: 0, Skipped: 0, Time elapsed: 0.186 sec
    Running org.apache.hadoop.hbase.client.TestAttributes
    Tests run: 3, Failures: 0, Errors: 0, Skipped: 0, Time elapsed: 0.016 sec
    Running org.apache.hadoop.hbase.master.TestLogsCleaner
    Tests run: 1, Failures: 0, Errors: 0, Skipped: 0, Time elapsed: 0.719 sec
    Running org.apache.hadoop.hbase.master.TestMasterStatusServlet
    Tests run: 4, Failures: 0, Errors: 0, Skipped: 0, Time elapsed: 0.402 sec
    Running org.apache.hadoop.hbase.catalog.TestCatalogTrackerOnCluster
    Tests run: 1, Failures: 0, Errors: 0, Skipped: 0, Time elapsed: 211.444 sec
    Running org.apache.hadoop.hbase.regionserver.TestQueryMatcher
    Tests run: 4, Failures: 0, Errors: 0, Skipped: 0, Time elapsed: 0.075 sec
    Running org.apache.hadoop.hbase.zookeeper.TestZKTable
    Tests run: 1, Failures: 0, Errors: 0, Skipped: 0, Time elapsed: 0.156 sec
    Running org.apache.hadoop.hbase.client.TestAdmin
    Tests run: 20, Failures: 0, Errors: 0, Skipped: 0, Time elapsed: 210.152 sec
    Running org.apache.hadoop.hbase.util.TestSortedCopyOnWriteSet
    Tests run: 2, Failures: 0, Errors: 0, Skipped: 0, Time elapsed: 0.019 sec
    Running org.apache.hadoop.hbase.util.TestMergeTool
    Tests run: 1, Failures: 0, Errors: 0, Skipped: 0, Time elapsed: 18.361 sec
    Running org.apache.hadoop.hbase.TestAcidGuarantees
    Tests run: 3, Failures: 0, Errors: 0, Skipped: 3, Time elapsed: 0.011 sec
    Running org.apache.hadoop.hbase.TestHRegionLocation
    Tests run: 3, Failures: 0, Errors: 0, Skipped: 0, Time elapsed: 0.014 sec
    Running org.apache.hadoop.hbase.filter.TestMultipleColumnPrefixFilter
    Tests run: 3, Failures: 0, Errors: 0, Skipped: 0, Time elapsed: 2.371 sec
    Running org.apache.hadoop.hbase.client.TestHTableUtil
    Tests run: 2, Failures: 0, Errors: 0, Skipped: 0, Time elapsed: 23.575 sec
    Running org.apache.hadoop.hbase.util.TestBase64
    Tests run: 1, Failures: 0, Errors: 0, Skipped: 0, Time elapsed: 0.013 sec
    Running org.apache.hadoop.hbase.coprocessor.TestRegionObserverStacking
    Tests run: 1, Failures: 0, Errors: 0, Skipped: 0, Time elapsed: 0.195 sec
    Running org.apache.hadoop.hbase.regionserver.TestMemStore
    Tests run: 21, Failures: 0, Errors: 0, Skipped: 0, Time elapsed: 20.223 sec
    Running org.apache.hadoop.hbase.rest.TestScannerResource
    Tests run: 5, Failures: 0, Errors: 0, Skipped: 0, Time elapsed: 61.232 sec
    Running org.apache.hadoop.hbase.io.hfile.TestLruBlockCache
    Tests run: 7, Failures: 0, Errors: 0, Skipped: 0, Time elapsed: 1.065 sec
    Running org.apache.hadoop.hbase.master.TestDeadServer
    Tests run: 1, Failures: 0, Errors: 0, Skipped: 0, Time elapsed: 0.014 sec
    Running org.apache.hadoop.hbase.rest.TestGzipFilter
    Tests run: 2, Failures: 0, Errors: 0, Skipped: 0, Time elapsed: 25.906 sec
    Running org.apache.hadoop.hbase.TestKeyValue
    Tests run: 9, Failures: 0, Errors: 0, Skipped: 0, Time elapsed: 0.02 sec
    Running org.apache.hadoop.hbase.mapreduce.TestTableMapReduce
    Tests run: 2, Failures: 0, Errors: 0, Skipped: 0, Time elapsed: 59.592 sec
    Running org.apache.hadoop.hbase.filter.TestColumnRangeFilter
    Tests run: 1, Failures: 0, Errors: 0, Skipped: 0, Time elapsed: 42.337 sec
    Running org.apache.hadoop.hbase.client.TestMultiParallel
    Tests run: 10, Failures: 0, Errors: 0, Skipped: 0, Time elapsed: 42.866 sec
    Running org.apache.hadoop.hbase.master.TestMaster
    Tests run: 1, Failures: 0, Errors: 0, Skipped: 0, Time elapsed: 77.93 sec
    Running org.apache.hadoop.hbase.client.TestResult
    Tests run: 2, Failures: 0, Errors: 0, Skipped: 0, Time elapsed: 0.034 sec
    Running org.apache.hadoop.hbase.master.TestRollingRestart
    Tests run: 1, Failures: 0, Errors: 0, Skipped: 0, Time elapsed: 58.441 sec
    Running org.apache.hadoop.hbase.client.TestHTablePool
    Tests run: 18, Failures: 0, Errors: 0, Skipped: 0, Time elapsed: 440.886 sec
    Running org.apache.hadoop.hbase.regionserver.TestRSStatusServlet
    Tests run: 2, Failures: 0, Errors: 0, Skipped: 0, Time elapsed: 0.216 sec
    Running org.apache.hadoop.hbase.util.TestByteBloomFilter
    Tests run: 3, Failures: 0, Errors: 0, Skipped: 0, Time elapsed: 1.042 sec
    Running org.apache.hadoop.hbase.rest.model.TestTableSchemaModel
    Tests run: 3, Failures: 0, Errors: 0, Skipped: 0, Time elapsed: 0.099 sec
    Running org.apache.hadoop.hbase.regionserver.TestCompactSelection
    Tests run: 1, Failures: 0, Errors: 0, Skipped: 0, Time elapsed: 0.193 sec
    Running org.apache.hadoop.hbase.filter.TestFilterList
    Tests run: 4, Failures: 0, Errors: 0, Skipped: 0, Time elapsed: 0.03 sec
    Running org.apache.hadoop.hbase.mapreduce.TestTableInputFormatScan
    Tests run: 11, Failures: 0, Errors: 0, Skipped: 0, Time elapsed: 319.95 sec
    Running org.apache.hadoop.hbase.regionserver.TestHRegion
    Tests run: 55, Failures: 0, Errors: 3, Skipped: 0, Time elapsed: 28.773 sec <<< FAILURE!
    Running org.apache.hadoop.hbase.rest.model.TestTableRegionModel
    Tests run: 4, Failures: 0, Errors: 0, Skipped: 0, Time elapsed: 0.026 sec
    Running org.apache.hadoop.hbase.client.TestScan
    Tests run: 2, Failures: 0, Errors: 0, Skipped: 0, Time elapsed: 0.014 sec
    Running org.apache.hadoop.hbase.master.TestMasterFailover
    Tests run: 3, Failures: 0, Errors: 0, Skipped: 0, Time elapsed: 75.957 sec
    Running org.apache.hadoop.hbase.client.TestTimestampsFilter
    Tests run: 3, Failures: 0, Errors: 0, Skipped: 0, Time elapsed: 29.112 sec
    Running org.apache.hadoop.hbase.util.TestRootPath
    Tests run: 1, Failures: 0, Errors: 0, Skipped: 0, Time elapsed: 0.018 sec
    Running org.apache.hadoop.hbase.master.TestLoadBalancer
    Tests run: 5, Failures: 0, Errors: 0, Skipped: 0, Time elapsed: 1.402 sec
    Running org.apache.hadoop.hbase.mapred.TestTableMapReduce
    Tests run: 1, Failures: 0, Errors: 0, Skipped: 0, Time elapsed: 39.284 sec
    Running org.apache.hadoop.hbase.client.TestScannerTimeout
    Tests run: 4, Failures: 0, Errors: 0, Skipped: 0, Time elapsed: 66.425 sec
    Running org.apache.hadoop.hbase.regionserver.wal.TestWALObserver
    Tests run: 1, Failures: 0, Errors: 0, Skipped: 0, Time elapsed: 0.301 sec
    Running org.apache.hadoop.hbase.coprocessor.TestAggregateProtocol
    Tests run: 44, Failures: 0, Errors: 0, Skipped: 0, Time elapsed: 39.533 sec
    Running org.apache.hadoop.hbase.util.TestBytes
    Tests run: 10, Failures: 0, Errors: 0, Skipped: 0, Time elapsed: 0.017 sec
    Running org.apache.hadoop.hbase.replication.regionserver.TestReplicationSourceManager
    Tests run: 1, Failures: 0, Errors: 0, Skipped: 0, Time elapsed: 0.467 sec
    Running org.apache.hadoop.hbase.filter.TestRandomRowFilter
    Tests run: 2, Failures: 0, Errors: 0, Skipped: 0, Time elapsed: 0.289 sec
    Running org.apache.hadoop.hbase.master.TestActiveMasterManager
    Tests run: 2, Failures: 0, Errors: 0, Skipped: 0, Time elapsed: 0.44 sec
    Running org.apache.hadoop.hbase.util.TestCompressionTest
    Tests run: 1, Failures: 0, Errors: 0, Skipped: 0, Time elapsed: 0.02 sec
    Running org.apache.hadoop.hbase.client.TestMetaMigration
    Tests run: 4, Failures: 0, Errors: 0, Skipped: 0, Time elapsed: 26.661 sec
    Running org.apache.hadoop.hbase.filter.TestDependentColumnFilter
    Tests run: 2, Failures: 0, Errors: 0, Skipped: 0, Time elapsed: 0.395 sec
    Running org.apache.hadoop.hbase.client.TestGetRowVersions
    Tests run: 1, Failures: 0, Errors: 0, Skipped: 0, Time elapsed: 30.599 sec
    Running org.apache.hadoop.hbase.rest.model.TestCellModel
    Tests run: 3, Failures: 0, Errors: 0, Skipped: 0, Time elapsed: 0.097 sec
    Running org.apache.hadoop.hbase.replication.TestReplicationSource
    Tests run: 1, Failures: 0, Errors: 0, Skipped: 0, Time elapsed: 16.916 sec
    Running org.apache.hadoop.hbase.coprocessor.TestWALObserver
    Tests run: 3, Failures: 0, Errors: 0, Skipped: 0, Time elapsed: 60.586 sec
    Running org.apache.hadoop.hbase.master.TestCatalogJanitor
    Tests run: 2, Failures: 0, Errors: 0, Skipped: 0, Time elapsed: 0.4 sec
    Running org.apache.hadoop.hbase.catalog.TestCatalogTracker
    Tests run: 8, Failures: 0, Errors: 0, Skipped: 0, Time elapsed: 2.655 sec
    Running org.apache.hadoop.hbase.rest.TestRowResource
    Tests run: 10, Failures: 0, Errors: 0, Skipped: 0, Time elapsed: 32.717 sec
    Running org.apache.hadoop.hbase.io.hfile.TestHFile
    Tests run: 7, Failures: 0, Errors: 0, Skipped: 0, Time elapsed: 0.205 sec
    Running org.apache.hadoop.hbase.catalog.TestMetaReaderEditor
    Tests run: 4, Failures: 0, Errors: 0, Skipped: 0, Time elapsed: 42.16 sec
    Running org.apache.hadoop.hbase.mapreduce.TestImportTsv
    Tests run: 8, Failures: 0, Errors: 0, Skipped: 0, Time elapsed: 49.277 sec
    Running org.apache.hadoop.hbase.rest.client.TestRemoteAdmin
    Tests run: 2, Failures: 0, Errors: 0, Skipped: 0, Time elapsed: 37.938 sec
    Running org.apache.hadoop.hbase.regionserver.wal.TestHLog
    Tests run: 9, Failures: 0, Errors: 0, Skipped: 0, Time elapsed: 93.305 sec
    Running org.apache.hadoop.hbase.client.TestTimestamp
    Tests run: 1, Failures: 0, Errors: 0, Skipped: 0, Time elapsed: 29.96 sec
    Running org.apache.hadoop.hbase.util.TestPoolMap
    Tests run: 9, Failures: 0, Errors: 0, Skipped: 0, Time elapsed: 0.034 sec
    Running org.apache.hadoop.hbase.TestScanMultipleVersions
    Tests run: 1, Failures: 0, Errors: 0, Skipped: 0, Time elapsed: 41.253 sec
    Running org.apache.hadoop.hbase.rest.model.TestStorageClusterVersionModel
    Tests run: 2, Failures: 0, Errors: 0, Skipped: 0, Time elapsed: 0.023 sec
    Running org.apache.hadoop.hbase.TestGlobalMemStoreSize
    Tests run: 1, Failures: 0, Errors: 0, Skipped: 0, Time elapsed: 13.391 sec
    Running org.apache.hadoop.hbase.client.TestHCM
    Tests run: 3, Failures: 0, Errors: 0, Skipped: 0, Time elapsed: 19.259 sec

    Results :

    Failed tests:

    Tests in error:

    Tests run: 829, Failures: 2, Errors: 3, Skipped: 9

    [INFO] ------------------------------------------------------------------------
    [INFO] BUILD FAILURE
    [INFO] ------------------------------------------------------------------------
    [INFO] Total time: 1:34:14.675s
    [INFO] Finished at: Thu Jul 14 02:48:58 UTC 2011
    [INFO] Final Memory: 33M/835M
    [INFO] ------------------------------------------------------------------------
    [ERROR] Failed to execute goal org.apache.maven.plugins:maven-surefire-plugin:2.4.3:test (default-test) on project hbase: There are test failures.
    [ERROR]
    [ERROR] Please refer to /x1/jenkins/jenkins-slave/workspace/HBase-TRUNK/trunk/target/surefire-reports for the individual test results.
    [ERROR] -> [Help 1]
    [ERROR]
    [ERROR] To see the full stack trace of the errors, re-run Maven with the -e switch.
    [ERROR] Re-run Maven using the -X switch to enable full debug logging.
    [ERROR]
    [ERROR] For more information about the errors and possible solutions, please read the following articles:
    [ERROR] [Help 1] http://cwiki.apache.org/confluence/display/MAVEN/MojoFailureException
    [locks-and-latches] Releasing all the locks
    [locks-and-latches] All the locks released
    Archiving artifacts
    Recording test results
    Updating HBASE-3872
  • Apache Jenkins Server at Jul 14, 2011 at 4:11 pm
    See <https://builds.apache.org/job/HBase-TRUNK/2029/changes>

    Changes:

    [stack] HBASE-3872 Hole in split transaction rollback; edits to .META. need to be rolled back even if it seems like they didn't make it; fix failing HRegion test -- server passed is null, allow for this in tests when running splits

    ------------------------------------------
    [...truncated 1428 lines...]
    Running org.apache.hadoop.hbase.regionserver.TestKeyValueScanFixture
    Tests run: 1, Failures: 0, Errors: 0, Skipped: 0, Time elapsed: 0.012 sec
    Running org.apache.hadoop.hbase.rest.model.TestTableListModel
    Tests run: 3, Failures: 0, Errors: 0, Skipped: 0, Time elapsed: 0.094 sec
    Running org.apache.hadoop.hbase.rest.model.TestColumnSchemaModel
    Tests run: 2, Failures: 0, Errors: 0, Skipped: 0, Time elapsed: 0.023 sec
    Running org.apache.hadoop.hbase.regionserver.TestStoreFile
    Tests run: 8, Failures: 0, Errors: 0, Skipped: 0, Time elapsed: 40.144 sec
    Running org.apache.hadoop.hbase.zookeeper.TestZooKeeperNodeTracker
    Tests run: 2, Failures: 0, Errors: 0, Skipped: 0, Time elapsed: 0.228 sec
    Running org.apache.hadoop.hbase.rest.model.TestScannerModel
    Tests run: 3, Failures: 0, Errors: 0, Skipped: 0, Time elapsed: 0.096 sec
    Running org.apache.hadoop.hbase.master.TestSplitLogManager
    Tests run: 9, Failures: 0, Errors: 0, Skipped: 0, Time elapsed: 11.646 sec
    Running org.apache.hadoop.hbase.regionserver.wal.TestHLogMethods
    Tests run: 3, Failures: 0, Errors: 0, Skipped: 0, Time elapsed: 0.311 sec
    Running org.apache.hadoop.hbase.rest.TestVersionResource
    Tests run: 7, Failures: 0, Errors: 0, Skipped: 0, Time elapsed: 17.949 sec
    Running org.apache.hadoop.hbase.filter.TestFilter
    Tests run: 18, Failures: 0, Errors: 0, Skipped: 0, Time elapsed: 3.593 sec
    Running org.apache.hadoop.hbase.TestServerName
    Tests run: 2, Failures: 0, Errors: 0, Skipped: 0, Time elapsed: 0.013 sec
    Running org.apache.hadoop.hbase.regionserver.TestWideScanner
    Tests run: 1, Failures: 0, Errors: 0, Skipped: 0, Time elapsed: 14.663 sec
    Running org.apache.hadoop.hbase.regionserver.TestSplitTransaction
    Tests run: 6, Failures: 0, Errors: 0, Skipped: 0, Time elapsed: 2.959 sec
    Running org.apache.hadoop.hbase.util.TestFSTableDescriptors
    Tests run: 5, Failures: 1, Errors: 0, Skipped: 0, Time elapsed: 1.501 sec <<< FAILURE!
    Running org.apache.hadoop.hbase.replication.regionserver.TestReplicationSink
    Tests run: 5, Failures: 0, Errors: 0, Skipped: 0, Time elapsed: 33.521 sec
    Running org.apache.hadoop.hbase.util.TestMergeTable
    Tests run: 1, Failures: 0, Errors: 0, Skipped: 0, Time elapsed: 39.257 sec
    Running org.apache.hadoop.hbase.regionserver.TestReadWriteConsistencyControl
    Tests run: 1, Failures: 0, Errors: 0, Skipped: 0, Time elapsed: 10.021 sec
    Running org.apache.hadoop.hbase.regionserver.TestGetClosestAtOrBefore
    Tests run: 3, Failures: 0, Errors: 0, Skipped: 0, Time elapsed: 16.377 sec
    Running org.apache.hadoop.hbase.coprocessor.TestMasterObserver
    Tests run: 3, Failures: 0, Errors: 0, Skipped: 0, Time elapsed: 31.66 sec
    Running org.apache.hadoop.hbase.rest.model.TestVersionModel
    Tests run: 3, Failures: 0, Errors: 0, Skipped: 0, Time elapsed: 0.092 sec
    Running org.apache.hadoop.hbase.rest.model.TestCellSetModel
    Tests run: 3, Failures: 0, Errors: 0, Skipped: 0, Time elapsed: 0.103 sec
    Running org.apache.hadoop.hbase.rest.model.TestStorageClusterStatusModel
    Tests run: 3, Failures: 0, Errors: 0, Skipped: 0, Time elapsed: 0.1 sec
    Running org.apache.hadoop.hbase.rest.client.TestRemoteTable
    Tests run: 3, Failures: 0, Errors: 0, Skipped: 0, Time elapsed: 20.665 sec
    Running org.apache.hadoop.hbase.monitoring.TestTaskMonitor
    Tests run: 3, Failures: 0, Errors: 0, Skipped: 0, Time elapsed: 0.251 sec
    Running org.apache.hadoop.hbase.avro.TestAvroServer
    Tests run: 3, Failures: 0, Errors: 0, Skipped: 0, Time elapsed: 30.86 sec
    Running org.apache.hadoop.hbase.TestFullLogReconstruction
    Tests run: 1, Failures: 0, Errors: 0, Skipped: 0, Time elapsed: 67.8 sec
    Running org.apache.hadoop.hbase.TestSerialization
    Tests run: 18, Failures: 0, Errors: 0, Skipped: 0, Time elapsed: 0.044 sec
    Running org.apache.hadoop.hbase.regionserver.TestKeyValueHeap
    Tests run: 3, Failures: 0, Errors: 0, Skipped: 0, Time elapsed: 0.065 sec
    Running org.apache.hadoop.hbase.regionserver.TestStoreScanner
    Tests run: 14, Failures: 0, Errors: 0, Skipped: 0, Time elapsed: 0.024 sec
    Running org.apache.hadoop.hbase.io.hfile.TestReseekTo
    Tests run: 1, Failures: 0, Errors: 0, Skipped: 0, Time elapsed: 0.144 sec
    Running org.apache.hadoop.hbase.util.TestIncrementingEnvironmentEdge
    Tests run: 1, Failures: 0, Errors: 0, Skipped: 0, Time elapsed: 0.012 sec
    Running org.apache.hadoop.hbase.util.TestKeying
    Tests run: 1, Failures: 0, Errors: 0, Skipped: 0, Time elapsed: 0.012 sec
    Running org.apache.hadoop.hbase.regionserver.TestScanner
    Tests run: 6, Failures: 0, Errors: 0, Skipped: 0, Time elapsed: 63.156 sec
    Running org.apache.hadoop.hbase.regionserver.TestHRegionInfo
    Tests run: 2, Failures: 0, Errors: 0, Skipped: 0, Time elapsed: 0.014 sec
    Running org.apache.hadoop.hbase.util.TestHBaseFsck
    Tests run: 2, Failures: 0, Errors: 0, Skipped: 0, Time elapsed: 30.846 sec
    Running org.apache.hadoop.hbase.client.TestShell
    Tests run: 1, Failures: 0, Errors: 0, Skipped: 0, Time elapsed: 37.494 sec
    Running org.apache.hadoop.hbase.master.TestRestartCluster
    Tests run: 2, Failures: 0, Errors: 0, Skipped: 0, Time elapsed: 62.673 sec
    Running org.apache.hadoop.hbase.rest.model.TestTableInfoModel
    Tests run: 3, Failures: 0, Errors: 0, Skipped: 0, Time elapsed: 0.098 sec
    Running org.apache.hadoop.hbase.TestInfoServers
    Tests run: 2, Failures: 0, Errors: 0, Skipped: 0, Time elapsed: 30.267 sec
    Running org.apache.hadoop.hbase.regionserver.TestMasterAddressManager
    Tests run: 1, Failures: 0, Errors: 0, Skipped: 0, Time elapsed: 0.17 sec
    Running org.apache.hadoop.hbase.client.TestAttributes
    Tests run: 3, Failures: 0, Errors: 0, Skipped: 0, Time elapsed: 0.016 sec
    Running org.apache.hadoop.hbase.master.TestLogsCleaner
    Tests run: 1, Failures: 0, Errors: 0, Skipped: 0, Time elapsed: 0.784 sec
    Running org.apache.hadoop.hbase.master.TestMasterStatusServlet
    Tests run: 4, Failures: 0, Errors: 0, Skipped: 0, Time elapsed: 0.373 sec
    Running org.apache.hadoop.hbase.catalog.TestCatalogTrackerOnCluster
    Tests run: 1, Failures: 0, Errors: 0, Skipped: 0, Time elapsed: 218.003 sec
    Running org.apache.hadoop.hbase.regionserver.TestQueryMatcher
    Tests run: 4, Failures: 0, Errors: 0, Skipped: 0, Time elapsed: 0.101 sec
    Running org.apache.hadoop.hbase.zookeeper.TestZKTable
    Tests run: 1, Failures: 0, Errors: 0, Skipped: 0, Time elapsed: 0.169 sec
    Running org.apache.hadoop.hbase.client.TestAdmin
    Tests run: 20, Failures: 0, Errors: 0, Skipped: 0, Time elapsed: 216.03 sec
    Running org.apache.hadoop.hbase.util.TestSortedCopyOnWriteSet
    Tests run: 2, Failures: 0, Errors: 0, Skipped: 0, Time elapsed: 0.019 sec
    Running org.apache.hadoop.hbase.util.TestMergeTool
    Tests run: 1, Failures: 0, Errors: 0, Skipped: 0, Time elapsed: 17.601 sec
    Running org.apache.hadoop.hbase.TestAcidGuarantees
    Tests run: 3, Failures: 0, Errors: 0, Skipped: 3, Time elapsed: 0.012 sec
    Running org.apache.hadoop.hbase.TestHRegionLocation
    Tests run: 3, Failures: 0, Errors: 0, Skipped: 0, Time elapsed: 0.015 sec
    Running org.apache.hadoop.hbase.filter.TestMultipleColumnPrefixFilter
    Tests run: 3, Failures: 0, Errors: 0, Skipped: 0, Time elapsed: 2.608 sec
    Running org.apache.hadoop.hbase.client.TestHTableUtil
    Tests run: 2, Failures: 0, Errors: 0, Skipped: 0, Time elapsed: 33.984 sec
    Running org.apache.hadoop.hbase.util.TestBase64
    Tests run: 1, Failures: 0, Errors: 0, Skipped: 0, Time elapsed: 0.013 sec
    Running org.apache.hadoop.hbase.coprocessor.TestRegionObserverStacking
    Tests run: 1, Failures: 0, Errors: 0, Skipped: 0, Time elapsed: 0.276 sec
    Running org.apache.hadoop.hbase.regionserver.TestMemStore
    Tests run: 21, Failures: 0, Errors: 0, Skipped: 0, Time elapsed: 20.009 sec
    Running org.apache.hadoop.hbase.rest.TestScannerResource
    Tests run: 5, Failures: 0, Errors: 0, Skipped: 0, Time elapsed: 61.067 sec
    Running org.apache.hadoop.hbase.io.hfile.TestLruBlockCache
    Tests run: 7, Failures: 0, Errors: 0, Skipped: 0, Time elapsed: 1.049 sec
    Running org.apache.hadoop.hbase.master.TestDeadServer
    Tests run: 1, Failures: 0, Errors: 0, Skipped: 0, Time elapsed: 0.014 sec
    Running org.apache.hadoop.hbase.rest.TestGzipFilter
    Tests run: 2, Failures: 0, Errors: 0, Skipped: 0, Time elapsed: 24.579 sec
    Running org.apache.hadoop.hbase.TestKeyValue
    Tests run: 9, Failures: 0, Errors: 0, Skipped: 0, Time elapsed: 0.023 sec
    Running org.apache.hadoop.hbase.mapreduce.TestTableMapReduce
    Tests run: 2, Failures: 0, Errors: 0, Skipped: 0, Time elapsed: 57.757 sec
    Running org.apache.hadoop.hbase.filter.TestColumnRangeFilter
    Tests run: 1, Failures: 0, Errors: 0, Skipped: 0, Time elapsed: 42.294 sec
    Running org.apache.hadoop.hbase.client.TestMultiParallel
    Tests run: 10, Failures: 0, Errors: 0, Skipped: 0, Time elapsed: 44.628 sec
    Running org.apache.hadoop.hbase.master.TestMaster
    Tests run: 1, Failures: 0, Errors: 0, Skipped: 0, Time elapsed: 92.33 sec
    Running org.apache.hadoop.hbase.client.TestResult
    Tests run: 2, Failures: 0, Errors: 0, Skipped: 0, Time elapsed: 0.031 sec
    Running org.apache.hadoop.hbase.master.TestRollingRestart
    Tests run: 1, Failures: 0, Errors: 0, Skipped: 0, Time elapsed: 53.956 sec
    Running org.apache.hadoop.hbase.client.TestHTablePool
    Tests run: 18, Failures: 0, Errors: 0, Skipped: 0, Time elapsed: 280.843 sec
    Running org.apache.hadoop.hbase.regionserver.TestRSStatusServlet
    Tests run: 2, Failures: 0, Errors: 0, Skipped: 0, Time elapsed: 0.212 sec
    Running org.apache.hadoop.hbase.util.TestByteBloomFilter
    Tests run: 3, Failures: 0, Errors: 0, Skipped: 0, Time elapsed: 1.046 sec
    Running org.apache.hadoop.hbase.rest.model.TestTableSchemaModel
    Tests run: 3, Failures: 0, Errors: 0, Skipped: 0, Time elapsed: 0.101 sec
    Running org.apache.hadoop.hbase.regionserver.TestCompactSelection
    Tests run: 1, Failures: 0, Errors: 0, Skipped: 0, Time elapsed: 0.159 sec
    Running org.apache.hadoop.hbase.filter.TestFilterList
    Tests run: 4, Failures: 0, Errors: 0, Skipped: 0, Time elapsed: 0.031 sec
    Running org.apache.hadoop.hbase.mapreduce.TestTableInputFormatScan
    Tests run: 11, Failures: 0, Errors: 0, Skipped: 0, Time elapsed: 312.897 sec
    Running org.apache.hadoop.hbase.regionserver.TestHRegion
    Tests run: 55, Failures: 0, Errors: 0, Skipped: 0, Time elapsed: 27.261 sec
    Running org.apache.hadoop.hbase.rest.model.TestTableRegionModel
    Tests run: 4, Failures: 0, Errors: 0, Skipped: 0, Time elapsed: 0.025 sec
    Running org.apache.hadoop.hbase.client.TestScan
    Tests run: 2, Failures: 0, Errors: 0, Skipped: 0, Time elapsed: 0.014 sec
    Running org.apache.hadoop.hbase.master.TestMasterFailover
    Tests run: 3, Failures: 0, Errors: 0, Skipped: 0, Time elapsed: 74.472 sec
    Running org.apache.hadoop.hbase.client.TestTimestampsFilter
    Tests run: 3, Failures: 0, Errors: 0, Skipped: 0, Time elapsed: 28.71 sec
    Running org.apache.hadoop.hbase.util.TestRootPath
    Tests run: 1, Failures: 0, Errors: 0, Skipped: 0, Time elapsed: 0.017 sec
    Running org.apache.hadoop.hbase.master.TestLoadBalancer
    Tests run: 5, Failures: 0, Errors: 0, Skipped: 0, Time elapsed: 1.401 sec
    Running org.apache.hadoop.hbase.mapred.TestTableMapReduce
    Tests run: 1, Failures: 0, Errors: 0, Skipped: 0, Time elapsed: 38.146 sec
    Running org.apache.hadoop.hbase.client.TestScannerTimeout
    Tests run: 4, Failures: 0, Errors: 0, Skipped: 0, Time elapsed: 64.684 sec
    Running org.apache.hadoop.hbase.regionserver.wal.TestWALObserver
    Tests run: 1, Failures: 0, Errors: 0, Skipped: 0, Time elapsed: 0.188 sec
    Running org.apache.hadoop.hbase.coprocessor.TestAggregateProtocol
    Tests run: 44, Failures: 0, Errors: 0, Skipped: 0, Time elapsed: 19.414 sec
    Running org.apache.hadoop.hbase.util.TestBytes
    Tests run: 10, Failures: 0, Errors: 0, Skipped: 0, Time elapsed: 0.018 sec
    Running org.apache.hadoop.hbase.replication.regionserver.TestReplicationSourceManager
    Tests run: 1, Failures: 0, Errors: 0, Skipped: 0, Time elapsed: 0.501 sec
    Running org.apache.hadoop.hbase.filter.TestRandomRowFilter
    Tests run: 2, Failures: 0, Errors: 0, Skipped: 0, Time elapsed: 0.292 sec
    Running org.apache.hadoop.hbase.master.TestActiveMasterManager
    Tests run: 2, Failures: 0, Errors: 0, Skipped: 0, Time elapsed: 0.43 sec
    Running org.apache.hadoop.hbase.util.TestCompressionTest
    Tests run: 1, Failures: 0, Errors: 0, Skipped: 0, Time elapsed: 0.028 sec
    Running org.apache.hadoop.hbase.client.TestMetaMigration
    Tests run: 4, Failures: 0, Errors: 0, Skipped: 0, Time elapsed: 15.175 sec
    Running org.apache.hadoop.hbase.filter.TestDependentColumnFilter
    Tests run: 2, Failures: 0, Errors: 0, Skipped: 0, Time elapsed: 0.269 sec
    Running org.apache.hadoop.hbase.client.TestGetRowVersions
    Tests run: 1, Failures: 0, Errors: 0, Skipped: 0, Time elapsed: 50.751 sec
    Running org.apache.hadoop.hbase.rest.model.TestCellModel
    Tests run: 3, Failures: 0, Errors: 0, Skipped: 0, Time elapsed: 0.095 sec
    Running org.apache.hadoop.hbase.replication.TestReplicationSource
    Tests run: 1, Failures: 0, Errors: 0, Skipped: 0, Time elapsed: 20.159 sec
    Running org.apache.hadoop.hbase.coprocessor.TestWALObserver
    Tests run: 3, Failures: 0, Errors: 0, Skipped: 0, Time elapsed: 64.71 sec
    Running org.apache.hadoop.hbase.master.TestCatalogJanitor
    Tests run: 2, Failures: 0, Errors: 0, Skipped: 0, Time elapsed: 0.418 sec
    Running org.apache.hadoop.hbase.catalog.TestCatalogTracker
    Tests run: 8, Failures: 0, Errors: 0, Skipped: 0, Time elapsed: 2.59 sec
    Running org.apache.hadoop.hbase.rest.TestRowResource
    Tests run: 10, Failures: 0, Errors: 0, Skipped: 0, Time elapsed: 20.873 sec
    Running org.apache.hadoop.hbase.io.hfile.TestHFile
    Tests run: 7, Failures: 0, Errors: 0, Skipped: 0, Time elapsed: 0.248 sec
    Running org.apache.hadoop.hbase.catalog.TestMetaReaderEditor
    Tests run: 4, Failures: 0, Errors: 0, Skipped: 0, Time elapsed: 39.959 sec
    Running org.apache.hadoop.hbase.mapreduce.TestImportTsv
    Tests run: 8, Failures: 0, Errors: 0, Skipped: 0, Time elapsed: 53.475 sec
    Running org.apache.hadoop.hbase.rest.client.TestRemoteAdmin
    Tests run: 2, Failures: 0, Errors: 0, Skipped: 0, Time elapsed: 40.48 sec
    Running org.apache.hadoop.hbase.regionserver.wal.TestHLog
    Tests run: 9, Failures: 0, Errors: 0, Skipped: 0, Time elapsed: 83.625 sec
    Running org.apache.hadoop.hbase.client.TestTimestamp
    Tests run: 1, Failures: 0, Errors: 0, Skipped: 0, Time elapsed: 16.527 sec
    Running org.apache.hadoop.hbase.util.TestPoolMap
    Tests run: 9, Failures: 0, Errors: 0, Skipped: 0, Time elapsed: 0.033 sec
    Running org.apache.hadoop.hbase.TestScanMultipleVersions
    Tests run: 1, Failures: 0, Errors: 0, Skipped: 0, Time elapsed: 48.947 sec
    Running org.apache.hadoop.hbase.rest.model.TestStorageClusterVersionModel
    Tests run: 2, Failures: 0, Errors: 0, Skipped: 0, Time elapsed: 0.023 sec
    Running org.apache.hadoop.hbase.TestGlobalMemStoreSize
    Tests run: 1, Failures: 0, Errors: 0, Skipped: 0, Time elapsed: 26.087 sec
    Running org.apache.hadoop.hbase.client.TestHCM
    Tests run: 3, Failures: 0, Errors: 0, Skipped: 0, Time elapsed: 19.437 sec

    Results :

    Failed tests:

    Tests run: 829, Failures: 1, Errors: 0, Skipped: 9

    [INFO] ------------------------------------------------------------------------
    [INFO] BUILD FAILURE
    [INFO] ------------------------------------------------------------------------
    [INFO] Total time: 1:43:05.877s
    [INFO] Finished at: Thu Jul 14 06:54:19 UTC 2011
    [INFO] Final Memory: 32M/935M
    [INFO] ------------------------------------------------------------------------
    [ERROR] Failed to execute goal org.apache.maven.plugins:maven-surefire-plugin:2.4.3:test (default-test) on project hbase: There are test failures.
    [ERROR]
    [ERROR] Please refer to /x1/jenkins/jenkins-slave/workspace/HBase-TRUNK/trunk/target/surefire-reports for the individual test results.
    [ERROR] -> [Help 1]
    [ERROR]
    [ERROR] To see the full stack trace of the errors, re-run Maven with the -e switch.
    [ERROR] Re-run Maven using the -X switch to enable full debug logging.
    [ERROR]
    [ERROR] For more information about the errors and possible solutions, please read the following articles:
    [ERROR] [Help 1] http://cwiki.apache.org/confluence/display/MAVEN/MojoFailureException
    [locks-and-latches] Releasing all the locks
    [locks-and-latches] All the locks released
    Archiving artifacts
    Recording test results
    Updating HBASE-3872

Related Discussions

Discussion Navigation
viewthread | post
Discussion Overview
groupdev @
categorieshbase, hadoop
postedJul 13, '11 at 9:36p
activeJul 14, '11 at 4:11p
posts4
users1
websitehbase.apache.org

1 user in discussion

Apache Jenkins Server: 4 posts

People

Translate

site design / logo © 2022 Grokbase