Grokbase Groups HBase dev June 2011
FAQ
See <https://builds.apache.org/job/HBase-TRUNK/1970/changes>

Changes:

[stack] doc fix from leif wickland up on mailing list

[todd] HBASE-3982. Improvements to TestHFileSeek.

------------------------------------------
[...truncated 3328 lines...]
[INFO] Copying 4 resources
[INFO] Copying 3 resources
[INFO] [compiler:testCompile {execution: default-testCompile}]
[INFO] Compiling 219 source files to <https://builds.apache.org/job/HBase-TRUNK/ws/trunk/target/test-classes>
[INFO] [surefire:test {execution: default-test}]
[INFO] Surefire report directory: <https://builds.apache.org/job/HBase-TRUNK/ws/trunk/target/surefire-reports>

-------------------------------------------------------
T E S T S
-------------------------------------------------------
Running org.apache.hadoop.hbase.master.TestHMasterRPCException
Tests run: 1, Failures: 0, Errors: 0, Skipped: 0, Time elapsed: 0.47 sec
Running org.apache.hadoop.hbase.regionserver.TestColumnSeeking
Tests run: 2, Failures: 0, Errors: 0, Skipped: 0, Time elapsed: 14.919 sec
Running org.apache.hadoop.hbase.client.TestMultipleTimestamps
Tests run: 8, Failures: 0, Errors: 0, Skipped: 0, Time elapsed: 66.904 sec
Running org.apache.hadoop.hbase.regionserver.TestMemStoreLAB
Tests run: 3, Failures: 0, Errors: 0, Skipped: 0, Time elapsed: 1.302 sec
Running org.apache.hadoop.hbase.coprocessor.TestRegionObserverInterface
Tests run: 4, Failures: 0, Errors: 0, Skipped: 0, Time elapsed: 39.298 sec
Running org.apache.hadoop.hbase.coprocessor.TestCoprocessorInterface
Tests run: 1, Failures: 0, Errors: 0, Skipped: 0, Time elapsed: 3.297 sec
Running org.apache.hadoop.hbase.TestZooKeeper
Tests run: 7, Failures: 0, Errors: 0, Skipped: 0, Time elapsed: 90.837 sec
Running org.apache.hadoop.hbase.regionserver.wal.TestLogRolling
Tests run: 2, Failures: 0, Errors: 0, Skipped: 0, Time elapsed: 135.35 sec
Running org.apache.hadoop.hbase.io.hfile.TestCachedBlockQueue
Tests run: 2, Failures: 0, Errors: 0, Skipped: 0, Time elapsed: 0.017 sec
Running org.apache.hadoop.hbase.filter.TestPrefixFilter
Tests run: 3, Failures: 0, Errors: 0, Skipped: 0, Time elapsed: 0.018 sec
Running org.apache.hadoop.hbase.io.TestImmutableBytesWritable
Tests run: 3, Failures: 0, Errors: 0, Skipped: 0, Time elapsed: 0.016 sec
Running org.apache.hadoop.hbase.io.TestHeapSize
Tests run: 2, Failures: 0, Errors: 0, Skipped: 0, Time elapsed: 0.034 sec
Running org.apache.hadoop.hbase.rest.model.TestRowModel
Tests run: 2, Failures: 0, Errors: 0, Skipped: 0, Time elapsed: 0.038 sec
Running org.apache.hadoop.hbase.io.hfile.TestHFileSeek
Tests run: 1, Failures: 0, Errors: 0, Skipped: 0, Time elapsed: 5.065 sec
Running org.apache.hadoop.hbase.regionserver.TestStore
Tests run: 11, Failures: 0, Errors: 0, Skipped: 0, Time elapsed: 1.63 sec
Running org.apache.hadoop.hbase.regionserver.TestSplitTransactionOnCluster
Tests run: 5, Failures: 0, Errors: 0, Skipped: 0, Time elapsed: 63.83 sec
Running org.apache.hadoop.hbase.zookeeper.TestHQuorumPeer
Tests run: 3, Failures: 0, Errors: 0, Skipped: 0, Time elapsed: 0.34 sec
Running org.apache.hadoop.hbase.rest.TestScannersWithFilters
Tests run: 10, Failures: 0, Errors: 0, Skipped: 0, Time elapsed: 33.908 sec
Running org.apache.hadoop.hbase.io.hfile.TestHFilePerformance
Tests run: 1, Failures: 0, Errors: 0, Skipped: 0, Time elapsed: 8.98 sec
Running org.apache.hadoop.hbase.regionserver.TestResettingCounters
Tests run: 1, Failures: 0, Errors: 0, Skipped: 0, Time elapsed: 0.288 sec
Running org.apache.hadoop.hbase.regionserver.handler.TestOpenRegionHandler
Tests run: 1, Failures: 0, Errors: 0, Skipped: 0, Time elapsed: 0.525 sec
Running org.apache.hadoop.hbase.io.TestHbaseObjectWritable
Tests run: 3, Failures: 0, Errors: 0, Skipped: 0, Time elapsed: 0.073 sec
Running org.apache.hadoop.hbase.regionserver.wal.TestHLogSplit
Tests run: 27, Failures: 0, Errors: 0, Skipped: 0, Time elapsed: 214.363 sec
Running org.apache.hadoop.hbase.thrift.TestThriftServer
Tests run: 1, Failures: 0, Errors: 0, Skipped: 0, Time elapsed: 42.404 sec
Running org.apache.hadoop.hbase.master.TestDistributedLogSplitting
Tests run: 4, Failures: 0, Errors: 0, Skipped: 0, Time elapsed: 152.131 sec
Running org.apache.hadoop.hbase.TestHServerInfo
Tests run: 6, Failures: 0, Errors: 0, Skipped: 0, Time elapsed: 0.024 sec
Running org.apache.hadoop.hbase.regionserver.TestRpcMetrics
Tests run: 1, Failures: 0, Errors: 0, Skipped: 0, Time elapsed: 1.248 sec
Running org.apache.hadoop.hbase.filter.TestColumnPrefixFilter
Tests run: 2, Failures: 0, Errors: 0, Skipped: 0, Time elapsed: 2.245 sec
Running org.apache.hadoop.hbase.master.TestZKBasedOpenCloseRegion
Tests run: 3, Failures: 0, Errors: 0, Skipped: 0, Time elapsed: 41.119 sec
Running org.apache.hadoop.hbase.regionserver.TestServerCustomProtocol
Tests run: 6, Failures: 0, Errors: 0, Skipped: 0, Time elapsed: 28.303 sec
Running org.apache.hadoop.hbase.TestCompare
Tests run: 1, Failures: 0, Errors: 0, Skipped: 0, Time elapsed: 0.015 sec
Running org.apache.hadoop.hbase.regionserver.TestExplicitColumnTracker
Tests run: 4, Failures: 0, Errors: 0, Skipped: 0, Time elapsed: 0.366 sec
Running org.apache.hadoop.hbase.util.TestEnvironmentEdgeManager
Tests run: 2, Failures: 0, Errors: 0, Skipped: 0, Time elapsed: 0.177 sec
Running org.apache.hadoop.hbase.io.TestHalfStoreFileReader
Tests run: 1, Failures: 0, Errors: 0, Skipped: 0, Time elapsed: 0.214 sec
Running org.apache.hadoop.hbase.util.TestDefaultEnvironmentEdge
Tests run: 1, Failures: 0, Errors: 0, Skipped: 0, Time elapsed: 0.016 sec
Running org.apache.hadoop.hbase.rest.TestTransform
Tests run: 1, Failures: 0, Errors: 0, Skipped: 0, Time elapsed: 24.593 sec
Running org.apache.hadoop.hbase.util.TestFSUtils
Tests run: 1, Failures: 0, Errors: 0, Skipped: 0, Time elapsed: 9.885 sec
Running org.apache.hadoop.hbase.filter.TestBitComparator
Tests run: 3, Failures: 0, Errors: 0, Skipped: 0, Time elapsed: 0.018 sec
Running org.apache.hadoop.hbase.security.TestUser
Tests run: 2, Failures: 0, Errors: 0, Skipped: 0, Time elapsed: 0.034 sec
Running org.apache.hadoop.hbase.master.TestMasterTransitions
Tests run: 3, Failures: 0, Errors: 0, Skipped: 3, Time elapsed: 28.747 sec
Running org.apache.hadoop.hbase.regionserver.TestScanWildcardColumnTracker
Tests run: 2, Failures: 0, Errors: 0, Skipped: 0, Time elapsed: 0.086 sec
Running org.apache.hadoop.hbase.regionserver.TestKeyValueSkipListSet
Tests run: 4, Failures: 0, Errors: 0, Skipped: 0, Time elapsed: 0.02 sec
Running org.apache.hadoop.hbase.filter.TestPageFilter
Tests run: 2, Failures: 0, Errors: 0, Skipped: 0, Time elapsed: 0.016 sec
Running org.apache.hadoop.hbase.io.hfile.TestSeekTo
Tests run: 3, Failures: 0, Errors: 0, Skipped: 0, Time elapsed: 0.201 sec
Running org.apache.hadoop.hbase.filter.TestColumnPaginationFilter
Tests run: 1, Failures: 0, Errors: 0, Skipped: 0, Time elapsed: 0.015 sec
Running org.apache.hadoop.hbase.rest.TestStatusResource
Tests run: 2, Failures: 0, Errors: 0, Skipped: 0, Time elapsed: 30.886 sec
Running org.apache.hadoop.hbase.coprocessor.TestCoprocessorEndpoint
Tests run: 2, Failures: 0, Errors: 0, Skipped: 0, Time elapsed: 36.413 sec
Running org.apache.hadoop.hbase.executor.TestExecutorService
Tests run: 1, Failures: 0, Errors: 0, Skipped: 0, Time elapsed: 2.175 sec
Running org.apache.hadoop.hbase.client.TestFromClientSide
Tests run: 45, Failures: 0, Errors: 0, Skipped: 3, Time elapsed: 149.245 sec
Running org.apache.hadoop.hbase.replication.TestReplication
Tests run: 7, Failures: 0, Errors: 0, Skipped: 0, Time elapsed: 143.396 sec
Running org.apache.hadoop.hbase.regionserver.TestCompaction
Tests run: 9, Failures: 0, Errors: 0, Skipped: 0, Time elapsed: 141.128 sec
Running org.apache.hadoop.hbase.filter.TestSingleColumnValueFilter
Tests run: 2, Failures: 0, Errors: 0, Skipped: 0, Time elapsed: 0.035 sec
Running org.apache.hadoop.hbase.mapreduce.TestTimeRangeMapRed
Tests run: 1, Failures: 0, Errors: 0, Skipped: 0, Time elapsed: 35.657 sec
Running org.apache.hadoop.hbase.TestHServerAddress
Tests run: 6, Failures: 0, Errors: 0, Skipped: 0, Time elapsed: 0.024 sec
Running org.apache.hadoop.hbase.zookeeper.TestZooKeeperMainServerArg
Tests run: 1, Failures: 0, Errors: 0, Skipped: 0, Time elapsed: 0.025 sec
Running org.apache.hadoop.hbase.mapreduce.TestSimpleTotalOrderPartitioner
Tests run: 1, Failures: 0, Errors: 0, Skipped: 0, Time elapsed: 0.089 sec
Running org.apache.hadoop.hbase.master.TestClockSkewDetection
Tests run: 1, Failures: 0, Errors: 0, Skipped: 0, Time elapsed: 0.057 sec
Running org.apache.hadoop.hbase.mapreduce.TestHFileOutputFormat
Tests run: 7, Failures: 0, Errors: 0, Skipped: 0, Time elapsed: 148.798 sec
Running org.apache.hadoop.hbase.regionserver.TestFSErrorsExposed
Tests run: 3, Failures: 0, Errors: 0, Skipped: 0, Time elapsed: 50.97 sec
Running org.apache.hadoop.hbase.client.replication.TestReplicationAdmin
Tests run: 1, Failures: 0, Errors: 0, Skipped: 0, Time elapsed: 1.956 sec
Running org.apache.hadoop.hbase.client.TestGet
Tests run: 2, Failures: 0, Errors: 0, Skipped: 0, Time elapsed: 0.018 sec
Running org.apache.hadoop.hbase.regionserver.TestScanDeleteTracker
Tests run: 6, Failures: 0, Errors: 0, Skipped: 0, Time elapsed: 0.127 sec
Running org.apache.hadoop.hbase.client.TestMetaScanner
Tests run: 1, Failures: 0, Errors: 0, Skipped: 0, Time elapsed: 30.299 sec
Running org.apache.hadoop.hbase.metrics.TestMetricsMBeanBase
Tests run: 2, Failures: 0, Errors: 0, Skipped: 0, Time elapsed: 0.037 sec
Running org.apache.hadoop.hbase.TestRegionRebalancing
Tests run: 1, Failures: 0, Errors: 0, Skipped: 0, Time elapsed: 83.231 sec
Running org.apache.hadoop.hbase.regionserver.TestSplitLogWorker
Tests run: 5, Failures: 0, Errors: 0, Skipped: 0, Time elapsed: 3.239 sec
Running org.apache.hadoop.hbase.rest.TestMultiRowResource
Tests run: 3, Failures: 0, Errors: 0, Skipped: 0, Time elapsed: 34.433 sec
Running org.apache.hadoop.hbase.filter.TestInclusiveStopFilter
Tests run: 2, Failures: 0, Errors: 0, Skipped: 0, Time elapsed: 0.016 sec
Running org.apache.hadoop.hbase.rest.TestTableResource
Tests run: 8, Failures: 0, Errors: 0, Skipped: 0, Time elapsed: 76.778 sec
Running org.apache.hadoop.hbase.mapreduce.TestTableSplit
Tests run: 1, Failures: 0, Errors: 0, Skipped: 0, Time elapsed: 0.027 sec
Running org.apache.hadoop.hbase.filter.TestSingleColumnValueExcludeFilter
Tests run: 1, Failures: 0, Errors: 0, Skipped: 0, Time elapsed: 0.016 sec
Running org.apache.hadoop.hbase.TestHBaseTestingUtility
Tests run: 6, Failures: 0, Errors: 0, Skipped: 0, Time elapsed: 75.974 sec
Running org.apache.hadoop.hbase.mapreduce.TestLoadIncrementalHFiles
Tests run: 4, Failures: 0, Errors: 0, Skipped: 0, Time elapsed: 43.811 sec
Running org.apache.hadoop.hbase.regionserver.wal.TestWALReplay
Tests run: 4, Failures: 0, Errors: 0, Skipped: 0, Time elapsed: 40.619 sec
Running org.apache.hadoop.hbase.rest.TestSchemaResource
Tests run: 2, Failures: 0, Errors: 0, Skipped: 0, Time elapsed: 32.102 sec
Running org.apache.hadoop.hbase.regionserver.TestKeyValueScanFixture
Tests run: 1, Failures: 0, Errors: 0, Skipped: 0, Time elapsed: 0.023 sec
Running org.apache.hadoop.hbase.rest.model.TestTableListModel
Tests run: 3, Failures: 0, Errors: 0, Skipped: 0, Time elapsed: 0.131 sec
Running org.apache.hadoop.hbase.rest.model.TestColumnSchemaModel
Tests run: 2, Failures: 0, Errors: 0, Skipped: 0, Time elapsed: 0.037 sec
Running org.apache.hadoop.hbase.regionserver.TestStoreFile
Tests run: 8, Failures: 0, Errors: 0, Skipped: 0, Time elapsed: 52.735 sec
Running org.apache.hadoop.hbase.zookeeper.TestZooKeeperNodeTracker
Tests run: 2, Failures: 0, Errors: 0, Skipped: 0, Time elapsed: 0.41 sec
Running org.apache.hadoop.hbase.master.TestSplitLogManager
Tests run: 9, Failures: 0, Errors: 0, Skipped: 0, Time elapsed: 14.75 sec
Running org.apache.hadoop.hbase.regionserver.wal.TestHLogMethods
Tests run: 3, Failures: 0, Errors: 0, Skipped: 0, Time elapsed: 0.418 sec
Running org.apache.hadoop.hbase.rest.model.TestScannerModel
Tests run: 3, Failures: 0, Errors: 0, Skipped: 0, Time elapsed: 0.149 sec
Running org.apache.hadoop.hbase.rest.TestVersionResource
Tests run: 7, Failures: 0, Errors: 0, Skipped: 0, Time elapsed: 21.45 sec
Running org.apache.hadoop.hbase.filter.TestFilter
Tests run: 18, Failures: 0, Errors: 0, Skipped: 0, Time elapsed: 5.082 sec
Running org.apache.hadoop.hbase.TestServerName
Tests run: 2, Failures: 0, Errors: 0, Skipped: 0, Time elapsed: 0.016 sec
Running org.apache.hadoop.hbase.regionserver.TestWideScanner
Tests run: 1, Failures: 0, Errors: 0, Skipped: 0, Time elapsed: 23.123 sec
Running org.apache.hadoop.hbase.regionserver.TestSplitTransaction
Tests run: 5, Failures: 0, Errors: 0, Skipped: 0, Time elapsed: 3.487 sec
Running org.apache.hadoop.hbase.replication.regionserver.TestReplicationSink
Tests run: 5, Failures: 0, Errors: 0, Skipped: 0, Time elapsed: 29.103 sec
Running org.apache.hadoop.hbase.regionserver.TestGetClosestAtOrBefore
Tests run: 3, Failures: 0, Errors: 0, Skipped: 0, Time elapsed: 15.07 sec
Running org.apache.hadoop.hbase.regionserver.TestReadWriteConsistencyControl
Tests run: 1, Failures: 0, Errors: 0, Skipped: 0, Time elapsed: 10.024 sec
Running org.apache.hadoop.hbase.util.TestMergeTable
Tests run: 1, Failures: 0, Errors: 0, Skipped: 0, Time elapsed: 64.783 sec
Running org.apache.hadoop.hbase.coprocessor.TestMasterObserver
Tests run: 3, Failures: 0, Errors: 0, Skipped: 0, Time elapsed: 28.884 sec
Running org.apache.hadoop.hbase.rest.model.TestVersionModel
Tests run: 3, Failures: 0, Errors: 0, Skipped: 0, Time elapsed: 0.127 sec
Running org.apache.hadoop.hbase.rest.model.TestCellSetModel
Tests run: 3, Failures: 0, Errors: 0, Skipped: 0, Time elapsed: 0.134 sec
Running org.apache.hadoop.hbase.rest.client.TestRemoteTable
Tests run: 3, Failures: 0, Errors: 0, Skipped: 0, Time elapsed: 24.286 sec
Running org.apache.hadoop.hbase.rest.model.TestStorageClusterStatusModel
Tests run: 3, Failures: 0, Errors: 0, Skipped: 0, Time elapsed: 0.139 sec
Running org.apache.hadoop.hbase.monitoring.TestTaskMonitor
Tests run: 3, Failures: 0, Errors: 0, Skipped: 0, Time elapsed: 0.22 sec
Running org.apache.hadoop.hbase.avro.TestAvroServer
Tests run: 3, Failures: 0, Errors: 0, Skipped: 0, Time elapsed: 37.594 sec
Running org.apache.hadoop.hbase.TestFullLogReconstruction
Tests run: 1, Failures: 0, Errors: 0, Skipped: 0, Time elapsed: 67.893 sec
Running org.apache.hadoop.hbase.TestSerialization
Tests run: 18, Failures: 0, Errors: 0, Skipped: 0, Time elapsed: 0.054 sec
Running org.apache.hadoop.hbase.regionserver.TestKeyValueHeap
Tests run: 3, Failures: 0, Errors: 0, Skipped: 0, Time elapsed: 0.096 sec
Running org.apache.hadoop.hbase.regionserver.TestStoreScanner
Tests run: 14, Failures: 0, Errors: 0, Skipped: 0, Time elapsed: 0.031 sec
Running org.apache.hadoop.hbase.io.hfile.TestReseekTo
Tests run: 1, Failures: 0, Errors: 0, Skipped: 0, Time elapsed: 0.194 sec
Running org.apache.hadoop.hbase.regionserver.TestHRegionInfo
Tests run: 2, Failures: 0, Errors: 0, Skipped: 0, Time elapsed: 0.017 sec
Running org.apache.hadoop.hbase.regionserver.TestScanner
Tests run: 6, Failures: 0, Errors: 0, Skipped: 0, Time elapsed: 72.907 sec
Running org.apache.hadoop.hbase.util.TestIncrementingEnvironmentEdge
Tests run: 1, Failures: 0, Errors: 0, Skipped: 0, Time elapsed: 0.016 sec
Running org.apache.hadoop.hbase.util.TestKeying
Tests run: 1, Failures: 0, Errors: 0, Skipped: 0, Time elapsed: 0.016 sec
Running org.apache.hadoop.hbase.util.TestHBaseFsck
Tests run: 2, Failures: 0, Errors: 0, Skipped: 0, Time elapsed: 37.39 sec
Running org.apache.hadoop.hbase.master.TestRestartCluster
Tests run: 2, Failures: 0, Errors: 0, Skipped: 0, Time elapsed: 58.267 sec
Running org.apache.hadoop.hbase.client.TestShell
killed.
[INFO] ------------------------------------------------------------------------
[ERROR] BUILD ERROR
[INFO] ------------------------------------------------------------------------
[INFO] Error while executing forked tests.; nested exception is org.apache.maven.surefire.booter.shade.org.codehaus.plexus.util.cli.CommandLineException: Error while executing external command, process killed.

Process timeout out after 900 seconds
[INFO] ------------------------------------------------------------------------
[INFO] For more information, run Maven with the -e switch
[INFO] ------------------------------------------------------------------------
[INFO] Total time: 75 minutes 19 seconds
[INFO] Finished at: Tue Jun 14 21:34:36 UTC 2011
[INFO] Final Memory: 94M/1073M
[INFO] ------------------------------------------------------------------------
[locks-and-latches] Releasing all the locks
[locks-and-latches] All the locks released
Archiving artifacts
Recording test results

Search Discussions

  • Apache Jenkins Server at Jun 15, 2011 at 2:13 am
    See <https://builds.apache.org/job/HBase-TRUNK/1971/changes>

    Changes:

    [stack] HBASE-3940 HBase daemons should log version info at startup and possibly periodically

    ------------------------------------------
    [...truncated 3479 lines...]
    Tests run: 1, Failures: 0, Errors: 0, Skipped: 0, Time elapsed: 0.016 sec
    Running org.apache.hadoop.hbase.TestHBaseTestingUtility
    Tests run: 6, Failures: 0, Errors: 0, Skipped: 0, Time elapsed: 79.505 sec
    Running org.apache.hadoop.hbase.mapreduce.TestLoadIncrementalHFiles
    Tests run: 4, Failures: 0, Errors: 0, Skipped: 0, Time elapsed: 50.952 sec
    Running org.apache.hadoop.hbase.regionserver.wal.TestWALReplay
    Tests run: 4, Failures: 0, Errors: 0, Skipped: 0, Time elapsed: 42.841 sec
    Running org.apache.hadoop.hbase.rest.TestSchemaResource
    Tests run: 2, Failures: 0, Errors: 0, Skipped: 0, Time elapsed: 28.958 sec
    Running org.apache.hadoop.hbase.regionserver.TestKeyValueScanFixture
    Tests run: 1, Failures: 0, Errors: 0, Skipped: 0, Time elapsed: 0.022 sec
    Running org.apache.hadoop.hbase.rest.model.TestTableListModel
    Tests run: 3, Failures: 0, Errors: 0, Skipped: 0, Time elapsed: 0.131 sec
    Running org.apache.hadoop.hbase.rest.model.TestColumnSchemaModel
    Tests run: 2, Failures: 0, Errors: 0, Skipped: 0, Time elapsed: 0.031 sec
    Running org.apache.hadoop.hbase.regionserver.TestStoreFile
    Tests run: 8, Failures: 0, Errors: 0, Skipped: 0, Time elapsed: 46.189 sec
    Running org.apache.hadoop.hbase.zookeeper.TestZooKeeperNodeTracker
    Tests run: 2, Failures: 0, Errors: 0, Skipped: 0, Time elapsed: 0.412 sec
    Running org.apache.hadoop.hbase.master.TestSplitLogManager
    Tests run: 9, Failures: 0, Errors: 0, Skipped: 0, Time elapsed: 13.714 sec
    Running org.apache.hadoop.hbase.regionserver.wal.TestHLogMethods
    Tests run: 3, Failures: 0, Errors: 0, Skipped: 0, Time elapsed: 0.416 sec
    Running org.apache.hadoop.hbase.rest.model.TestScannerModel
    Tests run: 3, Failures: 0, Errors: 0, Skipped: 0, Time elapsed: 0.127 sec
    Running org.apache.hadoop.hbase.rest.TestVersionResource
    Tests run: 7, Failures: 0, Errors: 0, Skipped: 0, Time elapsed: 24.857 sec
    Running org.apache.hadoop.hbase.filter.TestFilter
    Tests run: 18, Failures: 0, Errors: 0, Skipped: 0, Time elapsed: 4.519 sec
    Running org.apache.hadoop.hbase.TestServerName
    Tests run: 2, Failures: 0, Errors: 0, Skipped: 0, Time elapsed: 0.016 sec
    Running org.apache.hadoop.hbase.regionserver.TestWideScanner
    Tests run: 1, Failures: 0, Errors: 0, Skipped: 0, Time elapsed: 18.623 sec
    Running org.apache.hadoop.hbase.regionserver.TestSplitTransaction
    Tests run: 5, Failures: 0, Errors: 0, Skipped: 0, Time elapsed: 3.7 sec
    Running org.apache.hadoop.hbase.replication.regionserver.TestReplicationSink
    Tests run: 5, Failures: 0, Errors: 0, Skipped: 0, Time elapsed: 27.424 sec
    Running org.apache.hadoop.hbase.regionserver.TestGetClosestAtOrBefore
    Tests run: 3, Failures: 0, Errors: 0, Skipped: 0, Time elapsed: 14.991 sec
    Running org.apache.hadoop.hbase.regionserver.TestReadWriteConsistencyControl
    Tests run: 1, Failures: 0, Errors: 0, Skipped: 0, Time elapsed: 10.02 sec
    Running org.apache.hadoop.hbase.util.TestMergeTable
    Tests run: 1, Failures: 0, Errors: 0, Skipped: 0, Time elapsed: 56.507 sec
    Running org.apache.hadoop.hbase.coprocessor.TestMasterObserver
    Tests run: 3, Failures: 0, Errors: 0, Skipped: 0, Time elapsed: 27.751 sec
    Running org.apache.hadoop.hbase.rest.model.TestVersionModel
    Tests run: 3, Failures: 0, Errors: 0, Skipped: 0, Time elapsed: 0.127 sec
    Running org.apache.hadoop.hbase.rest.model.TestCellSetModel
    Tests run: 3, Failures: 0, Errors: 0, Skipped: 0, Time elapsed: 0.134 sec
    Running org.apache.hadoop.hbase.rest.client.TestRemoteTable
    Tests run: 3, Failures: 0, Errors: 0, Skipped: 0, Time elapsed: 22.474 sec
    Running org.apache.hadoop.hbase.rest.model.TestStorageClusterStatusModel
    Tests run: 3, Failures: 0, Errors: 0, Skipped: 0, Time elapsed: 0.133 sec
    Running org.apache.hadoop.hbase.monitoring.TestTaskMonitor
    Tests run: 3, Failures: 0, Errors: 0, Skipped: 0, Time elapsed: 0.225 sec
    Running org.apache.hadoop.hbase.avro.TestAvroServer
    Tests run: 3, Failures: 0, Errors: 0, Skipped: 0, Time elapsed: 33.061 sec
    Running org.apache.hadoop.hbase.TestFullLogReconstruction
    Tests run: 1, Failures: 0, Errors: 0, Skipped: 0, Time elapsed: 62.51 sec
    Running org.apache.hadoop.hbase.TestSerialization
    Tests run: 18, Failures: 0, Errors: 0, Skipped: 0, Time elapsed: 0.055 sec
    Running org.apache.hadoop.hbase.regionserver.TestKeyValueHeap
    Tests run: 3, Failures: 0, Errors: 0, Skipped: 0, Time elapsed: 0.098 sec
    Running org.apache.hadoop.hbase.regionserver.TestStoreScanner
    Tests run: 14, Failures: 0, Errors: 0, Skipped: 0, Time elapsed: 0.031 sec
    Running org.apache.hadoop.hbase.io.hfile.TestReseekTo
    Tests run: 1, Failures: 0, Errors: 0, Skipped: 0, Time elapsed: 0.208 sec
    Running org.apache.hadoop.hbase.regionserver.TestHRegionInfo
    Tests run: 2, Failures: 0, Errors: 0, Skipped: 0, Time elapsed: 0.017 sec
    Running org.apache.hadoop.hbase.regionserver.TestScanner
    Tests run: 6, Failures: 0, Errors: 0, Skipped: 0, Time elapsed: 64.199 sec
    Running org.apache.hadoop.hbase.util.TestIncrementingEnvironmentEdge
    Tests run: 1, Failures: 0, Errors: 0, Skipped: 0, Time elapsed: 0.016 sec
    Running org.apache.hadoop.hbase.util.TestKeying
    Tests run: 1, Failures: 0, Errors: 0, Skipped: 0, Time elapsed: 0.016 sec
    Running org.apache.hadoop.hbase.util.TestHBaseFsck
    Tests run: 2, Failures: 0, Errors: 0, Skipped: 0, Time elapsed: 37.04 sec
    Running org.apache.hadoop.hbase.master.TestRestartCluster
    Tests run: 2, Failures: 0, Errors: 0, Skipped: 0, Time elapsed: 62.395 sec
    Running org.apache.hadoop.hbase.client.TestShell
    Tests run: 1, Failures: 0, Errors: 0, Skipped: 0, Time elapsed: 51.463 sec
    Running org.apache.hadoop.hbase.rest.model.TestTableInfoModel
    Tests run: 3, Failures: 0, Errors: 0, Skipped: 0, Time elapsed: 0.13 sec
    Running org.apache.hadoop.hbase.TestInfoServers
    Tests run: 2, Failures: 0, Errors: 0, Skipped: 0, Time elapsed: 37.232 sec
    Running org.apache.hadoop.hbase.master.TestLogsCleaner
    Tests run: 1, Failures: 0, Errors: 0, Skipped: 0, Time elapsed: 1.338 sec
    Running org.apache.hadoop.hbase.client.TestAttributes
    Tests run: 3, Failures: 0, Errors: 0, Skipped: 0, Time elapsed: 0.02 sec
    Running org.apache.hadoop.hbase.regionserver.TestMasterAddressManager
    Tests run: 1, Failures: 0, Errors: 0, Skipped: 0, Time elapsed: 0.3 sec
    Running org.apache.hadoop.hbase.master.TestMasterStatusServlet
    Tests run: 4, Failures: 0, Errors: 0, Skipped: 0, Time elapsed: 0.535 sec
    Running org.apache.hadoop.hbase.catalog.TestCatalogTrackerOnCluster
    Tests run: 1, Failures: 0, Errors: 0, Skipped: 0, Time elapsed: 211.29 sec
    Running org.apache.hadoop.hbase.regionserver.TestQueryMatcher
    Tests run: 4, Failures: 0, Errors: 0, Skipped: 0, Time elapsed: 0.105 sec
    Running org.apache.hadoop.hbase.zookeeper.TestZKTable
    Tests run: 1, Failures: 0, Errors: 0, Skipped: 0, Time elapsed: 0.403 sec
    Running org.apache.hadoop.hbase.client.TestAdmin
    Tests run: 19, Failures: 0, Errors: 0, Skipped: 0, Time elapsed: 321.401 sec
    Running org.apache.hadoop.hbase.util.TestSortedCopyOnWriteSet
    Tests run: 2, Failures: 0, Errors: 0, Skipped: 0, Time elapsed: 0.024 sec
    Running org.apache.hadoop.hbase.util.TestMergeTool
    Tests run: 1, Failures: 0, Errors: 0, Skipped: 0, Time elapsed: 38.498 sec
    Running org.apache.hadoop.hbase.TestAcidGuarantees
    Tests run: 3, Failures: 0, Errors: 0, Skipped: 3, Time elapsed: 0.015 sec
    Running org.apache.hadoop.hbase.TestHRegionLocation
    Tests run: 3, Failures: 0, Errors: 0, Skipped: 0, Time elapsed: 0.019 sec
    Running org.apache.hadoop.hbase.util.TestBase64
    Tests run: 1, Failures: 0, Errors: 0, Skipped: 0, Time elapsed: 0.017 sec
    Running org.apache.hadoop.hbase.coprocessor.TestRegionObserverStacking
    Tests run: 1, Failures: 0, Errors: 0, Skipped: 0, Time elapsed: 0.276 sec
    Running org.apache.hadoop.hbase.regionserver.TestMemStore
    Tests run: 21, Failures: 0, Errors: 0, Skipped: 0, Time elapsed: 43.779 sec
    Running org.apache.hadoop.hbase.rest.TestScannerResource
    Tests run: 5, Failures: 0, Errors: 0, Skipped: 0, Time elapsed: 65.446 sec
    Running org.apache.hadoop.hbase.io.hfile.TestLruBlockCache
    Tests run: 7, Failures: 0, Errors: 0, Skipped: 0, Time elapsed: 1.052 sec
    Running org.apache.hadoop.hbase.master.TestDeadServer
    Tests run: 1, Failures: 0, Errors: 0, Skipped: 0, Time elapsed: 0.017 sec
    Running org.apache.hadoop.hbase.rest.TestGzipFilter
    Tests run: 2, Failures: 0, Errors: 0, Skipped: 0, Time elapsed: 28.098 sec
    Running org.apache.hadoop.hbase.mapreduce.TestTableMapReduce
    Tests run: 2, Failures: 0, Errors: 0, Skipped: 0, Time elapsed: 105.714 sec
    Running org.apache.hadoop.hbase.TestKeyValue
    Tests run: 9, Failures: 0, Errors: 0, Skipped: 0, Time elapsed: 0.024 sec
    Running org.apache.hadoop.hbase.filter.TestColumnRangeFilter
    Tests run: 1, Failures: 0, Errors: 0, Skipped: 0, Time elapsed: 43.518 sec
    Running org.apache.hadoop.hbase.client.TestMultiParallel
    Tests run: 10, Failures: 0, Errors: 0, Skipped: 0, Time elapsed: 34.545 sec
    Running org.apache.hadoop.hbase.master.TestMaster
    Tests run: 1, Failures: 0, Errors: 0, Skipped: 0, Time elapsed: 80.234 sec
    Running org.apache.hadoop.hbase.master.TestRollingRestart
    Tests run: 1, Failures: 0, Errors: 0, Skipped: 0, Time elapsed: 80.088 sec
    Running org.apache.hadoop.hbase.client.TestResult
    Tests run: 2, Failures: 0, Errors: 0, Skipped: 0, Time elapsed: 0.038 sec
    Running org.apache.hadoop.hbase.client.TestHTablePool
    Tests run: 10, Failures: 0, Errors: 0, Skipped: 0, Time elapsed: 208.427 sec
    Running org.apache.hadoop.hbase.regionserver.TestRSStatusServlet
    Tests run: 2, Failures: 0, Errors: 0, Skipped: 0, Time elapsed: 0.299 sec
    Running org.apache.hadoop.hbase.regionserver.TestCompactSelection
    Tests run: 1, Failures: 0, Errors: 0, Skipped: 0, Time elapsed: 0.329 sec
    Running org.apache.hadoop.hbase.util.TestByteBloomFilter
    Tests run: 3, Failures: 0, Errors: 0, Skipped: 0, Time elapsed: 1.571 sec
    Running org.apache.hadoop.hbase.rest.model.TestTableSchemaModel
    Tests run: 3, Failures: 0, Errors: 0, Skipped: 0, Time elapsed: 0.138 sec
    Running org.apache.hadoop.hbase.mapreduce.TestTableInputFormatScan
    Tests run: 11, Failures: 0, Errors: 0, Skipped: 0, Time elapsed: 342.229 sec
    Running org.apache.hadoop.hbase.filter.TestFilterList
    Tests run: 4, Failures: 0, Errors: 0, Skipped: 0, Time elapsed: 0.041 sec
    Running org.apache.hadoop.hbase.regionserver.TestHRegion
    Tests run: 54, Failures: 0, Errors: 0, Skipped: 0, Time elapsed: 40.227 sec
    Running org.apache.hadoop.hbase.master.TestMasterFailover
    Tests run: 3, Failures: 0, Errors: 1, Skipped: 0, Time elapsed: 242.958 sec <<< FAILURE!
    Running org.apache.hadoop.hbase.client.TestScan
    Tests run: 2, Failures: 0, Errors: 0, Skipped: 0, Time elapsed: 0.018 sec
    Running org.apache.hadoop.hbase.rest.model.TestTableRegionModel
    Tests run: 4, Failures: 0, Errors: 0, Skipped: 0, Time elapsed: 0.032 sec
    Running org.apache.hadoop.hbase.client.TestTimestampsFilter
    Tests run: 3, Failures: 0, Errors: 0, Skipped: 0, Time elapsed: 32.58 sec
    Running org.apache.hadoop.hbase.master.TestLoadBalancer
    Tests run: 5, Failures: 0, Errors: 0, Skipped: 0, Time elapsed: 2.067 sec
    Running org.apache.hadoop.hbase.util.TestRootPath
    Tests run: 1, Failures: 0, Errors: 0, Skipped: 0, Time elapsed: 0.021 sec
    Running org.apache.hadoop.hbase.client.TestScannerTimeout
    Tests run: 4, Failures: 0, Errors: 0, Skipped: 0, Time elapsed: 52.305 sec
    Running org.apache.hadoop.hbase.regionserver.wal.TestWALObserver
    Tests run: 1, Failures: 0, Errors: 0, Skipped: 0, Time elapsed: 0.321 sec
    Running org.apache.hadoop.hbase.mapred.TestTableMapReduce
    Tests run: 1, Failures: 0, Errors: 0, Skipped: 0, Time elapsed: 71.277 sec
    Running org.apache.hadoop.hbase.coprocessor.TestAggregateProtocol
    Tests run: 44, Failures: 0, Errors: 0, Skipped: 0, Time elapsed: 26.619 sec
    Running org.apache.hadoop.hbase.master.TestActiveMasterManager
    Tests run: 2, Failures: 0, Errors: 0, Skipped: 0, Time elapsed: 0.684 sec
    Running org.apache.hadoop.hbase.util.TestBytes
    Tests run: 10, Failures: 0, Errors: 0, Skipped: 0, Time elapsed: 0.021 sec
    Running org.apache.hadoop.hbase.filter.TestRandomRowFilter
    Tests run: 2, Failures: 0, Errors: 0, Skipped: 0, Time elapsed: 0.431 sec
    Running org.apache.hadoop.hbase.replication.regionserver.TestReplicationSourceManager
    Tests run: 1, Failures: 0, Errors: 0, Skipped: 0, Time elapsed: 0.951 sec
    Running org.apache.hadoop.hbase.util.TestCompressionTest
    Tests run: 1, Failures: 0, Errors: 0, Skipped: 0, Time elapsed: 0.026 sec
    Running org.apache.hadoop.hbase.client.TestMetaMigration
    Tests run: 3, Failures: 0, Errors: 0, Skipped: 0, Time elapsed: 18.873 sec
    Running org.apache.hadoop.hbase.client.TestGetRowVersions
    Tests run: 1, Failures: 0, Errors: 0, Skipped: 0, Time elapsed: 64.925 sec
    Running org.apache.hadoop.hbase.filter.TestDependentColumnFilter
    Tests run: 2, Failures: 0, Errors: 0, Skipped: 0, Time elapsed: 0.445 sec
    Running org.apache.hadoop.hbase.rest.model.TestCellModel
    Tests run: 3, Failures: 0, Errors: 0, Skipped: 0, Time elapsed: 0.127 sec
    Running org.apache.hadoop.hbase.master.TestCatalogJanitor
    Tests run: 2, Failures: 0, Errors: 0, Skipped: 0, Time elapsed: 0.657 sec
    Running org.apache.hadoop.hbase.catalog.TestCatalogTracker
    Tests run: 8, Failures: 0, Errors: 0, Skipped: 0, Time elapsed: 2.959 sec
    Running org.apache.hadoop.hbase.replication.TestReplicationSource
    Tests run: 1, Failures: 0, Errors: 0, Skipped: 0, Time elapsed: 2.541 sec
    Running org.apache.hadoop.hbase.coprocessor.TestWALObserver
    Tests run: 3, Failures: 0, Errors: 0, Skipped: 0, Time elapsed: 23.928 sec
    Running org.apache.hadoop.hbase.rest.TestRowResource
    Tests run: 10, Failures: 0, Errors: 0, Skipped: 0, Time elapsed: 26.923 sec
    Running org.apache.hadoop.hbase.io.hfile.TestHFile
    Tests run: 7, Failures: 0, Errors: 0, Skipped: 0, Time elapsed: 0.335 sec
    Running org.apache.hadoop.hbase.catalog.TestMetaReaderEditor
    Tests run: 4, Failures: 0, Errors: 0, Skipped: 0, Time elapsed: 27.617 sec
    Running org.apache.hadoop.hbase.mapreduce.TestImportTsv
    Tests run: 8, Failures: 0, Errors: 0, Skipped: 0, Time elapsed: 45.779 sec
    Running org.apache.hadoop.hbase.rest.client.TestRemoteAdmin
    Tests run: 2, Failures: 0, Errors: 0, Skipped: 0, Time elapsed: 27.671 sec
    Running org.apache.hadoop.hbase.regionserver.wal.TestHLog
    Tests run: 9, Failures: 0, Errors: 0, Skipped: 0, Time elapsed: 88.238 sec
    Running org.apache.hadoop.hbase.client.TestTimestamp
    Tests run: 1, Failures: 0, Errors: 0, Skipped: 0, Time elapsed: 21.405 sec
    Running org.apache.hadoop.hbase.TestScanMultipleVersions
    Tests run: 1, Failures: 0, Errors: 0, Skipped: 0, Time elapsed: 22.727 sec
    Running org.apache.hadoop.hbase.util.TestPoolMap
    Tests run: 9, Failures: 0, Errors: 0, Skipped: 0, Time elapsed: 0.041 sec
    Running org.apache.hadoop.hbase.TestGlobalMemStoreSize
    Tests run: 1, Failures: 1, Errors: 0, Skipped: 0, Time elapsed: 18.975 sec <<< FAILURE!
    Running org.apache.hadoop.hbase.rest.model.TestStorageClusterVersionModel
    Tests run: 2, Failures: 0, Errors: 0, Skipped: 0, Time elapsed: 0.03 sec
    Running org.apache.hadoop.hbase.client.TestHCM
    Tests run: 3, Failures: 0, Errors: 0, Skipped: 0, Time elapsed: 24.543 sec

    Results :

    Failed tests:

    Tests in error:

    Tests run: 805, Failures: 1, Errors: 1, Skipped: 9

    [INFO] ------------------------------------------------------------------------
    [ERROR] BUILD FAILURE
    [INFO] ------------------------------------------------------------------------
    [INFO] There are test failures.

    Please refer to <https://builds.apache.org/job/HBase-TRUNK/ws/trunk/target/surefire-reports> for the individual test results.
    [INFO] ------------------------------------------------------------------------
    [INFO] For more information, run Maven with the -e switch
    [INFO] ------------------------------------------------------------------------
    [INFO] Total time: 104 minutes 5 seconds
    [INFO] Finished at: Wed Jun 15 00:26:25 UTC 2011
    [INFO] Final Memory: 96M/869M
    [INFO] ------------------------------------------------------------------------
    [locks-and-latches] Releasing all the locks
    [locks-and-latches] All the locks released
    Archiving artifacts
    Recording test results

Related Discussions

Discussion Navigation
viewthread | post
Discussion Overview
groupdev @
categorieshbase, hadoop
postedJun 14, '11 at 9:42p
activeJun 15, '11 at 2:13a
posts2
users1
websitehbase.apache.org

1 user in discussion

Apache Jenkins Server: 2 posts

People

Translate

site design / logo © 2022 Grokbase