Grokbase Groups HBase dev March 2011
FAQ
See <https://hudson.apache.org/hudson/job/hbase-0.90/124/changes>

Changes:

[stack] HBASE-3671 Split report before we finish parent region open; workaround till 0.92; Race between split and OPENED processing

[stack] HBASE-3671 Split report before we finish parent region open; workaround till 0.92; Race between split and OPENED processing

------------------------------------------
[...truncated 2504 lines...]
Generating <https://hudson.apache.org/hudson/job/hbase-0.90/ws/trunk/target/site/apidocs/org/apache/hadoop/hbase/thrift/generated//class-use/Hbase.deleteAllRowTs_result.html...>
Generating <https://hudson.apache.org/hudson/job/hbase-0.90/ws/trunk/target/site/apidocs/org/apache/hadoop/hbase/thrift/generated//class-use/Hbase.deleteAllRowTs_result._Fields.html...>
Generating <https://hudson.apache.org/hudson/job/hbase-0.90/ws/trunk/target/site/apidocs/org/apache/hadoop/hbase/thrift/generated//class-use/Hbase.scannerOpen_args.html...>
Generating <https://hudson.apache.org/hudson/job/hbase-0.90/ws/trunk/target/site/apidocs/org/apache/hadoop/hbase/thrift/generated//class-use/Hbase.scannerOpen_args._Fields.html...>
Generating <https://hudson.apache.org/hudson/job/hbase-0.90/ws/trunk/target/site/apidocs/org/apache/hadoop/hbase/thrift/generated//class-use/Hbase.scannerOpen_result.html...>
Generating <https://hudson.apache.org/hudson/job/hbase-0.90/ws/trunk/target/site/apidocs/org/apache/hadoop/hbase/thrift/generated//class-use/Hbase.scannerOpen_result._Fields.html...>
Generating <https://hudson.apache.org/hudson/job/hbase-0.90/ws/trunk/target/site/apidocs/org/apache/hadoop/hbase/thrift/generated//class-use/Hbase.scannerOpenWithStop_args.html...>
Generating <https://hudson.apache.org/hudson/job/hbase-0.90/ws/trunk/target/site/apidocs/org/apache/hadoop/hbase/thrift/generated//class-use/Hbase.scannerOpenWithStop_args._Fields.html...>
Generating <https://hudson.apache.org/hudson/job/hbase-0.90/ws/trunk/target/site/apidocs/org/apache/hadoop/hbase/thrift/generated//class-use/Hbase.scannerOpenWithStop_result.html...>
Generating <https://hudson.apache.org/hudson/job/hbase-0.90/ws/trunk/target/site/apidocs/org/apache/hadoop/hbase/thrift/generated//class-use/Hbase.scannerOpenWithStop_result._Fields.html...>
Generating <https://hudson.apache.org/hudson/job/hbase-0.90/ws/trunk/target/site/apidocs/org/apache/hadoop/hbase/thrift/generated//class-use/Hbase.scannerOpenWithPrefix_args.html...>
Generating <https://hudson.apache.org/hudson/job/hbase-0.90/ws/trunk/target/site/apidocs/org/apache/hadoop/hbase/thrift/generated//class-use/Hbase.scannerOpenWithPrefix_args._Fields.html...>
Generating <https://hudson.apache.org/hudson/job/hbase-0.90/ws/trunk/target/site/apidocs/org/apache/hadoop/hbase/thrift/generated//class-use/Hbase.scannerOpenWithPrefix_result.html...>
Generating <https://hudson.apache.org/hudson/job/hbase-0.90/ws/trunk/target/site/apidocs/org/apache/hadoop/hbase/thrift/generated//class-use/Hbase.scannerOpenWithPrefix_result._Fields.html...>
Generating <https://hudson.apache.org/hudson/job/hbase-0.90/ws/trunk/target/site/apidocs/org/apache/hadoop/hbase/thrift/generated//class-use/Hbase.scannerOpenTs_args.html...>
Generating <https://hudson.apache.org/hudson/job/hbase-0.90/ws/trunk/target/site/apidocs/org/apache/hadoop/hbase/thrift/generated//class-use/Hbase.scannerOpenTs_args._Fields.html...>
Generating <https://hudson.apache.org/hudson/job/hbase-0.90/ws/trunk/target/site/apidocs/org/apache/hadoop/hbase/thrift/generated//class-use/Hbase.scannerOpenTs_result.html...>
Generating <https://hudson.apache.org/hudson/job/hbase-0.90/ws/trunk/target/site/apidocs/org/apache/hadoop/hbase/thrift/generated//class-use/Hbase.scannerOpenTs_result._Fields.html...>
Generating <https://hudson.apache.org/hudson/job/hbase-0.90/ws/trunk/target/site/apidocs/org/apache/hadoop/hbase/thrift/generated//class-use/Hbase.scannerOpenWithStopTs_args.html...>
Generating <https://hudson.apache.org/hudson/job/hbase-0.90/ws/trunk/target/site/apidocs/org/apache/hadoop/hbase/thrift/generated//class-use/Hbase.scannerOpenWithStopTs_args._Fields.html...>
Generating <https://hudson.apache.org/hudson/job/hbase-0.90/ws/trunk/target/site/apidocs/org/apache/hadoop/hbase/thrift/generated//class-use/Hbase.scannerOpenWithStopTs_result.html...>
Generating <https://hudson.apache.org/hudson/job/hbase-0.90/ws/trunk/target/site/apidocs/org/apache/hadoop/hbase/thrift/generated//class-use/Hbase.scannerOpenWithStopTs_result._Fields.html...>
Generating <https://hudson.apache.org/hudson/job/hbase-0.90/ws/trunk/target/site/apidocs/org/apache/hadoop/hbase/thrift/generated//class-use/Hbase.scannerGet_args.html...>
Generating <https://hudson.apache.org/hudson/job/hbase-0.90/ws/trunk/target/site/apidocs/org/apache/hadoop/hbase/thrift/generated//class-use/Hbase.scannerGet_args._Fields.html...>
Generating <https://hudson.apache.org/hudson/job/hbase-0.90/ws/trunk/target/site/apidocs/org/apache/hadoop/hbase/thrift/generated//class-use/Hbase.scannerGet_result.html...>
Generating <https://hudson.apache.org/hudson/job/hbase-0.90/ws/trunk/target/site/apidocs/org/apache/hadoop/hbase/thrift/generated//class-use/Hbase.scannerGet_result._Fields.html...>
Generating <https://hudson.apache.org/hudson/job/hbase-0.90/ws/trunk/target/site/apidocs/org/apache/hadoop/hbase/thrift/generated//class-use/Hbase.scannerGetList_args.html...>
Generating <https://hudson.apache.org/hudson/job/hbase-0.90/ws/trunk/target/site/apidocs/org/apache/hadoop/hbase/thrift/generated//class-use/Hbase.scannerGetList_args._Fields.html...>
Generating <https://hudson.apache.org/hudson/job/hbase-0.90/ws/trunk/target/site/apidocs/org/apache/hadoop/hbase/thrift/generated//class-use/Hbase.scannerGetList_result.html...>
Generating <https://hudson.apache.org/hudson/job/hbase-0.90/ws/trunk/target/site/apidocs/org/apache/hadoop/hbase/thrift/generated//class-use/Hbase.scannerGetList_result._Fields.html...>
Generating <https://hudson.apache.org/hudson/job/hbase-0.90/ws/trunk/target/site/apidocs/org/apache/hadoop/hbase/thrift/generated//class-use/Hbase.scannerClose_args.html...>
Generating <https://hudson.apache.org/hudson/job/hbase-0.90/ws/trunk/target/site/apidocs/org/apache/hadoop/hbase/thrift/generated//class-use/Hbase.scannerClose_args._Fields.html...>
Generating <https://hudson.apache.org/hudson/job/hbase-0.90/ws/trunk/target/site/apidocs/org/apache/hadoop/hbase/thrift/generated//class-use/Hbase.scannerClose_result.html...>
Generating <https://hudson.apache.org/hudson/job/hbase-0.90/ws/trunk/target/site/apidocs/org/apache/hadoop/hbase/thrift/generated//class-use/Hbase.scannerClose_result._Fields.html...>
Generating <https://hudson.apache.org/hudson/job/hbase-0.90/ws/trunk/target/site/apidocs/org/apache/hadoop/hbase/thrift/generated//class-use/IllegalArgument.html...>
Generating <https://hudson.apache.org/hudson/job/hbase-0.90/ws/trunk/target/site/apidocs/org/apache/hadoop/hbase/thrift/generated//class-use/IllegalArgument._Fields.html...>
Generating <https://hudson.apache.org/hudson/job/hbase-0.90/ws/trunk/target/site/apidocs/org/apache/hadoop/hbase/thrift/generated//class-use/BatchMutation.html...>
Generating <https://hudson.apache.org/hudson/job/hbase-0.90/ws/trunk/target/site/apidocs/org/apache/hadoop/hbase/thrift/generated//class-use/BatchMutation._Fields.html...>
Generating <https://hudson.apache.org/hudson/job/hbase-0.90/ws/trunk/target/site/apidocs/org/apache/hadoop/hbase/master//class-use/ServerManager.html...>
Generating <https://hudson.apache.org/hudson/job/hbase-0.90/ws/trunk/target/site/apidocs/org/apache/hadoop/hbase/master//class-use/TimeToLiveLogCleaner.html...>
Generating <https://hudson.apache.org/hudson/job/hbase-0.90/ws/trunk/target/site/apidocs/org/apache/hadoop/hbase/master//class-use/HMasterCommandLine.html...>
Generating <https://hudson.apache.org/hudson/job/hbase-0.90/ws/trunk/target/site/apidocs/org/apache/hadoop/hbase/master//class-use/HMasterCommandLine.LocalHMaster.html...>
Generating <https://hudson.apache.org/hudson/job/hbase-0.90/ws/trunk/target/site/apidocs/org/apache/hadoop/hbase/master//class-use/LogCleanerDelegate.html...>
Generating <https://hudson.apache.org/hudson/job/hbase-0.90/ws/trunk/target/site/apidocs/org/apache/hadoop/hbase/master//class-use/LogCleaner.html...>
Generating <https://hudson.apache.org/hudson/job/hbase-0.90/ws/trunk/target/site/apidocs/org/apache/hadoop/hbase/master//class-use/BulkAssigner.html...>
Generating <https://hudson.apache.org/hudson/job/hbase-0.90/ws/trunk/target/site/apidocs/org/apache/hadoop/hbase/master//class-use/AssignmentManager.html...>
Generating <https://hudson.apache.org/hudson/job/hbase-0.90/ws/trunk/target/site/apidocs/org/apache/hadoop/hbase/master//class-use/AssignmentManager.TimeoutMonitor.html...>
Generating <https://hudson.apache.org/hudson/job/hbase-0.90/ws/trunk/target/site/apidocs/org/apache/hadoop/hbase/master//class-use/AssignmentManager.RegionState.html...>
Generating <https://hudson.apache.org/hudson/job/hbase-0.90/ws/trunk/target/site/apidocs/org/apache/hadoop/hbase/master//class-use/AssignmentManager.RegionState.State.html...>
Generating <https://hudson.apache.org/hudson/job/hbase-0.90/ws/trunk/target/site/apidocs/org/apache/hadoop/hbase/master//class-use/MasterFileSystem.html...>
Generating <https://hudson.apache.org/hudson/job/hbase-0.90/ws/trunk/target/site/apidocs/org/apache/hadoop/hbase/master//class-use/HMaster.html...>
Generating <https://hudson.apache.org/hudson/job/hbase-0.90/ws/trunk/target/site/apidocs/org/apache/hadoop/hbase/master//class-use/MasterServices.html...>
Generating <https://hudson.apache.org/hudson/job/hbase-0.90/ws/trunk/target/site/apidocs/org/apache/hadoop/hbase/master//class-use/LoadBalancer.html...>
Generating <https://hudson.apache.org/hudson/job/hbase-0.90/ws/trunk/target/site/apidocs/org/apache/hadoop/hbase/master//class-use/LoadBalancer.RegionPlan.html...>
Generating <https://hudson.apache.org/hudson/job/hbase-0.90/ws/trunk/target/site/apidocs/org/apache/hadoop/hbase/master//class-use/DeadServer.html...>
Generating <https://hudson.apache.org/hudson/job/hbase-0.90/ws/trunk/target/site/apidocs/org/apache/hadoop/hbase/master/handler//class-use/ModifyTableHandler.html...>
Generating <https://hudson.apache.org/hudson/job/hbase-0.90/ws/trunk/target/site/apidocs/org/apache/hadoop/hbase/master/handler//class-use/DeleteTableHandler.html...>
Generating <https://hudson.apache.org/hudson/job/hbase-0.90/ws/trunk/target/site/apidocs/org/apache/hadoop/hbase/master/handler//class-use/TableAddFamilyHandler.html...>
Generating <https://hudson.apache.org/hudson/job/hbase-0.90/ws/trunk/target/site/apidocs/org/apache/hadoop/hbase/master/handler//class-use/TableDeleteFamilyHandler.html...>
Generating <https://hudson.apache.org/hudson/job/hbase-0.90/ws/trunk/target/site/apidocs/org/apache/hadoop/hbase/master/handler//class-use/OpenedRegionHandler.html...>
Generating <https://hudson.apache.org/hudson/job/hbase-0.90/ws/trunk/target/site/apidocs/org/apache/hadoop/hbase/master/handler//class-use/ClosedRegionHandler.html...>
Generating <https://hudson.apache.org/hudson/job/hbase-0.90/ws/trunk/target/site/apidocs/org/apache/hadoop/hbase/master/handler//class-use/MetaServerShutdownHandler.html...>
Generating <https://hudson.apache.org/hudson/job/hbase-0.90/ws/trunk/target/site/apidocs/org/apache/hadoop/hbase/master/handler//class-use/TableEventHandler.html...>
Generating <https://hudson.apache.org/hudson/job/hbase-0.90/ws/trunk/target/site/apidocs/org/apache/hadoop/hbase/master/handler//class-use/DisableTableHandler.html...>
Generating <https://hudson.apache.org/hudson/job/hbase-0.90/ws/trunk/target/site/apidocs/org/apache/hadoop/hbase/master/handler//class-use/EnableTableHandler.html...>
Generating <https://hudson.apache.org/hudson/job/hbase-0.90/ws/trunk/target/site/apidocs/org/apache/hadoop/hbase/master/handler//class-use/ServerShutdownHandler.html...>
Generating <https://hudson.apache.org/hudson/job/hbase-0.90/ws/trunk/target/site/apidocs/org/apache/hadoop/hbase/master/handler//class-use/TotesHRegionInfo.html...>
Generating <https://hudson.apache.org/hudson/job/hbase-0.90/ws/trunk/target/site/apidocs/org/apache/hadoop/hbase/master/handler//class-use/TableModifyFamilyHandler.html...>
Generating <https://hudson.apache.org/hudson/job/hbase-0.90/ws/trunk/target/site/apidocs/org/apache/hadoop/hbase/master/metrics//class-use/MasterStatistics.html...>
Generating <https://hudson.apache.org/hudson/job/hbase-0.90/ws/trunk/target/site/apidocs/org/apache/hadoop/hbase/master/metrics//class-use/MasterMetrics.html...>
Generating <https://hudson.apache.org/hudson/job/hbase-0.90/ws/trunk/target/site/apidocs/org/apache/hadoop/hbase/avro//class-use/AvroUtil.html...>
Generating <https://hudson.apache.org/hudson/job/hbase-0.90/ws/trunk/target/site/apidocs/org/apache/hadoop/hbase/avro//class-use/AvroServer.html...>
Generating <https://hudson.apache.org/hudson/job/hbase-0.90/ws/trunk/target/site/apidocs/org/apache/hadoop/hbase/avro//class-use/AvroServer.HBaseImpl.html...>
Generating <https://hudson.apache.org/hudson/job/hbase-0.90/ws/trunk/target/site/apidocs/org/apache/hadoop/hbase/avro/generated//class-use/AColumn.html...>
Generating <https://hudson.apache.org/hudson/job/hbase-0.90/ws/trunk/target/site/apidocs/org/apache/hadoop/hbase/avro/generated//class-use/AFamilyDescriptor.html...>
Generating <https://hudson.apache.org/hudson/job/hbase-0.90/ws/trunk/target/site/apidocs/org/apache/hadoop/hbase/avro/generated//class-use/ATableDescriptor.html...>
Generating <https://hudson.apache.org/hudson/job/hbase-0.90/ws/trunk/target/site/apidocs/org/apache/hadoop/hbase/avro/generated//class-use/ACompressionAlgorithm.html...>
Generating <https://hudson.apache.org/hudson/job/hbase-0.90/ws/trunk/target/site/apidocs/org/apache/hadoop/hbase/avro/generated//class-use/HBase.html...>
Generating <https://hudson.apache.org/hudson/job/hbase-0.90/ws/trunk/target/site/apidocs/org/apache/hadoop/hbase/avro/generated//class-use/AResult.html...>
Generating <https://hudson.apache.org/hudson/job/hbase-0.90/ws/trunk/target/site/apidocs/org/apache/hadoop/hbase/avro/generated//class-use/AServerInfo.html...>
Generating <https://hudson.apache.org/hudson/job/hbase-0.90/ws/trunk/target/site/apidocs/org/apache/hadoop/hbase/avro/generated//class-use/TCell.html...>
Generating <https://hudson.apache.org/hudson/job/hbase-0.90/ws/trunk/target/site/apidocs/org/apache/hadoop/hbase/avro/generated//class-use/APut.html...>
Generating <https://hudson.apache.org/hudson/job/hbase-0.90/ws/trunk/target/site/apidocs/org/apache/hadoop/hbase/avro/generated//class-use/AScan.html...>
Generating <https://hudson.apache.org/hudson/job/hbase-0.90/ws/trunk/target/site/apidocs/org/apache/hadoop/hbase/avro/generated//class-use/AClusterStatus.html...>
Generating <https://hudson.apache.org/hudson/job/hbase-0.90/ws/trunk/target/site/apidocs/org/apache/hadoop/hbase/avro/generated//class-use/AColumnValue.html...>
Generating <https://hudson.apache.org/hudson/job/hbase-0.90/ws/trunk/target/site/apidocs/org/apache/hadoop/hbase/avro/generated//class-use/AResultEntry.html...>
Generating <https://hudson.apache.org/hudson/job/hbase-0.90/ws/trunk/target/site/apidocs/org/apache/hadoop/hbase/avro/generated//class-use/IOError.html...>
Generating <https://hudson.apache.org/hudson/job/hbase-0.90/ws/trunk/target/site/apidocs/org/apache/hadoop/hbase/avro/generated//class-use/ARegionLoad.html...>
Generating <https://hudson.apache.org/hudson/job/hbase-0.90/ws/trunk/target/site/apidocs/org/apache/hadoop/hbase/avro/generated//class-use/AServerAddress.html...>
Generating <https://hudson.apache.org/hudson/job/hbase-0.90/ws/trunk/target/site/apidocs/org/apache/hadoop/hbase/avro/generated//class-use/AMasterNotRunning.html...>
Generating <https://hudson.apache.org/hudson/job/hbase-0.90/ws/trunk/target/site/apidocs/org/apache/hadoop/hbase/avro/generated//class-use/ATimeRange.html...>
Generating <https://hudson.apache.org/hudson/job/hbase-0.90/ws/trunk/target/site/apidocs/org/apache/hadoop/hbase/avro/generated//class-use/AAlreadyExists.html...>
Generating <https://hudson.apache.org/hudson/job/hbase-0.90/ws/trunk/target/site/apidocs/org/apache/hadoop/hbase/avro/generated//class-use/AServerLoad.html...>
Generating <https://hudson.apache.org/hudson/job/hbase-0.90/ws/trunk/target/site/apidocs/org/apache/hadoop/hbase/avro/generated//class-use/ADelete.html...>
Generating <https://hudson.apache.org/hudson/job/hbase-0.90/ws/trunk/target/site/apidocs/org/apache/hadoop/hbase/avro/generated//class-use/AGet.html...>
Generating <https://hudson.apache.org/hudson/job/hbase-0.90/ws/trunk/target/site/apidocs/org/apache/hadoop/hbase/avro/generated//class-use/AIOError.html...>
Generating <https://hudson.apache.org/hudson/job/hbase-0.90/ws/trunk/target/site/apidocs/org/apache/hadoop/hbase/avro/generated//class-use/AColumnFamilyDescriptor.html...>
Generating <https://hudson.apache.org/hudson/job/hbase-0.90/ws/trunk/target/site/apidocs/org/apache/hadoop/hbase/avro/generated//class-use/ATableExists.html...>
Generating <https://hudson.apache.org/hudson/job/hbase-0.90/ws/trunk/target/site/apidocs/org/apache/hadoop/hbase/avro/generated//class-use/AIllegalArgument.html...>
Generating <https://hudson.apache.org/hudson/job/hbase-0.90/ws/trunk/target/site/apidocs/org/apache/hadoop/hbase/ipc//class-use/HBaseServer.html...>
Generating <https://hudson.apache.org/hudson/job/hbase-0.90/ws/trunk/target/site/apidocs/org/apache/hadoop/hbase/ipc//class-use/ByteBufferOutputStream.html...>
Generating <https://hudson.apache.org/hudson/job/hbase-0.90/ws/trunk/target/site/apidocs/org/apache/hadoop/hbase/ipc//class-use/HBaseRpcMetrics.html...>
Generating <https://hudson.apache.org/hudson/job/hbase-0.90/ws/trunk/target/site/apidocs/org/apache/hadoop/hbase/ipc//class-use/HMasterInterface.html...>
Generating <https://hudson.apache.org/hudson/job/hbase-0.90/ws/trunk/target/site/apidocs/org/apache/hadoop/hbase/ipc//class-use/HBaseClient.html...>
Generating <https://hudson.apache.org/hudson/job/hbase-0.90/ws/trunk/target/site/apidocs/org/apache/hadoop/hbase/ipc//class-use/HBaseRPCErrorHandler.html...>
Generating <https://hudson.apache.org/hudson/job/hbase-0.90/ws/trunk/target/site/apidocs/org/apache/hadoop/hbase/ipc//class-use/HBaseRPCStatistics.html...>
Generating <https://hudson.apache.org/hudson/job/hbase-0.90/ws/trunk/target/site/apidocs/org/apache/hadoop/hbase/ipc//class-use/HBaseRPCProtocolVersion.html...>
Generating <https://hudson.apache.org/hudson/job/hbase-0.90/ws/trunk/target/site/apidocs/org/apache/hadoop/hbase/ipc//class-use/HMasterRegionInterface.html...>
Generating <https://hudson.apache.org/hudson/job/hbase-0.90/ws/trunk/target/site/apidocs/org/apache/hadoop/hbase/ipc//class-use/HBaseRPC.html...>
Generating <https://hudson.apache.org/hudson/job/hbase-0.90/ws/trunk/target/site/apidocs/org/apache/hadoop/hbase/ipc//class-use/HBaseRPC.Invocation.html...>
Generating <https://hudson.apache.org/hudson/job/hbase-0.90/ws/trunk/target/site/apidocs/org/apache/hadoop/hbase/ipc//class-use/HBaseRPC.VersionMismatch.html...>
Generating <https://hudson.apache.org/hudson/job/hbase-0.90/ws/trunk/target/site/apidocs/org/apache/hadoop/hbase/ipc//class-use/HBaseRPC.Server.html...>
Generating <https://hudson.apache.org/hudson/job/hbase-0.90/ws/trunk/target/site/apidocs/org/apache/hadoop/hbase/ipc//class-use/HRegionInterface.html...>
Generating <https://hudson.apache.org/hudson/job/hbase-0.90/ws/trunk/target/site/apidocs/org/apache/hadoop/hbase/ipc//class-use/ServerNotRunningException.html...>
Generating <https://hudson.apache.org/hudson/job/hbase-0.90/ws/trunk/target/site/apidocs/org/apache/hadoop/hbase/generated/regionserver//class-use/regionserver_jsp.html...>
Generating <https://hudson.apache.org/hudson/job/hbase-0.90/ws/trunk/target/site/apidocs/org/apache/hadoop/hbase/generated/master//class-use/zk_jsp.html...>
Generating <https://hudson.apache.org/hudson/job/hbase-0.90/ws/trunk/target/site/apidocs/org/apache/hadoop/hbase/generated/master//class-use/master_jsp.html...>
Generating <https://hudson.apache.org/hudson/job/hbase-0.90/ws/trunk/target/site/apidocs/org/apache/hadoop/hbase/generated/master//class-use/table_jsp.html...>
Generating <https://hudson.apache.org/hudson/job/hbase-0.90/ws/trunk/target/site/apidocs/org/apache/hadoop/hbase//package-use.html...>
Generating <https://hudson.apache.org/hudson/job/hbase-0.90/ws/trunk/target/site/apidocs/org/apache/hadoop/hbase/avro//package-use.html...>
Generating <https://hudson.apache.org/hudson/job/hbase-0.90/ws/trunk/target/site/apidocs/org/apache/hadoop/hbase/avro/generated//package-use.html...>
Generating <https://hudson.apache.org/hudson/job/hbase-0.90/ws/trunk/target/site/apidocs/org/apache/hadoop/hbase/catalog//package-use.html...>
Generating <https://hudson.apache.org/hudson/job/hbase-0.90/ws/trunk/target/site/apidocs/org/apache/hadoop/hbase/client//package-use.html...>
Generating <https://hudson.apache.org/hudson/job/hbase-0.90/ws/trunk/target/site/apidocs/org/apache/hadoop/hbase/client/replication//package-use.html...>
Generating <https://hudson.apache.org/hudson/job/hbase-0.90/ws/trunk/target/site/apidocs/org/apache/hadoop/hbase/executor//package-use.html...>
Generating <https://hudson.apache.org/hudson/job/hbase-0.90/ws/trunk/target/site/apidocs/org/apache/hadoop/hbase/filter//package-use.html...>
Generating <https://hudson.apache.org/hudson/job/hbase-0.90/ws/trunk/target/site/apidocs/org/apache/hadoop/hbase/generated/master//package-use.html...>
Generating <https://hudson.apache.org/hudson/job/hbase-0.90/ws/trunk/target/site/apidocs/org/apache/hadoop/hbase/generated/regionserver//package-use.html...>
Generating <https://hudson.apache.org/hudson/job/hbase-0.90/ws/trunk/target/site/apidocs/org/apache/hadoop/hbase/io//package-use.html...>
Generating <https://hudson.apache.org/hudson/job/hbase-0.90/ws/trunk/target/site/apidocs/org/apache/hadoop/hbase/io/hfile//package-use.html...>
Generating <https://hudson.apache.org/hudson/job/hbase-0.90/ws/trunk/target/site/apidocs/org/apache/hadoop/hbase/ipc//package-use.html...>
Generating <https://hudson.apache.org/hudson/job/hbase-0.90/ws/trunk/target/site/apidocs/org/apache/hadoop/hbase/mapred//package-use.html...>
Generating <https://hudson.apache.org/hudson/job/hbase-0.90/ws/trunk/target/site/apidocs/org/apache/hadoop/hbase/mapreduce//package-use.html...>
Generating <https://hudson.apache.org/hudson/job/hbase-0.90/ws/trunk/target/site/apidocs/org/apache/hadoop/hbase/mapreduce/hadoopbackport//package-use.html...>
Generating <https://hudson.apache.org/hudson/job/hbase-0.90/ws/trunk/target/site/apidocs/org/apache/hadoop/hbase/mapreduce/replication//package-use.html...>
Generating <https://hudson.apache.org/hudson/job/hbase-0.90/ws/trunk/target/site/apidocs/org/apache/hadoop/hbase/master//package-use.html...>
Generating <https://hudson.apache.org/hudson/job/hbase-0.90/ws/trunk/target/site/apidocs/org/apache/hadoop/hbase/master/handler//package-use.html...>
Generating <https://hudson.apache.org/hudson/job/hbase-0.90/ws/trunk/target/site/apidocs/org/apache/hadoop/hbase/master/metrics//package-use.html...>
Generating <https://hudson.apache.org/hudson/job/hbase-0.90/ws/trunk/target/site/apidocs/org/apache/hadoop/hbase/metrics//package-use.html...>
Generating <https://hudson.apache.org/hudson/job/hbase-0.90/ws/trunk/target/site/apidocs/org/apache/hadoop/hbase/metrics/file//package-use.html...>
Generating <https://hudson.apache.org/hudson/job/hbase-0.90/ws/trunk/target/site/apidocs/org/apache/hadoop/hbase/regionserver//package-use.html...>
Generating <https://hudson.apache.org/hudson/job/hbase-0.90/ws/trunk/target/site/apidocs/org/apache/hadoop/hbase/regionserver/handler//package-use.html...>
Generating <https://hudson.apache.org/hudson/job/hbase-0.90/ws/trunk/target/site/apidocs/org/apache/hadoop/hbase/regionserver/metrics//package-use.html...>
Generating <https://hudson.apache.org/hudson/job/hbase-0.90/ws/trunk/target/site/apidocs/org/apache/hadoop/hbase/regionserver/wal//package-use.html...>
Generating <https://hudson.apache.org/hudson/job/hbase-0.90/ws/trunk/target/site/apidocs/org/apache/hadoop/hbase/replication//package-use.html...>
Generating <https://hudson.apache.org/hudson/job/hbase-0.90/ws/trunk/target/site/apidocs/org/apache/hadoop/hbase/replication/master//package-use.html...>
Generating <https://hudson.apache.org/hudson/job/hbase-0.90/ws/trunk/target/site/apidocs/org/apache/hadoop/hbase/replication/regionserver//package-use.html...>
Generating <https://hudson.apache.org/hudson/job/hbase-0.90/ws/trunk/target/site/apidocs/org/apache/hadoop/hbase/rest//package-use.html...>
Generating <https://hudson.apache.org/hudson/job/hbase-0.90/ws/trunk/target/site/apidocs/org/apache/hadoop/hbase/rest/client//package-use.html...>
Generating <https://hudson.apache.org/hudson/job/hbase-0.90/ws/trunk/target/site/apidocs/org/apache/hadoop/hbase/rest/filter//package-use.html...>
Generating <https://hudson.apache.org/hudson/job/hbase-0.90/ws/trunk/target/site/apidocs/org/apache/hadoop/hbase/rest/metrics//package-use.html...>
Generating <https://hudson.apache.org/hudson/job/hbase-0.90/ws/trunk/target/site/apidocs/org/apache/hadoop/hbase/rest/model//package-use.html...>
Generating <https://hudson.apache.org/hudson/job/hbase-0.90/ws/trunk/target/site/apidocs/org/apache/hadoop/hbase/rest/protobuf/generated//package-use.html...>
Generating <https://hudson.apache.org/hudson/job/hbase-0.90/ws/trunk/target/site/apidocs/org/apache/hadoop/hbase/rest/provider//package-use.html...>
Generating <https://hudson.apache.org/hudson/job/hbase-0.90/ws/trunk/target/site/apidocs/org/apache/hadoop/hbase/rest/provider/consumer//package-use.html...>
Generating <https://hudson.apache.org/hudson/job/hbase-0.90/ws/trunk/target/site/apidocs/org/apache/hadoop/hbase/rest/provider/producer//package-use.html...>
Generating <https://hudson.apache.org/hudson/job/hbase-0.90/ws/trunk/target/site/apidocs/org/apache/hadoop/hbase/rest/transform//package-use.html...>
Generating <https://hudson.apache.org/hudson/job/hbase-0.90/ws/trunk/target/site/apidocs/org/apache/hadoop/hbase/security//package-use.html...>
Generating <https://hudson.apache.org/hudson/job/hbase-0.90/ws/trunk/target/site/apidocs/org/apache/hadoop/hbase/thrift//package-use.html...>
Generating <https://hudson.apache.org/hudson/job/hbase-0.90/ws/trunk/target/site/apidocs/org/apache/hadoop/hbase/thrift/generated//package-use.html...>
Generating <https://hudson.apache.org/hudson/job/hbase-0.90/ws/trunk/target/site/apidocs/org/apache/hadoop/hbase/util//package-use.html...>
Generating <https://hudson.apache.org/hudson/job/hbase-0.90/ws/trunk/target/site/apidocs/org/apache/hadoop/hbase/zookeeper//package-use.html...>
Building index for all the packages and classes...
Generating <https://hudson.apache.org/hudson/job/hbase-0.90/ws/trunk/target/site/apidocs/overview-tree.html...>
Generating <https://hudson.apache.org/hudson/job/hbase-0.90/ws/trunk/target/site/apidocs/index-all.html...>
Generating <https://hudson.apache.org/hudson/job/hbase-0.90/ws/trunk/target/site/apidocs/deprecated-list.html...>
Building index for all classes...
Generating <https://hudson.apache.org/hudson/job/hbase-0.90/ws/trunk/target/site/apidocs/allclasses-frame.html...>
Generating <https://hudson.apache.org/hudson/job/hbase-0.90/ws/trunk/target/site/apidocs/allclasses-noframe.html...>
Generating <https://hudson.apache.org/hudson/job/hbase-0.90/ws/trunk/target/site/apidocs/index.html...>
Generating <https://hudson.apache.org/hudson/job/hbase-0.90/ws/trunk/target/site/apidocs/overview-summary.html...>
Generating <https://hudson.apache.org/hudson/job/hbase-0.90/ws/trunk/target/site/apidocs/help-doc.html...>
Generating <https://hudson.apache.org/hudson/job/hbase-0.90/ws/trunk/target/site/apidocs/stylesheet.css...>
2 warnings
[WARNING] Javadoc Warnings
[WARNING] <https://hudson.apache.org/hudson/job/hbase-0.90/ws/trunk/src/main/java/org/apache/hadoop/hbase/security/User.java>:138: warning - Tag @link: can't find login(Configuration,String,String,String) in org.apache.hadoop.security.SecurityUtil
[WARNING] <https://hudson.apache.org/hudson/job/hbase-0.90/ws/trunk/src/main/java/org/apache/hadoop/hbase/regionserver/HRegionServer.java>:1368: warning - @return tag has no arguments.
[INFO] Generating "Project License" report.
[INFO] Generating "Source Xref" report.
[INFO] Generating "RAT Report" report.
[INFO] No excludes
[INFO] ------------------------------------------------------------------------
[INFO] Building HBase
[INFO] task-segment: [assembly:assembly] (aggregator-style)
[INFO] ------------------------------------------------------------------------
[INFO] Preparing assembly:assembly
[INFO] ------------------------------------------------------------------------
[INFO] Building HBase
[INFO] ------------------------------------------------------------------------
[INFO] [antrun:run {execution: generate}]
[INFO] Executing tasks
SLF4J: Failed to load class "org.slf4j.impl.StaticLoggerBinder".
SLF4J: See http://www.slf4j.org/codes.html#StaticLoggerBinder for further details.
2011-03-19 21:16:55.619:INFO::Logging to STDERR via org.mortbay.log.StdErrLog
[INFO] Executed tasks
[INFO] [build-helper:add-source {execution: add-jspc-source}]
[INFO] Source directory: <https://hudson.apache.org/hudson/job/hbase-0.90/ws/trunk/target/jspc> added.
[INFO] [build-helper:add-source {execution: add-package-info}]
[INFO] Source directory: <https://hudson.apache.org/hudson/job/hbase-0.90/ws/trunk/target/generated-sources> added.
[INFO] Setting property: classpath.resource.loader.class => 'org.codehaus.plexus.velocity.ContextClassLoaderResourceLoader'.
[INFO] Setting property: velocimacro.messages.on => 'false'.
[INFO] Setting property: resource.loader => 'classpath'.
[INFO] Setting property: resource.manager.logwhenfound => 'false'.
[INFO] [remote-resources:process {execution: default}]
[INFO] [resources:resources {execution: default-resources}]
[INFO] Using 'UTF-8' encoding to copy filtered resources.
[INFO] Copying 1 resource
[INFO] Copying 6 resources
[INFO] Copying 3 resources
[INFO] [antrun:run {execution: default}]
[INFO] Executing tasks
[INFO] Executed tasks
[INFO] [compiler:compile {execution: default-compile}]
[INFO] Compiling 456 source files to <https://hudson.apache.org/hudson/job/hbase-0.90/ws/trunk/target/classes>
[INFO] [resources:testResources {execution: default-testResources}]
[INFO] Using 'UTF-8' encoding to copy filtered resources.
[INFO] Copying 4 resources
[INFO] Copying 3 resources
[INFO] [compiler:testCompile {execution: default-testCompile}]
[INFO] Compiling 185 source files to <https://hudson.apache.org/hudson/job/hbase-0.90/ws/trunk/target/test-classes>
[INFO] [surefire:test {execution: default-test}]
[INFO] Surefire report directory: <https://hudson.apache.org/hudson/job/hbase-0.90/ws/trunk/target/surefire-reports>

-------------------------------------------------------
T E S T S
-------------------------------------------------------
Running org.apache.hadoop.hbase.master.TestHMasterRPCException
Tests run: 1, Failures: 0, Errors: 0, Skipped: 0, Time elapsed: 0.353 sec
Running org.apache.hadoop.hbase.regionserver.TestColumnSeeking
Tests run: 2, Failures: 0, Errors: 0, Skipped: 0, Time elapsed: 13.776 sec
Running org.apache.hadoop.hbase.client.TestMultipleTimestamps
killed.
[INFO] ------------------------------------------------------------------------
[ERROR] BUILD ERROR
[INFO] ------------------------------------------------------------------------
[INFO] Error while executing forked tests.; nested exception is org.apache.maven.surefire.booter.shade.org.codehaus.plexus.util.cli.CommandLineException: Error while executing external command, process killed.

Process timeout out after 900 seconds
[INFO] ------------------------------------------------------------------------
[INFO] For more information, run Maven with the -e switch
[INFO] ------------------------------------------------------------------------
[INFO] Total time: 16 minutes 16 seconds
[INFO] Finished at: Sat Mar 19 21:32:28 UTC 2011
[INFO] Final Memory: 113M/1094M
[INFO] ------------------------------------------------------------------------
[locks-and-latches] Releasing all the locks
[locks-and-latches] All the locks released
Archiving artifacts
Recording test results

Search Discussions

  • Apache Hudson Server at Mar 20, 2011 at 6:35 pm
    See <https://hudson.apache.org/hudson/job/hbase-0.90/125/changes>

    Changes:

    [stack] HBASE-3671) Split report before we finish parent region open; workaround till 0.92; Race between split and OPENED processing -- fix suggested by Ted Yu

    ------------------------------------------
    [...truncated 2809 lines...]
    Tests run: 1, Failures: 0, Errors: 0, Skipped: 0, Time elapsed: 2.048 sec
    Running org.apache.hadoop.hbase.client.TestFromClientSide
    Tests run: 41, Failures: 0, Errors: 0, Skipped: 3, Time elapsed: 268.324 sec
    Running org.apache.hadoop.hbase.replication.TestReplication
    Tests run: 7, Failures: 1, Errors: 0, Skipped: 0, Time elapsed: 243.439 sec <<< FAILURE!
    Running org.apache.hadoop.hbase.regionserver.TestCompaction
    Tests run: 9, Failures: 0, Errors: 0, Skipped: 0, Time elapsed: 140.692 sec
    Running org.apache.hadoop.hbase.filter.TestSingleColumnValueFilter
    Tests run: 2, Failures: 0, Errors: 0, Skipped: 0, Time elapsed: 0.034 sec
    Running org.apache.hadoop.hbase.mapreduce.TestTimeRangeMapRed
    Tests run: 1, Failures: 0, Errors: 0, Skipped: 0, Time elapsed: 26.919 sec
    Running org.apache.hadoop.hbase.zookeeper.TestZooKeeperMainServerArg
    Tests run: 1, Failures: 0, Errors: 0, Skipped: 0, Time elapsed: 0.026 sec
    Running org.apache.hadoop.hbase.mapreduce.TestSimpleTotalOrderPartitioner
    Tests run: 1, Failures: 0, Errors: 0, Skipped: 0, Time elapsed: 0.083 sec
    Running org.apache.hadoop.hbase.master.TestClockSkewDetection
    Tests run: 1, Failures: 0, Errors: 0, Skipped: 0, Time elapsed: 0.033 sec
    Running org.apache.hadoop.hbase.mapreduce.TestHFileOutputFormat
    Tests run: 5, Failures: 0, Errors: 0, Skipped: 0, Time elapsed: 170.307 sec
    Running org.apache.hadoop.hbase.regionserver.TestFSErrorsExposed
    Tests run: 3, Failures: 0, Errors: 0, Skipped: 0, Time elapsed: 37.709 sec
    Running org.apache.hadoop.hbase.client.replication.TestReplicationAdmin
    Tests run: 1, Failures: 0, Errors: 0, Skipped: 0, Time elapsed: 0.397 sec
    Running org.apache.hadoop.hbase.regionserver.TestScanDeleteTracker
    Tests run: 6, Failures: 0, Errors: 0, Skipped: 0, Time elapsed: 0.113 sec
    Running org.apache.hadoop.hbase.client.TestMetaScanner
    Tests run: 1, Failures: 0, Errors: 0, Skipped: 0, Time elapsed: 47.918 sec
    Running org.apache.hadoop.hbase.metrics.TestMetricsMBeanBase
    Tests run: 2, Failures: 0, Errors: 0, Skipped: 0, Time elapsed: 0.036 sec
    Running org.apache.hadoop.hbase.TestRegionRebalancing
    Tests run: 1, Failures: 0, Errors: 0, Skipped: 0, Time elapsed: 80.716 sec
    Running org.apache.hadoop.hbase.filter.TestSingleColumnValueExcludeFilter
    Tests run: 1, Failures: 0, Errors: 0, Skipped: 0, Time elapsed: 0.016 sec
    Running org.apache.hadoop.hbase.filter.TestInclusiveStopFilter
    Tests run: 2, Failures: 0, Errors: 0, Skipped: 0, Time elapsed: 0.017 sec
    Running org.apache.hadoop.hbase.rest.TestTableResource
    Tests run: 8, Failures: 0, Errors: 0, Skipped: 0, Time elapsed: 57.034 sec
    Running org.apache.hadoop.hbase.TestHBaseTestingUtility
    Tests run: 5, Failures: 0, Errors: 0, Skipped: 0, Time elapsed: 91.107 sec
    Running org.apache.hadoop.hbase.mapreduce.TestLoadIncrementalHFiles
    Tests run: 3, Failures: 0, Errors: 0, Skipped: 0, Time elapsed: 48.385 sec
    Running org.apache.hadoop.hbase.rest.TestSchemaResource
    Tests run: 2, Failures: 0, Errors: 0, Skipped: 0, Time elapsed: 73.761 sec
    Running org.apache.hadoop.hbase.regionserver.wal.TestWALReplay
    Tests run: 4, Failures: 0, Errors: 0, Skipped: 0, Time elapsed: 37.06 sec
    Running org.apache.hadoop.hbase.regionserver.TestKeyValueScanFixture
    Tests run: 1, Failures: 0, Errors: 0, Skipped: 0, Time elapsed: 0.015 sec
    Running org.apache.hadoop.hbase.rest.model.TestTableListModel
    Tests run: 3, Failures: 0, Errors: 0, Skipped: 0, Time elapsed: 0.126 sec
    Running org.apache.hadoop.hbase.rest.model.TestColumnSchemaModel
    Tests run: 2, Failures: 0, Errors: 0, Skipped: 0, Time elapsed: 0.029 sec
    Running org.apache.hadoop.hbase.regionserver.TestStoreFile
    Tests run: 7, Failures: 0, Errors: 0, Skipped: 0, Time elapsed: 37.099 sec
    Running org.apache.hadoop.hbase.zookeeper.TestZooKeeperNodeTracker
    Tests run: 2, Failures: 0, Errors: 0, Skipped: 0, Time elapsed: 0.468 sec
    Running org.apache.hadoop.hbase.rest.model.TestScannerModel
    Tests run: 3, Failures: 0, Errors: 0, Skipped: 0, Time elapsed: 0.126 sec
    Running org.apache.hadoop.hbase.regionserver.wal.TestHLogMethods
    Tests run: 3, Failures: 0, Errors: 0, Skipped: 0, Time elapsed: 0.428 sec
    Running org.apache.hadoop.hbase.rest.TestVersionResource
    Tests run: 7, Failures: 0, Errors: 0, Skipped: 0, Time elapsed: 22.736 sec
    Running org.apache.hadoop.hbase.filter.TestFilter
    Tests run: 18, Failures: 0, Errors: 0, Skipped: 0, Time elapsed: 3.571 sec
    Running org.apache.hadoop.hbase.regionserver.TestWideScanner
    Tests run: 1, Failures: 0, Errors: 0, Skipped: 0, Time elapsed: 17.334 sec
    Running org.apache.hadoop.hbase.regionserver.TestSplitTransaction
    Tests run: 5, Failures: 0, Errors: 0, Skipped: 0, Time elapsed: 2.893 sec
    Running org.apache.hadoop.hbase.replication.regionserver.TestReplicationSink
    Tests run: 5, Failures: 0, Errors: 0, Skipped: 0, Time elapsed: 35.762 sec
    Running org.apache.hadoop.hbase.regionserver.TestGetClosestAtOrBefore
    Tests run: 3, Failures: 0, Errors: 0, Skipped: 0, Time elapsed: 10.869 sec
    Running org.apache.hadoop.hbase.regionserver.TestReadWriteConsistencyControl
    Tests run: 1, Failures: 0, Errors: 0, Skipped: 0, Time elapsed: 10.021 sec
    Running org.apache.hadoop.hbase.util.TestMergeTable
    Tests run: 1, Failures: 0, Errors: 0, Skipped: 0, Time elapsed: 64.676 sec
    Running org.apache.hadoop.hbase.rest.model.TestVersionModel
    Tests run: 3, Failures: 0, Errors: 0, Skipped: 0, Time elapsed: 0.129 sec
    Running org.apache.hadoop.hbase.rest.model.TestCellSetModel
    Tests run: 3, Failures: 0, Errors: 0, Skipped: 0, Time elapsed: 0.137 sec
    Running org.apache.hadoop.hbase.rest.client.TestRemoteTable
    Tests run: 3, Failures: 0, Errors: 0, Skipped: 0, Time elapsed: 53.634 sec
    Running org.apache.hadoop.hbase.rest.model.TestStorageClusterStatusModel
    Tests run: 3, Failures: 0, Errors: 0, Skipped: 0, Time elapsed: 0.132 sec
    Running org.apache.hadoop.hbase.avro.TestAvroServer
    Tests run: 3, Failures: 0, Errors: 0, Skipped: 0, Time elapsed: 101.324 sec
    Running org.apache.hadoop.hbase.TestFullLogReconstruction
    Tests run: 1, Failures: 0, Errors: 0, Skipped: 0, Time elapsed: 90.066 sec
    Running org.apache.hadoop.hbase.TestSerialization
    Tests run: 19, Failures: 0, Errors: 0, Skipped: 0, Time elapsed: 0.058 sec
    Running org.apache.hadoop.hbase.regionserver.TestKeyValueHeap
    Tests run: 3, Failures: 0, Errors: 0, Skipped: 0, Time elapsed: 0.091 sec
    Running org.apache.hadoop.hbase.regionserver.TestStoreScanner
    Tests run: 14, Failures: 0, Errors: 0, Skipped: 0, Time elapsed: 0.031 sec
    Running org.apache.hadoop.hbase.TestHMsg
    Tests run: 2, Failures: 0, Errors: 0, Skipped: 0, Time elapsed: 0.021 sec
    Running org.apache.hadoop.hbase.io.hfile.TestReseekTo
    Tests run: 1, Failures: 0, Errors: 0, Skipped: 0, Time elapsed: 0.209 sec
    Running org.apache.hadoop.hbase.regionserver.TestHRegionInfo
    Tests run: 2, Failures: 0, Errors: 0, Skipped: 0, Time elapsed: 0.017 sec
    Running org.apache.hadoop.hbase.util.TestIncrementingEnvironmentEdge
    Tests run: 1, Failures: 0, Errors: 0, Skipped: 0, Time elapsed: 0.016 sec
    Running org.apache.hadoop.hbase.util.TestKeying
    Tests run: 1, Failures: 0, Errors: 0, Skipped: 0, Time elapsed: 0.015 sec
    Running org.apache.hadoop.hbase.regionserver.TestScanner
    Tests run: 6, Failures: 0, Errors: 0, Skipped: 0, Time elapsed: 63.184 sec
    Running org.apache.hadoop.hbase.util.TestHBaseFsck
    Tests run: 1, Failures: 0, Errors: 0, Skipped: 0, Time elapsed: 36.766 sec
    Running org.apache.hadoop.hbase.master.TestRestartCluster
    Tests run: 2, Failures: 0, Errors: 0, Skipped: 0, Time elapsed: 68.256 sec
    Running org.apache.hadoop.hbase.client.TestShell
    Tests run: 1, Failures: 0, Errors: 0, Skipped: 0, Time elapsed: 73.454 sec
    Running org.apache.hadoop.hbase.rest.model.TestTableInfoModel
    Tests run: 3, Failures: 0, Errors: 0, Skipped: 0, Time elapsed: 0.128 sec
    Running org.apache.hadoop.hbase.TestInfoServers
    Tests run: 1, Failures: 0, Errors: 0, Skipped: 0, Time elapsed: 38.436 sec
    Running org.apache.hadoop.hbase.master.TestLogsCleaner
    Tests run: 1, Failures: 0, Errors: 0, Skipped: 0, Time elapsed: 1.255 sec
    Running org.apache.hadoop.hbase.regionserver.TestMasterAddressManager
    Tests run: 1, Failures: 0, Errors: 0, Skipped: 0, Time elapsed: 0.341 sec
    Running org.apache.hadoop.hbase.catalog.TestCatalogTrackerOnCluster
    Tests run: 1, Failures: 0, Errors: 0, Skipped: 0, Time elapsed: 89.407 sec
    Running org.apache.hadoop.hbase.regionserver.TestQueryMatcher
    Tests run: 4, Failures: 0, Errors: 0, Skipped: 0, Time elapsed: 0.104 sec
    Running org.apache.hadoop.hbase.zookeeper.TestZKTable
    Tests run: 1, Failures: 0, Errors: 0, Skipped: 0, Time elapsed: 0.299 sec
    Running org.apache.hadoop.hbase.client.TestAdmin
    Tests run: 16, Failures: 0, Errors: 0, Skipped: 0, Time elapsed: 562.207 sec
    Running org.apache.hadoop.hbase.regionserver.TestPriorityCompactionQueue
    Tests run: 1, Failures: 0, Errors: 0, Skipped: 0, Time elapsed: 1.074 sec
    Running org.apache.hadoop.hbase.util.TestMergeTool
    Tests run: 1, Failures: 0, Errors: 0, Skipped: 0, Time elapsed: 27.654 sec
    Running org.apache.hadoop.hbase.TestAcidGuarantees
    Tests run: 3, Failures: 0, Errors: 0, Skipped: 3, Time elapsed: 0.015 sec
    Running org.apache.hadoop.hbase.util.TestBase64
    Tests run: 1, Failures: 0, Errors: 0, Skipped: 0, Time elapsed: 0.018 sec
    Running org.apache.hadoop.hbase.regionserver.TestMemStore
    Tests run: 21, Failures: 0, Errors: 0, Skipped: 0, Time elapsed: 51.388 sec
    Running org.apache.hadoop.hbase.rest.TestScannerResource
    Tests run: 5, Failures: 0, Errors: 0, Skipped: 0, Time elapsed: 46.496 sec
    Running org.apache.hadoop.hbase.io.hfile.TestLruBlockCache
    Tests run: 7, Failures: 0, Errors: 0, Skipped: 0, Time elapsed: 1.052 sec
    Running org.apache.hadoop.hbase.master.TestDeadServer
    Tests run: 1, Failures: 0, Errors: 0, Skipped: 0, Time elapsed: 0.018 sec
    Running org.apache.hadoop.hbase.rest.TestGzipFilter
    Tests run: 2, Failures: 0, Errors: 0, Skipped: 0, Time elapsed: 52.446 sec
    Running org.apache.hadoop.hbase.mapreduce.TestTableMapReduce
    Tests run: 2, Failures: 0, Errors: 0, Skipped: 0, Time elapsed: 93.8 sec
    Running org.apache.hadoop.hbase.TestKeyValue
    Tests run: 9, Failures: 0, Errors: 0, Skipped: 0, Time elapsed: 0.024 sec
    Running org.apache.hadoop.hbase.client.TestMultiParallel
    Tests run: 10, Failures: 0, Errors: 0, Skipped: 0, Time elapsed: 64.805 sec
    Running org.apache.hadoop.hbase.master.TestMaster
    Tests run: 1, Failures: 0, Errors: 0, Skipped: 0, Time elapsed: 84.546 sec
    Running org.apache.hadoop.hbase.master.TestRollingRestart
    Tests run: 1, Failures: 0, Errors: 0, Skipped: 0, Time elapsed: 75.726 sec
    Running org.apache.hadoop.hbase.client.TestResult
    Tests run: 2, Failures: 0, Errors: 0, Skipped: 0, Time elapsed: 0.037 sec
    Running org.apache.hadoop.hbase.client.TestHTablePool
    Tests run: 5, Failures: 0, Errors: 0, Skipped: 0, Time elapsed: 59.08 sec
    Running org.apache.hadoop.hbase.rest.model.TestTableSchemaModel
    Tests run: 3, Failures: 0, Errors: 0, Skipped: 0, Time elapsed: 0.133 sec
    Running org.apache.hadoop.hbase.util.TestByteBloomFilter
    Tests run: 3, Failures: 0, Errors: 0, Skipped: 0, Time elapsed: 1.571 sec
    Running org.apache.hadoop.hbase.filter.TestFilterList
    Tests run: 4, Failures: 0, Errors: 0, Skipped: 0, Time elapsed: 0.041 sec
    Running org.apache.hadoop.hbase.mapreduce.TestTableInputFormatScan
    Tests run: 11, Failures: 0, Errors: 0, Skipped: 0, Time elapsed: 339.219 sec
    Running org.apache.hadoop.hbase.regionserver.TestHRegion
    Tests run: 54, Failures: 0, Errors: 0, Skipped: 0, Time elapsed: 34.249 sec
    Running org.apache.hadoop.hbase.master.TestMasterFailover
    Tests run: 3, Failures: 0, Errors: 0, Skipped: 0, Time elapsed: 73.332 sec
    Running org.apache.hadoop.hbase.rest.model.TestTableRegionModel
    Tests run: 4, Failures: 0, Errors: 0, Skipped: 0, Time elapsed: 0.032 sec
    Running org.apache.hadoop.hbase.client.TestTimestampsFilter
    Tests run: 2, Failures: 0, Errors: 0, Skipped: 0, Time elapsed: 67.871 sec
    Running org.apache.hadoop.hbase.master.TestLoadBalancer
    Tests run: 5, Failures: 0, Errors: 0, Skipped: 0, Time elapsed: 2.108 sec
    Running org.apache.hadoop.hbase.util.TestRootPath
    Tests run: 1, Failures: 0, Errors: 0, Skipped: 0, Time elapsed: 0.021 sec
    Running org.apache.hadoop.hbase.client.TestScannerTimeout
    Tests run: 2, Failures: 0, Errors: 0, Skipped: 0, Time elapsed: 51.316 sec
    Running org.apache.hadoop.hbase.mapred.TestTableMapReduce
    Tests run: 1, Failures: 0, Errors: 0, Skipped: 0, Time elapsed: 68.519 sec
    Running org.apache.hadoop.hbase.regionserver.wal.TestWALObserver
    Tests run: 1, Failures: 0, Errors: 0, Skipped: 0, Time elapsed: 0.418 sec
    Running org.apache.hadoop.hbase.master.TestActiveMasterManager
    Tests run: 2, Failures: 0, Errors: 0, Skipped: 0, Time elapsed: 0.481 sec
    Running org.apache.hadoop.hbase.replication.regionserver.TestReplicationSourceManager
    Tests run: 1, Failures: 0, Errors: 0, Skipped: 0, Time elapsed: 2.942 sec
    Running org.apache.hadoop.hbase.util.TestBytes
    Tests run: 10, Failures: 0, Errors: 0, Skipped: 0, Time elapsed: 0.021 sec
    Running org.apache.hadoop.hbase.util.TestCompressionTest
    Tests run: 1, Failures: 0, Errors: 0, Skipped: 0, Time elapsed: 0.029 sec
    Running org.apache.hadoop.hbase.client.TestGetRowVersions
    Tests run: 1, Failures: 0, Errors: 0, Skipped: 0, Time elapsed: 41.688 sec
    Running org.apache.hadoop.hbase.filter.TestDependentColumnFilter
    Tests run: 2, Failures: 0, Errors: 0, Skipped: 0, Time elapsed: 0.354 sec
    Running org.apache.hadoop.hbase.rest.model.TestCellModel
    Tests run: 3, Failures: 0, Errors: 0, Skipped: 0, Time elapsed: 0.125 sec
    Running org.apache.hadoop.hbase.master.TestCatalogJanitor
    Tests run: 2, Failures: 0, Errors: 0, Skipped: 0, Time elapsed: 0.492 sec
    Running org.apache.hadoop.hbase.catalog.TestCatalogTracker
    Tests run: 8, Failures: 0, Errors: 0, Skipped: 0, Time elapsed: 3.17 sec
    Running org.apache.hadoop.hbase.replication.TestReplicationSource
    Tests run: 1, Failures: 0, Errors: 0, Skipped: 0, Time elapsed: 2.595 sec
    Running org.apache.hadoop.hbase.rest.TestRowResource
    Tests run: 10, Failures: 0, Errors: 0, Skipped: 0, Time elapsed: 72.279 sec
    Running org.apache.hadoop.hbase.io.hfile.TestHFile
    Tests run: 7, Failures: 0, Errors: 0, Skipped: 0, Time elapsed: 0.351 sec
    Running org.apache.hadoop.hbase.catalog.TestMetaReaderEditor
    Tests run: 4, Failures: 0, Errors: 0, Skipped: 0, Time elapsed: 47.516 sec
    Running org.apache.hadoop.hbase.mapreduce.TestImportTsv
    Tests run: 7, Failures: 0, Errors: 0, Skipped: 0, Time elapsed: 27.211 sec
    Running org.apache.hadoop.hbase.rest.client.TestRemoteAdmin
    Tests run: 2, Failures: 0, Errors: 0, Skipped: 0, Time elapsed: 50.818 sec
    Running org.apache.hadoop.hbase.regionserver.wal.TestHLog
    Tests run: 8, Failures: 0, Errors: 0, Skipped: 0, Time elapsed: 78.786 sec
    Running org.apache.hadoop.hbase.client.TestTimestamp
    Tests run: 1, Failures: 0, Errors: 0, Skipped: 0, Time elapsed: 68.565 sec
    Running org.apache.hadoop.hbase.TestScanMultipleVersions
    Tests run: 1, Failures: 0, Errors: 0, Skipped: 0, Time elapsed: 19.294 sec
    Running org.apache.hadoop.hbase.rest.model.TestStorageClusterVersionModel
    Tests run: 2, Failures: 0, Errors: 0, Skipped: 0, Time elapsed: 0.03 sec
    Running org.apache.hadoop.hbase.client.TestHCM
    Tests run: 2, Failures: 0, Errors: 0, Skipped: 0, Time elapsed: 33.903 sec

    Results :

    Failed tests:

    Tests run: 629, Failures: 1, Errors: 0, Skipped: 9

    [INFO] ------------------------------------------------------------------------
    [ERROR] BUILD FAILURE
    [INFO] ------------------------------------------------------------------------
    [INFO] There are test failures.

    Please refer to <https://hudson.apache.org/hudson/job/hbase-0.90/ws/trunk/target/surefire-reports> for the individual test results.
    [INFO] ------------------------------------------------------------------------
    [INFO] For more information, run Maven with the -e switch
    [INFO] ------------------------------------------------------------------------
    [INFO] Total time: 96 minutes 17 seconds
    [INFO] Finished at: Sun Mar 20 05:39:53 UTC 2011
    [INFO] Final Memory: 87M/1130M
    [INFO] ------------------------------------------------------------------------
    [locks-and-latches] Releasing all the locks
    [locks-and-latches] All the locks released
    Archiving artifacts
    Recording test results
  • Apache Hudson Server at Mar 22, 2011 at 12:06 am
    See <https://hudson.apache.org/hudson/job/hbase-0.90/126/changes>

    Changes:

    [jgray] HBASE-3641 LruBlockCache.CacheStats.getHitCount() is not using the correct variable

    ------------------------------------------
    [...truncated 2735 lines...]
    Running org.apache.hadoop.hbase.regionserver.TestColumnSeeking
    Tests run: 2, Failures: 0, Errors: 0, Skipped: 0, Time elapsed: 12.157 sec
    Running org.apache.hadoop.hbase.client.TestMultipleTimestamps
    Tests run: 8, Failures: 0, Errors: 0, Skipped: 0, Time elapsed: 76.282 sec
    Running org.apache.hadoop.hbase.regionserver.TestMemStoreLAB
    Tests run: 3, Failures: 0, Errors: 0, Skipped: 0, Time elapsed: 1.319 sec
    Running org.apache.hadoop.hbase.TestZooKeeper
    Tests run: 5, Failures: 0, Errors: 0, Skipped: 0, Time elapsed: 110.989 sec
    Running org.apache.hadoop.hbase.regionserver.wal.TestLogRolling
    Tests run: 2, Failures: 0, Errors: 0, Skipped: 0, Time elapsed: 169.882 sec
    Running org.apache.hadoop.hbase.io.hfile.TestCachedBlockQueue
    Tests run: 2, Failures: 0, Errors: 0, Skipped: 0, Time elapsed: 0.017 sec
    Running org.apache.hadoop.hbase.filter.TestPrefixFilter
    Tests run: 3, Failures: 0, Errors: 0, Skipped: 0, Time elapsed: 0.018 sec
    Running org.apache.hadoop.hbase.io.TestImmutableBytesWritable
    Tests run: 3, Failures: 0, Errors: 0, Skipped: 0, Time elapsed: 0.017 sec
    Running org.apache.hadoop.hbase.io.TestHeapSize
    Tests run: 2, Failures: 0, Errors: 0, Skipped: 0, Time elapsed: 0.03 sec
    Running org.apache.hadoop.hbase.rest.model.TestRowModel
    Tests run: 2, Failures: 0, Errors: 0, Skipped: 0, Time elapsed: 0.032 sec
    Running org.apache.hadoop.hbase.io.hfile.TestHFileSeek
    Tests run: 1, Failures: 0, Errors: 0, Skipped: 0, Time elapsed: 4.88 sec
    Running org.apache.hadoop.hbase.regionserver.TestStore
    Tests run: 9, Failures: 0, Errors: 0, Skipped: 0, Time elapsed: 1.242 sec
    Running org.apache.hadoop.hbase.zookeeper.TestHQuorumPeer
    Tests run: 3, Failures: 0, Errors: 0, Skipped: 0, Time elapsed: 0.408 sec
    Running org.apache.hadoop.hbase.regionserver.TestSplitTransactionOnCluster
    Tests run: 2, Failures: 0, Errors: 0, Skipped: 0, Time elapsed: 76.836 sec
    Running org.apache.hadoop.hbase.rest.TestScannersWithFilters
    Tests run: 10, Failures: 0, Errors: 0, Skipped: 0, Time elapsed: 45.169 sec
    Running org.apache.hadoop.hbase.io.hfile.TestHFilePerformance
    Tests run: 1, Failures: 0, Errors: 0, Skipped: 0, Time elapsed: 5.583 sec
    Running org.apache.hadoop.hbase.io.TestHbaseObjectWritable
    Tests run: 2, Failures: 0, Errors: 0, Skipped: 0, Time elapsed: 0.061 sec
    Running org.apache.hadoop.hbase.regionserver.TestResettingCounters
    Tests run: 1, Failures: 0, Errors: 0, Skipped: 0, Time elapsed: 0.259 sec
    Running org.apache.hadoop.hbase.regionserver.wal.TestHLogSplit
    Tests run: 23, Failures: 0, Errors: 0, Skipped: 0, Time elapsed: 216.654 sec
    Running org.apache.hadoop.hbase.thrift.TestThriftServer
    Tests run: 1, Failures: 0, Errors: 0, Skipped: 0, Time elapsed: 98.879 sec
    Running org.apache.hadoop.hbase.regionserver.TestRpcMetrics
    Tests run: 1, Failures: 0, Errors: 0, Skipped: 0, Time elapsed: 1.288 sec
    Running org.apache.hadoop.hbase.filter.TestColumnPrefixFilter
    Tests run: 2, Failures: 0, Errors: 0, Skipped: 0, Time elapsed: 1.912 sec
    Running org.apache.hadoop.hbase.master.TestZKBasedOpenCloseRegion
    Tests run: 2, Failures: 0, Errors: 0, Skipped: 0, Time elapsed: 31.626 sec
    Running org.apache.hadoop.hbase.TestCompare
    Tests run: 1, Failures: 0, Errors: 0, Skipped: 0, Time elapsed: 0.016 sec
    Running org.apache.hadoop.hbase.regionserver.TestExplicitColumnTracker
    Tests run: 4, Failures: 0, Errors: 0, Skipped: 0, Time elapsed: 0.36 sec
    Running org.apache.hadoop.hbase.util.TestEnvironmentEdgeManager
    Tests run: 2, Failures: 0, Errors: 0, Skipped: 0, Time elapsed: 0.138 sec
    Running org.apache.hadoop.hbase.io.TestHalfStoreFileReader
    Tests run: 1, Failures: 0, Errors: 0, Skipped: 0, Time elapsed: 0.242 sec
    Running org.apache.hadoop.hbase.util.TestDefaultEnvironmentEdge
    Tests run: 1, Failures: 0, Errors: 0, Skipped: 0, Time elapsed: 0.017 sec
    Running org.apache.hadoop.hbase.rest.TestTransform
    Tests run: 1, Failures: 0, Errors: 0, Skipped: 0, Time elapsed: 56.527 sec
    Running org.apache.hadoop.hbase.util.TestFSUtils
    Tests run: 1, Failures: 0, Errors: 0, Skipped: 0, Time elapsed: 3.592 sec
    Running org.apache.hadoop.hbase.security.TestUser
    Tests run: 2, Failures: 0, Errors: 0, Skipped: 0, Time elapsed: 0.035 sec
    Running org.apache.hadoop.hbase.master.TestMasterTransitions
    Tests run: 3, Failures: 0, Errors: 0, Skipped: 3, Time elapsed: 81.207 sec
    Running org.apache.hadoop.hbase.regionserver.TestScanWildcardColumnTracker
    Tests run: 2, Failures: 0, Errors: 0, Skipped: 0, Time elapsed: 0.084 sec
    Running org.apache.hadoop.hbase.regionserver.TestKeyValueSkipListSet
    Tests run: 4, Failures: 0, Errors: 0, Skipped: 0, Time elapsed: 0.02 sec
    Running org.apache.hadoop.hbase.filter.TestPageFilter
    Tests run: 2, Failures: 0, Errors: 0, Skipped: 0, Time elapsed: 0.015 sec
    Running org.apache.hadoop.hbase.io.hfile.TestSeekTo
    Tests run: 3, Failures: 0, Errors: 0, Skipped: 0, Time elapsed: 0.18 sec
    Running org.apache.hadoop.hbase.filter.TestColumnPaginationFilter
    Tests run: 1, Failures: 0, Errors: 0, Skipped: 0, Time elapsed: 0.015 sec
    Running org.apache.hadoop.hbase.rest.TestStatusResource
    Tests run: 2, Failures: 0, Errors: 0, Skipped: 0, Time elapsed: 23.008 sec
    Running org.apache.hadoop.hbase.executor.TestExecutorService
    Tests run: 1, Failures: 0, Errors: 0, Skipped: 0, Time elapsed: 2.048 sec
    Running org.apache.hadoop.hbase.client.TestFromClientSide
    Tests run: 41, Failures: 0, Errors: 0, Skipped: 3, Time elapsed: 266.047 sec
    Running org.apache.hadoop.hbase.replication.TestReplication
    Tests run: 7, Failures: 0, Errors: 0, Skipped: 0, Time elapsed: 182.827 sec
    Running org.apache.hadoop.hbase.regionserver.TestCompaction
    Tests run: 9, Failures: 0, Errors: 0, Skipped: 0, Time elapsed: 147.196 sec
    Running org.apache.hadoop.hbase.filter.TestSingleColumnValueFilter
    Tests run: 2, Failures: 0, Errors: 0, Skipped: 0, Time elapsed: 0.033 sec
    Running org.apache.hadoop.hbase.mapreduce.TestTimeRangeMapRed
    Tests run: 1, Failures: 0, Errors: 0, Skipped: 0, Time elapsed: 48.843 sec
    Running org.apache.hadoop.hbase.zookeeper.TestZooKeeperMainServerArg
    Tests run: 1, Failures: 0, Errors: 0, Skipped: 0, Time elapsed: 0.025 sec
    Running org.apache.hadoop.hbase.mapreduce.TestSimpleTotalOrderPartitioner
    Tests run: 1, Failures: 0, Errors: 0, Skipped: 0, Time elapsed: 0.086 sec
    Running org.apache.hadoop.hbase.master.TestClockSkewDetection
    Tests run: 1, Failures: 0, Errors: 0, Skipped: 0, Time elapsed: 0.034 sec
    Running org.apache.hadoop.hbase.mapreduce.TestHFileOutputFormat
    Tests run: 5, Failures: 0, Errors: 0, Skipped: 0, Time elapsed: 195.485 sec
    Running org.apache.hadoop.hbase.regionserver.TestFSErrorsExposed
    Tests run: 3, Failures: 0, Errors: 0, Skipped: 0, Time elapsed: 36.242 sec
    Running org.apache.hadoop.hbase.client.replication.TestReplicationAdmin
    Tests run: 1, Failures: 0, Errors: 0, Skipped: 0, Time elapsed: 6.521 sec
    Running org.apache.hadoop.hbase.regionserver.TestScanDeleteTracker
    Tests run: 6, Failures: 0, Errors: 0, Skipped: 0, Time elapsed: 0.113 sec
    Running org.apache.hadoop.hbase.client.TestMetaScanner
    Tests run: 1, Failures: 0, Errors: 0, Skipped: 0, Time elapsed: 41.807 sec
    Running org.apache.hadoop.hbase.metrics.TestMetricsMBeanBase
    Tests run: 2, Failures: 0, Errors: 0, Skipped: 0, Time elapsed: 0.033 sec
    Running org.apache.hadoop.hbase.TestRegionRebalancing
    Tests run: 1, Failures: 0, Errors: 0, Skipped: 0, Time elapsed: 92.082 sec
    Running org.apache.hadoop.hbase.filter.TestSingleColumnValueExcludeFilter
    Tests run: 1, Failures: 0, Errors: 0, Skipped: 0, Time elapsed: 0.016 sec
    Running org.apache.hadoop.hbase.filter.TestInclusiveStopFilter
    Tests run: 2, Failures: 0, Errors: 0, Skipped: 0, Time elapsed: 0.017 sec
    Running org.apache.hadoop.hbase.rest.TestTableResource
    Tests run: 8, Failures: 0, Errors: 0, Skipped: 0, Time elapsed: 59.059 sec
    Running org.apache.hadoop.hbase.TestHBaseTestingUtility
    Tests run: 5, Failures: 0, Errors: 0, Skipped: 0, Time elapsed: 79.666 sec
    Running org.apache.hadoop.hbase.mapreduce.TestLoadIncrementalHFiles
    Tests run: 3, Failures: 0, Errors: 0, Skipped: 0, Time elapsed: 70.276 sec
    Running org.apache.hadoop.hbase.rest.TestSchemaResource
    Tests run: 2, Failures: 0, Errors: 0, Skipped: 0, Time elapsed: 55.179 sec
    Running org.apache.hadoop.hbase.regionserver.wal.TestWALReplay
    Tests run: 4, Failures: 0, Errors: 0, Skipped: 0, Time elapsed: 33.842 sec
    Running org.apache.hadoop.hbase.regionserver.TestKeyValueScanFixture
    Tests run: 1, Failures: 0, Errors: 0, Skipped: 0, Time elapsed: 0.016 sec
    Running org.apache.hadoop.hbase.rest.model.TestTableListModel
    Tests run: 3, Failures: 0, Errors: 0, Skipped: 0, Time elapsed: 0.126 sec
    Running org.apache.hadoop.hbase.rest.model.TestColumnSchemaModel
    Tests run: 2, Failures: 0, Errors: 0, Skipped: 0, Time elapsed: 0.03 sec
    Running org.apache.hadoop.hbase.regionserver.TestStoreFile
    Tests run: 7, Failures: 0, Errors: 0, Skipped: 0, Time elapsed: 41.467 sec
    Running org.apache.hadoop.hbase.zookeeper.TestZooKeeperNodeTracker
    Tests run: 2, Failures: 0, Errors: 0, Skipped: 0, Time elapsed: 0.436 sec
    Running org.apache.hadoop.hbase.rest.model.TestScannerModel
    Tests run: 3, Failures: 0, Errors: 0, Skipped: 0, Time elapsed: 0.126 sec
    Running org.apache.hadoop.hbase.regionserver.wal.TestHLogMethods
    Tests run: 3, Failures: 0, Errors: 0, Skipped: 0, Time elapsed: 0.41 sec
    Running org.apache.hadoop.hbase.rest.TestVersionResource
    Tests run: 7, Failures: 0, Errors: 0, Skipped: 0, Time elapsed: 22.777 sec
    Running org.apache.hadoop.hbase.filter.TestFilter
    Tests run: 18, Failures: 0, Errors: 0, Skipped: 0, Time elapsed: 3.332 sec
    Running org.apache.hadoop.hbase.regionserver.TestWideScanner
    Tests run: 1, Failures: 0, Errors: 0, Skipped: 0, Time elapsed: 38.9 sec
    Running org.apache.hadoop.hbase.regionserver.TestSplitTransaction
    Tests run: 5, Failures: 0, Errors: 0, Skipped: 0, Time elapsed: 2.901 sec
    Running org.apache.hadoop.hbase.replication.regionserver.TestReplicationSink
    Tests run: 5, Failures: 0, Errors: 0, Skipped: 0, Time elapsed: 36.222 sec
    Running org.apache.hadoop.hbase.regionserver.TestGetClosestAtOrBefore
    Tests run: 3, Failures: 0, Errors: 0, Skipped: 0, Time elapsed: 16.636 sec
    Running org.apache.hadoop.hbase.regionserver.TestReadWriteConsistencyControl
    Tests run: 1, Failures: 0, Errors: 0, Skipped: 0, Time elapsed: 10.02 sec
    Running org.apache.hadoop.hbase.util.TestMergeTable
    Tests run: 1, Failures: 0, Errors: 0, Skipped: 0, Time elapsed: 56.262 sec
    Running org.apache.hadoop.hbase.rest.model.TestVersionModel
    Tests run: 3, Failures: 0, Errors: 0, Skipped: 0, Time elapsed: 0.131 sec
    Running org.apache.hadoop.hbase.rest.model.TestCellSetModel
    Tests run: 3, Failures: 0, Errors: 0, Skipped: 0, Time elapsed: 0.134 sec
    Running org.apache.hadoop.hbase.rest.client.TestRemoteTable
    Tests run: 3, Failures: 0, Errors: 0, Skipped: 0, Time elapsed: 28.873 sec
    Running org.apache.hadoop.hbase.rest.model.TestStorageClusterStatusModel
    Tests run: 3, Failures: 0, Errors: 0, Skipped: 0, Time elapsed: 0.134 sec
    Running org.apache.hadoop.hbase.avro.TestAvroServer
    Tests run: 3, Failures: 0, Errors: 0, Skipped: 0, Time elapsed: 84.474 sec
    Running org.apache.hadoop.hbase.TestFullLogReconstruction
    Tests run: 1, Failures: 0, Errors: 0, Skipped: 0, Time elapsed: 90.59 sec
    Running org.apache.hadoop.hbase.TestSerialization
    Tests run: 19, Failures: 0, Errors: 0, Skipped: 0, Time elapsed: 0.107 sec
    Running org.apache.hadoop.hbase.regionserver.TestKeyValueHeap
    Tests run: 3, Failures: 0, Errors: 0, Skipped: 0, Time elapsed: 0.093 sec
    Running org.apache.hadoop.hbase.regionserver.TestStoreScanner
    Tests run: 14, Failures: 0, Errors: 0, Skipped: 0, Time elapsed: 0.033 sec
    Running org.apache.hadoop.hbase.TestHMsg
    Tests run: 2, Failures: 0, Errors: 0, Skipped: 0, Time elapsed: 0.023 sec
    Running org.apache.hadoop.hbase.io.hfile.TestReseekTo
    Tests run: 1, Failures: 0, Errors: 0, Skipped: 0, Time elapsed: 0.212 sec
    Running org.apache.hadoop.hbase.regionserver.TestHRegionInfo
    Tests run: 2, Failures: 0, Errors: 0, Skipped: 0, Time elapsed: 0.017 sec
    Running org.apache.hadoop.hbase.util.TestIncrementingEnvironmentEdge
    Tests run: 1, Failures: 0, Errors: 0, Skipped: 0, Time elapsed: 0.016 sec
    Running org.apache.hadoop.hbase.util.TestKeying
    Tests run: 1, Failures: 0, Errors: 0, Skipped: 0, Time elapsed: 0.016 sec
    Running org.apache.hadoop.hbase.regionserver.TestScanner
    Tests run: 6, Failures: 0, Errors: 0, Skipped: 0, Time elapsed: 80.734 sec
    Running org.apache.hadoop.hbase.util.TestHBaseFsck
    Tests run: 1, Failures: 0, Errors: 0, Skipped: 0, Time elapsed: 54.663 sec
    Running org.apache.hadoop.hbase.master.TestRestartCluster
    Tests run: 2, Failures: 0, Errors: 0, Skipped: 0, Time elapsed: 68.372 sec
    Running org.apache.hadoop.hbase.client.TestShell
    Tests run: 1, Failures: 0, Errors: 0, Skipped: 0, Time elapsed: 74.978 sec
    Running org.apache.hadoop.hbase.rest.model.TestTableInfoModel
    Tests run: 3, Failures: 0, Errors: 0, Skipped: 0, Time elapsed: 0.129 sec
    Running org.apache.hadoop.hbase.TestInfoServers
    Tests run: 1, Failures: 0, Errors: 0, Skipped: 0, Time elapsed: 18.287 sec
    Running org.apache.hadoop.hbase.master.TestLogsCleaner
    Tests run: 1, Failures: 0, Errors: 0, Skipped: 0, Time elapsed: 1.365 sec
    Running org.apache.hadoop.hbase.regionserver.TestMasterAddressManager
    Tests run: 1, Failures: 0, Errors: 0, Skipped: 0, Time elapsed: 0.321 sec
    Running org.apache.hadoop.hbase.catalog.TestCatalogTrackerOnCluster
    Tests run: 1, Failures: 0, Errors: 0, Skipped: 0, Time elapsed: 92.076 sec
    Running org.apache.hadoop.hbase.regionserver.TestQueryMatcher
    Tests run: 4, Failures: 0, Errors: 0, Skipped: 0, Time elapsed: 0.107 sec
    Running org.apache.hadoop.hbase.zookeeper.TestZKTable
    Tests run: 1, Failures: 0, Errors: 0, Skipped: 0, Time elapsed: 0.36 sec
    Running org.apache.hadoop.hbase.client.TestAdmin
    Tests run: 16, Failures: 0, Errors: 0, Skipped: 0, Time elapsed: 556.837 sec
    Running org.apache.hadoop.hbase.regionserver.TestPriorityCompactionQueue
    Tests run: 1, Failures: 0, Errors: 0, Skipped: 0, Time elapsed: 1.076 sec
    Running org.apache.hadoop.hbase.util.TestMergeTool
    Tests run: 1, Failures: 0, Errors: 0, Skipped: 0, Time elapsed: 39.611 sec
    Running org.apache.hadoop.hbase.TestAcidGuarantees
    Tests run: 3, Failures: 0, Errors: 0, Skipped: 3, Time elapsed: 0.015 sec
    Running org.apache.hadoop.hbase.util.TestBase64
    Tests run: 1, Failures: 0, Errors: 0, Skipped: 0, Time elapsed: 0.018 sec
    Running org.apache.hadoop.hbase.regionserver.TestMemStore
    Tests run: 21, Failures: 0, Errors: 0, Skipped: 0, Time elapsed: 51.001 sec
    Running org.apache.hadoop.hbase.rest.TestScannerResource
    Tests run: 5, Failures: 0, Errors: 0, Skipped: 0, Time elapsed: 65.369 sec
    Running org.apache.hadoop.hbase.io.hfile.TestLruBlockCache
    Tests run: 7, Failures: 0, Errors: 0, Skipped: 0, Time elapsed: 1.055 sec
    Running org.apache.hadoop.hbase.master.TestDeadServer
    Tests run: 1, Failures: 0, Errors: 0, Skipped: 0, Time elapsed: 0.019 sec
    Running org.apache.hadoop.hbase.rest.TestGzipFilter
    Tests run: 2, Failures: 0, Errors: 0, Skipped: 0, Time elapsed: 28.595 sec
    Running org.apache.hadoop.hbase.mapreduce.TestTableMapReduce
    Tests run: 2, Failures: 0, Errors: 0, Skipped: 0, Time elapsed: 112.88 sec
    Running org.apache.hadoop.hbase.TestKeyValue
    Tests run: 9, Failures: 0, Errors: 0, Skipped: 0, Time elapsed: 0.024 sec
    Running org.apache.hadoop.hbase.client.TestMultiParallel
    Tests run: 10, Failures: 0, Errors: 0, Skipped: 0, Time elapsed: 58.993 sec
    Running org.apache.hadoop.hbase.master.TestMaster
    Tests run: 1, Failures: 0, Errors: 0, Skipped: 0, Time elapsed: 84.576 sec
    Running org.apache.hadoop.hbase.master.TestRollingRestart
    killed.
    [INFO] ------------------------------------------------------------------------
    [ERROR] BUILD ERROR
    [INFO] ------------------------------------------------------------------------
    [INFO] Error while executing forked tests.; nested exception is org.apache.maven.surefire.booter.shade.org.codehaus.plexus.util.cli.CommandLineException: Error while executing external command, process killed.

    Process timeout out after 900 seconds
    [INFO] ------------------------------------------------------------------------
    [INFO] For more information, run Maven with the -e switch
    [INFO] ------------------------------------------------------------------------
    [INFO] Total time: 92 minutes 5 seconds
    [INFO] Finished at: Mon Mar 21 23:48:07 UTC 2011
    [INFO] Final Memory: 89M/1122M
    [INFO] ------------------------------------------------------------------------
    [locks-and-latches] Releasing all the locks
    [locks-and-latches] All the locks released
    Archiving artifacts
    Recording test results

Related Discussions

Discussion Navigation
viewthread | post
Discussion Overview
groupdev @
categorieshbase, hadoop
postedMar 20, '11 at 12:34a
activeMar 22, '11 at 12:06a
posts3
users1
websitehbase.apache.org

1 user in discussion

Apache Hudson Server: 3 posts

People

Translate

site design / logo © 2022 Grokbase