FAQ
See <https://hudson.apache.org/hudson/job/HBase-TRUNK/1749/changes>

Changes:

[rawson] HBASE-3514 Speedup HFile.Writer append

------------------------------------------
[...truncated 2969 lines...]
Tests run: 2, Failures: 0, Errors: 0, Skipped: 0, Time elapsed: 0.034 sec
Running org.apache.hadoop.hbase.mapreduce.TestTimeRangeMapRed
Tests run: 1, Failures: 0, Errors: 0, Skipped: 0, Time elapsed: 33.08 sec
Running org.apache.hadoop.hbase.zookeeper.TestZooKeeperMainServerArg
Tests run: 1, Failures: 0, Errors: 0, Skipped: 0, Time elapsed: 0.026 sec
Running org.apache.hadoop.hbase.mapreduce.TestSimpleTotalOrderPartitioner
Tests run: 1, Failures: 0, Errors: 0, Skipped: 0, Time elapsed: 0.084 sec
Running org.apache.hadoop.hbase.master.TestClockSkewDetection
Tests run: 1, Failures: 0, Errors: 0, Skipped: 0, Time elapsed: 0.034 sec
Running org.apache.hadoop.hbase.mapreduce.TestHFileOutputFormat
Tests run: 5, Failures: 0, Errors: 0, Skipped: 0, Time elapsed: 174.88 sec
Running org.apache.hadoop.hbase.regionserver.TestFSErrorsExposed
Tests run: 3, Failures: 0, Errors: 0, Skipped: 0, Time elapsed: 44.136 sec
Running org.apache.hadoop.hbase.client.replication.TestReplicationAdmin
Tests run: 1, Failures: 0, Errors: 0, Skipped: 0, Time elapsed: 0.447 sec
Running org.apache.hadoop.hbase.regionserver.TestScanDeleteTracker
Tests run: 6, Failures: 0, Errors: 0, Skipped: 0, Time elapsed: 0.113 sec
Running org.apache.hadoop.hbase.client.TestMetaScanner
Tests run: 1, Failures: 0, Errors: 0, Skipped: 0, Time elapsed: 33.015 sec
Running org.apache.hadoop.hbase.metrics.TestMetricsMBeanBase
Tests run: 2, Failures: 0, Errors: 0, Skipped: 0, Time elapsed: 0.067 sec
Running org.apache.hadoop.hbase.TestRegionRebalancing
Tests run: 1, Failures: 0, Errors: 0, Skipped: 0, Time elapsed: 69.307 sec
Running org.apache.hadoop.hbase.filter.TestInclusiveStopFilter
Tests run: 2, Failures: 0, Errors: 0, Skipped: 0, Time elapsed: 0.016 sec
Running org.apache.hadoop.hbase.rest.TestTableResource
Tests run: 8, Failures: 0, Errors: 0, Skipped: 0, Time elapsed: 61.063 sec
Running org.apache.hadoop.hbase.filter.TestSingleColumnValueExcludeFilter
Tests run: 1, Failures: 0, Errors: 0, Skipped: 0, Time elapsed: 0.016 sec
Running org.apache.hadoop.hbase.TestHBaseTestingUtility
Tests run: 5, Failures: 0, Errors: 0, Skipped: 0, Time elapsed: 90.919 sec
Running org.apache.hadoop.hbase.mapreduce.TestLoadIncrementalHFiles
Tests run: 3, Failures: 0, Errors: 0, Skipped: 0, Time elapsed: 56.105 sec
Running org.apache.hadoop.hbase.regionserver.wal.TestWALReplay
Tests run: 4, Failures: 0, Errors: 0, Skipped: 0, Time elapsed: 31.45 sec
Running org.apache.hadoop.hbase.rest.TestSchemaResource
Tests run: 2, Failures: 0, Errors: 0, Skipped: 0, Time elapsed: 51.436 sec
Running org.apache.hadoop.hbase.regionserver.TestKeyValueScanFixture
Tests run: 1, Failures: 0, Errors: 0, Skipped: 0, Time elapsed: 0.015 sec
Running org.apache.hadoop.hbase.rest.model.TestTableListModel
Tests run: 3, Failures: 0, Errors: 0, Skipped: 0, Time elapsed: 0.128 sec
Running org.apache.hadoop.hbase.rest.model.TestColumnSchemaModel
Tests run: 2, Failures: 0, Errors: 0, Skipped: 0, Time elapsed: 0.03 sec
Running org.apache.hadoop.hbase.regionserver.TestStoreFile
Tests run: 8, Failures: 0, Errors: 0, Skipped: 0, Time elapsed: 42.982 sec
Running org.apache.hadoop.hbase.zookeeper.TestZooKeeperNodeTracker
Tests run: 2, Failures: 0, Errors: 0, Skipped: 0, Time elapsed: 0.551 sec
Running org.apache.hadoop.hbase.regionserver.wal.TestHLogMethods
Tests run: 3, Failures: 0, Errors: 0, Skipped: 0, Time elapsed: 0.462 sec
Running org.apache.hadoop.hbase.rest.model.TestScannerModel
Tests run: 3, Failures: 0, Errors: 0, Skipped: 0, Time elapsed: 0.148 sec
Running org.apache.hadoop.hbase.rest.TestVersionResource
Tests run: 7, Failures: 0, Errors: 0, Skipped: 0, Time elapsed: 27.822 sec
Running org.apache.hadoop.hbase.filter.TestFilter
Tests run: 18, Failures: 0, Errors: 0, Skipped: 0, Time elapsed: 4.073 sec
Running org.apache.hadoop.hbase.regionserver.TestWideScanner
Tests run: 1, Failures: 0, Errors: 0, Skipped: 0, Time elapsed: 20.12 sec
Running org.apache.hadoop.hbase.regionserver.TestSplitTransaction
Tests run: 5, Failures: 0, Errors: 0, Skipped: 0, Time elapsed: 3.026 sec
Running org.apache.hadoop.hbase.replication.regionserver.TestReplicationSink
Tests run: 5, Failures: 0, Errors: 0, Skipped: 0, Time elapsed: 32.185 sec
Running org.apache.hadoop.hbase.regionserver.TestGetClosestAtOrBefore
Tests run: 3, Failures: 0, Errors: 2, Skipped: 0, Time elapsed: 13.253 sec <<< FAILURE!
Running org.apache.hadoop.hbase.regionserver.TestReadWriteConsistencyControl
Tests run: 1, Failures: 0, Errors: 0, Skipped: 0, Time elapsed: 10.02 sec
Running org.apache.hadoop.hbase.util.TestMergeTable
Tests run: 1, Failures: 0, Errors: 0, Skipped: 0, Time elapsed: 66.203 sec
Running org.apache.hadoop.hbase.coprocessor.TestMasterObserver
Tests run: 3, Failures: 0, Errors: 0, Skipped: 0, Time elapsed: 58.229 sec
Running org.apache.hadoop.hbase.rest.model.TestVersionModel
Tests run: 3, Failures: 0, Errors: 0, Skipped: 0, Time elapsed: 0.129 sec
Running org.apache.hadoop.hbase.rest.model.TestCellSetModel
Tests run: 3, Failures: 0, Errors: 0, Skipped: 0, Time elapsed: 0.198 sec
Running org.apache.hadoop.hbase.rest.client.TestRemoteTable
Tests run: 3, Failures: 0, Errors: 0, Skipped: 0, Time elapsed: 29.589 sec
Running org.apache.hadoop.hbase.rest.model.TestStorageClusterStatusModel
Tests run: 3, Failures: 0, Errors: 0, Skipped: 0, Time elapsed: 0.137 sec
Running org.apache.hadoop.hbase.avro.TestAvroServer
Tests run: 3, Failures: 0, Errors: 0, Skipped: 0, Time elapsed: 82.437 sec
Running org.apache.hadoop.hbase.TestFullLogReconstruction
Tests run: 1, Failures: 0, Errors: 0, Skipped: 0, Time elapsed: 99.314 sec
Running org.apache.hadoop.hbase.TestSerialization
Tests run: 19, Failures: 0, Errors: 0, Skipped: 0, Time elapsed: 0.066 sec
Running org.apache.hadoop.hbase.regionserver.TestKeyValueHeap
Tests run: 3, Failures: 0, Errors: 0, Skipped: 0, Time elapsed: 0.101 sec
Running org.apache.hadoop.hbase.regionserver.TestStoreScanner
Tests run: 14, Failures: 0, Errors: 0, Skipped: 0, Time elapsed: 0.031 sec
Running org.apache.hadoop.hbase.TestHMsg
Tests run: 2, Failures: 0, Errors: 0, Skipped: 0, Time elapsed: 0.021 sec
Running org.apache.hadoop.hbase.io.hfile.TestReseekTo
Tests run: 1, Failures: 0, Errors: 0, Skipped: 0, Time elapsed: 0.226 sec
Running org.apache.hadoop.hbase.regionserver.TestHRegionInfo
Tests run: 2, Failures: 0, Errors: 0, Skipped: 0, Time elapsed: 0.017 sec
Running org.apache.hadoop.hbase.util.TestIncrementingEnvironmentEdge
Tests run: 1, Failures: 0, Errors: 0, Skipped: 0, Time elapsed: 0.016 sec
Running org.apache.hadoop.hbase.util.TestKeying
Tests run: 1, Failures: 0, Errors: 0, Skipped: 0, Time elapsed: 0.016 sec
Running org.apache.hadoop.hbase.regionserver.TestScanner
Tests run: 6, Failures: 0, Errors: 0, Skipped: 0, Time elapsed: 68.671 sec
Running org.apache.hadoop.hbase.util.TestHBaseFsck
Tests run: 1, Failures: 0, Errors: 0, Skipped: 0, Time elapsed: 39.435 sec
Running org.apache.hadoop.hbase.master.TestRestartCluster
Tests run: 2, Failures: 0, Errors: 0, Skipped: 0, Time elapsed: 85.436 sec
Running org.apache.hadoop.hbase.rest.model.TestTableInfoModel
Tests run: 3, Failures: 0, Errors: 0, Skipped: 0, Time elapsed: 0.134 sec
Running org.apache.hadoop.hbase.TestInfoServers
Tests run: 1, Failures: 0, Errors: 0, Skipped: 0, Time elapsed: 36.927 sec
Running org.apache.hadoop.hbase.master.TestLogsCleaner
Tests run: 1, Failures: 0, Errors: 0, Skipped: 0, Time elapsed: 2.183 sec
Running org.apache.hadoop.hbase.regionserver.TestMasterAddressManager
Tests run: 1, Failures: 0, Errors: 0, Skipped: 0, Time elapsed: 0.427 sec
Running org.apache.hadoop.hbase.catalog.TestCatalogTrackerOnCluster
Tests run: 1, Failures: 0, Errors: 0, Skipped: 0, Time elapsed: 157.972 sec
Running org.apache.hadoop.hbase.regionserver.TestQueryMatcher
Tests run: 4, Failures: 0, Errors: 0, Skipped: 0, Time elapsed: 0.104 sec
Running org.apache.hadoop.hbase.zookeeper.TestZKTable
Tests run: 1, Failures: 0, Errors: 0, Skipped: 0, Time elapsed: 0.34 sec
Running org.apache.hadoop.hbase.client.TestAdmin
Tests run: 16, Failures: 1, Errors: 0, Skipped: 0, Time elapsed: 545.801 sec <<< FAILURE!
Running org.apache.hadoop.hbase.regionserver.TestPriorityCompactionQueue
Tests run: 1, Failures: 0, Errors: 0, Skipped: 0, Time elapsed: 1.079 sec
Running org.apache.hadoop.hbase.util.TestMergeTool
Tests run: 1, Failures: 0, Errors: 0, Skipped: 0, Time elapsed: 42.493 sec
Running org.apache.hadoop.hbase.TestAcidGuarantees
Tests run: 3, Failures: 0, Errors: 0, Skipped: 3, Time elapsed: 0.016 sec
Running org.apache.hadoop.hbase.util.TestBase64
Tests run: 1, Failures: 0, Errors: 0, Skipped: 0, Time elapsed: 0.017 sec
Running org.apache.hadoop.hbase.coprocessor.TestRegionObserverStacking
Tests run: 1, Failures: 0, Errors: 0, Skipped: 0, Time elapsed: 0.292 sec
Running org.apache.hadoop.hbase.regionserver.TestMemStore
Tests run: 21, Failures: 0, Errors: 0, Skipped: 0, Time elapsed: 50.744 sec
Running org.apache.hadoop.hbase.rest.TestScannerResource
Tests run: 5, Failures: 0, Errors: 0, Skipped: 0, Time elapsed: 118.442 sec
Running org.apache.hadoop.hbase.io.hfile.TestLruBlockCache
Tests run: 7, Failures: 0, Errors: 0, Skipped: 0, Time elapsed: 1.053 sec
Running org.apache.hadoop.hbase.master.TestDeadServer
Tests run: 1, Failures: 0, Errors: 0, Skipped: 0, Time elapsed: 0.018 sec
Running org.apache.hadoop.hbase.rest.TestGzipFilter
Tests run: 2, Failures: 0, Errors: 0, Skipped: 0, Time elapsed: 37.761 sec
Running org.apache.hadoop.hbase.mapreduce.TestTableMapReduce
Tests run: 2, Failures: 0, Errors: 0, Skipped: 0, Time elapsed: 109.55 sec
Running org.apache.hadoop.hbase.TestKeyValue
Tests run: 9, Failures: 0, Errors: 0, Skipped: 0, Time elapsed: 0.024 sec
Running org.apache.hadoop.hbase.client.TestMultiParallel
Tests run: 9, Failures: 0, Errors: 0, Skipped: 0, Time elapsed: 80.317 sec
Running org.apache.hadoop.hbase.master.TestMaster
Tests run: 1, Failures: 0, Errors: 0, Skipped: 0, Time elapsed: 87.519 sec
Running org.apache.hadoop.hbase.master.TestRollingRestart
Tests run: 1, Failures: 0, Errors: 0, Skipped: 0, Time elapsed: 74.823 sec
Running org.apache.hadoop.hbase.client.TestResult
Tests run: 2, Failures: 0, Errors: 0, Skipped: 0, Time elapsed: 0.037 sec
Running org.apache.hadoop.hbase.client.TestHTablePool
Tests run: 5, Failures: 0, Errors: 0, Skipped: 0, Time elapsed: 45.829 sec
Running org.apache.hadoop.hbase.rest.model.TestTableSchemaModel
Tests run: 3, Failures: 0, Errors: 0, Skipped: 0, Time elapsed: 0.136 sec
Running org.apache.hadoop.hbase.util.TestByteBloomFilter
Tests run: 3, Failures: 0, Errors: 0, Skipped: 0, Time elapsed: 1.568 sec
Running org.apache.hadoop.hbase.regionserver.TestCompactSelection
Tests run: 1, Failures: 0, Errors: 0, Skipped: 0, Time elapsed: 0.197 sec
Running org.apache.hadoop.hbase.filter.TestFilterList
Tests run: 4, Failures: 0, Errors: 0, Skipped: 0, Time elapsed: 0.04 sec
Running org.apache.hadoop.hbase.mapreduce.TestTableInputFormatScan
Tests run: 11, Failures: 0, Errors: 0, Skipped: 0, Time elapsed: 336.352 sec
Running org.apache.hadoop.hbase.regionserver.TestHRegion
Tests run: 53, Failures: 0, Errors: 1, Skipped: 0, Time elapsed: 36.585 sec <<< FAILURE!
Running org.apache.hadoop.hbase.master.TestMasterFailover
Tests run: 3, Failures: 0, Errors: 0, Skipped: 0, Time elapsed: 94.647 sec
Running org.apache.hadoop.hbase.rest.model.TestTableRegionModel
Tests run: 4, Failures: 0, Errors: 0, Skipped: 0, Time elapsed: 0.033 sec
Running org.apache.hadoop.hbase.client.TestTimestampsFilter
Tests run: 2, Failures: 0, Errors: 2, Skipped: 0, Time elapsed: 32.23 sec <<< FAILURE!
Running org.apache.hadoop.hbase.master.TestLoadBalancer
Tests run: 4, Failures: 0, Errors: 0, Skipped: 0, Time elapsed: 1.147 sec
Running org.apache.hadoop.hbase.util.TestRootPath
Tests run: 1, Failures: 0, Errors: 0, Skipped: 0, Time elapsed: 0.021 sec
Running org.apache.hadoop.hbase.client.TestScannerTimeout
Tests run: 2, Failures: 0, Errors: 0, Skipped: 0, Time elapsed: 69.601 sec
Running org.apache.hadoop.hbase.regionserver.wal.TestWALObserver
Tests run: 1, Failures: 0, Errors: 0, Skipped: 0, Time elapsed: 0.411 sec
Running org.apache.hadoop.hbase.mapred.TestTableMapReduce
Tests run: 1, Failures: 0, Errors: 0, Skipped: 0, Time elapsed: 79.015 sec
Running org.apache.hadoop.hbase.master.TestActiveMasterManager
Tests run: 2, Failures: 0, Errors: 0, Skipped: 0, Time elapsed: 0.429 sec
Running org.apache.hadoop.hbase.filter.TestRandomRowFilter
Tests run: 2, Failures: 0, Errors: 0, Skipped: 0, Time elapsed: 0.439 sec
Running org.apache.hadoop.hbase.replication.regionserver.TestReplicationSourceManager
Tests run: 1, Failures: 0, Errors: 0, Skipped: 0, Time elapsed: 0.904 sec
Running org.apache.hadoop.hbase.util.TestBytes
Tests run: 10, Failures: 0, Errors: 0, Skipped: 0, Time elapsed: 0.021 sec
Running org.apache.hadoop.hbase.util.TestCompressionTest
Tests run: 1, Failures: 0, Errors: 0, Skipped: 0, Time elapsed: 0.03 sec
Running org.apache.hadoop.hbase.client.TestGetRowVersions
Tests run: 1, Failures: 0, Errors: 0, Skipped: 0, Time elapsed: 45.597 sec
Running org.apache.hadoop.hbase.filter.TestDependentColumnFilter
Tests run: 2, Failures: 0, Errors: 0, Skipped: 0, Time elapsed: 0.399 sec
Running org.apache.hadoop.hbase.rest.model.TestCellModel
Tests run: 3, Failures: 0, Errors: 0, Skipped: 0, Time elapsed: 0.127 sec
Running org.apache.hadoop.hbase.master.TestCatalogJanitor
Tests run: 2, Failures: 0, Errors: 0, Skipped: 0, Time elapsed: 0.573 sec
Running org.apache.hadoop.hbase.catalog.TestCatalogTracker
Tests run: 8, Failures: 0, Errors: 0, Skipped: 0, Time elapsed: 3.206 sec
Running org.apache.hadoop.hbase.replication.TestReplicationSource
Tests run: 1, Failures: 0, Errors: 0, Skipped: 0, Time elapsed: 2.452 sec
Running org.apache.hadoop.hbase.rest.TestRowResource
Tests run: 10, Failures: 0, Errors: 0, Skipped: 0, Time elapsed: 71.93 sec
Running org.apache.hadoop.hbase.io.hfile.TestHFile
Tests run: 7, Failures: 0, Errors: 0, Skipped: 0, Time elapsed: 0.333 sec
Running org.apache.hadoop.hbase.catalog.TestMetaReaderEditor
Tests run: 3, Failures: 0, Errors: 0, Skipped: 0, Time elapsed: 64.308 sec
Running org.apache.hadoop.hbase.mapreduce.TestImportTsv
Tests run: 6, Failures: 0, Errors: 0, Skipped: 0, Time elapsed: 0.041 sec
Running org.apache.hadoop.hbase.rest.client.TestRemoteAdmin
Tests run: 2, Failures: 0, Errors: 0, Skipped: 0, Time elapsed: 47.107 sec
Running org.apache.hadoop.hbase.regionserver.wal.TestHLog
Tests run: 9, Failures: 0, Errors: 0, Skipped: 0, Time elapsed: 71.818 sec
Running org.apache.hadoop.hbase.client.TestTimestamp
Tests run: 1, Failures: 0, Errors: 0, Skipped: 0, Time elapsed: 24.62 sec
Running org.apache.hadoop.hbase.TestScanMultipleVersions
Tests run: 1, Failures: 0, Errors: 0, Skipped: 0, Time elapsed: 21.697 sec
Running org.apache.hadoop.hbase.rest.model.TestStorageClusterVersionModel
Tests run: 2, Failures: 0, Errors: 0, Skipped: 0, Time elapsed: 0.03 sec
Running org.apache.hadoop.hbase.client.TestHCM
Tests run: 2, Failures: 0, Errors: 0, Skipped: 0, Time elapsed: 37.79 sec

Results :

Failed tests:

Tests in error:

Tests run: 649, Failures: 1, Errors: 34, Skipped: 9

[INFO] ------------------------------------------------------------------------
[ERROR] BUILD FAILURE
[INFO] ------------------------------------------------------------------------
[INFO] There are test failures.

Please refer to <https://hudson.apache.org/hudson/job/HBase-TRUNK/ws/trunk/target/surefire-reports> for the individual test results.
[INFO] ------------------------------------------------------------------------
[INFO] For more information, run Maven with the -e switch
[INFO] ------------------------------------------------------------------------
[INFO] Total time: 95 minutes 53 seconds
[INFO] Finished at: Thu Feb 24 05:03:54 UTC 2011
[INFO] Final Memory: 90M/924M
[INFO] ------------------------------------------------------------------------
[locks-and-latches] Releasing all the locks
[locks-and-latches] All the locks released
Archiving artifacts
Recording test results

Search Discussions

  • Stack at Feb 24, 2011 at 5:30 am
    A bunch of stuff seems to have failed on your last commit Ryan?
    St.Ack

    On Wed, Feb 23, 2011 at 9:04 PM, Apache Hudson Server
    wrote:
    See <https://hudson.apache.org/hudson/job/HBase-TRUNK/1749/changes>

    Changes:

    [rawson] HBASE-3514  Speedup HFile.Writer append

    ------------------------------------------
    [...truncated 2969 lines...]
    Tests run: 2, Failures: 0, Errors: 0, Skipped: 0, Time elapsed: 0.034 sec
    Running org.apache.hadoop.hbase.mapreduce.TestTimeRangeMapRed
    Tests run: 1, Failures: 0, Errors: 0, Skipped: 0, Time elapsed: 33.08 sec
    Running org.apache.hadoop.hbase.zookeeper.TestZooKeeperMainServerArg
    Tests run: 1, Failures: 0, Errors: 0, Skipped: 0, Time elapsed: 0.026 sec
    Running org.apache.hadoop.hbase.mapreduce.TestSimpleTotalOrderPartitioner
    Tests run: 1, Failures: 0, Errors: 0, Skipped: 0, Time elapsed: 0.084 sec
    Running org.apache.hadoop.hbase.master.TestClockSkewDetection
    Tests run: 1, Failures: 0, Errors: 0, Skipped: 0, Time elapsed: 0.034 sec
    Running org.apache.hadoop.hbase.mapreduce.TestHFileOutputFormat
    Tests run: 5, Failures: 0, Errors: 0, Skipped: 0, Time elapsed: 174.88 sec
    Running org.apache.hadoop.hbase.regionserver.TestFSErrorsExposed
    Tests run: 3, Failures: 0, Errors: 0, Skipped: 0, Time elapsed: 44.136 sec
    Running org.apache.hadoop.hbase.client.replication.TestReplicationAdmin
    Tests run: 1, Failures: 0, Errors: 0, Skipped: 0, Time elapsed: 0.447 sec
    Running org.apache.hadoop.hbase.regionserver.TestScanDeleteTracker
    Tests run: 6, Failures: 0, Errors: 0, Skipped: 0, Time elapsed: 0.113 sec
    Running org.apache.hadoop.hbase.client.TestMetaScanner
    Tests run: 1, Failures: 0, Errors: 0, Skipped: 0, Time elapsed: 33.015 sec
    Running org.apache.hadoop.hbase.metrics.TestMetricsMBeanBase
    Tests run: 2, Failures: 0, Errors: 0, Skipped: 0, Time elapsed: 0.067 sec
    Running org.apache.hadoop.hbase.TestRegionRebalancing
    Tests run: 1, Failures: 0, Errors: 0, Skipped: 0, Time elapsed: 69.307 sec
    Running org.apache.hadoop.hbase.filter.TestInclusiveStopFilter
    Tests run: 2, Failures: 0, Errors: 0, Skipped: 0, Time elapsed: 0.016 sec
    Running org.apache.hadoop.hbase.rest.TestTableResource
    Tests run: 8, Failures: 0, Errors: 0, Skipped: 0, Time elapsed: 61.063 sec
    Running org.apache.hadoop.hbase.filter.TestSingleColumnValueExcludeFilter
    Tests run: 1, Failures: 0, Errors: 0, Skipped: 0, Time elapsed: 0.016 sec
    Running org.apache.hadoop.hbase.TestHBaseTestingUtility
    Tests run: 5, Failures: 0, Errors: 0, Skipped: 0, Time elapsed: 90.919 sec
    Running org.apache.hadoop.hbase.mapreduce.TestLoadIncrementalHFiles
    Tests run: 3, Failures: 0, Errors: 0, Skipped: 0, Time elapsed: 56.105 sec
    Running org.apache.hadoop.hbase.regionserver.wal.TestWALReplay
    Tests run: 4, Failures: 0, Errors: 0, Skipped: 0, Time elapsed: 31.45 sec
    Running org.apache.hadoop.hbase.rest.TestSchemaResource
    Tests run: 2, Failures: 0, Errors: 0, Skipped: 0, Time elapsed: 51.436 sec
    Running org.apache.hadoop.hbase.regionserver.TestKeyValueScanFixture
    Tests run: 1, Failures: 0, Errors: 0, Skipped: 0, Time elapsed: 0.015 sec
    Running org.apache.hadoop.hbase.rest.model.TestTableListModel
    Tests run: 3, Failures: 0, Errors: 0, Skipped: 0, Time elapsed: 0.128 sec
    Running org.apache.hadoop.hbase.rest.model.TestColumnSchemaModel
    Tests run: 2, Failures: 0, Errors: 0, Skipped: 0, Time elapsed: 0.03 sec
    Running org.apache.hadoop.hbase.regionserver.TestStoreFile
    Tests run: 8, Failures: 0, Errors: 0, Skipped: 0, Time elapsed: 42.982 sec
    Running org.apache.hadoop.hbase.zookeeper.TestZooKeeperNodeTracker
    Tests run: 2, Failures: 0, Errors: 0, Skipped: 0, Time elapsed: 0.551 sec
    Running org.apache.hadoop.hbase.regionserver.wal.TestHLogMethods
    Tests run: 3, Failures: 0, Errors: 0, Skipped: 0, Time elapsed: 0.462 sec
    Running org.apache.hadoop.hbase.rest.model.TestScannerModel
    Tests run: 3, Failures: 0, Errors: 0, Skipped: 0, Time elapsed: 0.148 sec
    Running org.apache.hadoop.hbase.rest.TestVersionResource
    Tests run: 7, Failures: 0, Errors: 0, Skipped: 0, Time elapsed: 27.822 sec
    Running org.apache.hadoop.hbase.filter.TestFilter
    Tests run: 18, Failures: 0, Errors: 0, Skipped: 0, Time elapsed: 4.073 sec
    Running org.apache.hadoop.hbase.regionserver.TestWideScanner
    Tests run: 1, Failures: 0, Errors: 0, Skipped: 0, Time elapsed: 20.12 sec
    Running org.apache.hadoop.hbase.regionserver.TestSplitTransaction
    Tests run: 5, Failures: 0, Errors: 0, Skipped: 0, Time elapsed: 3.026 sec
    Running org.apache.hadoop.hbase.replication.regionserver.TestReplicationSink
    Tests run: 5, Failures: 0, Errors: 0, Skipped: 0, Time elapsed: 32.185 sec
    Running org.apache.hadoop.hbase.regionserver.TestGetClosestAtOrBefore
    Tests run: 3, Failures: 0, Errors: 2, Skipped: 0, Time elapsed: 13.253 sec <<< FAILURE!
    Running org.apache.hadoop.hbase.regionserver.TestReadWriteConsistencyControl
    Tests run: 1, Failures: 0, Errors: 0, Skipped: 0, Time elapsed: 10.02 sec
    Running org.apache.hadoop.hbase.util.TestMergeTable
    Tests run: 1, Failures: 0, Errors: 0, Skipped: 0, Time elapsed: 66.203 sec
    Running org.apache.hadoop.hbase.coprocessor.TestMasterObserver
    Tests run: 3, Failures: 0, Errors: 0, Skipped: 0, Time elapsed: 58.229 sec
    Running org.apache.hadoop.hbase.rest.model.TestVersionModel
    Tests run: 3, Failures: 0, Errors: 0, Skipped: 0, Time elapsed: 0.129 sec
    Running org.apache.hadoop.hbase.rest.model.TestCellSetModel
    Tests run: 3, Failures: 0, Errors: 0, Skipped: 0, Time elapsed: 0.198 sec
    Running org.apache.hadoop.hbase.rest.client.TestRemoteTable
    Tests run: 3, Failures: 0, Errors: 0, Skipped: 0, Time elapsed: 29.589 sec
    Running org.apache.hadoop.hbase.rest.model.TestStorageClusterStatusModel
    Tests run: 3, Failures: 0, Errors: 0, Skipped: 0, Time elapsed: 0.137 sec
    Running org.apache.hadoop.hbase.avro.TestAvroServer
    Tests run: 3, Failures: 0, Errors: 0, Skipped: 0, Time elapsed: 82.437 sec
    Running org.apache.hadoop.hbase.TestFullLogReconstruction
    Tests run: 1, Failures: 0, Errors: 0, Skipped: 0, Time elapsed: 99.314 sec
    Running org.apache.hadoop.hbase.TestSerialization
    Tests run: 19, Failures: 0, Errors: 0, Skipped: 0, Time elapsed: 0.066 sec
    Running org.apache.hadoop.hbase.regionserver.TestKeyValueHeap
    Tests run: 3, Failures: 0, Errors: 0, Skipped: 0, Time elapsed: 0.101 sec
    Running org.apache.hadoop.hbase.regionserver.TestStoreScanner
    Tests run: 14, Failures: 0, Errors: 0, Skipped: 0, Time elapsed: 0.031 sec
    Running org.apache.hadoop.hbase.TestHMsg
    Tests run: 2, Failures: 0, Errors: 0, Skipped: 0, Time elapsed: 0.021 sec
    Running org.apache.hadoop.hbase.io.hfile.TestReseekTo
    Tests run: 1, Failures: 0, Errors: 0, Skipped: 0, Time elapsed: 0.226 sec
    Running org.apache.hadoop.hbase.regionserver.TestHRegionInfo
    Tests run: 2, Failures: 0, Errors: 0, Skipped: 0, Time elapsed: 0.017 sec
    Running org.apache.hadoop.hbase.util.TestIncrementingEnvironmentEdge
    Tests run: 1, Failures: 0, Errors: 0, Skipped: 0, Time elapsed: 0.016 sec
    Running org.apache.hadoop.hbase.util.TestKeying
    Tests run: 1, Failures: 0, Errors: 0, Skipped: 0, Time elapsed: 0.016 sec
    Running org.apache.hadoop.hbase.regionserver.TestScanner
    Tests run: 6, Failures: 0, Errors: 0, Skipped: 0, Time elapsed: 68.671 sec
    Running org.apache.hadoop.hbase.util.TestHBaseFsck
    Tests run: 1, Failures: 0, Errors: 0, Skipped: 0, Time elapsed: 39.435 sec
    Running org.apache.hadoop.hbase.master.TestRestartCluster
    Tests run: 2, Failures: 0, Errors: 0, Skipped: 0, Time elapsed: 85.436 sec
    Running org.apache.hadoop.hbase.rest.model.TestTableInfoModel
    Tests run: 3, Failures: 0, Errors: 0, Skipped: 0, Time elapsed: 0.134 sec
    Running org.apache.hadoop.hbase.TestInfoServers
    Tests run: 1, Failures: 0, Errors: 0, Skipped: 0, Time elapsed: 36.927 sec
    Running org.apache.hadoop.hbase.master.TestLogsCleaner
    Tests run: 1, Failures: 0, Errors: 0, Skipped: 0, Time elapsed: 2.183 sec
    Running org.apache.hadoop.hbase.regionserver.TestMasterAddressManager
    Tests run: 1, Failures: 0, Errors: 0, Skipped: 0, Time elapsed: 0.427 sec
    Running org.apache.hadoop.hbase.catalog.TestCatalogTrackerOnCluster
    Tests run: 1, Failures: 0, Errors: 0, Skipped: 0, Time elapsed: 157.972 sec
    Running org.apache.hadoop.hbase.regionserver.TestQueryMatcher
    Tests run: 4, Failures: 0, Errors: 0, Skipped: 0, Time elapsed: 0.104 sec
    Running org.apache.hadoop.hbase.zookeeper.TestZKTable
    Tests run: 1, Failures: 0, Errors: 0, Skipped: 0, Time elapsed: 0.34 sec
    Running org.apache.hadoop.hbase.client.TestAdmin
    Tests run: 16, Failures: 1, Errors: 0, Skipped: 0, Time elapsed: 545.801 sec <<< FAILURE!
    Running org.apache.hadoop.hbase.regionserver.TestPriorityCompactionQueue
    Tests run: 1, Failures: 0, Errors: 0, Skipped: 0, Time elapsed: 1.079 sec
    Running org.apache.hadoop.hbase.util.TestMergeTool
    Tests run: 1, Failures: 0, Errors: 0, Skipped: 0, Time elapsed: 42.493 sec
    Running org.apache.hadoop.hbase.TestAcidGuarantees
    Tests run: 3, Failures: 0, Errors: 0, Skipped: 3, Time elapsed: 0.016 sec
    Running org.apache.hadoop.hbase.util.TestBase64
    Tests run: 1, Failures: 0, Errors: 0, Skipped: 0, Time elapsed: 0.017 sec
    Running org.apache.hadoop.hbase.coprocessor.TestRegionObserverStacking
    Tests run: 1, Failures: 0, Errors: 0, Skipped: 0, Time elapsed: 0.292 sec
    Running org.apache.hadoop.hbase.regionserver.TestMemStore
    Tests run: 21, Failures: 0, Errors: 0, Skipped: 0, Time elapsed: 50.744 sec
    Running org.apache.hadoop.hbase.rest.TestScannerResource
    Tests run: 5, Failures: 0, Errors: 0, Skipped: 0, Time elapsed: 118.442 sec
    Running org.apache.hadoop.hbase.io.hfile.TestLruBlockCache
    Tests run: 7, Failures: 0, Errors: 0, Skipped: 0, Time elapsed: 1.053 sec
    Running org.apache.hadoop.hbase.master.TestDeadServer
    Tests run: 1, Failures: 0, Errors: 0, Skipped: 0, Time elapsed: 0.018 sec
    Running org.apache.hadoop.hbase.rest.TestGzipFilter
    Tests run: 2, Failures: 0, Errors: 0, Skipped: 0, Time elapsed: 37.761 sec
    Running org.apache.hadoop.hbase.mapreduce.TestTableMapReduce
    Tests run: 2, Failures: 0, Errors: 0, Skipped: 0, Time elapsed: 109.55 sec
    Running org.apache.hadoop.hbase.TestKeyValue
    Tests run: 9, Failures: 0, Errors: 0, Skipped: 0, Time elapsed: 0.024 sec
    Running org.apache.hadoop.hbase.client.TestMultiParallel
    Tests run: 9, Failures: 0, Errors: 0, Skipped: 0, Time elapsed: 80.317 sec
    Running org.apache.hadoop.hbase.master.TestMaster
    Tests run: 1, Failures: 0, Errors: 0, Skipped: 0, Time elapsed: 87.519 sec
    Running org.apache.hadoop.hbase.master.TestRollingRestart
    Tests run: 1, Failures: 0, Errors: 0, Skipped: 0, Time elapsed: 74.823 sec
    Running org.apache.hadoop.hbase.client.TestResult
    Tests run: 2, Failures: 0, Errors: 0, Skipped: 0, Time elapsed: 0.037 sec
    Running org.apache.hadoop.hbase.client.TestHTablePool
    Tests run: 5, Failures: 0, Errors: 0, Skipped: 0, Time elapsed: 45.829 sec
    Running org.apache.hadoop.hbase.rest.model.TestTableSchemaModel
    Tests run: 3, Failures: 0, Errors: 0, Skipped: 0, Time elapsed: 0.136 sec
    Running org.apache.hadoop.hbase.util.TestByteBloomFilter
    Tests run: 3, Failures: 0, Errors: 0, Skipped: 0, Time elapsed: 1.568 sec
    Running org.apache.hadoop.hbase.regionserver.TestCompactSelection
    Tests run: 1, Failures: 0, Errors: 0, Skipped: 0, Time elapsed: 0.197 sec
    Running org.apache.hadoop.hbase.filter.TestFilterList
    Tests run: 4, Failures: 0, Errors: 0, Skipped: 0, Time elapsed: 0.04 sec
    Running org.apache.hadoop.hbase.mapreduce.TestTableInputFormatScan
    Tests run: 11, Failures: 0, Errors: 0, Skipped: 0, Time elapsed: 336.352 sec
    Running org.apache.hadoop.hbase.regionserver.TestHRegion
    Tests run: 53, Failures: 0, Errors: 1, Skipped: 0, Time elapsed: 36.585 sec <<< FAILURE!
    Running org.apache.hadoop.hbase.master.TestMasterFailover
    Tests run: 3, Failures: 0, Errors: 0, Skipped: 0, Time elapsed: 94.647 sec
    Running org.apache.hadoop.hbase.rest.model.TestTableRegionModel
    Tests run: 4, Failures: 0, Errors: 0, Skipped: 0, Time elapsed: 0.033 sec
    Running org.apache.hadoop.hbase.client.TestTimestampsFilter
    Tests run: 2, Failures: 0, Errors: 2, Skipped: 0, Time elapsed: 32.23 sec <<< FAILURE!
    Running org.apache.hadoop.hbase.master.TestLoadBalancer
    Tests run: 4, Failures: 0, Errors: 0, Skipped: 0, Time elapsed: 1.147 sec
    Running org.apache.hadoop.hbase.util.TestRootPath
    Tests run: 1, Failures: 0, Errors: 0, Skipped: 0, Time elapsed: 0.021 sec
    Running org.apache.hadoop.hbase.client.TestScannerTimeout
    Tests run: 2, Failures: 0, Errors: 0, Skipped: 0, Time elapsed: 69.601 sec
    Running org.apache.hadoop.hbase.regionserver.wal.TestWALObserver
    Tests run: 1, Failures: 0, Errors: 0, Skipped: 0, Time elapsed: 0.411 sec
    Running org.apache.hadoop.hbase.mapred.TestTableMapReduce
    Tests run: 1, Failures: 0, Errors: 0, Skipped: 0, Time elapsed: 79.015 sec
    Running org.apache.hadoop.hbase.master.TestActiveMasterManager
    Tests run: 2, Failures: 0, Errors: 0, Skipped: 0, Time elapsed: 0.429 sec
    Running org.apache.hadoop.hbase.filter.TestRandomRowFilter
    Tests run: 2, Failures: 0, Errors: 0, Skipped: 0, Time elapsed: 0.439 sec
    Running org.apache.hadoop.hbase.replication.regionserver.TestReplicationSourceManager
    Tests run: 1, Failures: 0, Errors: 0, Skipped: 0, Time elapsed: 0.904 sec
    Running org.apache.hadoop.hbase.util.TestBytes
    Tests run: 10, Failures: 0, Errors: 0, Skipped: 0, Time elapsed: 0.021 sec
    Running org.apache.hadoop.hbase.util.TestCompressionTest
    Tests run: 1, Failures: 0, Errors: 0, Skipped: 0, Time elapsed: 0.03 sec
    Running org.apache.hadoop.hbase.client.TestGetRowVersions
    Tests run: 1, Failures: 0, Errors: 0, Skipped: 0, Time elapsed: 45.597 sec
    Running org.apache.hadoop.hbase.filter.TestDependentColumnFilter
    Tests run: 2, Failures: 0, Errors: 0, Skipped: 0, Time elapsed: 0.399 sec
    Running org.apache.hadoop.hbase.rest.model.TestCellModel
    Tests run: 3, Failures: 0, Errors: 0, Skipped: 0, Time elapsed: 0.127 sec
    Running org.apache.hadoop.hbase.master.TestCatalogJanitor
    Tests run: 2, Failures: 0, Errors: 0, Skipped: 0, Time elapsed: 0.573 sec
    Running org.apache.hadoop.hbase.catalog.TestCatalogTracker
    Tests run: 8, Failures: 0, Errors: 0, Skipped: 0, Time elapsed: 3.206 sec
    Running org.apache.hadoop.hbase.replication.TestReplicationSource
    Tests run: 1, Failures: 0, Errors: 0, Skipped: 0, Time elapsed: 2.452 sec
    Running org.apache.hadoop.hbase.rest.TestRowResource
    Tests run: 10, Failures: 0, Errors: 0, Skipped: 0, Time elapsed: 71.93 sec
    Running org.apache.hadoop.hbase.io.hfile.TestHFile
    Tests run: 7, Failures: 0, Errors: 0, Skipped: 0, Time elapsed: 0.333 sec
    Running org.apache.hadoop.hbase.catalog.TestMetaReaderEditor
    Tests run: 3, Failures: 0, Errors: 0, Skipped: 0, Time elapsed: 64.308 sec
    Running org.apache.hadoop.hbase.mapreduce.TestImportTsv
    Tests run: 6, Failures: 0, Errors: 0, Skipped: 0, Time elapsed: 0.041 sec
    Running org.apache.hadoop.hbase.rest.client.TestRemoteAdmin
    Tests run: 2, Failures: 0, Errors: 0, Skipped: 0, Time elapsed: 47.107 sec
    Running org.apache.hadoop.hbase.regionserver.wal.TestHLog
    Tests run: 9, Failures: 0, Errors: 0, Skipped: 0, Time elapsed: 71.818 sec
    Running org.apache.hadoop.hbase.client.TestTimestamp
    Tests run: 1, Failures: 0, Errors: 0, Skipped: 0, Time elapsed: 24.62 sec
    Running org.apache.hadoop.hbase.TestScanMultipleVersions
    Tests run: 1, Failures: 0, Errors: 0, Skipped: 0, Time elapsed: 21.697 sec
    Running org.apache.hadoop.hbase.rest.model.TestStorageClusterVersionModel
    Tests run: 2, Failures: 0, Errors: 0, Skipped: 0, Time elapsed: 0.03 sec
    Running org.apache.hadoop.hbase.client.TestHCM
    Tests run: 2, Failures: 0, Errors: 0, Skipped: 0, Time elapsed: 37.79 sec

    Results :

    Failed tests:

    Tests in error:

    Tests run: 649, Failures: 1, Errors: 34, Skipped: 9

    [INFO] ------------------------------------------------------------------------
    [ERROR] BUILD FAILURE
    [INFO] ------------------------------------------------------------------------
    [INFO] There are test failures.

    Please refer to <https://hudson.apache.org/hudson/job/HBase-TRUNK/ws/trunk/target/surefire-reports> for the individual test results.
    [INFO] ------------------------------------------------------------------------
    [INFO] For more information, run Maven with the -e switch
    [INFO] ------------------------------------------------------------------------
    [INFO] Total time: 95 minutes 53 seconds
    [INFO] Finished at: Thu Feb 24 05:03:54 UTC 2011
    [INFO] Final Memory: 90M/924M
    [INFO] ------------------------------------------------------------------------
    [locks-and-latches] Releasing all the locks
    [locks-and-latches] All the locks released
    Archiving artifacts
    Recording test results
  • Apache Hudson Server at Feb 24, 2011 at 4:05 pm

Related Discussions

Discussion Navigation
viewthread | post
Discussion Overview
groupdev @
categorieshbase, hadoop
postedFeb 24, '11 at 5:26a
activeFeb 24, '11 at 4:05p
posts3
users2
websitehbase.apache.org

2 users in discussion

Apache Hudson Server: 2 posts Stack: 1 post

People

Translate

site design / logo © 2022 Grokbase