FAQ
See https://builds.apache.org/job/Hadoop-Common-trunk-Commit/682/

###################################################################################
########################## LAST 60 LINES OF THE CONSOLE ###########################
[...truncated 26233 lines...]

jar:
[tar] Nothing to do: /grid/0/hudson/hudson-slave/workspace/Hadoop-Common-trunk-Commit/trunk/build-fi/classes/bin.tgz is up to date.
[jar] Building jar: /grid/0/hudson/hudson-slave/workspace/Hadoop-Common-trunk-Commit/trunk/build-fi/hadoop-common-0.23.0-SNAPSHOT.jar
[jar] Building jar: /grid/0/hudson/hudson-slave/workspace/Hadoop-Common-trunk-Commit/trunk/build-fi/hadoop-common-0.23.0-SNAPSHOT-sources.jar

ivy-resolve-test:

ivy-retrieve-test:

generate-test-records:

generate-avro-records:
Trying to override old definition of task schema

generate-avro-protocols:
Trying to override old definition of task schema

compile-core-test:
[javac] Compiling 9 source files to /grid/0/hudson/hudson-slave/workspace/Hadoop-Common-trunk-Commit/trunk/build-fi/test/core/classes
[clover] Clover Version 3.0.2, built on April 13 2010 (build-790)
[clover] Loaded from: /homes/hudson/tools/clover/latest/lib/clover.jar
[clover] Clover: Open Source License registered to Apache.
[clover] Updating existing database at '/grid/0/hudson/hudson-slave/workspace/Hadoop-Common-trunk-Commit/trunk/build-fi/test/clover/db/hadoop_coverage.db'.
[clover] Processing files at 1.6 source level.
[clover] Clover all over. Instrumented 0 files (0 packages).
[clover] Elapsed time = 0 secs.
[javac] Note: Some input files use or override a deprecated API.
[javac] Note: Recompile with -Xlint:deprecation for details.
[javac] Note: Some input files use unchecked or unsafe operations.
[javac] Note: Recompile with -Xlint:unchecked for details.
Trying to override old definition of task paranamer
[paranamer] Generating parameter names from /grid/0/hudson/hudson-slave/workspace/Hadoop-Common-trunk-Commit/trunk/src/test/core to /grid/0/hudson/hudson-slave/workspace/Hadoop-Common-trunk-Commit/trunk/build-fi/test/core/classes
[delete] Deleting directory /grid/0/hudson/hudson-slave/workspace/Hadoop-Common-trunk-Commit/trunk/build-fi/test/cache
[mkdir] Created dir: /grid/0/hudson/hudson-slave/workspace/Hadoop-Common-trunk-Commit/trunk/build-fi/test/cache
[copy] Copying 1 file to /grid/0/hudson/hudson-slave/workspace/Hadoop-Common-trunk-Commit/trunk/build-fi/test/cache

run-test-core:
[mkdir] Created dir: /grid/0/hudson/hudson-slave/workspace/Hadoop-Common-trunk-Commit/trunk/build-fi/test/data
[copy] Copying 3 files to /grid/0/hudson/hudson-slave/workspace/Hadoop-Common-trunk-Commit/trunk/build-fi/test/webapps
[mkdir] Created dir: /grid/0/hudson/hudson-slave/workspace/Hadoop-Common-trunk-Commit/trunk/build-fi/test/logs
[copy] Copying 1 file to /grid/0/hudson/hudson-slave/workspace/Hadoop-Common-trunk-Commit/trunk/build-fi/test/extraconf
[copy] Copying 1 file to /grid/0/hudson/hudson-slave/workspace/Hadoop-Common-trunk-Commit/trunk/build-fi/test/extraconf

checkfailure:

BUILD FAILED
/grid/0/hudson/hudson-slave/workspace/Hadoop-Common-trunk-Commit/trunk/build.xml:859: Tests failed!

Total time: 9 minutes 22 seconds
[FINDBUGS] Skipping publisher since build result is FAILURE
Archiving artifacts
Publishing Clover coverage report...
No Clover report will be published due to a Build Failure
Recording test results
Publishing Javadoc
Recording fingerprints
Email was triggered for: Failure
Sending email for trigger: Failure



###################################################################################
############################## FAILED TESTS (if any) ##############################
6 tests failed.
REGRESSION: org.apache.hadoop.io.file.tfile.TestTFileByteArrays.testOneBlockPlusOneEntry

Error Message:
expected:<1> but was:<0>

Stack Trace:
junit.framework.AssertionFailedError: expected:<1> but was:(TestTFileByteArrays.java:665)
at org.apache.hadoop.io.file.tfile.TestTFileByteArrays.__CLR3_0_2qcmd5m1bcm(TestTFileByteArrays.java:157)
at org.apache.hadoop.io.file.tfile.TestTFileByteArrays.testOneBlockPlusOneEntry(TestTFileByteArrays.java:151)


REGRESSION: org.apache.hadoop.io.file.tfile.TestTFileByteArrays.testTwoBlocks

Error Message:
expected:<1> but was:<0>

Stack Trace:
junit.framework.AssertionFailedError: expected:<1> but was:(TestTFileByteArrays.java:665)
at org.apache.hadoop.io.file.tfile.TestTFileByteArrays.__CLR3_0_2sehq6f1bcv(TestTFileByteArrays.java:165)
at org.apache.hadoop.io.file.tfile.TestTFileByteArrays.testTwoBlocks(TestTFileByteArrays.java:160)


REGRESSION: org.apache.hadoop.io.file.tfile.TestTFileByteArrays.testThreeBlocks

Error Message:
expected:<2> but was:<1>

Stack Trace:
junit.framework.AssertionFailedError: expected:<2> but was:(TestTFileByteArrays.java:665)
at org.apache.hadoop.io.file.tfile.TestTFileByteArrays.__CLR3_0_29rsp471bd3(TestTFileByteArrays.java:174)
at org.apache.hadoop.io.file.tfile.TestTFileByteArrays.testThreeBlocks(TestTFileByteArrays.java:168)


REGRESSION: org.apache.hadoop.io.file.tfile.TestTFileJClassComparatorByteArrays.testOneBlockPlusOneEntry

Error Message:
expected:<1> but was:<0>

Stack Trace:
junit.framework.AssertionFailedError: expected:<1> but was:(TestTFileByteArrays.java:665)
at org.apache.hadoop.io.file.tfile.TestTFileByteArrays.__CLR3_0_2qcmd5m1bcm(TestTFileByteArrays.java:157)
at org.apache.hadoop.io.file.tfile.TestTFileByteArrays.testOneBlockPlusOneEntry(TestTFileByteArrays.java:151)


REGRESSION: org.apache.hadoop.io.file.tfile.TestTFileJClassComparatorByteArrays.testTwoBlocks

Error Message:
expected:<1> but was:<0>

Stack Trace:
junit.framework.AssertionFailedError: expected:<1> but was:(TestTFileByteArrays.java:665)
at org.apache.hadoop.io.file.tfile.TestTFileByteArrays.__CLR3_0_2sehq6f1bcv(TestTFileByteArrays.java:165)
at org.apache.hadoop.io.file.tfile.TestTFileByteArrays.testTwoBlocks(TestTFileByteArrays.java:160)


REGRESSION: org.apache.hadoop.io.file.tfile.TestTFileJClassComparatorByteArrays.testThreeBlocks

Error Message:
expected:<2> but was:<1>

Stack Trace:
junit.framework.AssertionFailedError: expected:<2> but was:(TestTFileByteArrays.java:665)
at org.apache.hadoop.io.file.tfile.TestTFileByteArrays.__CLR3_0_29rsp471bd3(TestTFileByteArrays.java:174)
at org.apache.hadoop.io.file.tfile.TestTFileByteArrays.testThreeBlocks(TestTFileByteArrays.java:168)

Search Discussions

  • Apache Jenkins Server at Jul 8, 2011 at 9:19 pm
    See https://builds.apache.org/job/Hadoop-Common-trunk-Commit/683/

    ###################################################################################
    ########################## LAST 60 LINES OF THE CONSOLE ###########################
    [...truncated 26046 lines...]

    jar:
    [tar] Nothing to do: /grid/0/hudson/hudson-slave/workspace/Hadoop-Common-trunk-Commit/trunk/build-fi/classes/bin.tgz is up to date.
    [jar] Building jar: /grid/0/hudson/hudson-slave/workspace/Hadoop-Common-trunk-Commit/trunk/build-fi/hadoop-common-0.23.0-SNAPSHOT.jar
    [jar] Building jar: /grid/0/hudson/hudson-slave/workspace/Hadoop-Common-trunk-Commit/trunk/build-fi/hadoop-common-0.23.0-SNAPSHOT-sources.jar

    ivy-resolve-test:

    ivy-retrieve-test:

    generate-test-records:

    generate-avro-records:
    Trying to override old definition of task schema

    generate-avro-protocols:
    Trying to override old definition of task schema

    compile-core-test:
    [javac] Compiling 9 source files to /grid/0/hudson/hudson-slave/workspace/Hadoop-Common-trunk-Commit/trunk/build-fi/test/core/classes
    [clover] Clover Version 3.0.2, built on April 13 2010 (build-790)
    [clover] Loaded from: /homes/hudson/tools/clover/latest/lib/clover.jar
    [clover] Clover: Open Source License registered to Apache.
    [clover] Updating existing database at '/grid/0/hudson/hudson-slave/workspace/Hadoop-Common-trunk-Commit/trunk/build-fi/test/clover/db/hadoop_coverage.db'.
    [clover] Processing files at 1.6 source level.
    [clover] Clover all over. Instrumented 0 files (0 packages).
    [clover] Elapsed time = 0 secs.
    [javac] Note: Some input files use or override a deprecated API.
    [javac] Note: Recompile with -Xlint:deprecation for details.
    [javac] Note: Some input files use unchecked or unsafe operations.
    [javac] Note: Recompile with -Xlint:unchecked for details.
    Trying to override old definition of task paranamer
    [paranamer] Generating parameter names from /grid/0/hudson/hudson-slave/workspace/Hadoop-Common-trunk-Commit/trunk/src/test/core to /grid/0/hudson/hudson-slave/workspace/Hadoop-Common-trunk-Commit/trunk/build-fi/test/core/classes
    [delete] Deleting directory /grid/0/hudson/hudson-slave/workspace/Hadoop-Common-trunk-Commit/trunk/build-fi/test/cache
    [mkdir] Created dir: /grid/0/hudson/hudson-slave/workspace/Hadoop-Common-trunk-Commit/trunk/build-fi/test/cache
    [copy] Copying 1 file to /grid/0/hudson/hudson-slave/workspace/Hadoop-Common-trunk-Commit/trunk/build-fi/test/cache

    run-test-core:
    [mkdir] Created dir: /grid/0/hudson/hudson-slave/workspace/Hadoop-Common-trunk-Commit/trunk/build-fi/test/data
    [copy] Copying 3 files to /grid/0/hudson/hudson-slave/workspace/Hadoop-Common-trunk-Commit/trunk/build-fi/test/webapps
    [mkdir] Created dir: /grid/0/hudson/hudson-slave/workspace/Hadoop-Common-trunk-Commit/trunk/build-fi/test/logs
    [copy] Copying 1 file to /grid/0/hudson/hudson-slave/workspace/Hadoop-Common-trunk-Commit/trunk/build-fi/test/extraconf
    [copy] Copying 1 file to /grid/0/hudson/hudson-slave/workspace/Hadoop-Common-trunk-Commit/trunk/build-fi/test/extraconf

    checkfailure:

    BUILD FAILED
    /grid/0/hudson/hudson-slave/workspace/Hadoop-Common-trunk-Commit/trunk/build.xml:859: Tests failed!

    Total time: 9 minutes 27 seconds
    [FINDBUGS] Skipping publisher since build result is FAILURE
    Archiving artifacts
    Publishing Clover coverage report...
    No Clover report will be published due to a Build Failure
    Recording test results
    Publishing Javadoc
    Recording fingerprints
    Email was triggered for: Failure
    Sending email for trigger: Failure



    ###################################################################################
    ############################## FAILED TESTS (if any) ##############################
    6 tests failed.
    FAILED: org.apache.hadoop.io.file.tfile.TestTFileByteArrays.testOneBlockPlusOneEntry

    Error Message:
    expected:<1> but was:<0>

    Stack Trace:
    junit.framework.AssertionFailedError: expected:<1> but was:(TestTFileByteArrays.java:665)
    at org.apache.hadoop.io.file.tfile.TestTFileByteArrays.__CLR3_0_2qcmd5m1bcm(TestTFileByteArrays.java:157)
    at org.apache.hadoop.io.file.tfile.TestTFileByteArrays.testOneBlockPlusOneEntry(TestTFileByteArrays.java:151)


    FAILED: org.apache.hadoop.io.file.tfile.TestTFileByteArrays.testTwoBlocks

    Error Message:
    expected:<1> but was:<0>

    Stack Trace:
    junit.framework.AssertionFailedError: expected:<1> but was:(TestTFileByteArrays.java:665)
    at org.apache.hadoop.io.file.tfile.TestTFileByteArrays.__CLR3_0_2sehq6f1bcv(TestTFileByteArrays.java:165)
    at org.apache.hadoop.io.file.tfile.TestTFileByteArrays.testTwoBlocks(TestTFileByteArrays.java:160)


    FAILED: org.apache.hadoop.io.file.tfile.TestTFileByteArrays.testThreeBlocks

    Error Message:
    expected:<2> but was:<1>

    Stack Trace:
    junit.framework.AssertionFailedError: expected:<2> but was:(TestTFileByteArrays.java:665)
    at org.apache.hadoop.io.file.tfile.TestTFileByteArrays.__CLR3_0_29rsp471bd3(TestTFileByteArrays.java:174)
    at org.apache.hadoop.io.file.tfile.TestTFileByteArrays.testThreeBlocks(TestTFileByteArrays.java:168)


    FAILED: org.apache.hadoop.io.file.tfile.TestTFileJClassComparatorByteArrays.testOneBlockPlusOneEntry

    Error Message:
    expected:<1> but was:<0>

    Stack Trace:
    junit.framework.AssertionFailedError: expected:<1> but was:(TestTFileByteArrays.java:665)
    at org.apache.hadoop.io.file.tfile.TestTFileByteArrays.__CLR3_0_2qcmd5m1bcm(TestTFileByteArrays.java:157)
    at org.apache.hadoop.io.file.tfile.TestTFileByteArrays.testOneBlockPlusOneEntry(TestTFileByteArrays.java:151)


    FAILED: org.apache.hadoop.io.file.tfile.TestTFileJClassComparatorByteArrays.testTwoBlocks

    Error Message:
    expected:<1> but was:<0>

    Stack Trace:
    junit.framework.AssertionFailedError: expected:<1> but was:(TestTFileByteArrays.java:665)
    at org.apache.hadoop.io.file.tfile.TestTFileByteArrays.__CLR3_0_2sehq6f1bcv(TestTFileByteArrays.java:165)
    at org.apache.hadoop.io.file.tfile.TestTFileByteArrays.testTwoBlocks(TestTFileByteArrays.java:160)


    FAILED: org.apache.hadoop.io.file.tfile.TestTFileJClassComparatorByteArrays.testThreeBlocks

    Error Message:
    expected:<2> but was:<1>

    Stack Trace:
    junit.framework.AssertionFailedError: expected:<2> but was:(TestTFileByteArrays.java:665)
    at org.apache.hadoop.io.file.tfile.TestTFileByteArrays.__CLR3_0_29rsp471bd3(TestTFileByteArrays.java:174)
    at org.apache.hadoop.io.file.tfile.TestTFileByteArrays.testThreeBlocks(TestTFileByteArrays.java:168)
  • Apache Jenkins Server at Jul 10, 2011 at 1:45 pm
    See https://builds.apache.org/job/Hadoop-Common-trunk-Commit/684/

    ###################################################################################
    ########################## LAST 60 LINES OF THE CONSOLE ###########################
    [...truncated 26059 lines...]
    jar:
    [tar] Nothing to do: /grid/0/hudson/hudson-slave/workspace/Hadoop-Common-trunk-Commit/trunk/build-fi/classes/bin.tgz is up to date.
    [jar] Building jar: /grid/0/hudson/hudson-slave/workspace/Hadoop-Common-trunk-Commit/trunk/build-fi/hadoop-common-0.23.0-SNAPSHOT.jar
    [jar] Building jar: /grid/0/hudson/hudson-slave/workspace/Hadoop-Common-trunk-Commit/trunk/build-fi/hadoop-common-0.23.0-SNAPSHOT-sources.jar

    ivy-resolve-test:

    ivy-retrieve-test:

    generate-test-records:

    generate-avro-records:
    Trying to override old definition of task schema

    generate-avro-protocols:
    Trying to override old definition of task schema

    compile-core-test:
    [javac] Compiling 9 source files to /grid/0/hudson/hudson-slave/workspace/Hadoop-Common-trunk-Commit/trunk/build-fi/test/core/classes
    [clover] Clover Version 3.0.2, built on April 13 2010 (build-790)
    [clover] Loaded from: /homes/hudson/tools/clover/latest/lib/clover.jar
    [clover] Clover: Open Source License registered to Apache.
    [clover] Updating existing database at '/grid/0/hudson/hudson-slave/workspace/Hadoop-Common-trunk-Commit/trunk/build-fi/test/clover/db/hadoop_coverage.db'.
    [clover] Processing files at 1.6 source level.
    [clover] Clover all over. Instrumented 0 files (0 packages).
    [clover] Elapsed time = 0 secs.
    [javac] Note: Some input files use or override a deprecated API.
    [javac] Note: Recompile with -Xlint:deprecation for details.
    [javac] Note: Some input files use unchecked or unsafe operations.
    [javac] Note: Recompile with -Xlint:unchecked for details.
    Trying to override old definition of task paranamer
    [paranamer] Generating parameter names from /grid/0/hudson/hudson-slave/workspace/Hadoop-Common-trunk-Commit/trunk/src/test/core to /grid/0/hudson/hudson-slave/workspace/Hadoop-Common-trunk-Commit/trunk/build-fi/test/core/classes
    [delete] Deleting directory /grid/0/hudson/hudson-slave/workspace/Hadoop-Common-trunk-Commit/trunk/build-fi/test/cache
    [mkdir] Created dir: /grid/0/hudson/hudson-slave/workspace/Hadoop-Common-trunk-Commit/trunk/build-fi/test/cache
    [copy] Copying 1 file to /grid/0/hudson/hudson-slave/workspace/Hadoop-Common-trunk-Commit/trunk/build-fi/test/cache

    run-test-core:
    [mkdir] Created dir: /grid/0/hudson/hudson-slave/workspace/Hadoop-Common-trunk-Commit/trunk/build-fi/test/data
    [copy] Copying 3 files to /grid/0/hudson/hudson-slave/workspace/Hadoop-Common-trunk-Commit/trunk/build-fi/test/webapps
    [mkdir] Created dir: /grid/0/hudson/hudson-slave/workspace/Hadoop-Common-trunk-Commit/trunk/build-fi/test/logs
    [copy] Copying 1 file to /grid/0/hudson/hudson-slave/workspace/Hadoop-Common-trunk-Commit/trunk/build-fi/test/extraconf
    [copy] Copying 1 file to /grid/0/hudson/hudson-slave/workspace/Hadoop-Common-trunk-Commit/trunk/build-fi/test/extraconf

    checkfailure:

    BUILD FAILED
    /grid/0/hudson/hudson-slave/workspace/Hadoop-Common-trunk-Commit/trunk/build.xml:859: Tests failed!

    Total time: 9 minutes 23 seconds
    [FINDBUGS] Skipping publisher since build result is FAILURE
    Archiving artifacts
    Publishing Clover coverage report...
    No Clover report will be published due to a Build Failure
    Recording test results
    Publishing Javadoc
    Recording fingerprints
    Updating HADOOP-7361
    Email was triggered for: Failure
    Sending email for trigger: Failure



    ###################################################################################
    ############################## FAILED TESTS (if any) ##############################
    6 tests failed.
    FAILED: org.apache.hadoop.io.file.tfile.TestTFileByteArrays.testOneBlockPlusOneEntry

    Error Message:
    expected:<1> but was:<0>

    Stack Trace:
    junit.framework.AssertionFailedError: expected:<1> but was:(TestTFileByteArrays.java:665)
    at org.apache.hadoop.io.file.tfile.TestTFileByteArrays.__CLR3_0_2qcmd5m1bco(TestTFileByteArrays.java:157)
    at org.apache.hadoop.io.file.tfile.TestTFileByteArrays.testOneBlockPlusOneEntry(TestTFileByteArrays.java:151)


    FAILED: org.apache.hadoop.io.file.tfile.TestTFileByteArrays.testTwoBlocks

    Error Message:
    expected:<1> but was:<0>

    Stack Trace:
    junit.framework.AssertionFailedError: expected:<1> but was:(TestTFileByteArrays.java:665)
    at org.apache.hadoop.io.file.tfile.TestTFileByteArrays.__CLR3_0_2sehq6f1bcx(TestTFileByteArrays.java:165)
    at org.apache.hadoop.io.file.tfile.TestTFileByteArrays.testTwoBlocks(TestTFileByteArrays.java:160)


    FAILED: org.apache.hadoop.io.file.tfile.TestTFileByteArrays.testThreeBlocks

    Error Message:
    expected:<2> but was:<1>

    Stack Trace:
    junit.framework.AssertionFailedError: expected:<2> but was:(TestTFileByteArrays.java:665)
    at org.apache.hadoop.io.file.tfile.TestTFileByteArrays.__CLR3_0_29rsp471bd5(TestTFileByteArrays.java:174)
    at org.apache.hadoop.io.file.tfile.TestTFileByteArrays.testThreeBlocks(TestTFileByteArrays.java:168)


    FAILED: org.apache.hadoop.io.file.tfile.TestTFileJClassComparatorByteArrays.testOneBlockPlusOneEntry

    Error Message:
    expected:<1> but was:<0>

    Stack Trace:
    junit.framework.AssertionFailedError: expected:<1> but was:(TestTFileByteArrays.java:665)
    at org.apache.hadoop.io.file.tfile.TestTFileByteArrays.__CLR3_0_2qcmd5m1bco(TestTFileByteArrays.java:157)
    at org.apache.hadoop.io.file.tfile.TestTFileByteArrays.testOneBlockPlusOneEntry(TestTFileByteArrays.java:151)


    FAILED: org.apache.hadoop.io.file.tfile.TestTFileJClassComparatorByteArrays.testTwoBlocks

    Error Message:
    expected:<1> but was:<0>

    Stack Trace:
    junit.framework.AssertionFailedError: expected:<1> but was:(TestTFileByteArrays.java:665)
    at org.apache.hadoop.io.file.tfile.TestTFileByteArrays.__CLR3_0_2sehq6f1bcx(TestTFileByteArrays.java:165)
    at org.apache.hadoop.io.file.tfile.TestTFileByteArrays.testTwoBlocks(TestTFileByteArrays.java:160)


    FAILED: org.apache.hadoop.io.file.tfile.TestTFileJClassComparatorByteArrays.testThreeBlocks

    Error Message:
    expected:<2> but was:<1>

    Stack Trace:
    junit.framework.AssertionFailedError: expected:<2> but was:(TestTFileByteArrays.java:665)
    at org.apache.hadoop.io.file.tfile.TestTFileByteArrays.__CLR3_0_29rsp471bd5(TestTFileByteArrays.java:174)
    at org.apache.hadoop.io.file.tfile.TestTFileByteArrays.testThreeBlocks(TestTFileByteArrays.java:168)

Related Discussions

Discussion Navigation
viewthread | post
Discussion Overview
groupcommon-dev @
categorieshadoop
postedJul 8, '11 at 9:05p
activeJul 10, '11 at 1:45p
posts3
users1
websitehadoop.apache.org...
irc#hadoop

1 user in discussion

Apache Jenkins Server: 3 posts

People

Translate

site design / logo © 2022 Grokbase