FAQ
See https://builds.apache.org/hudson/job/Hadoop-Common-trunk-Commit/598/

###################################################################################
########################## LAST 60 LINES OF THE CONSOLE ###########################
[...truncated 2141 lines...]
[artifact:install-provider] for artifact:
[artifact:install-provider] unspecified:unspecified:jar:0.0
[artifact:install-provider]
[artifact:install-provider] from the specified remote repositories:
[artifact:install-provider] central (http://repo1.maven.org/maven2)
[artifact:install-provider]
[artifact:install-provider]

BUILD FAILED
/grid/0/hudson/hudson-slave/workspace/Hadoop-Common-trunk-Commit/trunk/build.xml:1353: Error downloading wagon provider from the remote repository: Missing:
----------
1) org.apache.maven.wagon:wagon-http:jar:1.0-beta-2

Try downloading the file manually from the project website.

Then, install it using the command:
mvn install:install-file -DgroupId=org.apache.maven.wagon -DartifactId=wagon-http -Dversion=1.0-beta-2 -Dpackaging=jar -Dfile=/path/to/file

Alternatively, if you host your own repository you can deploy the file there:
mvn deploy:deploy-file -DgroupId=org.apache.maven.wagon -DartifactId=wagon-http -Dversion=1.0-beta-2 -Dpackaging=jar -Dfile=/path/to/file -Durl=[url] -DrepositoryId=[id]

Path to dependency:
1) unspecified:unspecified:jar:0.0
2) org.apache.maven.wagon:wagon-http:jar:1.0-beta-2

----------
1 required artifact is missing.

for artifact:
unspecified:unspecified:jar:0.0

from the specified remote repositories:
central (http://repo1.maven.org/maven2)



Total time: 1 minute 4 seconds


======================================================================
======================================================================
STORE: saving artifacts
======================================================================
======================================================================


mv: cannot stat `build/*.tar.gz': No such file or directory
mv: cannot stat `build/test/findbugs': No such file or directory
mv: cannot stat `build/docs/api': No such file or directory
Build Failed
[FINDBUGS] Skipping publisher since build result is FAILURE
Recording fingerprints
Archiving artifacts
Recording test results
Publishing Javadoc
Publishing Clover coverage report...
No Clover report will be published due to a Build Failure
Email was triggered for: Failure
Sending email for trigger: Failure



###################################################################################
############################## FAILED TESTS (if any) ##############################
No tests ran.

Search Discussions

  • Apache Jenkins Server at May 14, 2011 at 4:42 am
    See https://builds.apache.org/hudson/job/Hadoop-Common-trunk-Commit/599/

    ###################################################################################
    ########################## LAST 60 LINES OF THE CONSOLE ###########################
    [...truncated 2141 lines...]
    [artifact:install-provider] for artifact:
    [artifact:install-provider] unspecified:unspecified:jar:0.0
    [artifact:install-provider]
    [artifact:install-provider] from the specified remote repositories:
    [artifact:install-provider] central (http://repo1.maven.org/maven2)
    [artifact:install-provider]
    [artifact:install-provider]

    BUILD FAILED
    /grid/0/hudson/hudson-slave/workspace/Hadoop-Common-trunk-Commit/trunk/build.xml:1353: Error downloading wagon provider from the remote repository: Missing:
    ----------
    1) org.apache.maven.wagon:wagon-http:jar:1.0-beta-2

    Try downloading the file manually from the project website.

    Then, install it using the command:
    mvn install:install-file -DgroupId=org.apache.maven.wagon -DartifactId=wagon-http -Dversion=1.0-beta-2 -Dpackaging=jar -Dfile=/path/to/file

    Alternatively, if you host your own repository you can deploy the file there:
    mvn deploy:deploy-file -DgroupId=org.apache.maven.wagon -DartifactId=wagon-http -Dversion=1.0-beta-2 -Dpackaging=jar -Dfile=/path/to/file -Durl=[url] -DrepositoryId=[id]

    Path to dependency:
    1) unspecified:unspecified:jar:0.0
    2) org.apache.maven.wagon:wagon-http:jar:1.0-beta-2

    ----------
    1 required artifact is missing.

    for artifact:
    unspecified:unspecified:jar:0.0

    from the specified remote repositories:
    central (http://repo1.maven.org/maven2)



    Total time: 1 minute 5 seconds


    ======================================================================
    ======================================================================
    STORE: saving artifacts
    ======================================================================
    ======================================================================


    mv: cannot stat `build/*.tar.gz': No such file or directory
    mv: cannot stat `build/test/findbugs': No such file or directory
    mv: cannot stat `build/docs/api': No such file or directory
    Build Failed
    [FINDBUGS] Skipping publisher since build result is FAILURE
    Recording fingerprints
    Archiving artifacts
    Recording test results
    Publishing Javadoc
    Publishing Clover coverage report...
    No Clover report will be published due to a Build Failure
    Email was triggered for: Failure
    Sending email for trigger: Failure



    ###################################################################################
    ############################## FAILED TESTS (if any) ##############################
    No tests ran.
  • Apache Jenkins Server at May 16, 2011 at 6:02 pm
    See https://builds.apache.org/hudson/job/Hadoop-Common-trunk-Commit/600/

    ###################################################################################
    ########################## LAST 60 LINES OF THE CONSOLE ###########################
    [...truncated 2141 lines...]
    [artifact:install-provider] for artifact:
    [artifact:install-provider] unspecified:unspecified:jar:0.0
    [artifact:install-provider]
    [artifact:install-provider] from the specified remote repositories:
    [artifact:install-provider] central (http://repo1.maven.org/maven2)
    [artifact:install-provider]
    [artifact:install-provider]

    BUILD FAILED
    /grid/0/hudson/hudson-slave/workspace/Hadoop-Common-trunk-Commit/trunk/build.xml:1353: Error downloading wagon provider from the remote repository: Missing:
    ----------
    1) org.apache.maven.wagon:wagon-http:jar:1.0-beta-2

    Try downloading the file manually from the project website.

    Then, install it using the command:
    mvn install:install-file -DgroupId=org.apache.maven.wagon -DartifactId=wagon-http -Dversion=1.0-beta-2 -Dpackaging=jar -Dfile=/path/to/file

    Alternatively, if you host your own repository you can deploy the file there:
    mvn deploy:deploy-file -DgroupId=org.apache.maven.wagon -DartifactId=wagon-http -Dversion=1.0-beta-2 -Dpackaging=jar -Dfile=/path/to/file -Durl=[url] -DrepositoryId=[id]

    Path to dependency:
    1) unspecified:unspecified:jar:0.0
    2) org.apache.maven.wagon:wagon-http:jar:1.0-beta-2

    ----------
    1 required artifact is missing.

    for artifact:
    unspecified:unspecified:jar:0.0

    from the specified remote repositories:
    central (http://repo1.maven.org/maven2)



    Total time: 1 minute 5 seconds


    ======================================================================
    ======================================================================
    STORE: saving artifacts
    ======================================================================
    ======================================================================


    mv: cannot stat `build/*.tar.gz': No such file or directory
    mv: cannot stat `build/test/findbugs': No such file or directory
    mv: cannot stat `build/docs/api': No such file or directory
    Build Failed
    [FINDBUGS] Skipping publisher since build result is FAILURE
    Recording fingerprints
    Archiving artifacts
    Recording test results
    Publishing Javadoc
    Publishing Clover coverage report...
    No Clover report will be published due to a Build Failure
    Email was triggered for: Failure
    Sending email for trigger: Failure



    ###################################################################################
    ############################## FAILED TESTS (if any) ##############################
    No tests ran.

Related Discussions

Discussion Navigation
viewthread | post
Discussion Overview
groupcommon-dev @
categorieshadoop
postedMay 14, '11 at 1:32a
activeMay 16, '11 at 6:02p
posts3
users1
websitehadoop.apache.org...
irc#hadoop

1 user in discussion

Apache Jenkins Server: 3 posts

People

Translate

site design / logo © 2022 Grokbase