FAQ
See http://hudson.zones.apache.org/hudson/job/Hadoop-Patch-vesta.apache.org/461/

------------------------------------------
[...truncated 424492 lines...]
[exec] [junit] 09/06/04 13:36:49 INFO mapred.TaskTracker: attempt_200906041326_0004_m_000000_0 0.0% map > map
[exec] [junit] 09/06/04 13:36:49 INFO mapred.TaskTracker: attempt_200906041326_0005_r_000002_0 0.0% reduce > copy >
[exec] [junit] 09/06/04 13:36:49 INFO mapred.TaskTracker: attempt_200906041326_0005_m_000002_0 0.0% map > map
[exec] [junit] 09/06/04 13:36:50 INFO mapred.TaskTracker: attempt_200906041326_0004_m_000001_0 0.0% map > map
[exec] [junit] 09/06/04 13:36:50 INFO mapred.TaskTracker: attempt_200906041326_0004_m_000002_0 0.0% map > map
[exec] [junit] 09/06/04 13:36:50 INFO mapred.TaskTracker: attempt_200906041326_0005_r_000003_0 0.0% reduce > copy >
[exec] [junit] 09/06/04 13:36:50 INFO mapred.TaskTracker: attempt_200906041326_0005_m_000003_0 0.0% map > map
[exec] [junit] 09/06/04 13:36:50 INFO mapred.TaskTracker: attempt_200906041326_0004_r_000000_0 0.0% reduce > copy >
[exec] [junit] 09/06/04 13:36:50 INFO mapred.TaskTracker: attempt_200906041326_0003_m_000000_0 0.0% map > map
[exec] [junit] 09/06/04 13:36:51 INFO mapred.TaskTracker: attempt_200906041326_0005_m_000000_0 0.0% map > map
[exec] [junit] 09/06/04 13:36:51 INFO mapred.TaskTracker: attempt_200906041326_0004_r_000001_0 0.0% reduce > copy >
[exec] [junit] 09/06/04 13:36:51 INFO mapred.TaskTracker: attempt_200906041326_0003_m_000001_0 0.0% map > map
[exec] [junit] 09/06/04 13:36:51 INFO mapred.TaskTracker: attempt_200906041326_0005_m_000001_0 0.0% map > map
[exec] [junit] 09/06/04 13:36:52 INFO mapred.TaskTracker: attempt_200906041326_0003_r_000000_0 0.0% reduce > copy >
[exec] [junit] 09/06/04 13:36:52 INFO mapred.TaskTracker: attempt_200906041326_0004_m_000000_0 0.0% map > map
[exec] [junit] 09/06/04 13:36:52 INFO mapred.TaskTracker: attempt_200906041326_0005_m_000002_0 0.0% map > map
[exec] [junit] 09/06/04 13:36:53 INFO mapred.TaskTracker: attempt_200906041326_0003_r_000001_0 0.0% reduce > copy >
[exec] [junit] 09/06/04 13:36:53 INFO mapred.TaskTracker: attempt_200906041326_0005_r_000000_0 0.0% reduce > copy >
[exec] [junit] 09/06/04 13:36:53 INFO mapred.TaskTracker: attempt_200906041326_0004_m_000001_0 0.0% map > map
[exec] [junit] 09/06/04 13:36:53 INFO mapred.TaskTracker: attempt_200906041326_0004_m_000002_0 0.0% map > map
[exec] [junit] 09/06/04 13:36:53 INFO mapred.TaskTracker: attempt_200906041326_0005_m_000003_0 0.0% map > map
[exec] [junit] 09/06/04 13:36:53 INFO mapred.TaskTracker: attempt_200906041326_0004_r_000000_0 0.0% reduce > copy >
[exec] [junit] 09/06/04 13:36:53 INFO mapred.TaskTracker: attempt_200906041326_0003_m_000000_0 0.0% map > map
[exec] [junit] 09/06/04 13:36:54 INFO mapred.TaskTracker: attempt_200906041326_0004_r_000002_0 0.0% reduce > copy >
[exec] [junit] 09/06/04 13:36:54 INFO mapred.TaskTracker: attempt_200906041326_0005_m_000000_0 0.0% map > map
[exec] [junit] 09/06/04 13:36:54 INFO mapred.TaskTracker: attempt_200906041326_0005_r_000001_0 0.0% reduce > copy >
[exec] [junit] 09/06/04 13:36:54 INFO mapred.TaskTracker: attempt_200906041326_0004_r_000001_0 0.0% reduce > copy >
[exec] [junit] 09/06/04 13:36:54 INFO mapred.TaskTracker: attempt_200906041326_0003_m_000001_0 0.0% map > map
[exec] [junit] 09/06/04 13:36:54 INFO mapred.TaskTracker: attempt_200906041326_0005_m_000001_0 0.0% map > map
[exec] [junit] 09/06/04 13:36:55 INFO mapred.TaskTracker: attempt_200906041326_0003_r_000000_0 0.0% reduce > copy >
[exec] [junit] 09/06/04 13:36:55 INFO mapred.TaskTracker: attempt_200906041326_0004_m_000000_0 0.0% map > map
[exec] [junit] 09/06/04 13:36:55 INFO mapred.TaskTracker: attempt_200906041326_0005_r_000002_0 0.0% reduce > copy >
[exec] [junit] 09/06/04 13:36:55 INFO mapred.TaskTracker: attempt_200906041326_0005_m_000002_0 0.0% map > map
[exec] [junit] 09/06/04 13:36:56 INFO mapred.TaskTracker: attempt_200906041326_0003_r_000001_0 0.0% reduce > copy >
[exec] [junit] 09/06/04 13:36:56 INFO mapred.TaskTracker: attempt_200906041326_0005_r_000000_0 0.0% reduce > copy >
[exec] [junit] 09/06/04 13:36:56 INFO mapred.TaskTracker: attempt_200906041326_0004_m_000001_0 0.0% map > map
[exec] [junit] 09/06/04 13:36:56 INFO mapred.TaskTracker: attempt_200906041326_0004_m_000002_0 0.0% map > map
[exec] [junit] 09/06/04 13:36:56 INFO mapred.TaskTracker: attempt_200906041326_0005_r_000003_0 0.0% reduce > copy >
[exec] [junit] 09/06/04 13:36:56 INFO mapred.TaskTracker: attempt_200906041326_0005_m_000003_0 0.0% map > map
[exec] [junit] 09/06/04 13:36:56 INFO mapred.TaskTracker: attempt_200906041326_0003_m_000000_0 0.0% map > map
[exec] [junit] 09/06/04 13:36:57 INFO mapred.TaskTracker: attempt_200906041326_0004_r_000002_0 0.0% reduce > copy >
[exec] [junit] 09/06/04 13:36:57 INFO mapred.TaskTracker: attempt_200906041326_0005_m_000000_0 0.0% map > map
[exec] [junit] 09/06/04 13:36:57 INFO mapred.TaskTracker: attempt_200906041326_0005_r_000001_0 0.0% reduce > copy >
[exec] [junit] 09/06/04 13:36:57 INFO mapred.TaskTracker: attempt_200906041326_0003_m_000001_0 0.0% map > map
[exec] [junit] 09/06/04 13:36:57 INFO mapred.TaskTracker: attempt_200906041326_0005_m_000001_0 0.0% map > map
[exec] [junit] 09/06/04 13:36:58 INFO mapred.TaskTracker: attempt_200906041326_0004_m_000000_0 0.0% map > map
[exec] [junit] 09/06/04 13:36:58 INFO mapred.TaskTracker: attempt_200906041326_0005_r_000002_0 0.0% reduce > copy >
[exec] [junit] 09/06/04 13:36:58 INFO mapred.TaskTracker: attempt_200906041326_0005_m_000002_0 0.0% map > map
[exec] [junit] 09/06/04 13:36:59 INFO mapred.TaskTracker: attempt_200906041326_0004_m_000001_0 0.0% map > map
[exec] [junit] 09/06/04 13:36:59 INFO mapred.TaskTracker: attempt_200906041326_0004_m_000002_0 0.0% map > map
[exec] [junit] 09/06/04 13:36:59 INFO mapred.TaskTracker: attempt_200906041326_0005_r_000003_0 0.0% reduce > copy >
[exec] [junit] 09/06/04 13:36:59 INFO mapred.TaskTracker: attempt_200906041326_0005_m_000003_0 0.0% map > map
[exec] [junit] 09/06/04 13:36:59 INFO mapred.TaskTracker: attempt_200906041326_0004_r_000000_0 0.0% reduce > copy >
[exec] [junit] 09/06/04 13:36:59 INFO mapred.TaskTracker: attempt_200906041326_0003_m_000000_0 0.0% map > map
[exec] [junit] 09/06/04 13:37:00 INFO mapred.TaskTracker: attempt_200906041326_0005_m_000000_0 0.0% map > map
[exec] [junit] 09/06/04 13:37:00 INFO mapred.TaskTracker: attempt_200906041326_0004_r_000001_0 0.0% reduce > copy >
[exec] [junit] 09/06/04 13:37:00 INFO mapred.TaskTracker: attempt_200906041326_0003_m_000001_0 0.0% map > map
[exec] [junit] 09/06/04 13:37:00 INFO mapred.TaskTracker: attempt_200906041326_0005_m_000001_0 0.0% map > map
[exec] [junit] 09/06/04 13:37:01 INFO mapred.TaskTracker: attempt_200906041326_0003_r_000000_0 0.0% reduce > copy >
[exec] [junit] 09/06/04 13:37:01 INFO mapred.TaskTracker: attempt_200906041326_0004_m_000000_0 0.0% map > map
[exec] [junit] 09/06/04 13:37:01 INFO mapred.TaskTracker: attempt_200906041326_0005_m_000002_0 0.0% map > map
[exec] [junit] 09/06/04 13:37:02 INFO mapred.TaskTracker: attempt_200906041326_0003_r_000001_0 0.0% reduce > copy >
[exec] [junit] 09/06/04 13:37:02 INFO mapred.TaskTracker: attempt_200906041326_0005_r_000000_0 0.0% reduce > copy >
[exec] [junit] 09/06/04 13:37:02 INFO mapred.TaskTracker: attempt_200906041326_0004_m_000001_0 0.0% map > map
[exec] [junit] 09/06/04 13:37:02 INFO mapred.TaskTracker: attempt_200906041326_0004_m_000002_0 0.0% map > map
[exec] [junit] 09/06/04 13:37:02 INFO mapred.TaskTracker: attempt_200906041326_0005_m_000003_0 0.0% map > map
[exec] [junit] 09/06/04 13:37:02 INFO mapred.TaskTracker: attempt_200906041326_0003_m_000000_0 0.0% map > map
[exec] [junit] 09/06/04 13:37:03 INFO mapred.TaskTracker: attempt_200906041326_0004_r_000002_0 0.0% reduce > copy >
[exec] [junit] 09/06/04 13:37:03 INFO mapred.TaskTracker: attempt_200906041326_0005_m_000000_0 0.0% map > map
[exec] [junit] 09/06/04 13:37:03 INFO mapred.TaskTracker: attempt_200906041326_0005_r_000001_0 0.0% reduce > copy >
[exec] [junit] 09/06/04 13:37:03 INFO mapred.TaskTracker: attempt_200906041326_0003_m_000001_0 0.0% map > map
[exec] [junit] 09/06/04 13:37:03 INFO mapred.TaskTracker: attempt_200906041326_0005_m_000001_0 0.0% map > map
[exec] [junit] 09/06/04 13:37:04 INFO mapred.TaskTracker: attempt_200906041326_0004_m_000000_0 0.0% map > map
[exec] [junit] 09/06/04 13:37:04 INFO mapred.TaskTracker: attempt_200906041326_0005_r_000002_0 0.0% reduce > copy >
[exec] [junit] 09/06/04 13:37:04 INFO mapred.TaskTracker: attempt_200906041326_0005_m_000002_0 0.0% map > map
[exec] [junit] 09/06/04 13:37:05 INFO mapred.TaskTracker: attempt_200906041326_0004_m_000001_0 0.0% map > map
[exec] [junit] 09/06/04 13:37:05 INFO mapred.TaskTracker: attempt_200906041326_0004_m_000002_0 0.0% map > map
[exec] [junit] 09/06/04 13:37:05 INFO mapred.TaskTracker: attempt_200906041326_0005_r_000003_0 0.0% reduce > copy >
[exec] [junit] 09/06/04 13:37:05 INFO mapred.TaskTracker: attempt_200906041326_0005_m_000003_0 0.0% map > map
[exec] [junit] 09/06/04 13:37:05 INFO mapred.TaskTracker: attempt_200906041326_0004_r_000000_0 0.0% reduce > copy >
[exec] [junit] 09/06/04 13:37:05 INFO mapred.TaskTracker: attempt_200906041326_0003_m_000000_0 0.0% map > map
[exec] [junit] 09/06/04 13:37:06 INFO mapred.TaskTracker: attempt_200906041326_0005_m_000000_0 0.0% map > map
[exec] [junit] 09/06/04 13:37:06 INFO mapred.TaskTracker: attempt_200906041326_0004_r_000001_0 0.0% reduce > copy >
[exec] [junit] 09/06/04 13:37:06 INFO mapred.TaskTracker: attempt_200906041326_0003_m_000001_0 0.0% map > map
[exec] [junit] 09/06/04 13:37:06 INFO mapred.TaskTracker: attempt_200906041326_0005_m_000001_0 0.0% map > map
[exec] [junit] 09/06/04 13:37:07 INFO mapred.TaskTracker: attempt_200906041326_0003_r_000000_0 0.0% reduce > copy >
[exec] [junit] 09/06/04 13:37:07 INFO mapred.TaskTracker: attempt_200906041326_0004_m_000000_0 0.0% map > map
[exec] [junit] 09/06/04 13:37:07 INFO mapred.TaskTracker: attempt_200906041326_0005_m_000002_0 0.0% map > map
[exec] [junit] 09/06/04 13:37:08 INFO mapred.TaskTracker: attempt_200906041326_0003_r_000001_0 0.0% reduce > copy >
[exec] [junit] 09/06/04 13:37:08 INFO mapred.TaskTracker: attempt_200906041326_0005_r_000000_0 0.0% reduce > copy >
[exec] [junit] 09/06/04 13:37:08 INFO mapred.TaskTracker: attempt_200906041326_0004_m_000001_0 0.0% map > map
[exec] [junit] 09/06/04 13:37:08 INFO mapred.TaskTracker: attempt_200906041326_0004_m_000002_0 0.0% map > map
[exec] [junit] 09/06/04 13:37:08 INFO mapred.TaskTracker: attempt_200906041326_0005_m_000003_0 0.0% map > map
[exec] [junit] 09/06/04 13:37:08 INFO mapred.TaskTracker: attempt_200906041326_0004_r_000000_0 0.0% reduce > copy >
[exec] [junit] 09/06/04 13:37:08 INFO mapred.TaskTracker: attempt_200906041326_0003_m_000000_0 0.0% map > map
[exec] [junit] 09/06/04 13:37:09 INFO mapred.TaskTracker: attempt_200906041326_0004_r_000002_0 0.0% reduce > copy >
[exec] [junit] 09/06/04 13:37:09 INFO mapred.TaskTracker: attempt_200906041326_0005_m_000000_0 0.0% map > map
[exec] [junit] 09/06/04 13:37:09 INFO mapred.TaskTracker: attempt_200906041326_0005_r_000001_0 0.0% reduce > copy >
[exec] [junit] 09/06/04 13:37:09 INFO mapred.TaskTracker: attempt_200906041326_0004_r_000001_0 0.0% reduce > copy >
[exec] [junit] 09/06/04 13:37:09 INFO mapred.TaskTracker: attempt_200906041326_0003_m_000001_0 0.0% map > map
[exec] [junit] 09/06/04 13:37:09 INFO mapred.TaskTracker: attempt_200906041326_0005_m_000001_0 0.0% map > map
[exec] [junit] 09/06/04 13:37:10 INFO mapred.TaskTracker: attempt_200906041326_0003_r_000000_0 0.0% reduce > copy >
[exec] [junit] 09/06/04 13:37:10 INFO mapred.TaskTracker: attempt_200906041326_0004_m_000000_0 0.0% map > map
[exec] [junit] 09/06/04 13:37:10 INFO mapred.TaskTracker: attempt_200906041326_0005_r_000002_0 0.0% reduce > copy >
[exec] [junit] 09/06/04 13:37:10 INFO mapred.TaskTracker: attempt_200906041326_0005_m_000002_0 0.0% map > map
[exec] [junit] 09/06/04 13:37:11 INFO mapred.TaskTracker: attempt_200906041326_0003_r_000001_0 0.0% reduce > copy >
[exec] [junit] 09/06/04 13:37:11 INFO mapred.TaskTracker: attempt_200906041326_0005_r_000000_0 0.0% reduce > copy >
[exec] [junit] 09/06/04 13:37:11 INFO mapred.TaskTracker: attempt_200906041326_0004_m_000001_0 0.0% map > map
[exec] [junit] 09/06/04 13:37:11 INFO mapred.TaskTracker: attempt_200906041326_0004_m_000002_0 0.0% map > map
[exec] [junit] 09/06/04 13:37:11 INFO mapred.TaskTracker: attempt_200906041326_0005_r_000003_0 0.0% reduce > copy >
[exec] [junit] 09/06/04 13:37:11 INFO mapred.TaskTracker: attempt_200906041326_0005_m_000003_0 0.0% map > map
[exec] [junit] 09/06/04 13:37:11 INFO mapred.TaskTracker: attempt_200906041326_0003_m_000000_0 0.0% map > map
[exec] [junit] 09/06/04 13:37:12 INFO mapred.TaskTracker: attempt_200906041326_0004_r_000002_0 0.0% reduce > copy >
[exec] [junit] 09/06/04 13:37:12 INFO mapred.TaskTracker: attempt_200906041326_0005_m_000000_0 0.0% map > map
[exec] [junit] 09/06/04 13:37:12 INFO mapred.TaskTracker: attempt_200906041326_0005_r_000001_0 0.0% reduce > copy >
[exec] [junit] 09/06/04 13:37:12 INFO mapred.TaskTracker: attempt_200906041326_0003_m_000001_0 0.0% map > map
[exec] [junit] 09/06/04 13:37:12 INFO mapred.TaskTracker: attempt_200906041326_0005_m_000001_0 0.0% map > map
[exec] [junit] 09/06/04 13:37:13 INFO mapred.TaskTracker: attempt_200906041326_0004_m_000000_0 0.0% map > map
[exec] [junit] 09/06/04 13:37:13 INFO mapred.TaskTracker: attempt_200906041326_0005_r_000002_0 0.0% reduce > copy >
[exec] [junit] 09/06/04 13:37:13 INFO mapred.TaskTracker: attempt_200906041326_0005_m_000002_0 0.0% map > map
[exec] [junit] 09/06/04 13:37:14 INFO mapred.TaskTracker: attempt_200906041326_0004_m_000001_0 0.0% map > map
[exec] [junit] 09/06/04 13:37:14 INFO mapred.TaskTracker: attempt_200906041326_0004_m_000002_0 0.0% map > map
[exec] [junit] 09/06/04 13:37:14 INFO mapred.TaskTracker: attempt_200906041326_0005_r_000003_0 0.0% reduce > copy >
[exec] [junit] 09/06/04 13:37:14 INFO mapred.TaskTracker: attempt_200906041326_0005_m_000003_0 0.0% map > map
[exec] [junit] 09/06/04 13:37:14 INFO mapred.TaskTracker: attempt_200906041326_0004_r_000000_0 0.0% reduce > copy >
[exec] [junit] 09/06/04 13:37:14 INFO mapred.TaskTracker: attempt_200906041326_0003_m_000000_0 0.0% map > map
[exec] [junit] 09/06/04 13:37:15 INFO mapred.TaskTracker: attempt_200906041326_0005_m_000000_0 0.0% map > map
[exec] [junit] 09/06/04 13:37:15 INFO mapred.TaskTracker: attempt_200906041326_0004_r_000001_0 0.0% reduce > copy >
[exec] [junit] 09/06/04 13:37:15 INFO mapred.TaskTracker: attempt_200906041326_0003_m_000001_0 0.0% map > map
[exec] [junit] 09/06/04 13:37:15 INFO mapred.TaskTracker: attempt_200906041326_0005_m_000001_0 0.0% map > map
[exec] [junit] 09/06/04 13:37:16 INFO mapred.TaskTracker: attempt_200906041326_0003_r_000000_0 0.0% reduce > copy >
[exec] [junit] 09/06/04 13:37:16 INFO mapred.TaskTracker: attempt_200906041326_0004_m_000000_0 0.0% map > map
[exec] [junit] 09/06/04 13:37:16 INFO mapred.TaskTracker: attempt_200906041326_0005_m_000002_0 0.0% map > map
[exec] [junit] 09/06/04 13:37:17 INFO mapred.TaskTracker: attempt_200906041326_0003_r_000001_0 0.0% reduce > copy >
[exec] [junit] 09/06/04 13:37:17 INFO mapred.TaskTracker: attempt_200906041326_0005_r_000000_0 0.0% reduce > copy >
[exec] [junit] 09/06/04 13:37:17 INFO mapred.TaskTracker: attempt_200906041326_0004_m_000001_0 0.0% map > map
[exec] [junit] 09/06/04 13:37:17 INFO mapred.TaskTracker: attempt_200906041326_0004_m_000002_0 0.0% map > map
[exec] [junit] 09/06/04 13:37:17 INFO mapred.TaskTracker: attempt_200906041326_0005_m_000003_0 0.0% map > map
[exec] [junit] 09/06/04 13:37:17 INFO mapred.TaskTracker: attempt_200906041326_0003_m_000000_0 0.0% map > map
[exec] [junit] 09/06/04 13:37:18 INFO mapred.TaskTracker: attempt_200906041326_0004_r_000002_0 0.0% reduce > copy >
[exec] [junit] 09/06/04 13:37:18 INFO mapred.TaskTracker: attempt_200906041326_0005_m_000000_0 0.0% map > map
[exec] [junit] 09/06/04 13:37:18 INFO mapred.TaskTracker: attempt_200906041326_0005_r_000001_0 0.0% reduce > copy >
[exec] [junit] 09/06/04 13:37:18 INFO mapred.TaskTracker: attempt_200906041326_0003_m_000001_0 0.0% map > map
[exec] [junit] 09/06/04 13:37:18 INFO mapred.TaskTracker: attempt_200906041326_0005_m_000001_0 0.0% map > map
[exec] [junit] 09/06/04 13:37:19 INFO mapred.TaskTracker: attempt_200906041326_0004_m_000000_0 0.0% map > map
[exec] [junit] 09/06/04 13:37:19 INFO mapred.TaskTracker: attempt_200906041326_0005_r_000002_0 0.0% reduce > copy >
[exec] [junit] 09/06/04 13:37:19 INFO mapred.TaskTracker: attempt_200906041326_0005_m_000002_0 0.0% map > map
[exec] [junit] 09/06/04 13:37:20 INFO mapred.TaskTracker: attempt_200906041326_0004_m_000001_0 0.0% map > map
[exec] [junit] 09/06/04 13:37:20 INFO mapred.TaskTracker: attempt_200906041326_0004_m_000002_0 0.0% map > map
[exec] [junit] 09/06/04 13:37:20 INFO mapred.TaskTracker: attempt_200906041326_0005_r_000003_0 0.0% reduce > copy >
[exec] [junit] 09/06/04 13:37:20 INFO mapred.TaskTracker: attempt_200906041326_0005_m_000003_0 0.0% map > map
[exec] [junit] 09/06/04 13:37:20 INFO mapred.TaskTracker: attempt_200906041326_0004_r_000000_0 0.0% reduce > copy >
[exec] [junit] 09/06/04 13:37:20 INFO mapred.TaskTracker: attempt_200906041326_0003_m_000000_0 0.0% map > map
[exec] [junit] 09/06/04 13:37:21 INFO mapred.TaskTracker: attempt_200906041326_0005_m_000000_0 0.0% map > map
[exec] [junit] 09/06/04 13:37:21 INFO mapred.TaskTracker: attempt_200906041326_0004_r_000001_0 0.0% reduce > copy >
[exec] [junit] 09/06/04 13:37:21 INFO mapred.TaskTracker: attempt_200906041326_0003_m_000001_0 0.0% map > map
[exec] [junit] 09/06/04 13:37:21 INFO mapred.TaskTracker: attempt_200906041326_0005_m_000001_0 0.0% map > map
[exec] [junit] 09/06/04 13:37:22 INFO mapred.TaskTracker: attempt_200906041326_0003_r_000000_0 0.0% reduce > copy >
[exec] [junit] 09/06/04 13:37:22 INFO mapred.TaskTracker: attempt_200906041326_0004_m_000000_0 0.0% map > map
[exec] [junit] 09/06/04 13:37:22 INFO mapred.TaskTracker: attempt_200906041326_0005_m_000002_0 0.0% map > map
[exec] [junit] 09/06/04 13:37:23 INFO mapred.TaskTracker: attempt_200906041326_0003_r_000001_0 0.0% reduce > copy >
[exec] [junit] 09/06/04 13:37:23 INFO mapred.TaskTracker: attempt_200906041326_0005_r_000000_0 0.0% reduce > copy >
[exec] [junit] 09/06/04 13:37:23 INFO mapred.TaskTracker: attempt_200906041326_0004_m_000001_0 0.0% map > map
[exec] [junit] 09/06/04 13:37:23 INFO mapred.TaskTracker: attempt_200906041326_0004_m_000002_0 0.0% map > map
[exec] [junit] 09/06/04 13:37:23 INFO mapred.TaskTracker: attempt_200906041326_0005_m_000003_0 0.0% map > map
[exec] [junit] Running org.apache.hadoop.mapred.TestQueueCapacities
[exec] [junit] Tests run: 1, Failures: 0, Errors: 1, Time elapsed: 0 sec
[exec] [junit] Test org.apache.hadoop.mapred.TestQueueCapacities FAILED (timeout)
[exec]
[exec] BUILD FAILED
[exec] http://hudson.zones.apache.org/hudson/job/Hadoop-Patch-vesta.apache.org/ws/trunk/build.xml :1028: The following error occurred while executing this line:
[exec] http://hudson.zones.apache.org/hudson/job/Hadoop-Patch-vesta.apache.org/ws/trunk/src/contrib/build.xml :48: The following error occurred while executing this line:
[exec] http://hudson.zones.apache.org/hudson/job/Hadoop-Patch-vesta.apache.org/ws/trunk/src/contrib/build-contrib.xml :250: Tests failed!
[exec]
[exec] Total time: 27 minutes 50 seconds
[exec]
[exec]
[exec]
[exec]
[exec] -1 overall. Here are the results of testing the latest attachment
[exec] http://issues.apache.org/jira/secure/attachment/12409796/5859-41.patch
[exec] against trunk revision 781683.
[exec]
[exec] +1 @author. The patch does not contain any @author tags.
[exec]
[exec] -1 tests included. The patch doesn't appear to include any new or modified tests.
[exec] Please justify why no tests are needed for this patch.
[exec]
[exec] +1 javadoc. The javadoc tool did not generate any warning messages.
[exec]
[exec] +1 javac. The applied patch does not increase the total number of javac compiler warnings.
[exec]
[exec] +1 findbugs. The patch does not introduce any new Findbugs warnings.
[exec]
[exec] +1 Eclipse classpath. The patch retains Eclipse classpath integrity.
[exec]
[exec] +1 release audit. The applied patch does not increase the total number of release audit warnings.
[exec]
[exec] +1 core tests. The patch passed core unit tests.
[exec]
[exec] -1 contrib tests. The patch failed contrib unit tests.
[exec]
[exec] Test results: http://hudson.zones.apache.org/hudson/job/Hadoop-Patch-vesta.apache.org/461/testReport/
[exec] Findbugs warnings: http://hudson.zones.apache.org/hudson/job/Hadoop-Patch-vesta.apache.org/461/artifact/trunk/build/test/findbugs/newPatchFindbugsWarnings.html
[exec] Checkstyle results: http://hudson.zones.apache.org/hudson/job/Hadoop-Patch-vesta.apache.org/461/artifact/trunk/build/test/checkstyle-errors.html
[exec] Console output: http://hudson.zones.apache.org/hudson/job/Hadoop-Patch-vesta.apache.org/461/console
[exec]
[exec] This message is automatically generated.
[exec]
[exec]
[exec] ======================================================================
[exec] ======================================================================
[exec] Adding comment to Jira.
[exec] ======================================================================
[exec] ======================================================================
[exec]
[exec]
[exec] Traceback (most recent call last):
[exec] File "/home/nigel/tools/jira_cli/src/cli/jira", line 1097, in <module>
[exec] serverInfo = soap.getServerInfo(auth)
[exec] File "/usr/lib/python2.5/site-packages/SOAPpy/Client.py", line 472, in __call__
[exec] return self.__r_call(*args, **kw)
[exec] File "/usr/lib/python2.5/site-packages/SOAPpy/Client.py", line 494, in __r_call
[exec] self.__hd, self.__ma)
[exec] File "/usr/lib/python2.5/site-packages/SOAPpy/Client.py", line 365, in __call
[exec] config = self.config)
[exec] File "/usr/lib/python2.5/site-packages/SOAPpy/Client.py", line 265, in call
[exec] raise HTTPError(code, msg)
[exec] SOAPpy.Errors.HTTPError: <HTTPError 503 Service Temporarily Unavailable>
[exec] % Total % Received % Xferd Average Speed Time Time Time Current
[exec] Dload Upload Total Spent Left Speed
[exec]
[exec] 0 0 0 0 0 0 0 0 --:--:-- --:--:-- --:--:-- 0 0 0 0 0 0 0 0 0 --:--:-- --:--:-- --:--:-- 0
[exec]
[exec]
[exec] ======================================================================
[exec] ======================================================================
[exec] Finished build.
[exec] ======================================================================
[exec] ======================================================================
[exec]
[exec]

BUILD FAILED
http://hudson.zones.apache.org/hudson/job/Hadoop-Patch-vesta.apache.org/ws/trunk/build.xml :1878: exec returned: 2

Total time: 250 minutes 24 seconds
Recording test results
Description found: HADOOP-5859

Search Discussions

  • Apache Hudson Server at Jun 4, 2009 at 10:59 pm
    See http://hudson.zones.apache.org/hudson/job/Hadoop-Patch-vesta.apache.org/463/changes

    Changes:

    [szetszwo] HADOOP-5859. Fix "wait() or sleep() with locks held" findbugs warnings in DFSClient. Contributed by Kan Zhang

    [sharad] HADOOP-2838. Add mapred.child.env to pass environment variables to tasktracker's child processes. Contributed by Amar Kamat.

    [ddas] HADOOP-5746. Fixes a corner case problem in Streaming, where if an exception happens in MROutputThread after the last call to the map/reduce method, the exception goes undetected. Contributed by Amar Kamat.

    ------------------------------------------
    started
    Building remotely on vesta.apache.org (Ubuntu)
    Updating http://svn.apache.org/repos/asf/hadoop/core/trunk
    U CHANGES.txt
    U src/hdfs/org/apache/hadoop/hdfs/DFSClient.java
    At revision 781865
    [Hadoop-Patch-vesta.apache.org] $ /bin/bash -xe /tmp/hudson6202528642619558652.sh
    + set +x
    /home/hudson/tools/java/latest1.6/bin/java
    Buildfile: build.xml

    check-for-findbugs:

    findbugs.check:

    java5.check:

    forrest.check:

    hudson-test-patch:
    [exec]
    [exec]
    [exec] ======================================================================
    [exec] ======================================================================
    [exec] Testing patch for HADOOP-5862.
    [exec] ======================================================================
    [exec] ======================================================================
    [exec]
    [exec]
    [exec] Reverted 'src/contrib/build-contrib.xml'
    [exec] Reverted 'src/contrib/build.xml'
    [exec] Reverted 'src/c++/pipes/configure'
    [exec] Reverted 'src/c++/pipes/Makefile.in'
    [exec] Reverted 'src/c++/pipes/depcomp'
    [exec] Reverted 'src/c++/pipes/config.guess'
    [exec] Reverted 'src/c++/pipes/ltmain.sh'
    [exec] Reverted 'src/c++/pipes/config.sub'
    [exec] Reverted 'src/c++/pipes/impl/config.h.in'
    [exec] Reverted 'src/c++/pipes/missing'
    [exec] Reverted 'src/c++/pipes/aclocal.m4'
    [exec] Reverted 'src/c++/pipes/install-sh'
    [exec] Reverted 'src/c++/utils/configure'
    [exec] Reverted 'src/c++/utils/Makefile.in'
    [exec] Reverted 'src/c++/utils/depcomp'
    [exec] Reverted 'src/c++/utils/config.guess'
    [exec] Reverted 'src/c++/utils/ltmain.sh'
    [exec] Reverted 'src/c++/utils/config.sub'
    [exec] Reverted 'src/c++/utils/impl/config.h.in'
    [exec] Reverted 'src/c++/utils/missing'
    [exec] Reverted 'src/c++/utils/aclocal.m4'
    [exec] Reverted 'src/c++/utils/install-sh'
    [exec] Reverted 'src/examples/pipes/configure'
    [exec] Reverted 'src/examples/pipes/Makefile.in'
    [exec] Reverted 'src/examples/pipes/depcomp'
    [exec] Reverted 'src/examples/pipes/config.guess'
    [exec] Reverted 'src/examples/pipes/ltmain.sh'
    [exec] Reverted 'src/examples/pipes/config.sub'
    [exec] Reverted 'src/examples/pipes/impl/config.h.in'
    [exec] Reverted 'src/examples/pipes/missing'
    [exec] Reverted 'src/examples/pipes/aclocal.m4'
    [exec] Reverted 'src/examples/pipes/install-sh'
    [exec] At revision 781865.
    [exec] HADOOP-5862 patch is being downloaded at Thu Jun 4 23:13:48 UTC 2009 from
    [exec] http://issues.apache.org/jira/secure/attachment/12409707/HADOOP-5862.patch
    [exec]
    [exec]
    [exec] ======================================================================
    [exec] ======================================================================
    [exec] Pre-building trunk to determine trunk number
    [exec] of release audit, javac, and Findbugs warnings.
    [exec] ======================================================================
    [exec] ======================================================================
    [exec]
    [exec]
    [exec] /home/hudson/tools/ant/latest/bin/ant -Dversion=781816_HADOOP-5862_PATCH-12409707 -Djava5.home=/home/hudson/tools/java/latest1.5 -Dforrest.home=/home/nigel/tools/forrest/latest -DHadoopPatchProcess= releaseaudit > http://hudson.zones.apache.org/hudson/job/Hadoop-Patch-vesta.apache.org/ws/patchprocess/trunkReleaseAuditWarnings.txt 2>&1
    [exec] /home/hudson/tools/ant/latest/bin/ant -Dversion=781816_HADOOP-5862_PATCH-12409707 -Djavac.args=-Xlint -Xmaxwarns 1000 -Declipse.home=/home/nigel/tools/eclipse/latest -Djava5.home=/home/hudson/tools/java/latest1.5 -Dforrest.home=/home/nigel/tools/forrest/latest -DHadoopPatchProcess= clean tar > http://hudson.zones.apache.org/hudson/job/Hadoop-Patch-vesta.apache.org/ws/patchprocess/trunkJavacWarnings.txt 2>&1
    [exec] /home/hudson/tools/ant/latest/bin/ant -Dversion=781816_HADOOP-5862_PATCH-12409707 -Dfindbugs.home=/home/nigel/tools/findbugs/latest -Djava5.home=/home/hudson/tools/java/latest1.5 -Dforrest.home=/home/nigel/tools/forrest/latest -DHadoopPatchProcess= findbugs > /dev/null 2>&1
    [exec]
    [exec]
    [exec] ======================================================================
    [exec] ======================================================================
    [exec] Checking there are no @author tags in the patch.
    [exec] ======================================================================
    [exec] ======================================================================
    [exec]
    [exec]
    [exec] There appear to be 0 @author tags in the patch.
    [exec]
    [exec]
    [exec] ======================================================================
    [exec] ======================================================================
    [exec] Checking there are new or changed tests in the patch.
    [exec] ======================================================================
    [exec] ======================================================================
    [exec]
    [exec]
    [exec] There appear to be 13 test files referenced in the patch.
    [exec]
    [exec]
    [exec] ======================================================================
    [exec] ======================================================================
    [exec] Applying patch.
    [exec] ======================================================================
    [exec] ======================================================================
    [exec]
    [exec]
    [exec] patching file src/test/hdfs/org/apache/hadoop/cli/testHDFSConf.xml
    [exec] Hunk #1 succeeded at 16206 (offset 27 lines).
    [exec] Hunk #2 succeeded at 16274 (offset 27 lines).
    [exec] Hunk #3 succeeded at 16294 (offset 27 lines).
    [exec] patching file src/test/hdfs/org/apache/hadoop/hdfs/TestQuota.java
    [exec] patching file src/docs/src/documentation/content/xdocs/hdfs_quota_admin_guide.xml
    [exec] patching file src/hdfs/org/apache/hadoop/hdfs/protocol/DSQuotaExceededException.java
    [exec] patching file src/hdfs/org/apache/hadoop/hdfs/protocol/NSQuotaExceededException.java
    [exec] patching file src/hdfs/org/apache/hadoop/hdfs/protocol/QuotaExceededException.java
    [exec] patching file src/hdfs/org/apache/hadoop/hdfs/tools/DFSAdmin.java
    [exec] patching file src/hdfs/org/apache/hadoop/hdfs/DFSClient.java
    [exec] Hunk #1 succeeded at 460 (offset 1 line).
    [exec] Hunk #2 succeeded at 485 (offset 1 line).
    [exec] Hunk #3 succeeded at 500 (offset 1 line).
    [exec] Hunk #4 succeeded at 864 (offset 1 line).
    [exec] Hunk #5 succeeded at 899 (offset 1 line).
    [exec] Hunk #6 succeeded at 2938 (offset 240 lines).
    [exec] Hunk #7 FAILED at 3172.
    [exec] 1 out of 7 hunks FAILED -- saving rejects to file src/hdfs/org/apache/hadoop/hdfs/DFSClient.java.rej
    [exec] patching file src/hdfs/org/apache/hadoop/hdfs/server/namenode/INodeDirectoryWithQuota.java
    [exec] patching file src/hdfs/org/apache/hadoop/hdfs/server/namenode/FSDirectory.java
    [exec] PATCH APPLICATION FAILED
    [exec]
    [exec]
    [exec]
    [exec]
    [exec] -1 overall. Here are the results of testing the latest attachment
    [exec] http://issues.apache.org/jira/secure/attachment/12409707/HADOOP-5862.patch
    [exec] against trunk revision 781816.
    [exec]
    [exec] +1 @author. The patch does not contain any @author tags.
    [exec]
    [exec] +1 tests included. The patch appears to include 13 new or modified tests.
    [exec]
    [exec] -1 patch. The patch command could not apply the patch.
    [exec]
    [exec] Console output: http://hudson.zones.apache.org/hudson/job/Hadoop-Patch-vesta.apache.org/463/console
    [exec]
    [exec] This message is automatically generated.
    [exec]
    [exec]
    [exec] ======================================================================
    [exec] ======================================================================
    [exec] Adding comment to Jira.
    [exec] ======================================================================
    [exec] ======================================================================
    [exec]
    [exec]
    [exec] % Total % Received % Xferd Average Speed Time Time Time Current
    [exec] Dload Upload Total Spent Left Speed
    [exec]
    [exec] 0 0 0 0 0 0 0 0 --:--:-- --:--:-- --:--:-- 0 0 0 0 0 0 0 0 0 --:--:-- --:--:-- --:--:-- 0
    [exec]
    [exec]
    [exec] ======================================================================
    [exec] ======================================================================
    [exec] Finished build.
    [exec] ======================================================================
    [exec] ======================================================================
    [exec]
    [exec]

    BUILD FAILED
    http://hudson.zones.apache.org/hudson/job/Hadoop-Patch-vesta.apache.org/ws/trunk/build.xml :1878: exec returned: 1

    Total time: 5 minutes 46 seconds
    Recording test results
    Description found: HADOOP-5862
  • Apache Hudson Server at Jun 5, 2009 at 3:06 am
    See http://hudson.zones.apache.org/hudson/job/Hadoop-Patch-vesta.apache.org/464/

    ------------------------------------------
    [...truncated 448440 lines...]
    [exec]
    [exec] ivy-init-antlib:
    [exec]
    [exec] ivy-init:
    [exec] :: loading settings :: file = http://hudson.zones.apache.org/hudson/job/Hadoop-Patch-vesta.apache.org/ws/trunk/ivy/ivysettings.xml
    [exec]
    [exec] ivy-resolve-common:
    [exec] [ivy:resolve] :: resolving dependencies :: org.apache.hadoop#vaidya;working@vesta.apache.org
    [exec] [ivy:resolve] confs: [common]
    [exec] [ivy:resolve] found commons-logging#commons-logging;1.0.4 in maven2
    [exec] [ivy:resolve] found log4j#log4j;1.2.15 in maven2
    [exec] [ivy:resolve] :: resolution report :: resolve 20ms :: artifacts dl 1ms
    [exec] ---------------------------------------------------------------------
    [exec] | | modules || artifacts |
    [exec] | conf | number| search|dwnlded|evicted|| number|dwnlded|
    [exec] ---------------------------------------------------------------------
    [exec] | common | 2 | 0 | 0 | 0 || 2 | 0 |
    [exec] ---------------------------------------------------------------------
    [exec]
    [exec] ivy-retrieve-common:
    [exec] [ivy:retrieve] :: retrieving :: org.apache.hadoop#vaidya [sync]
    [exec] [ivy:retrieve] confs: [common]
    [exec] [ivy:retrieve] 0 artifacts copied, 2 already retrieved (0kB/2ms)
    [exec] No ivy:settings found for the default reference 'ivy.instance'. A default instance will be used
    [exec] DEPRECATED: 'ivy.conf.file' is deprecated, use 'ivy.settings.file' instead
    [exec] :: loading settings :: file = http://hudson.zones.apache.org/hudson/job/Hadoop-Patch-vesta.apache.org/ws/trunk/ivy/ivysettings.xml
    [exec]
    [exec] compile:
    [exec] [echo] contrib: vaidya
    [exec]
    [exec] compile-ant-tasks:
    [exec]
    [exec] compile-tools:
    [exec]
    [exec] compile:
    [exec]
    [exec] create-c++-examples-pipes-makefile:
    [exec]
    [exec] compile-c++-examples-pipes:
    [exec]
    [exec] compile-c++-examples:
    [exec]
    [exec] compile-examples:
    [exec]
    [exec] generate-test-records:
    [exec]
    [exec] compile-core-test:
    [exec] [javac] Compiling 7 source files to http://hudson.zones.apache.org/hudson/job/Hadoop-Patch-vesta.apache.org/ws/trunk/build/test/core/classes
    [exec] [javac] Note: Some input files use unchecked or unsafe operations.
    [exec] [javac] Note: Recompile with -Xlint:unchecked for details.
    [exec] [delete] Deleting directory http://hudson.zones.apache.org/hudson/job/Hadoop-Patch-vesta.apache.org/ws/trunk/build/test/cache
    [exec] [mkdir] Created dir: http://hudson.zones.apache.org/hudson/job/Hadoop-Patch-vesta.apache.org/ws/trunk/build/test/cache
    [exec] [copy] Copying 1 file to http://hudson.zones.apache.org/hudson/job/Hadoop-Patch-vesta.apache.org/ws/trunk/build/test/cache
    [exec]
    [exec] compile-hdfs-test:
    [exec] [delete] Deleting directory http://hudson.zones.apache.org/hudson/job/Hadoop-Patch-vesta.apache.org/ws/trunk/build/test/cache
    [exec] [mkdir] Created dir: http://hudson.zones.apache.org/hudson/job/Hadoop-Patch-vesta.apache.org/ws/trunk/build/test/cache
    [exec] [copy] Copying 1 file to http://hudson.zones.apache.org/hudson/job/Hadoop-Patch-vesta.apache.org/ws/trunk/build/test/cache
    [exec] [copy] Copying 1 file to http://hudson.zones.apache.org/hudson/job/Hadoop-Patch-vesta.apache.org/ws/trunk/build/test/cache
    [exec] [copy] Copying 1 file to http://hudson.zones.apache.org/hudson/job/Hadoop-Patch-vesta.apache.org/ws/trunk/build/test/cache
    [exec] [copy] Copying 1 file to http://hudson.zones.apache.org/hudson/job/Hadoop-Patch-vesta.apache.org/ws/trunk/build/test/cache
    [exec] [copy] Copying 1 file to http://hudson.zones.apache.org/hudson/job/Hadoop-Patch-vesta.apache.org/ws/trunk/build/test/cache
    [exec] [copy] Copying 1 file to http://hudson.zones.apache.org/hudson/job/Hadoop-Patch-vesta.apache.org/ws/trunk/build/test/cache
    [exec] [copy] Copying 1 file to http://hudson.zones.apache.org/hudson/job/Hadoop-Patch-vesta.apache.org/ws/trunk/build/test/cache
    [exec] [copy] Copying 1 file to http://hudson.zones.apache.org/hudson/job/Hadoop-Patch-vesta.apache.org/ws/trunk/build/test/cache
    [exec] [copy] Copying 1 file to http://hudson.zones.apache.org/hudson/job/Hadoop-Patch-vesta.apache.org/ws/trunk/build/test/cache
    [exec] [copy] Copying 1 file to http://hudson.zones.apache.org/hudson/job/Hadoop-Patch-vesta.apache.org/ws/trunk/build/test/cache
    [exec]
    [exec] compile-mapred-test:
    [exec] [javac] Compiling 1 source file to http://hudson.zones.apache.org/hudson/job/Hadoop-Patch-vesta.apache.org/ws/trunk/build/test/mapred/classes
    [exec] [javac] Compiling 5 source files to http://hudson.zones.apache.org/hudson/job/Hadoop-Patch-vesta.apache.org/ws/trunk/build/test/mapred/testjar
    [exec] [javac] Note: Some input files use or override a deprecated API.
    [exec] [javac] Note: Recompile with -Xlint:deprecation for details.
    [exec] [delete] Deleting: http://hudson.zones.apache.org/hudson/job/Hadoop-Patch-vesta.apache.org/ws/trunk/build/test/mapred/testjar/testjob.jar
    [exec] [jar] Building jar: http://hudson.zones.apache.org/hudson/job/Hadoop-Patch-vesta.apache.org/ws/trunk/build/test/mapred/testjar/testjob.jar
    [exec] [javac] Compiling 1 source file to http://hudson.zones.apache.org/hudson/job/Hadoop-Patch-vesta.apache.org/ws/trunk/build/test/mapred/testshell
    [exec] [javac] Note: http://hudson.zones.apache.org/hudson/job/Hadoop-Patch-vesta.apache.org/ws/trunk/src/test/mapred/testshell/ExternalMapReduce.java uses or overrides a deprecated API.
    [exec] [javac] Note: Recompile with -Xlint:deprecation for details.
    [exec] [delete] Deleting: http://hudson.zones.apache.org/hudson/job/Hadoop-Patch-vesta.apache.org/ws/trunk/build/test/mapred/testshell/testshell.jar
    [exec] [jar] Building jar: http://hudson.zones.apache.org/hudson/job/Hadoop-Patch-vesta.apache.org/ws/trunk/build/test/mapred/testshell/testshell.jar
    [exec] [delete] Deleting directory http://hudson.zones.apache.org/hudson/job/Hadoop-Patch-vesta.apache.org/ws/trunk/build/test/cache
    [exec] [mkdir] Created dir: http://hudson.zones.apache.org/hudson/job/Hadoop-Patch-vesta.apache.org/ws/trunk/build/test/cache
    [exec] [delete] Deleting directory http://hudson.zones.apache.org/hudson/job/Hadoop-Patch-vesta.apache.org/ws/trunk/build/test/debug
    [exec] [mkdir] Created dir: http://hudson.zones.apache.org/hudson/job/Hadoop-Patch-vesta.apache.org/ws/trunk/build/test/debug
    [exec] [copy] Copying 1 file to http://hudson.zones.apache.org/hudson/job/Hadoop-Patch-vesta.apache.org/ws/trunk/build/test/debug
    [exec] [copy] Copying 1 file to http://hudson.zones.apache.org/hudson/job/Hadoop-Patch-vesta.apache.org/ws/trunk/build/test/cache
    [exec] [copy] Copying 1 file to http://hudson.zones.apache.org/hudson/job/Hadoop-Patch-vesta.apache.org/ws/trunk/build/test/cache
    [exec] [copy] Copying 1 file to http://hudson.zones.apache.org/hudson/job/Hadoop-Patch-vesta.apache.org/ws/trunk/build/test/cache
    [exec] [copy] Copying 1 file to http://hudson.zones.apache.org/hudson/job/Hadoop-Patch-vesta.apache.org/ws/trunk/build/test/cache
    [exec] [copy] Copying 1 file to http://hudson.zones.apache.org/hudson/job/Hadoop-Patch-vesta.apache.org/ws/trunk/build/test/cache
    [exec] [copy] Copying 1 file to http://hudson.zones.apache.org/hudson/job/Hadoop-Patch-vesta.apache.org/ws/trunk/build/test/cache
    [exec] [copy] Copying 1 file to http://hudson.zones.apache.org/hudson/job/Hadoop-Patch-vesta.apache.org/ws/trunk/build/test/cache
    [exec] [copy] Copying 1 file to http://hudson.zones.apache.org/hudson/job/Hadoop-Patch-vesta.apache.org/ws/trunk/build/test/cache
    [exec]
    [exec] compile-hdfs-with-mr-test:
    [exec]
    [exec] test-contrib:
    [exec]
    [exec] test:
    [exec] Trying to override old definition of task macro_tar
    [exec]
    [exec] check-contrib:
    [exec]
    [exec] init:
    [exec] [echo] contrib: hdfsproxy
    [exec]
    [exec] init-contrib:
    [exec]
    [exec] ivy-download:
    [exec] [get] Getting: http://repo2.maven.org/maven2/org/apache/ivy/ivy/2.0.0-rc2/ivy-2.0.0-rc2.jar
    [exec] [get] To: http://hudson.zones.apache.org/hudson/job/Hadoop-Patch-vesta.apache.org/ws/trunk/ivy/ivy-2.0.0-rc2.jar
    [exec] [get] Not modified - so not downloaded
    [exec]
    [exec] ivy-probe-antlib:
    [exec]
    [exec] ivy-init-antlib:
    [exec]
    [exec] ivy-init:
    [exec]
    [exec] ivy-resolve-common:
    [exec] :: loading settings :: file = http://hudson.zones.apache.org/hudson/job/Hadoop-Patch-vesta.apache.org/ws/trunk/ivy/ivysettings.xml
    [exec] [ivy:resolve] :: resolving dependencies :: org.apache.hadoop#hdfsproxy;working@vesta.apache.org
    [exec] [ivy:resolve] confs: [common]
    [exec] [ivy:resolve] found commons-cli#commons-cli;1.2 in maven2
    [exec] [ivy:resolve] found log4j#log4j;1.2.15 in maven2
    [exec] [ivy:resolve] found commons-logging#commons-logging;1.1 in maven2
    [exec] [ivy:resolve] found commons-logging#commons-logging-api;1.0.4 in maven2
    [exec] [ivy:resolve] found junit#junit;3.8.2 in maven2
    [exec] [ivy:resolve] found org.slf4j#slf4j-api;1.4.3 in maven2
    [exec] [ivy:resolve] found org.slf4j#slf4j-log4j12;1.4.3 in maven2
    [exec] [ivy:resolve] found xmlenc#xmlenc;0.52 in maven2
    [exec] [ivy:resolve] found org.mortbay.jetty#jetty;6.1.14 in maven2
    [exec] [ivy:resolve] found org.mortbay.jetty#jetty-util;6.1.14 in maven2
    [exec] [ivy:resolve] found org.mortbay.jetty#servlet-api-2.5;6.1.14 in maven2
    [exec] [ivy:resolve] found org.eclipse.jdt#core;3.1.1 in maven2
    [exec] [ivy:resolve] found org.apache.cactus#cactus.core.framework.uberjar.javaEE.14;1.8.0 in maven2
    [exec] [ivy:resolve] found org.apache.cactus#cactus.integration.ant;1.8.0 in maven2
    [exec] [ivy:resolve] found org.apache.cactus#cactus.integration.shared.api;1.8.0 in maven2
    [exec] [ivy:resolve] found commons-httpclient#commons-httpclient;3.1 in maven2
    [exec] [ivy:resolve] found commons-io#commons-io;1.4 in maven2
    [exec] [ivy:resolve] found commons-lang#commons-lang;2.3 in maven2
    [exec] [ivy:resolve] found commons-codec#commons-codec;1.3 in maven2
    [exec] [ivy:resolve] found aspectj#aspectjrt;1.5.3 in maven2
    [exec] [ivy:resolve] found org.codehaus.cargo#cargo-core-uberjar;0.9 in maven2
    [exec] [ivy:resolve] found org.codehaus.cargo#cargo-ant;0.9 in maven2
    [exec] [ivy:resolve] found javax.servlet#jsp-api;2.0 in maven2
    [exec] [ivy:resolve] found javax.servlet#servlet-api;2.5 in maven2
    [exec] [ivy:resolve] found javax.servlet#jstl;1.1.2 in maven2
    [exec] [ivy:resolve] found taglibs#standard;1.1.2 in maven2
    [exec] [ivy:resolve] found junitperf#junitperf;1.8 in maven2
    [exec] [ivy:resolve] :: resolution report :: resolve 201ms :: artifacts dl 10ms
    [exec] ---------------------------------------------------------------------
    [exec] | | modules || artifacts |
    [exec] | conf | number| search|dwnlded|evicted|| number|dwnlded|
    [exec] ---------------------------------------------------------------------
    [exec] | common | 27 | 0 | 0 | 0 || 27 | 0 |
    [exec] ---------------------------------------------------------------------
    [exec]
    [exec] ivy-retrieve-common:
    [exec] [ivy:retrieve] :: retrieving :: org.apache.hadoop#hdfsproxy [sync]
    [exec] [ivy:retrieve] confs: [common]
    [exec] [ivy:retrieve] 0 artifacts copied, 27 already retrieved (0kB/7ms)
    [exec] No ivy:settings found for the default reference 'ivy.instance'. A default instance will be used
    [exec] :: loading settings :: file = http://hudson.zones.apache.org/hudson/job/Hadoop-Patch-vesta.apache.org/ws/trunk/ivy/ivysettings.xml
    [exec]
    [exec] compile:
    [exec] [echo] contrib: hdfsproxy
    [exec]
    [exec] compile-examples:
    [exec]
    [exec] compile-test:
    [exec] [echo] contrib: hdfsproxy
    [exec] [javac] Compiling 7 source files to http://hudson.zones.apache.org/hudson/job/Hadoop-Patch-vesta.apache.org/ws/trunk/build/contrib/hdfsproxy/test
    [exec]
    [exec] test-junit:
    [exec] [junit] Running org.apache.hadoop.hdfsproxy.TestHdfsProxy
    [exec] [junit] Tests run: 1, Failures: 0, Errors: 1, Time elapsed: 21.343 sec
    [exec] [junit] Test org.apache.hadoop.hdfsproxy.TestHdfsProxy FAILED
    [exec] [junit] Running org.apache.hadoop.hdfsproxy.TestProxyUgiManager
    [exec] [junit] Tests run: 3, Failures: 0, Errors: 0, Time elapsed: 4.125 sec
    [exec]
    [exec] BUILD FAILED
    [exec] http://hudson.zones.apache.org/hudson/job/Hadoop-Patch-vesta.apache.org/ws/trunk/build.xml :1028: The following error occurred while executing this line:
    [exec] http://hudson.zones.apache.org/hudson/job/Hadoop-Patch-vesta.apache.org/ws/trunk/src/contrib/build.xml :48: The following error occurred while executing this line:
    [exec] http://hudson.zones.apache.org/hudson/job/Hadoop-Patch-vesta.apache.org/ws/trunk/src/contrib/hdfsproxy/build.xml :224: Tests failed!
    [exec]
    [exec] Total time: 34 seconds
    [exec]
    [exec]
    [exec]
    [exec]
    [exec] -1 overall. Here are the results of testing the latest attachment
    [exec] http://issues.apache.org/jira/secure/attachment/12409907/HADOOP-5961.patch
    [exec] against trunk revision 781816.
    [exec]
    [exec] +1 @author. The patch does not contain any @author tags.
    [exec]
    [exec] -1 tests included. The patch doesn't appear to include any new or modified tests.
    [exec] Please justify why no tests are needed for this patch.
    [exec]
    [exec] +1 javadoc. The javadoc tool did not generate any warning messages.
    [exec]
    [exec] +1 javac. The applied patch does not increase the total number of javac compiler warnings.
    [exec]
    [exec] +1 findbugs. The patch does not introduce any new Findbugs warnings.
    [exec]
    [exec] +1 Eclipse classpath. The patch retains Eclipse classpath integrity.
    [exec]
    [exec] +1 release audit. The applied patch does not increase the total number of release audit warnings.
    [exec]
    [exec] -1 core tests. The patch failed core unit tests.
    [exec]
    [exec] -1 contrib tests. The patch failed contrib unit tests.
    [exec]
    [exec] Test results: http://hudson.zones.apache.org/hudson/job/Hadoop-Patch-vesta.apache.org/464/testReport/
    [exec] Findbugs warnings: http://hudson.zones.apache.org/hudson/job/Hadoop-Patch-vesta.apache.org/464/artifact/trunk/build/test/findbugs/newPatchFindbugsWarnings.html
    [exec] Checkstyle results: http://hudson.zones.apache.org/hudson/job/Hadoop-Patch-vesta.apache.org/464/artifact/trunk/build/test/checkstyle-errors.html
    [exec] Console output: http://hudson.zones.apache.org/hudson/job/Hadoop-Patch-vesta.apache.org/464/console
    [exec]
    [exec] This message is automatically generated.
    [exec]
    [exec]
    [exec] ======================================================================
    [exec] ======================================================================
    [exec] Adding comment to Jira.
    [exec] ======================================================================
    [exec] ======================================================================
    [exec]
    [exec]
    [exec] % Total % Received % Xferd Average Speed Time Time Time Current
    [exec] Dload Upload Total Spent Left Speed
    [exec]
    [exec] 0 0 0 0 0 0 0 0 --:--:-- --:--:-- --:--:-- 0 0 0 0 0 0 0 0 0 --:--:-- --:--:-- --:--:-- 0
    [exec]
    [exec]
    [exec] ======================================================================
    [exec] ======================================================================
    [exec] Finished build.
    [exec] ======================================================================
    [exec] ======================================================================
    [exec]
    [exec]

    BUILD FAILED
    http://hudson.zones.apache.org/hudson/job/Hadoop-Patch-vesta.apache.org/ws/trunk/build.xml :1878: exec returned: 3

    Total time: 246 minutes 4 seconds
    Recording test results
    Description found: HADOOP-5961
  • Apache Hudson Server at Jun 5, 2009 at 8:02 am
    See http://hudson.zones.apache.org/hudson/job/Hadoop-Patch-vesta.apache.org/465/

    ------------------------------------------
    [...truncated 465349 lines...]
    [exec] [junit] 09/06/05 08:21:03 INFO mapred.TaskTracker: attempt_200906050810_0005_m_000002_0 0.0% map > map
    [exec] [junit] 09/06/05 08:21:04 INFO mapred.TaskTracker: attempt_200906050810_0003_r_000001_0 0.0% reduce > copy >
    [exec] [junit] 09/06/05 08:21:04 INFO mapred.TaskTracker: attempt_200906050810_0005_r_000000_0 0.0% reduce > copy >
    [exec] [junit] 09/06/05 08:21:04 INFO mapred.TaskTracker: attempt_200906050810_0004_m_000002_0 0.0% map > map
    [exec] [junit] 09/06/05 08:21:04 INFO mapred.TaskTracker: attempt_200906050810_0004_m_000001_0 0.0% map > map
    [exec] [junit] 09/06/05 08:21:04 INFO mapred.TaskTracker: attempt_200906050810_0005_r_000003_0 0.0% reduce > copy >
    [exec] [junit] 09/06/05 08:21:04 INFO mapred.TaskTracker: attempt_200906050810_0005_m_000003_0 0.0% map > map
    [exec] [junit] 09/06/05 08:21:04 INFO mapred.TaskTracker: attempt_200906050810_0003_m_000000_0 0.0% map > map
    [exec] [junit] 09/06/05 08:21:05 INFO mapred.TaskTracker: attempt_200906050810_0004_r_000002_0 0.0% reduce > copy >
    [exec] [junit] 09/06/05 08:21:05 INFO mapred.TaskTracker: attempt_200906050810_0005_m_000000_0 0.0% map > map
    [exec] [junit] 09/06/05 08:21:05 INFO mapred.TaskTracker: attempt_200906050810_0005_r_000001_0 0.0% reduce > copy >
    [exec] [junit] 09/06/05 08:21:05 INFO mapred.TaskTracker: attempt_200906050810_0003_m_000001_0 0.0% map > map
    [exec] [junit] 09/06/05 08:21:05 INFO mapred.TaskTracker: attempt_200906050810_0005_m_000001_0 0.0% map > map
    [exec] [junit] 09/06/05 08:21:06 INFO mapred.TaskTracker: attempt_200906050810_0004_m_000000_0 0.0% map > map
    [exec] [junit] 09/06/05 08:21:06 INFO mapred.TaskTracker: attempt_200906050810_0005_r_000002_0 0.0% reduce > copy >
    [exec] [junit] 09/06/05 08:21:06 INFO mapred.TaskTracker: attempt_200906050810_0005_m_000002_0 0.0% map > map
    [exec] [junit] 09/06/05 08:21:07 INFO mapred.TaskTracker: attempt_200906050810_0004_m_000002_0 0.0% map > map
    [exec] [junit] 09/06/05 08:21:07 INFO mapred.TaskTracker: attempt_200906050810_0004_m_000001_0 0.0% map > map
    [exec] [junit] 09/06/05 08:21:07 INFO mapred.TaskTracker: attempt_200906050810_0005_r_000003_0 0.0% reduce > copy >
    [exec] [junit] 09/06/05 08:21:07 INFO mapred.TaskTracker: attempt_200906050810_0005_m_000003_0 0.0% map > map
    [exec] [junit] 09/06/05 08:21:07 INFO mapred.TaskTracker: attempt_200906050810_0003_m_000000_0 0.0% map > map
    [exec] [junit] 09/06/05 08:21:08 INFO mapred.TaskTracker: attempt_200906050810_0004_r_000000_0 0.0% reduce > copy >
    [exec] [junit] 09/06/05 08:21:08 INFO mapred.TaskTracker: attempt_200906050810_0005_m_000000_0 0.0% map > map
    [exec] [junit] 09/06/05 08:21:08 INFO mapred.TaskTracker: attempt_200906050810_0004_r_000001_0 0.0% reduce > copy >
    [exec] [junit] 09/06/05 08:21:08 INFO mapred.TaskTracker: attempt_200906050810_0003_m_000001_0 0.0% map > map
    [exec] [junit] 09/06/05 08:21:08 INFO mapred.TaskTracker: attempt_200906050810_0005_m_000001_0 0.0% map > map
    [exec] [junit] 09/06/05 08:21:09 INFO mapred.TaskTracker: attempt_200906050810_0003_r_000000_0 0.0% reduce > copy >
    [exec] [junit] 09/06/05 08:21:09 INFO mapred.TaskTracker: attempt_200906050810_0004_m_000000_0 0.0% map > map
    [exec] [junit] 09/06/05 08:21:09 INFO mapred.TaskTracker: attempt_200906050810_0005_m_000002_0 0.0% map > map
    [exec] [junit] 09/06/05 08:21:10 INFO mapred.TaskTracker: attempt_200906050810_0003_r_000001_0 0.0% reduce > copy >
    [exec] [junit] 09/06/05 08:21:10 INFO mapred.TaskTracker: attempt_200906050810_0005_r_000000_0 0.0% reduce > copy >
    [exec] [junit] 09/06/05 08:21:10 INFO mapred.TaskTracker: attempt_200906050810_0004_m_000002_0 0.0% map > map
    [exec] [junit] 09/06/05 08:21:10 INFO mapred.TaskTracker: attempt_200906050810_0004_m_000001_0 0.0% map > map
    [exec] [junit] 09/06/05 08:21:10 INFO mapred.TaskTracker: attempt_200906050810_0005_m_000003_0 0.0% map > map
    [exec] [junit] 09/06/05 08:21:10 INFO mapred.TaskTracker: attempt_200906050810_0003_m_000000_0 0.0% map > map
    [exec] [junit] 09/06/05 08:21:11 INFO mapred.TaskTracker: attempt_200906050810_0004_r_000002_0 0.0% reduce > copy >
    [exec] [junit] 09/06/05 08:21:11 INFO mapred.TaskTracker: attempt_200906050810_0005_m_000000_0 0.0% map > map
    [exec] [junit] 09/06/05 08:21:11 INFO mapred.TaskTracker: attempt_200906050810_0005_r_000001_0 0.0% reduce > copy >
    [exec] [junit] 09/06/05 08:21:11 INFO mapred.TaskTracker: attempt_200906050810_0003_m_000001_0 0.0% map > map
    [exec] [junit] 09/06/05 08:21:11 INFO mapred.TaskTracker: attempt_200906050810_0005_m_000001_0 0.0% map > map
    [exec] [junit] 09/06/05 08:21:12 INFO mapred.TaskTracker: attempt_200906050810_0004_m_000000_0 0.0% map > map
    [exec] [junit] 09/06/05 08:21:12 INFO mapred.TaskTracker: attempt_200906050810_0005_r_000002_0 0.0% reduce > copy >
    [exec] [junit] 09/06/05 08:21:12 INFO mapred.TaskTracker: attempt_200906050810_0005_m_000002_0 0.0% map > map
    [exec] [junit] 09/06/05 08:21:13 INFO mapred.TaskTracker: attempt_200906050810_0004_m_000002_0 0.0% map > map
    [exec] [junit] 09/06/05 08:21:13 INFO mapred.TaskTracker: attempt_200906050810_0004_m_000001_0 0.0% map > map
    [exec] [junit] 09/06/05 08:21:13 INFO mapred.TaskTracker: attempt_200906050810_0005_r_000003_0 0.0% reduce > copy >
    [exec] [junit] 09/06/05 08:21:13 INFO mapred.TaskTracker: attempt_200906050810_0005_m_000003_0 0.0% map > map
    [exec] [junit] 09/06/05 08:21:14 INFO mapred.TaskTracker: attempt_200906050810_0003_m_000000_0 0.0% map > map
    [exec] [junit] 09/06/05 08:21:14 INFO mapred.TaskTracker: attempt_200906050810_0004_r_000000_0 0.0% reduce > copy >
    [exec] [junit] 09/06/05 08:21:14 INFO mapred.TaskTracker: attempt_200906050810_0005_m_000000_0 0.0% map > map
    [exec] [junit] 09/06/05 08:21:14 INFO mapred.TaskTracker: attempt_200906050810_0004_r_000001_0 0.0% reduce > copy >
    [exec] [junit] 09/06/05 08:21:14 INFO mapred.TaskTracker: attempt_200906050810_0003_m_000001_0 0.0% map > map
    [exec] [junit] 09/06/05 08:21:14 INFO mapred.TaskTracker: attempt_200906050810_0005_m_000001_0 0.0% map > map
    [exec] [junit] 09/06/05 08:21:15 INFO mapred.TaskTracker: attempt_200906050810_0003_r_000000_0 0.0% reduce > copy >
    [exec] [junit] 09/06/05 08:21:15 INFO mapred.TaskTracker: attempt_200906050810_0004_m_000000_0 0.0% map > map
    [exec] [junit] 09/06/05 08:21:15 INFO mapred.TaskTracker: attempt_200906050810_0005_m_000002_0 0.0% map > map
    [exec] [junit] 09/06/05 08:21:16 INFO mapred.TaskTracker: attempt_200906050810_0003_r_000001_0 0.0% reduce > copy >
    [exec] [junit] 09/06/05 08:21:16 INFO mapred.TaskTracker: attempt_200906050810_0005_r_000000_0 0.0% reduce > copy >
    [exec] [junit] 09/06/05 08:21:16 INFO mapred.TaskTracker: attempt_200906050810_0004_m_000002_0 0.0% map > map
    [exec] [junit] 09/06/05 08:21:16 INFO mapred.TaskTracker: attempt_200906050810_0004_m_000001_0 0.0% map > map
    [exec] [junit] 09/06/05 08:21:16 INFO mapred.TaskTracker: attempt_200906050810_0005_m_000003_0 0.0% map > map
    [exec] [junit] 09/06/05 08:21:17 INFO mapred.TaskTracker: attempt_200906050810_0003_m_000000_0 0.0% map > map
    [exec] [junit] 09/06/05 08:21:17 INFO mapred.TaskTracker: attempt_200906050810_0004_r_000000_0 0.0% reduce > copy >
    [exec] [junit] 09/06/05 08:21:17 INFO mapred.TaskTracker: attempt_200906050810_0004_r_000002_0 0.0% reduce > copy >
    [exec] [junit] 09/06/05 08:21:17 INFO mapred.TaskTracker: attempt_200906050810_0005_m_000000_0 0.0% map > map
    [exec] [junit] 09/06/05 08:21:17 INFO mapred.TaskTracker: attempt_200906050810_0005_r_000001_0 0.0% reduce > copy >
    [exec] [junit] 09/06/05 08:21:17 INFO mapred.TaskTracker: attempt_200906050810_0004_r_000001_0 0.0% reduce > copy >
    [exec] [junit] 09/06/05 08:21:17 INFO mapred.TaskTracker: attempt_200906050810_0003_m_000001_0 0.0% map > map
    [exec] [junit] 09/06/05 08:21:17 INFO mapred.TaskTracker: attempt_200906050810_0005_m_000001_0 0.0% map > map
    [exec] [junit] 09/06/05 08:21:18 INFO mapred.TaskTracker: attempt_200906050810_0003_r_000000_0 0.0% reduce > copy >
    [exec] [junit] 09/06/05 08:21:18 INFO mapred.TaskTracker: attempt_200906050810_0004_m_000000_0 0.0% map > map
    [exec] [junit] 09/06/05 08:21:18 INFO mapred.TaskTracker: attempt_200906050810_0005_r_000002_0 0.0% reduce > copy >
    [exec] [junit] 09/06/05 08:21:18 INFO mapred.TaskTracker: attempt_200906050810_0005_m_000002_0 0.0% map > map
    [exec] [junit] 09/06/05 08:21:19 INFO mapred.TaskTracker: attempt_200906050810_0003_r_000001_0 0.0% reduce > copy >
    [exec] [junit] 09/06/05 08:21:19 INFO mapred.TaskTracker: attempt_200906050810_0005_r_000000_0 0.0% reduce > copy >
    [exec] [junit] 09/06/05 08:21:19 INFO mapred.TaskTracker: attempt_200906050810_0004_m_000002_0 0.0% map > map
    [exec] [junit] 09/06/05 08:21:19 INFO mapred.TaskTracker: attempt_200906050810_0004_m_000001_0 0.0% map > map
    [exec] [junit] 09/06/05 08:21:19 INFO mapred.TaskTracker: attempt_200906050810_0005_r_000003_0 0.0% reduce > copy >
    [exec] [junit] 09/06/05 08:21:19 INFO mapred.TaskTracker: attempt_200906050810_0005_m_000003_0 0.0% map > map
    [exec] [junit] 09/06/05 08:21:20 INFO mapred.TaskTracker: attempt_200906050810_0003_m_000000_0 0.0% map > map
    [exec] [junit] 09/06/05 08:21:20 INFO mapred.TaskTracker: attempt_200906050810_0004_r_000002_0 0.0% reduce > copy >
    [exec] [junit] 09/06/05 08:21:20 INFO mapred.TaskTracker: attempt_200906050810_0005_m_000000_0 0.0% map > map
    [exec] [junit] 09/06/05 08:21:20 INFO mapred.TaskTracker: attempt_200906050810_0005_r_000001_0 0.0% reduce > copy >
    [exec] [junit] 09/06/05 08:21:20 INFO mapred.TaskTracker: attempt_200906050810_0003_m_000001_0 0.0% map > map
    [exec] [junit] 09/06/05 08:21:20 INFO mapred.TaskTracker: attempt_200906050810_0005_m_000001_0 0.0% map > map
    [exec] [junit] 09/06/05 08:21:21 INFO mapred.TaskTracker: attempt_200906050810_0004_m_000000_0 0.0% map > map
    [exec] [junit] 09/06/05 08:21:21 INFO mapred.TaskTracker: attempt_200906050810_0005_r_000002_0 0.0% reduce > copy >
    [exec] [junit] 09/06/05 08:21:21 INFO mapred.TaskTracker: attempt_200906050810_0005_m_000002_0 0.0% map > map
    [exec] [junit] 09/06/05 08:21:22 INFO mapred.TaskTracker: attempt_200906050810_0004_m_000002_0 0.0% map > map
    [exec] [junit] 09/06/05 08:21:22 INFO mapred.TaskTracker: attempt_200906050810_0004_m_000001_0 0.0% map > map
    [exec] [junit] 09/06/05 08:21:22 INFO mapred.TaskTracker: attempt_200906050810_0005_r_000003_0 0.0% reduce > copy >
    [exec] [junit] 09/06/05 08:21:22 INFO mapred.TaskTracker: attempt_200906050810_0005_m_000003_0 0.0% map > map
    [exec] [junit] 09/06/05 08:21:23 INFO mapred.TaskTracker: attempt_200906050810_0003_m_000000_0 0.0% map > map
    [exec] [junit] 09/06/05 08:21:23 INFO mapred.TaskTracker: attempt_200906050810_0004_r_000000_0 0.0% reduce > copy >
    [exec] [junit] 09/06/05 08:21:23 INFO mapred.TaskTracker: attempt_200906050810_0005_m_000000_0 0.0% map > map
    [exec] [junit] 09/06/05 08:21:23 INFO mapred.TaskTracker: attempt_200906050810_0004_r_000001_0 0.0% reduce > copy >
    [exec] [junit] 09/06/05 08:21:23 INFO mapred.TaskTracker: attempt_200906050810_0003_m_000001_0 0.0% map > map
    [exec] [junit] 09/06/05 08:21:23 INFO mapred.TaskTracker: attempt_200906050810_0005_m_000001_0 0.0% map > map
    [exec] [junit] 09/06/05 08:21:24 INFO mapred.TaskTracker: attempt_200906050810_0003_r_000000_0 0.0% reduce > copy >
    [exec] [junit] 09/06/05 08:21:24 INFO mapred.TaskTracker: attempt_200906050810_0004_m_000000_0 0.0% map > map
    [exec] [junit] 09/06/05 08:21:24 INFO mapred.TaskTracker: attempt_200906050810_0005_m_000002_0 0.0% map > map
    [exec] [junit] 09/06/05 08:21:25 INFO mapred.TaskTracker: attempt_200906050810_0003_r_000001_0 0.0% reduce > copy >
    [exec] [junit] 09/06/05 08:21:25 INFO mapred.TaskTracker: attempt_200906050810_0005_r_000000_0 0.0% reduce > copy >
    [exec] [junit] 09/06/05 08:21:25 INFO mapred.TaskTracker: attempt_200906050810_0004_m_000002_0 0.0% map > map
    [exec] [junit] 09/06/05 08:21:25 INFO mapred.TaskTracker: attempt_200906050810_0004_m_000001_0 0.0% map > map
    [exec] [junit] 09/06/05 08:21:25 INFO mapred.TaskTracker: attempt_200906050810_0005_m_000003_0 0.0% map > map
    [exec] [junit] 09/06/05 08:21:26 INFO mapred.TaskTracker: attempt_200906050810_0003_m_000000_0 0.0% map > map
    [exec] [junit] 09/06/05 08:21:26 INFO mapred.TaskTracker: attempt_200906050810_0004_r_000002_0 0.0% reduce > copy >
    [exec] [junit] 09/06/05 08:21:26 INFO mapred.TaskTracker: attempt_200906050810_0005_m_000000_0 0.0% map > map
    [exec] [junit] 09/06/05 08:21:26 INFO mapred.TaskTracker: attempt_200906050810_0005_r_000001_0 0.0% reduce > copy >
    [exec] [junit] 09/06/05 08:21:26 INFO mapred.TaskTracker: attempt_200906050810_0003_m_000001_0 0.0% map > map
    [exec] [junit] 09/06/05 08:21:26 INFO mapred.TaskTracker: attempt_200906050810_0005_m_000001_0 0.0% map > map
    [exec] [junit] 09/06/05 08:21:27 INFO mapred.TaskTracker: attempt_200906050810_0004_m_000000_0 0.0% map > map
    [exec] [junit] 09/06/05 08:21:27 INFO mapred.TaskTracker: attempt_200906050810_0005_r_000002_0 0.0% reduce > copy >
    [exec] [junit] 09/06/05 08:21:27 INFO mapred.TaskTracker: attempt_200906050810_0005_m_000002_0 0.0% map > map
    [exec] [junit] 09/06/05 08:21:28 INFO mapred.TaskTracker: attempt_200906050810_0004_m_000002_0 0.0% map > map
    [exec] [junit] 09/06/05 08:21:28 INFO mapred.TaskTracker: attempt_200906050810_0005_r_000003_0 0.0% reduce > copy >
    [exec] [junit] 09/06/05 08:21:28 INFO mapred.TaskTracker: attempt_200906050810_0004_m_000001_0 0.0% map > map
    [exec] [junit] 09/06/05 08:21:28 INFO mapred.TaskTracker: attempt_200906050810_0005_m_000003_0 0.0% map > map
    [exec] [junit] 09/06/05 08:21:29 INFO mapred.TaskTracker: attempt_200906050810_0003_m_000000_0 0.0% map > map
    [exec] [junit] 09/06/05 08:21:29 INFO mapred.TaskTracker: attempt_200906050810_0004_r_000000_0 0.0% reduce > copy >
    [exec] [junit] 09/06/05 08:21:29 INFO mapred.TaskTracker: attempt_200906050810_0005_m_000000_0 0.0% map > map
    [exec] [junit] 09/06/05 08:21:29 INFO mapred.TaskTracker: attempt_200906050810_0004_r_000001_0 0.0% reduce > copy >
    [exec] [junit] 09/06/05 08:21:29 INFO mapred.TaskTracker: attempt_200906050810_0003_m_000001_0 0.0% map > map
    [exec] [junit] 09/06/05 08:21:29 INFO mapred.TaskTracker: attempt_200906050810_0005_m_000001_0 0.0% map > map
    [exec] [junit] 09/06/05 08:21:30 INFO mapred.TaskTracker: attempt_200906050810_0003_r_000000_0 0.0% reduce > copy >
    [exec] [junit] 09/06/05 08:21:30 INFO mapred.TaskTracker: attempt_200906050810_0004_m_000000_0 0.0% map > map
    [exec] [junit] 09/06/05 08:21:30 INFO mapred.TaskTracker: attempt_200906050810_0005_m_000002_0 0.0% map > map
    [exec] [junit] 09/06/05 08:21:31 INFO mapred.TaskTracker: attempt_200906050810_0003_r_000001_0 0.0% reduce > copy >
    [exec] [junit] 09/06/05 08:21:31 INFO mapred.TaskTracker: attempt_200906050810_0005_r_000000_0 0.0% reduce > copy >
    [exec] [junit] 09/06/05 08:21:31 INFO mapred.TaskTracker: attempt_200906050810_0004_m_000002_0 0.0% map > map
    [exec] [junit] 09/06/05 08:21:31 INFO mapred.TaskTracker: attempt_200906050810_0004_m_000001_0 0.0% map > map
    [exec] [junit] 09/06/05 08:21:31 INFO mapred.TaskTracker: attempt_200906050810_0005_m_000003_0 0.0% map > map
    [exec] [junit] 09/06/05 08:21:32 INFO mapred.TaskTracker: attempt_200906050810_0003_m_000000_0 0.0% map > map
    [exec] [junit] 09/06/05 08:21:32 INFO mapred.TaskTracker: attempt_200906050810_0004_r_000000_0 0.0% reduce > copy >
    [exec] [junit] 09/06/05 08:21:32 INFO mapred.TaskTracker: attempt_200906050810_0004_r_000002_0 0.0% reduce > copy >
    [exec] [junit] 09/06/05 08:21:32 INFO mapred.TaskTracker: attempt_200906050810_0005_m_000000_0 0.0% map > map
    [exec] [junit] 09/06/05 08:21:32 INFO mapred.TaskTracker: attempt_200906050810_0005_r_000001_0 0.0% reduce > copy >
    [exec] [junit] 09/06/05 08:21:32 INFO mapred.TaskTracker: attempt_200906050810_0004_r_000001_0 0.0% reduce > copy >
    [exec] [junit] 09/06/05 08:21:32 INFO mapred.TaskTracker: attempt_200906050810_0003_m_000001_0 0.0% map > map
    [exec] [junit] 09/06/05 08:21:32 INFO mapred.TaskTracker: attempt_200906050810_0005_m_000001_0 0.0% map > map
    [exec] [junit] 09/06/05 08:21:33 INFO mapred.TaskTracker: attempt_200906050810_0003_r_000000_0 0.0% reduce > copy >
    [exec] [junit] 09/06/05 08:21:33 INFO mapred.TaskTracker: attempt_200906050810_0004_m_000000_0 0.0% map > map
    [exec] [junit] 09/06/05 08:21:33 INFO mapred.TaskTracker: attempt_200906050810_0005_r_000002_0 0.0% reduce > copy >
    [exec] [junit] 09/06/05 08:21:33 INFO mapred.TaskTracker: attempt_200906050810_0005_m_000002_0 0.0% map > map
    [exec] [junit] 09/06/05 08:21:34 INFO mapred.TaskTracker: attempt_200906050810_0003_r_000001_0 0.0% reduce > copy >
    [exec] [junit] 09/06/05 08:21:34 INFO mapred.TaskTracker: attempt_200906050810_0005_r_000000_0 0.0% reduce > copy >
    [exec] [junit] 09/06/05 08:21:34 INFO mapred.TaskTracker: attempt_200906050810_0004_m_000002_0 0.0% map > map
    [exec] [junit] 09/06/05 08:21:34 INFO mapred.TaskTracker: attempt_200906050810_0005_r_000003_0 0.0% reduce > copy >
    [exec] [junit] 09/06/05 08:21:34 INFO mapred.TaskTracker: attempt_200906050810_0004_m_000001_0 0.0% map > map
    [exec] [junit] 09/06/05 08:21:34 INFO mapred.TaskTracker: attempt_200906050810_0005_m_000003_0 0.0% map > map
    [exec] [junit] 09/06/05 08:21:35 INFO mapred.TaskTracker: attempt_200906050810_0003_m_000000_0 0.0% map > map
    [exec] [junit] 09/06/05 08:21:35 INFO mapred.TaskTracker: attempt_200906050810_0004_r_000002_0 0.0% reduce > copy >
    [exec] [junit] 09/06/05 08:21:35 INFO mapred.TaskTracker: attempt_200906050810_0005_m_000000_0 0.0% map > map
    [exec] [junit] 09/06/05 08:21:35 INFO mapred.TaskTracker: attempt_200906050810_0005_r_000001_0 0.0% reduce > copy >
    [exec] [junit] 09/06/05 08:21:35 INFO mapred.TaskTracker: attempt_200906050810_0003_m_000001_0 0.0% map > map
    [exec] [junit] 09/06/05 08:21:35 INFO mapred.TaskTracker: attempt_200906050810_0005_m_000001_0 0.0% map > map
    [exec] [junit] 09/06/05 08:21:36 INFO mapred.TaskTracker: attempt_200906050810_0004_m_000000_0 0.0% map > map
    [exec] [junit] 09/06/05 08:21:36 INFO mapred.TaskTracker: attempt_200906050810_0005_r_000002_0 0.0% reduce > copy >
    [exec] [junit] 09/06/05 08:21:36 INFO mapred.TaskTracker: attempt_200906050810_0005_m_000002_0 0.0% map > map
    [exec] [junit] 09/06/05 08:21:37 INFO mapred.TaskTracker: attempt_200906050810_0004_m_000002_0 0.0% map > map
    [exec] [junit] 09/06/05 08:21:37 INFO mapred.TaskTracker: attempt_200906050810_0005_r_000003_0 0.0% reduce > copy >
    [exec] [junit] 09/06/05 08:21:37 INFO mapred.TaskTracker: attempt_200906050810_0004_m_000001_0 0.0% map > map
    [exec] [junit] 09/06/05 08:21:37 INFO mapred.TaskTracker: attempt_200906050810_0005_m_000003_0 0.0% map > map
    [exec] [junit] 09/06/05 08:21:38 INFO mapred.TaskTracker: attempt_200906050810_0003_m_000000_0 0.0% map > map
    [exec] [junit] 09/06/05 08:21:38 INFO mapred.TaskTracker: attempt_200906050810_0004_r_000000_0 0.0% reduce > copy >
    [exec] [junit] 09/06/05 08:21:38 INFO mapred.TaskTracker: attempt_200906050810_0005_m_000000_0 0.0% map > map
    [exec] [junit] 09/06/05 08:21:38 INFO mapred.TaskTracker: attempt_200906050810_0004_r_000001_0 0.0% reduce > copy >
    [exec] [junit] 09/06/05 08:21:38 INFO mapred.TaskTracker: attempt_200906050810_0003_m_000001_0 0.0% map > map
    [exec] [junit] 09/06/05 08:21:38 INFO mapred.TaskTracker: attempt_200906050810_0005_m_000001_0 0.0% map > map
    [exec] [junit] 09/06/05 08:21:39 INFO mapred.TaskTracker: attempt_200906050810_0003_r_000000_0 0.0% reduce > copy >
    [exec] [junit] 09/06/05 08:21:39 INFO mapred.TaskTracker: attempt_200906050810_0004_m_000000_0 0.0% map > map
    [exec] [junit] 09/06/05 08:21:39 INFO mapred.TaskTracker: attempt_200906050810_0005_m_000002_0 0.0% map > map
    [exec] [junit] 09/06/05 08:21:40 INFO mapred.TaskTracker: attempt_200906050810_0003_r_000001_0 0.0% reduce > copy >
    [exec] [junit] 09/06/05 08:21:40 INFO mapred.TaskTracker: attempt_200906050810_0005_r_000000_0 0.0% reduce > copy >
    [exec] [junit] 09/06/05 08:21:40 INFO mapred.TaskTracker: attempt_200906050810_0004_m_000002_0 0.0% map > map
    [exec] [junit] 09/06/05 08:21:40 INFO mapred.TaskTracker: attempt_200906050810_0004_m_000001_0 0.0% map > map
    [exec] [junit] 09/06/05 08:21:40 INFO mapred.TaskTracker: attempt_200906050810_0005_m_000003_0 0.0% map > map
    [exec] [junit] Test org.apache.hadoop.mapred.TestQueueCapacities FAILED (timeout)
    [exec]
    [exec] BUILD FAILED
    [exec] http://hudson.zones.apache.org/hudson/job/Hadoop-Patch-vesta.apache.org/ws/trunk/build.xml :1028: The following error occurred while executing this line:
    [exec] http://hudson.zones.apache.org/hudson/job/Hadoop-Patch-vesta.apache.org/ws/trunk/src/contrib/build.xml :48: The following error occurred while executing this line:
    [exec] http://hudson.zones.apache.org/hudson/job/Hadoop-Patch-vesta.apache.org/ws/trunk/src/contrib/build-contrib.xml :250: Tests failed!
    [exec]
    [exec] Total time: 27 minutes 48 seconds
    [exec] [junit] Running org.apache.hadoop.mapred.TestQueueCapacities
    [exec] [junit] Tests run: 1, Failures: 0, Errors: 1, Time elapsed: 0 sec
    [exec]
    [exec]
    [exec]
    [exec]
    [exec] -1 overall. Here are the results of testing the latest attachment
    [exec] http://issues.apache.org/jira/secure/attachment/12409864/HADOOP-5501new.patch
    [exec] against trunk revision 781816.
    [exec]
    [exec] +1 @author. The patch does not contain any @author tags.
    [exec]
    [exec] +1 tests included. The patch appears to include 3 new or modified tests.
    [exec]
    [exec] +1 javadoc. The javadoc tool did not generate any warning messages.
    [exec]
    [exec] +1 javac. The applied patch does not increase the total number of javac compiler warnings.
    [exec]
    [exec] +1 findbugs. The patch does not introduce any new Findbugs warnings.
    [exec]
    [exec] +1 Eclipse classpath. The patch retains Eclipse classpath integrity.
    [exec]
    [exec] +1 release audit. The applied patch does not increase the total number of release audit warnings.
    [exec]
    [exec] +1 core tests. The patch passed core unit tests.
    [exec]
    [exec] -1 contrib tests. The patch failed contrib unit tests.
    [exec]
    [exec] Test results: http://hudson.zones.apache.org/hudson/job/Hadoop-Patch-vesta.apache.org/465/testReport/
    [exec] Findbugs warnings: http://hudson.zones.apache.org/hudson/job/Hadoop-Patch-vesta.apache.org/465/artifact/trunk/build/test/findbugs/newPatchFindbugsWarnings.html
    [exec] Checkstyle results: http://hudson.zones.apache.org/hudson/job/Hadoop-Patch-vesta.apache.org/465/artifact/trunk/build/test/checkstyle-errors.html
    [exec] Console output: http://hudson.zones.apache.org/hudson/job/Hadoop-Patch-vesta.apache.org/465/console
    [exec]
    [exec] This message is automatically generated.
    [exec]
    [exec]
    [exec] ======================================================================
    [exec] ======================================================================
    [exec] Adding comment to Jira.
    [exec] ======================================================================
    [exec] ======================================================================
    [exec]
    [exec]
    [exec] % Total % Received % Xferd Average Speed Time Time Time Current
    [exec] Dload Upload Total Spent Left Speed
    [exec]
    [exec] 0 0 0 0 0 0 0 0 --:--:-- --:--:-- --:--:-- 0 0 0 0 0 0 0 0 0 --:--:-- --:--:-- --:--:-- 0
    [exec]
    [exec]
    [exec] ======================================================================
    [exec] ======================================================================
    [exec] Finished build.
    [exec] ======================================================================
    [exec] ======================================================================
    [exec]
    [exec]

    BUILD FAILED
    http://hudson.zones.apache.org/hudson/job/Hadoop-Patch-vesta.apache.org/ws/trunk/build.xml :1878: exec returned: 1

    Total time: 260 minutes 1 second
    Recording test results
    Description found: HADOOP-5501
  • Apache Hudson Server at Jun 5, 2009 at 1:26 pm
    See http://hudson.zones.apache.org/hudson/job/Hadoop-Patch-vesta.apache.org/466/changes

    Changes:

    [yhemanth] HADOOP-5884. Fixes accounting in capacity scheduler so that high RAM jobs take more slots. Contributed by Vinod Kumar Vavilapalli.

    ------------------------------------------
    [...truncated 514459 lines...]
    [exec] [junit] 09/06/05 13:45:46 INFO mapred.TaskTracker: attempt_200906051335_0005_m_000003_0 0.0% map > map
    [exec] [junit] 09/06/05 13:45:46 INFO mapred.TaskTracker: attempt_200906051335_0003_m_000000_0 0.0% map > map
    [exec] [junit] 09/06/05 13:45:46 INFO mapred.TaskTracker: attempt_200906051335_0005_m_000000_0 0.0% map > map
    [exec] [junit] 09/06/05 13:45:46 INFO mapred.TaskTracker: attempt_200906051335_0004_r_000000_0 0.0% reduce > copy >
    [exec] [junit] 09/06/05 13:45:46 INFO mapred.TaskTracker: attempt_200906051335_0004_r_000001_0 0.0% reduce > copy >
    [exec] [junit] 09/06/05 13:45:46 INFO mapred.TaskTracker: attempt_200906051335_0003_m_000001_0 0.0% map > map
    [exec] [junit] 09/06/05 13:45:47 INFO mapred.TaskTracker: attempt_200906051335_0005_m_000001_0 0.0% map > map
    [exec] [junit] 09/06/05 13:45:47 INFO mapred.TaskTracker: attempt_200906051335_0003_r_000000_0 0.0% reduce > copy >
    [exec] [junit] 09/06/05 13:45:47 INFO mapred.TaskTracker: attempt_200906051335_0004_m_000000_0 0.0% map > map
    [exec] [junit] 09/06/05 13:45:47 INFO mapred.TaskTracker: attempt_200906051335_0005_m_000002_0 0.0% map > map
    [exec] [junit] 09/06/05 13:45:48 INFO mapred.TaskTracker: attempt_200906051335_0003_r_000001_0 0.0% reduce > copy >
    [exec] [junit] 09/06/05 13:45:48 INFO mapred.TaskTracker: attempt_200906051335_0005_r_000000_0 0.0% reduce > copy >
    [exec] [junit] 09/06/05 13:45:48 INFO mapred.TaskTracker: attempt_200906051335_0004_m_000001_0 0.0% map > map
    [exec] [junit] 09/06/05 13:45:49 INFO mapred.TaskTracker: attempt_200906051335_0004_m_000002_0 0.0% map > map
    [exec] [junit] 09/06/05 13:45:49 INFO mapred.TaskTracker: attempt_200906051335_0005_m_000003_0 0.0% map > map
    [exec] [junit] 09/06/05 13:45:49 INFO mapred.TaskTracker: attempt_200906051335_0003_m_000000_0 0.0% map > map
    [exec] [junit] 09/06/05 13:45:49 INFO mapred.TaskTracker: attempt_200906051335_0004_r_000002_0 0.0% reduce > copy >
    [exec] [junit] 09/06/05 13:45:49 INFO mapred.TaskTracker: attempt_200906051335_0005_m_000000_0 0.0% map > map
    [exec] [junit] 09/06/05 13:45:49 INFO mapred.TaskTracker: attempt_200906051335_0005_r_000001_0 0.0% reduce > copy >
    [exec] [junit] 09/06/05 13:45:49 INFO mapred.TaskTracker: attempt_200906051335_0003_m_000001_0 0.0% map > map
    [exec] [junit] 09/06/05 13:45:50 INFO mapred.TaskTracker: attempt_200906051335_0005_m_000001_0 0.0% map > map
    [exec] [junit] 09/06/05 13:45:50 INFO mapred.TaskTracker: attempt_200906051335_0005_r_000002_0 0.0% reduce > copy >
    [exec] [junit] 09/06/05 13:45:50 INFO mapred.TaskTracker: attempt_200906051335_0004_m_000000_0 0.0% map > map
    [exec] [junit] 09/06/05 13:45:50 INFO mapred.TaskTracker: attempt_200906051335_0005_m_000002_0 0.0% map > map
    [exec] [junit] 09/06/05 13:45:51 INFO mapred.TaskTracker: attempt_200906051335_0004_m_000001_0 0.0% map > map
    [exec] [junit] 09/06/05 13:45:52 INFO mapred.TaskTracker: attempt_200906051335_0005_r_000003_0 0.0% reduce > copy >
    [exec] [junit] 09/06/05 13:45:52 INFO mapred.TaskTracker: attempt_200906051335_0004_m_000002_0 0.0% map > map
    [exec] [junit] 09/06/05 13:45:52 INFO mapred.TaskTracker: attempt_200906051335_0005_m_000003_0 0.0% map > map
    [exec] [junit] 09/06/05 13:45:52 INFO mapred.TaskTracker: attempt_200906051335_0003_m_000000_0 0.0% map > map
    [exec] [junit] 09/06/05 13:45:52 INFO mapred.TaskTracker: attempt_200906051335_0005_m_000000_0 0.0% map > map
    [exec] [junit] 09/06/05 13:45:52 INFO mapred.TaskTracker: attempt_200906051335_0004_r_000000_0 0.0% reduce > copy >
    [exec] [junit] 09/06/05 13:45:52 INFO mapred.TaskTracker: attempt_200906051335_0004_r_000001_0 0.0% reduce > copy >
    [exec] [junit] 09/06/05 13:45:52 INFO mapred.TaskTracker: attempt_200906051335_0003_m_000001_0 0.0% map > map
    [exec] [junit] 09/06/05 13:45:53 INFO mapred.TaskTracker: attempt_200906051335_0005_m_000001_0 0.0% map > map
    [exec] [junit] 09/06/05 13:45:53 INFO mapred.TaskTracker: attempt_200906051335_0003_r_000000_0 0.0% reduce > copy >
    [exec] [junit] 09/06/05 13:45:53 INFO mapred.TaskTracker: attempt_200906051335_0004_m_000000_0 0.0% map > map
    [exec] [junit] 09/06/05 13:45:53 INFO mapred.TaskTracker: attempt_200906051335_0005_m_000002_0 0.0% map > map
    [exec] [junit] 09/06/05 13:45:54 INFO mapred.TaskTracker: attempt_200906051335_0003_r_000001_0 0.0% reduce > copy >
    [exec] [junit] 09/06/05 13:45:54 INFO mapred.TaskTracker: attempt_200906051335_0005_r_000000_0 0.0% reduce > copy >
    [exec] [junit] 09/06/05 13:45:54 INFO mapred.TaskTracker: attempt_200906051335_0004_m_000001_0 0.0% map > map
    [exec] [junit] 09/06/05 13:45:55 INFO mapred.TaskTracker: attempt_200906051335_0004_m_000002_0 0.0% map > map
    [exec] [junit] 09/06/05 13:45:55 INFO mapred.TaskTracker: attempt_200906051335_0005_m_000003_0 0.0% map > map
    [exec] [junit] 09/06/05 13:45:55 INFO mapred.TaskTracker: attempt_200906051335_0003_m_000000_0 0.0% map > map
    [exec] [junit] 09/06/05 13:45:55 INFO mapred.TaskTracker: attempt_200906051335_0004_r_000002_0 0.0% reduce > copy >
    [exec] [junit] 09/06/05 13:45:55 INFO mapred.TaskTracker: attempt_200906051335_0005_m_000000_0 0.0% map > map
    [exec] [junit] 09/06/05 13:45:55 INFO mapred.TaskTracker: attempt_200906051335_0004_r_000000_0 0.0% reduce > copy >
    [exec] [junit] 09/06/05 13:45:55 INFO mapred.TaskTracker: attempt_200906051335_0005_r_000001_0 0.0% reduce > copy >
    [exec] [junit] 09/06/05 13:45:55 INFO mapred.TaskTracker: attempt_200906051335_0004_r_000001_0 0.0% reduce > copy >
    [exec] [junit] 09/06/05 13:45:55 INFO mapred.TaskTracker: attempt_200906051335_0003_m_000001_0 0.0% map > map
    [exec] [junit] 09/06/05 13:45:56 INFO mapred.TaskTracker: attempt_200906051335_0005_m_000001_0 0.0% map > map
    [exec] [junit] 09/06/05 13:45:56 INFO mapred.TaskTracker: attempt_200906051335_0003_r_000000_0 0.0% reduce > copy >
    [exec] [junit] 09/06/05 13:45:56 INFO mapred.TaskTracker: attempt_200906051335_0005_r_000002_0 0.0% reduce > copy >
    [exec] [junit] 09/06/05 13:45:56 INFO mapred.TaskTracker: attempt_200906051335_0004_m_000000_0 0.0% map > map
    [exec] [junit] 09/06/05 13:45:56 INFO mapred.TaskTracker: attempt_200906051335_0005_m_000002_0 0.0% map > map
    [exec] [junit] 09/06/05 13:45:57 INFO mapred.TaskTracker: attempt_200906051335_0003_r_000001_0 0.0% reduce > copy >
    [exec] [junit] 09/06/05 13:45:57 INFO mapred.TaskTracker: attempt_200906051335_0005_r_000000_0 0.0% reduce > copy >
    [exec] [junit] 09/06/05 13:45:57 INFO mapred.TaskTracker: attempt_200906051335_0004_m_000001_0 0.0% map > map
    [exec] [junit] 09/06/05 13:45:58 INFO mapred.TaskTracker: attempt_200906051335_0005_r_000003_0 0.0% reduce > copy >
    [exec] [junit] 09/06/05 13:45:58 INFO mapred.TaskTracker: attempt_200906051335_0004_m_000002_0 0.0% map > map
    [exec] [junit] 09/06/05 13:45:58 INFO mapred.TaskTracker: attempt_200906051335_0005_m_000003_0 0.0% map > map
    [exec] [junit] 09/06/05 13:45:58 INFO mapred.TaskTracker: attempt_200906051335_0003_m_000000_0 0.0% map > map
    [exec] [junit] 09/06/05 13:45:58 INFO mapred.TaskTracker: attempt_200906051335_0004_r_000002_0 0.0% reduce > copy >
    [exec] [junit] 09/06/05 13:45:58 INFO mapred.TaskTracker: attempt_200906051335_0005_m_000000_0 0.0% map > map
    [exec] [junit] 09/06/05 13:45:58 INFO mapred.TaskTracker: attempt_200906051335_0005_r_000001_0 0.0% reduce > copy >
    [exec] [junit] 09/06/05 13:45:58 INFO mapred.TaskTracker: attempt_200906051335_0003_m_000001_0 0.0% map > map
    [exec] [junit] 09/06/05 13:45:59 INFO mapred.TaskTracker: attempt_200906051335_0005_m_000001_0 0.0% map > map
    [exec] [junit] 09/06/05 13:45:59 INFO mapred.TaskTracker: attempt_200906051335_0005_r_000002_0 0.0% reduce > copy >
    [exec] [junit] 09/06/05 13:45:59 INFO mapred.TaskTracker: attempt_200906051335_0004_m_000000_0 0.0% map > map
    [exec] [junit] 09/06/05 13:45:59 INFO mapred.TaskTracker: attempt_200906051335_0005_m_000002_0 0.0% map > map
    [exec] [junit] 09/06/05 13:46:00 INFO mapred.TaskTracker: attempt_200906051335_0004_m_000001_0 0.0% map > map
    [exec] [junit] 09/06/05 13:46:01 INFO mapred.TaskTracker: attempt_200906051335_0005_r_000003_0 0.0% reduce > copy >
    [exec] [junit] 09/06/05 13:46:01 INFO mapred.TaskTracker: attempt_200906051335_0004_m_000002_0 0.0% map > map
    [exec] [junit] 09/06/05 13:46:01 INFO mapred.TaskTracker: attempt_200906051335_0005_m_000003_0 0.0% map > map
    [exec] [junit] 09/06/05 13:46:01 INFO mapred.TaskTracker: attempt_200906051335_0003_m_000000_0 0.0% map > map
    [exec] [junit] 09/06/05 13:46:01 INFO mapred.TaskTracker: attempt_200906051335_0005_m_000000_0 0.0% map > map
    [exec] [junit] 09/06/05 13:46:01 INFO mapred.TaskTracker: attempt_200906051335_0004_r_000000_0 0.0% reduce > copy >
    [exec] [junit] 09/06/05 13:46:01 INFO mapred.TaskTracker: attempt_200906051335_0004_r_000001_0 0.0% reduce > copy >
    [exec] [junit] 09/06/05 13:46:01 INFO mapred.TaskTracker: attempt_200906051335_0003_m_000001_0 0.0% map > map
    [exec] [junit] 09/06/05 13:46:02 INFO mapred.TaskTracker: attempt_200906051335_0005_m_000001_0 0.0% map > map
    [exec] [junit] 09/06/05 13:46:02 INFO mapred.TaskTracker: attempt_200906051335_0003_r_000000_0 0.0% reduce > copy >
    [exec] [junit] 09/06/05 13:46:02 INFO mapred.TaskTracker: attempt_200906051335_0004_m_000000_0 0.0% map > map
    [exec] [junit] 09/06/05 13:46:02 INFO mapred.TaskTracker: attempt_200906051335_0005_m_000002_0 0.0% map > map
    [exec] [junit] 09/06/05 13:46:03 INFO mapred.TaskTracker: attempt_200906051335_0003_r_000001_0 0.0% reduce > copy >
    [exec] [junit] 09/06/05 13:46:03 INFO mapred.TaskTracker: attempt_200906051335_0005_r_000000_0 0.0% reduce > copy >
    [exec] [junit] 09/06/05 13:46:03 INFO mapred.TaskTracker: attempt_200906051335_0004_m_000001_0 0.0% map > map
    [exec] [junit] 09/06/05 13:46:04 INFO mapred.TaskTracker: attempt_200906051335_0004_m_000002_0 0.0% map > map
    [exec] [junit] 09/06/05 13:46:04 INFO mapred.TaskTracker: attempt_200906051335_0005_m_000003_0 0.0% map > map
    [exec] [junit] 09/06/05 13:46:04 INFO mapred.TaskTracker: attempt_200906051335_0003_m_000000_0 0.0% map > map
    [exec] [junit] 09/06/05 13:46:04 INFO mapred.TaskTracker: attempt_200906051335_0004_r_000002_0 0.0% reduce > copy >
    [exec] [junit] 09/06/05 13:46:04 INFO mapred.TaskTracker: attempt_200906051335_0005_m_000000_0 0.0% map > map
    [exec] [junit] 09/06/05 13:46:04 INFO mapred.TaskTracker: attempt_200906051335_0005_r_000001_0 0.0% reduce > copy >
    [exec] [junit] 09/06/05 13:46:04 INFO mapred.TaskTracker: attempt_200906051335_0003_m_000001_0 0.0% map > map
    [exec] [junit] 09/06/05 13:46:05 INFO mapred.TaskTracker: attempt_200906051335_0005_m_000001_0 0.0% map > map
    [exec] [junit] 09/06/05 13:46:05 INFO mapred.TaskTracker: attempt_200906051335_0005_r_000002_0 0.0% reduce > copy >
    [exec] [junit] 09/06/05 13:46:05 INFO mapred.TaskTracker: attempt_200906051335_0004_m_000000_0 0.0% map > map
    [exec] [junit] 09/06/05 13:46:05 INFO mapred.TaskTracker: attempt_200906051335_0005_m_000002_0 0.0% map > map
    [exec] [junit] 09/06/05 13:46:06 INFO mapred.TaskTracker: attempt_200906051335_0004_m_000001_0 0.0% map > map
    [exec] [junit] 09/06/05 13:46:07 INFO mapred.TaskTracker: attempt_200906051335_0005_r_000003_0 0.0% reduce > copy >
    [exec] [junit] 09/06/05 13:46:07 INFO mapred.TaskTracker: attempt_200906051335_0004_m_000002_0 0.0% map > map
    [exec] [junit] 09/06/05 13:46:07 INFO mapred.TaskTracker: attempt_200906051335_0005_m_000003_0 0.0% map > map
    [exec] [junit] 09/06/05 13:46:07 INFO mapred.TaskTracker: attempt_200906051335_0003_m_000000_0 0.0% map > map
    [exec] [junit] 09/06/05 13:46:07 INFO mapred.TaskTracker: attempt_200906051335_0005_m_000000_0 0.0% map > map
    [exec] [junit] 09/06/05 13:46:07 INFO mapred.TaskTracker: attempt_200906051335_0004_r_000000_0 0.0% reduce > copy >
    [exec] [junit] 09/06/05 13:46:07 INFO mapred.TaskTracker: attempt_200906051335_0004_r_000001_0 0.0% reduce > copy >
    [exec] [junit] 09/06/05 13:46:07 INFO mapred.TaskTracker: attempt_200906051335_0003_m_000001_0 0.0% map > map
    [exec] [junit] 09/06/05 13:46:08 INFO mapred.TaskTracker: attempt_200906051335_0005_m_000001_0 0.0% map > map
    [exec] [junit] 09/06/05 13:46:08 INFO mapred.TaskTracker: attempt_200906051335_0003_r_000000_0 0.0% reduce > copy >
    [exec] [junit] 09/06/05 13:46:08 INFO mapred.TaskTracker: attempt_200906051335_0004_m_000000_0 0.0% map > map
    [exec] [junit] 09/06/05 13:46:08 INFO mapred.TaskTracker: attempt_200906051335_0005_m_000002_0 0.0% map > map
    [exec] [junit] 09/06/05 13:46:09 INFO mapred.TaskTracker: attempt_200906051335_0003_r_000001_0 0.0% reduce > copy >
    [exec] [junit] 09/06/05 13:46:09 INFO mapred.TaskTracker: attempt_200906051335_0005_r_000000_0 0.0% reduce > copy >
    [exec] [junit] 09/06/05 13:46:09 INFO mapred.TaskTracker: attempt_200906051335_0004_m_000001_0 0.0% map > map
    [exec] [junit] 09/06/05 13:46:10 INFO mapred.TaskTracker: attempt_200906051335_0004_m_000002_0 0.0% map > map
    [exec] [junit] 09/06/05 13:46:10 INFO mapred.TaskTracker: attempt_200906051335_0005_m_000003_0 0.0% map > map
    [exec] [junit] 09/06/05 13:46:10 INFO mapred.TaskTracker: attempt_200906051335_0003_m_000000_0 0.0% map > map
    [exec] [junit] 09/06/05 13:46:10 INFO mapred.TaskTracker: attempt_200906051335_0004_r_000002_0 0.0% reduce > copy >
    [exec] [junit] 09/06/05 13:46:10 INFO mapred.TaskTracker: attempt_200906051335_0005_m_000000_0 0.0% map > map
    [exec] [junit] 09/06/05 13:46:10 INFO mapred.TaskTracker: attempt_200906051335_0004_r_000000_0 0.0% reduce > copy >
    [exec] [junit] 09/06/05 13:46:10 INFO mapred.TaskTracker: attempt_200906051335_0005_r_000001_0 0.0% reduce > copy >
    [exec] [junit] 09/06/05 13:46:10 INFO mapred.TaskTracker: attempt_200906051335_0004_r_000001_0 0.0% reduce > copy >
    [exec] [junit] 09/06/05 13:46:10 INFO mapred.TaskTracker: attempt_200906051335_0003_m_000001_0 0.0% map > map
    [exec] [junit] 09/06/05 13:46:11 INFO mapred.TaskTracker: attempt_200906051335_0005_m_000001_0 0.0% map > map
    [exec] [junit] 09/06/05 13:46:11 INFO mapred.TaskTracker: attempt_200906051335_0003_r_000000_0 0.0% reduce > copy >
    [exec] [junit] 09/06/05 13:46:11 INFO mapred.TaskTracker: attempt_200906051335_0005_r_000002_0 0.0% reduce > copy >
    [exec] [junit] 09/06/05 13:46:11 INFO mapred.TaskTracker: attempt_200906051335_0004_m_000000_0 0.0% map > map
    [exec] [junit] 09/06/05 13:46:11 INFO mapred.TaskTracker: attempt_200906051335_0005_m_000002_0 0.0% map > map
    [exec] [junit] 09/06/05 13:46:12 INFO mapred.TaskTracker: attempt_200906051335_0003_r_000001_0 0.0% reduce > copy >
    [exec] [junit] 09/06/05 13:46:12 INFO mapred.TaskTracker: attempt_200906051335_0005_r_000000_0 0.0% reduce > copy >
    [exec] [junit] 09/06/05 13:46:12 INFO mapred.TaskTracker: attempt_200906051335_0004_m_000001_0 0.0% map > map
    [exec] [junit] 09/06/05 13:46:13 INFO mapred.TaskTracker: attempt_200906051335_0005_r_000003_0 0.0% reduce > copy >
    [exec] [junit] 09/06/05 13:46:13 INFO mapred.TaskTracker: attempt_200906051335_0004_m_000002_0 0.0% map > map
    [exec] [junit] 09/06/05 13:46:13 INFO mapred.TaskTracker: attempt_200906051335_0005_m_000003_0 0.0% map > map
    [exec] [junit] 09/06/05 13:46:13 INFO mapred.TaskTracker: attempt_200906051335_0003_m_000000_0 0.0% map > map
    [exec] [junit] 09/06/05 13:46:13 INFO mapred.TaskTracker: attempt_200906051335_0004_r_000002_0 0.0% reduce > copy >
    [exec] [junit] 09/06/05 13:46:13 INFO mapred.TaskTracker: attempt_200906051335_0005_m_000000_0 0.0% map > map
    [exec] [junit] 09/06/05 13:46:13 INFO mapred.TaskTracker: attempt_200906051335_0005_r_000001_0 0.0% reduce > copy >
    [exec] [junit] 09/06/05 13:46:13 INFO mapred.TaskTracker: attempt_200906051335_0003_m_000001_0 0.0% map > map
    [exec] [junit] 09/06/05 13:46:14 INFO mapred.TaskTracker: attempt_200906051335_0005_m_000001_0 0.0% map > map
    [exec] [junit] 09/06/05 13:46:14 INFO mapred.TaskTracker: attempt_200906051335_0005_r_000002_0 0.0% reduce > copy >
    [exec] [junit] 09/06/05 13:46:14 INFO mapred.TaskTracker: attempt_200906051335_0004_m_000000_0 0.0% map > map
    [exec] [junit] 09/06/05 13:46:14 INFO mapred.TaskTracker: attempt_200906051335_0005_m_000002_0 0.0% map > map
    [exec] [junit] 09/06/05 13:46:15 INFO mapred.TaskTracker: attempt_200906051335_0004_m_000001_0 0.0% map > map
    [exec] [junit] 09/06/05 13:46:16 INFO mapred.TaskTracker: attempt_200906051335_0005_r_000003_0 0.0% reduce > copy >
    [exec] [junit] 09/06/05 13:46:16 INFO mapred.TaskTracker: attempt_200906051335_0004_m_000002_0 0.0% map > map
    [exec] [junit] 09/06/05 13:46:16 INFO mapred.TaskTracker: attempt_200906051335_0005_m_000003_0 0.0% map > map
    [exec] [junit] 09/06/05 13:46:16 INFO mapred.TaskTracker: attempt_200906051335_0003_m_000000_0 0.0% map > map
    [exec] [junit] 09/06/05 13:46:16 INFO mapred.TaskTracker: attempt_200906051335_0005_m_000000_0 0.0% map > map
    [exec] [junit] 09/06/05 13:46:16 INFO mapred.TaskTracker: attempt_200906051335_0004_r_000000_0 0.0% reduce > copy >
    [exec] [junit] 09/06/05 13:46:16 INFO mapred.TaskTracker: attempt_200906051335_0004_r_000001_0 0.0% reduce > copy >
    [exec] [junit] 09/06/05 13:46:16 INFO mapred.TaskTracker: attempt_200906051335_0003_m_000001_0 0.0% map > map
    [exec] [junit] 09/06/05 13:46:17 INFO mapred.TaskTracker: attempt_200906051335_0005_m_000001_0 0.0% map > map
    [exec] [junit] 09/06/05 13:46:17 INFO mapred.TaskTracker: attempt_200906051335_0003_r_000000_0 0.0% reduce > copy >
    [exec] [junit] 09/06/05 13:46:17 INFO mapred.TaskTracker: attempt_200906051335_0004_m_000000_0 0.0% map > map
    [exec] [junit] 09/06/05 13:46:17 INFO mapred.TaskTracker: attempt_200906051335_0005_m_000002_0 0.0% map > map
    [exec] [junit] 09/06/05 13:46:18 INFO mapred.TaskTracker: attempt_200906051335_0003_r_000001_0 0.0% reduce > copy >
    [exec] [junit] 09/06/05 13:46:18 INFO mapred.TaskTracker: attempt_200906051335_0005_r_000000_0 0.0% reduce > copy >
    [exec] [junit] 09/06/05 13:46:18 INFO mapred.TaskTracker: attempt_200906051335_0004_m_000001_0 0.0% map > map
    [exec] [junit] 09/06/05 13:46:19 INFO mapred.TaskTracker: attempt_200906051335_0004_m_000002_0 0.0% map > map
    [exec] [junit] 09/06/05 13:46:19 INFO mapred.TaskTracker: attempt_200906051335_0005_m_000003_0 0.0% map > map
    [exec] [junit] 09/06/05 13:46:19 INFO mapred.TaskTracker: attempt_200906051335_0003_m_000000_0 0.0% map > map
    [exec] [junit] 09/06/05 13:46:19 INFO mapred.TaskTracker: attempt_200906051335_0004_r_000002_0 0.0% reduce > copy >
    [exec] [junit] 09/06/05 13:46:19 INFO mapred.TaskTracker: attempt_200906051335_0005_m_000000_0 0.0% map > map
    [exec] [junit] 09/06/05 13:46:19 INFO mapred.TaskTracker: attempt_200906051335_0005_r_000001_0 0.0% reduce > copy >
    [exec] [junit] 09/06/05 13:46:19 INFO mapred.TaskTracker: attempt_200906051335_0003_m_000001_0 0.0% map > map
    [exec] [junit] 09/06/05 13:46:20 INFO mapred.TaskTracker: attempt_200906051335_0005_m_000001_0 0.0% map > map
    [exec] [junit] 09/06/05 13:46:20 INFO mapred.TaskTracker: attempt_200906051335_0005_r_000002_0 0.0% reduce > copy >
    [exec] [junit] 09/06/05 13:46:20 INFO mapred.TaskTracker: attempt_200906051335_0004_m_000000_0 0.0% map > map
    [exec] [junit] 09/06/05 13:46:20 INFO mapred.TaskTracker: attempt_200906051335_0005_m_000002_0 0.0% map > map
    [exec] [junit] 09/06/05 13:46:21 INFO mapred.TaskTracker: attempt_200906051335_0004_m_000001_0 0.0% map > map
    [exec] [junit] 09/06/05 13:46:22 INFO mapred.TaskTracker: attempt_200906051335_0005_r_000003_0 0.0% reduce > copy >
    [exec] [junit] 09/06/05 13:46:22 INFO mapred.TaskTracker: attempt_200906051335_0004_m_000002_0 0.0% map > map
    [exec] [junit] 09/06/05 13:46:22 INFO mapred.TaskTracker: attempt_200906051335_0005_m_000003_0 0.0% map > map
    [exec] [junit] 09/06/05 13:46:22 INFO mapred.TaskTracker: attempt_200906051335_0003_m_000000_0 0.0% map > map
    [exec] [junit] 09/06/05 13:46:22 INFO mapred.TaskTracker: attempt_200906051335_0005_m_000000_0 0.0% map > map
    [exec] [junit] 09/06/05 13:46:22 INFO mapred.TaskTracker: attempt_200906051335_0004_r_000000_0 0.0% reduce > copy >
    [exec] [junit] 09/06/05 13:46:22 INFO mapred.TaskTracker: attempt_200906051335_0004_r_000001_0 0.0% reduce > copy >
    [exec] [junit] 09/06/05 13:46:22 INFO mapred.TaskTracker: attempt_200906051335_0003_m_000001_0 0.0% map > map
    [exec] [junit] 09/06/05 13:46:23 INFO mapred.TaskTracker: attempt_200906051335_0005_m_000001_0 0.0% map > map
    [exec] [junit] Running org.apache.hadoop.mapred.TestQueueCapacities
    [exec] [junit] Tests run: 1, Failures: 0, Errors: 1, Time elapsed: 0 sec
    [exec] [junit] Test org.apache.hadoop.mapred.TestQueueCapacities FAILED (timeout)
    [exec]
    [exec] BUILD FAILED
    [exec] http://hudson.zones.apache.org/hudson/job/Hadoop-Patch-vesta.apache.org/ws/trunk/build.xml :1030: The following error occurred while executing this line:
    [exec] http://hudson.zones.apache.org/hudson/job/Hadoop-Patch-vesta.apache.org/ws/trunk/src/contrib/build.xml :48: The following error occurred while executing this line:
    [exec] http://hudson.zones.apache.org/hudson/job/Hadoop-Patch-vesta.apache.org/ws/trunk/src/contrib/build-contrib.xml :250: Tests failed!
    [exec]
    [exec] Total time: 26 minutes 43 seconds
    [exec]
    [exec]
    [exec]
    [exec]
    [exec] -1 overall. Here are the results of testing the latest attachment
    [exec] http://issues.apache.org/jira/secure/attachment/12409749/hadoop-3315-0602.patch
    [exec] against trunk revision 781916.
    [exec]
    [exec] +1 @author. The patch does not contain any @author tags.
    [exec]
    [exec] +1 tests included. The patch appears to include 43 new or modified tests.
    [exec]
    [exec] -1 javadoc. The javadoc tool appears to have generated 1 warning messages.
    [exec]
    [exec] +1 javac. The applied patch does not increase the total number of javac compiler warnings.
    [exec]
    [exec] +1 findbugs. The patch does not introduce any new Findbugs warnings.
    [exec]
    [exec] +1 Eclipse classpath. The patch retains Eclipse classpath integrity.
    [exec]
    [exec] +1 release audit. The applied patch does not increase the total number of release audit warnings.
    [exec]
    [exec] -1 core tests. The patch failed core unit tests.
    [exec]
    [exec] -1 contrib tests. The patch failed contrib unit tests.
    [exec]
    [exec] Test results: http://hudson.zones.apache.org/hudson/job/Hadoop-Patch-vesta.apache.org/466/testReport/
    [exec] Findbugs warnings: http://hudson.zones.apache.org/hudson/job/Hadoop-Patch-vesta.apache.org/466/artifact/trunk/build/test/findbugs/newPatchFindbugsWarnings.html
    [exec] Checkstyle results: http://hudson.zones.apache.org/hudson/job/Hadoop-Patch-vesta.apache.org/466/artifact/trunk/build/test/checkstyle-errors.html
    [exec] Console output: http://hudson.zones.apache.org/hudson/job/Hadoop-Patch-vesta.apache.org/466/console
    [exec]
    [exec] This message is automatically generated.
    [exec]
    [exec]
    [exec] ======================================================================
    [exec] ======================================================================
    [exec] Adding comment to Jira.
    [exec] ======================================================================
    [exec] ======================================================================
    [exec]
    [exec]
    [exec] % Total % Received % Xferd Average Speed Time Time Time Current
    [exec] Dload Upload Total Spent Left Speed
    [exec]
    [exec] 0 0 0 0 0 0 0 0 --:--:-- --:--:-- --:--:-- 0 0 0 0 0 0 0 0 0 --:--:-- --:--:-- --:--:-- 0
    [exec]
    [exec]
    [exec] ======================================================================
    [exec] ======================================================================
    [exec] Finished build.
    [exec] ======================================================================
    [exec] ======================================================================
    [exec]
    [exec]

    BUILD FAILED
    http://hudson.zones.apache.org/hudson/job/Hadoop-Patch-vesta.apache.org/ws/trunk/build.xml :1878: exec returned: 3

    Total time: 287 minutes 5 seconds
    Recording test results
    Description found: HADOOP-3315
  • Apache Hudson Server at Jun 5, 2009 at 5:48 pm
    See http://hudson.zones.apache.org/hudson/job/Hadoop-Patch-vesta.apache.org/467/changes

    Changes:

    [gkesavan] HADOOP-5457. Fix to continue to run builds even if contrib test fails.

    ------------------------------------------
    started
    Building remotely on vesta.apache.org (Ubuntu)
    Updating http://svn.apache.org/repos/asf/hadoop/core/trunk
    U CHANGES.txt
    U src/contrib/build-contrib.xml
    U src/contrib/build.xml
    At revision 782076
    [Hadoop-Patch-vesta.apache.org] $ /bin/bash -xe /tmp/hudson5411477040409652264.sh
    + set +x
    /home/hudson/tools/java/latest1.6/bin/java
    Buildfile: build.xml

    check-for-findbugs:

    findbugs.check:

    java5.check:

    forrest.check:

    hudson-test-patch:
    [exec]
    [exec]
    [exec] ======================================================================
    [exec] ======================================================================
    [exec] Testing patch for HADOOP-5785.
    [exec] ======================================================================
    [exec] ======================================================================
    [exec]
    [exec]
    [exec] Reverted 'src/test/findbugsExcludeFile.xml'
    [exec] Reverted 'src/c++/pipes/configure'
    [exec] Reverted 'src/c++/pipes/Makefile.in'
    [exec] Reverted 'src/c++/pipes/depcomp'
    [exec] Reverted 'src/c++/pipes/config.guess'
    [exec] Reverted 'src/c++/pipes/ltmain.sh'
    [exec] Reverted 'src/c++/pipes/config.sub'
    [exec] Reverted 'src/c++/pipes/impl/config.h.in'
    [exec] Reverted 'src/c++/pipes/missing'
    [exec] Reverted 'src/c++/pipes/aclocal.m4'
    [exec] Reverted 'src/c++/pipes/install-sh'
    [exec] Reverted 'src/c++/utils/configure'
    [exec] Reverted 'src/c++/utils/Makefile.in'
    [exec] Reverted 'src/c++/utils/depcomp'
    [exec] Reverted 'src/c++/utils/config.guess'
    [exec] Reverted 'src/c++/utils/ltmain.sh'
    [exec] Reverted 'src/c++/utils/config.sub'
    [exec] Reverted 'src/c++/utils/impl/config.h.in'
    [exec] Reverted 'src/c++/utils/missing'
    [exec] Reverted 'src/c++/utils/aclocal.m4'
    [exec] Reverted 'src/c++/utils/install-sh'
    [exec] Reverted 'src/examples/pipes/configure'
    [exec] Reverted 'src/examples/pipes/Makefile.in'
    [exec] Reverted 'src/examples/pipes/depcomp'
    [exec] Reverted 'src/examples/pipes/config.guess'
    [exec] Reverted 'src/examples/pipes/ltmain.sh'
    [exec] Reverted 'src/examples/pipes/config.sub'
    [exec] Reverted 'src/examples/pipes/impl/config.h.in'
    [exec] Reverted 'src/examples/pipes/missing'
    [exec] Reverted 'src/examples/pipes/aclocal.m4'
    [exec] Reverted 'src/examples/pipes/install-sh'
    [exec] Reverted 'build.xml'
    [exec] At revision 782076.
    [exec] HADOOP-5785 patch is being downloaded at Fri Jun 5 18:03:33 UTC 2009 from
    [exec] http://issues.apache.org/jira/secure/attachment/12409758/patch-5785-1.txt
    [exec]
    [exec]
    [exec] ======================================================================
    [exec] ======================================================================
    [exec] Pre-building trunk to determine trunk number
    [exec] of release audit, javac, and Findbugs warnings.
    [exec] ======================================================================
    [exec] ======================================================================
    [exec]
    [exec]
    [exec] /home/hudson/tools/ant/latest/bin/ant -Dversion=781968_HADOOP-5785_PATCH-12409758 -Djava5.home=/home/hudson/tools/java/latest1.5 -Dforrest.home=/home/nigel/tools/forrest/latest -DHadoopPatchProcess= releaseaudit > http://hudson.zones.apache.org/hudson/job/Hadoop-Patch-vesta.apache.org/ws/patchprocess/trunkReleaseAuditWarnings.txt 2>&1
    [exec] /home/hudson/tools/ant/latest/bin/ant -Dversion=781968_HADOOP-5785_PATCH-12409758 -Djavac.args=-Xlint -Xmaxwarns 1000 -Declipse.home=/home/nigel/tools/eclipse/latest -Djava5.home=/home/hudson/tools/java/latest1.5 -Dforrest.home=/home/nigel/tools/forrest/latest -DHadoopPatchProcess= clean tar > http://hudson.zones.apache.org/hudson/job/Hadoop-Patch-vesta.apache.org/ws/patchprocess/trunkJavacWarnings.txt 2>&1
    [exec] /home/hudson/tools/ant/latest/bin/ant -Dversion=781968_HADOOP-5785_PATCH-12409758 -Dfindbugs.home=/home/nigel/tools/findbugs/latest -Djava5.home=/home/hudson/tools/java/latest1.5 -Dforrest.home=/home/nigel/tools/forrest/latest -DHadoopPatchProcess= findbugs > /dev/null 2>&1
    [exec]
    [exec]
    [exec] ======================================================================
    [exec] ======================================================================
    [exec] Checking there are no @author tags in the patch.
    [exec] ======================================================================
    [exec] ======================================================================
    [exec]
    [exec]
    [exec] There appear to be 0 @author tags in the patch.
    [exec]
    [exec]
    [exec] ======================================================================
    [exec] ======================================================================
    [exec] Checking there are new or changed tests in the patch.
    [exec] ======================================================================
    [exec] ======================================================================
    [exec]
    [exec]
    [exec] There appear to be 18 test files referenced in the patch.
    [exec]
    [exec]
    [exec] ======================================================================
    [exec] ======================================================================
    [exec] Applying patch.
    [exec] ======================================================================
    [exec] ======================================================================
    [exec]
    [exec]
    [exec] patching file src/contrib/capacity-scheduler/src/java/org/apache/hadoop/mapred/CapacityTaskScheduler.java
    [exec] Reversed (or previously applied) patch detected! Assume -R? [n]
    [exec] Apply anyway? [n]
    [exec] Skipping patch.
    [exec] 3 out of 3 hunks ignored -- saving rejects to file src/contrib/capacity-scheduler/src/java/org/apache/hadoop/mapred/CapacityTaskScheduler.java.rej
    [exec] patching file src/contrib/capacity-scheduler/src/java/org/apache/hadoop/mapred/JobInitializationPoller.java
    [exec] patching file src/contrib/capacity-scheduler/src/test/org/apache/hadoop/mapred/TestCapacityScheduler.java
    [exec] Hunk #1 succeeded at 97 (offset -2 lines).
    [exec] Hunk #2 succeeded at 475 (offset -2 lines).
    [exec] Hunk #3 succeeded at 728 (offset -2 lines).
    [exec] Hunk #4 succeeded at 756 (offset -2 lines).
    [exec] Hunk #5 succeeded at 776 (offset -2 lines).
    [exec] Hunk #6 succeeded at 806 (offset -2 lines).
    [exec] patching file src/contrib/fairscheduler/src/java/org/apache/hadoop/mapred/FairScheduler.java
    [exec] patching file src/contrib/fairscheduler/src/test/org/apache/hadoop/mapred/TestFairScheduler.java
    [exec] patching file src/mapred/mapred-default.xml
    [exec] patching file src/mapred/org/apache/hadoop/mapred/EagerTaskInitializationListener.java
    [exec] patching file src/mapred/org/apache/hadoop/mapred/JobInProgress.java
    [exec] Hunk #1 succeeded at 101 (offset 6 lines).
    [exec] Hunk #2 succeeded at 182 (offset 6 lines).
    [exec] Hunk #3 FAILED at 265.
    [exec] Hunk #4 succeeded at 468 (offset 11 lines).
    [exec] Hunk #5 succeeded at 512 (offset 11 lines).
    [exec] Hunk #6 succeeded at 1114 (offset 11 lines).
    [exec] Hunk #7 succeeded at 1202 (offset 11 lines).
    [exec] Hunk #8 succeeded at 2131 (offset 55 lines).
    [exec] Hunk #9 succeeded at 2146 (offset 55 lines).
    [exec] Hunk #10 succeeded at 2257 (offset 55 lines).
    [exec] Hunk #11 succeeded at 2568 (offset 55 lines).
    [exec] Hunk #12 succeeded at 2602 (offset 55 lines).
    [exec] Hunk #13 succeeded at 2616 (offset 55 lines).
    [exec] 1 out of 13 hunks FAILED -- saving rejects to file src/mapred/org/apache/hadoop/mapred/JobInProgress.java.rej
    [exec] patching file src/mapred/org/apache/hadoop/mapred/JobQueueTaskScheduler.java
    [exec] patching file src/mapred/org/apache/hadoop/mapred/JobTracker.java
    [exec] patching file src/mapred/org/apache/hadoop/mapred/TaskTrackerManager.java
    [exec] patching file src/test/mapred/org/apache/hadoop/mapred/MiniMRCluster.java
    [exec] patching file src/test/mapred/org/apache/hadoop/mapred/TestJobQueueTaskScheduler.java
    [exec] patching file src/test/mapred/org/apache/hadoop/mapred/TestMiniMRWithDFS.java
    [exec] patching file src/test/mapred/org/apache/hadoop/mapred/TestParallelInitialization.java
    [exec] PATCH APPLICATION FAILED
    [exec]
    [exec]
    [exec]
    [exec]
    [exec] -1 overall. Here are the results of testing the latest attachment
    [exec] http://issues.apache.org/jira/secure/attachment/12409758/patch-5785-1.txt
    [exec] against trunk revision 781968.
    [exec]
    [exec] +1 @author. The patch does not contain any @author tags.
    [exec]
    [exec] +1 tests included. The patch appears to include 18 new or modified tests.
    [exec]
    [exec] -1 patch. The patch command could not apply the patch.
    [exec]
    [exec] Console output: http://hudson.zones.apache.org/hudson/job/Hadoop-Patch-vesta.apache.org/467/console
    [exec]
    [exec] This message is automatically generated.
    [exec]
    [exec]
    [exec] ======================================================================
    [exec] ======================================================================
    [exec] Adding comment to Jira.
    [exec] ======================================================================
    [exec] ======================================================================
    [exec]
    [exec]
    [exec] % Total % Received % Xferd Average Speed Time Time Time Current
    [exec] Dload Upload Total Spent Left Speed
    [exec]
    [exec]
    [exec]
    [exec] ======================================================================
    [exec] ======================================================================
    [exec] Finished build.
    [exec] ======================================================================
    [exec] ======================================================================
    [exec]
    [exec]
    [exec] 0 0 0 0 0 0 0 0 --:--:-- --:--:-- --:--:-- 0 0 0 0 0 0 0 0 0 --:--:-- --:--:-- --:--:-- 0

    BUILD FAILED
    http://hudson.zones.apache.org/hudson/job/Hadoop-Patch-vesta.apache.org/ws/trunk/build.xml :1880: exec returned: 1

    Total time: 5 minutes 42 seconds
    Recording test results
    Description found: HADOOP-5785
  • Apache Hudson Server at Jun 5, 2009 at 5:56 pm
    See http://hudson.zones.apache.org/hudson/job/Hadoop-Patch-vesta.apache.org/468/

    ------------------------------------------
    started
    Building remotely on vesta.apache.org (Ubuntu)
    Updating http://svn.apache.org/repos/asf/hadoop/core/trunk
    At revision 782082
    no change for http://svn.apache.org/repos/asf/hadoop/core/trunk since the previous build
    [Hadoop-Patch-vesta.apache.org] $ /bin/bash -xe /tmp/hudson2703098684514949009.sh
    + set +x
    /home/hudson/tools/java/latest1.6/bin/java
    Buildfile: build.xml

    check-for-findbugs:

    findbugs.check:

    java5.check:

    forrest.check:

    hudson-test-patch:
    [exec]
    [exec]
    [exec] ======================================================================
    [exec] ======================================================================
    [exec] Testing patch for HADOOP-5884.
    [exec] ======================================================================
    [exec] ======================================================================
    [exec]
    [exec]
    [exec] Reverted 'src/test/mapred/org/apache/hadoop/mapred/TestParallelInitialization.java'
    [exec] Reverted 'src/test/mapred/org/apache/hadoop/mapred/MiniMRCluster.java'
    [exec] Reverted 'src/test/mapred/org/apache/hadoop/mapred/TestJobQueueTaskScheduler.java'
    [exec] Reverted 'src/test/mapred/org/apache/hadoop/mapred/TestMiniMRWithDFS.java'
    [exec] Reverted 'src/contrib/fairscheduler/src/test/org/apache/hadoop/mapred/TestFairScheduler.java'
    [exec] Reverted 'src/contrib/fairscheduler/src/java/org/apache/hadoop/mapred/FairScheduler.java'
    [exec] Reverted 'src/contrib/capacity-scheduler/src/test/org/apache/hadoop/mapred/TestCapacityScheduler.java'
    [exec] Reverted 'src/contrib/capacity-scheduler/src/java/org/apache/hadoop/mapred/JobInitializationPoller.java'
    [exec] Reverted 'src/mapred/org/apache/hadoop/mapred/JobInProgress.java'
    [exec] Reverted 'src/mapred/org/apache/hadoop/mapred/JobTracker.java'
    [exec] Reverted 'src/mapred/org/apache/hadoop/mapred/TaskTrackerManager.java'
    [exec] Reverted 'src/mapred/org/apache/hadoop/mapred/JobQueueTaskScheduler.java'
    [exec] Reverted 'src/mapred/org/apache/hadoop/mapred/EagerTaskInitializationListener.java'
    [exec] Reverted 'src/mapred/mapred-default.xml'
    [exec] At revision 782082.
    [exec] HADOOP-5884 is not "Patch Available". Exiting.
    [exec] % Total % Received % Xferd Average Speed Time Time Time Current
    [exec] Dload Upload Total Spent Left Speed
    [exec]
    [exec]
    [exec]
    [exec] ======================================================================
    [exec] ======================================================================
    [exec] Finished build.
    [exec] ======================================================================
    [exec] 0 0 0 0 0 0 0 0 --:--:-- --:--:-- --:--:-- 0 0 0 0 0 0 0 0 0 --:--:-- --:--:-- --:--:-- 0
    [exec] ======================================================================
    [exec]
    [exec]

    BUILD SUCCESSFUL
    Total time: 2 seconds
    ERROR: No artifacts found that match the file pattern "trunk/build/test/checkstyle-errors.html,trunk/build/test/findbugs/newPatchFindbugsWarnings.html,trunk/patchprocess/*Warnings.txt,trunk/patchprocess/*Warnings.xml,trunk/build/contrib/hdfsproxy/target/logs/output.log". Configuration error?
    ERROR: 'trunk/build/test/checkstyle-errors.html' doesn't match anything: 'trunk' exists but not 'trunk/build/test/checkstyle-errors.html'
    Recording test results
    Description found: HADOOP-5884
  • Apache Hudson Server at Jun 5, 2009 at 10:12 pm
    See http://hudson.zones.apache.org/hudson/job/Hadoop-Patch-vesta.apache.org/469/changes

    Changes:

    [rangadi] HADOOP-5961. DataNode process understand generic hadoop command line
    options (like -Ddfs.property=value). (Raghu Angadi)

    ------------------------------------------
    [...truncated 428731 lines...]
    [exec]
    [exec] ivy-init-antlib:
    [exec]
    [exec] ivy-init:
    [exec] :: loading settings :: file = http://hudson.zones.apache.org/hudson/job/Hadoop-Patch-vesta.apache.org/ws/trunk/ivy/ivysettings.xml
    [exec]
    [exec] ivy-resolve-common:
    [exec] [ivy:resolve] :: resolving dependencies :: org.apache.hadoop#vaidya;working@vesta.apache.org
    [exec] [ivy:resolve] confs: [common]
    [exec] [ivy:resolve] found commons-logging#commons-logging;1.0.4 in maven2
    [exec] [ivy:resolve] found log4j#log4j;1.2.15 in maven2
    [exec] [ivy:resolve] :: resolution report :: resolve 18ms :: artifacts dl 1ms
    [exec] ---------------------------------------------------------------------
    [exec] | | modules || artifacts |
    [exec] | conf | number| search|dwnlded|evicted|| number|dwnlded|
    [exec] ---------------------------------------------------------------------
    [exec] | common | 2 | 0 | 0 | 0 || 2 | 0 |
    [exec] ---------------------------------------------------------------------
    [exec]
    [exec] ivy-retrieve-common:
    [exec] [ivy:retrieve] :: retrieving :: org.apache.hadoop#vaidya [sync]
    [exec] [ivy:retrieve] confs: [common]
    [exec] [ivy:retrieve] 0 artifacts copied, 2 already retrieved (0kB/1ms)
    [exec] No ivy:settings found for the default reference 'ivy.instance'. A default instance will be used
    [exec] DEPRECATED: 'ivy.conf.file' is deprecated, use 'ivy.settings.file' instead
    [exec] :: loading settings :: file = http://hudson.zones.apache.org/hudson/job/Hadoop-Patch-vesta.apache.org/ws/trunk/ivy/ivysettings.xml
    [exec]
    [exec] compile:
    [exec] [echo] contrib: vaidya
    [exec]
    [exec] compile-ant-tasks:
    [exec]
    [exec] compile-tools:
    [exec]
    [exec] compile:
    [exec]
    [exec] create-c++-examples-pipes-makefile:
    [exec]
    [exec] compile-c++-examples-pipes:
    [exec]
    [exec] compile-c++-examples:
    [exec]
    [exec] compile-examples:
    [exec]
    [exec] generate-test-records:
    [exec]
    [exec] compile-core-test:
    [exec] [javac] Compiling 7 source files to http://hudson.zones.apache.org/hudson/job/Hadoop-Patch-vesta.apache.org/ws/trunk/build/test/core/classes
    [exec] [javac] Note: Some input files use unchecked or unsafe operations.
    [exec] [javac] Note: Recompile with -Xlint:unchecked for details.
    [exec] [delete] Deleting directory http://hudson.zones.apache.org/hudson/job/Hadoop-Patch-vesta.apache.org/ws/trunk/build/test/cache
    [exec] [mkdir] Created dir: http://hudson.zones.apache.org/hudson/job/Hadoop-Patch-vesta.apache.org/ws/trunk/build/test/cache
    [exec] [copy] Copying 1 file to http://hudson.zones.apache.org/hudson/job/Hadoop-Patch-vesta.apache.org/ws/trunk/build/test/cache
    [exec]
    [exec] compile-hdfs-test:
    [exec] [delete] Deleting directory http://hudson.zones.apache.org/hudson/job/Hadoop-Patch-vesta.apache.org/ws/trunk/build/test/cache
    [exec] [mkdir] Created dir: http://hudson.zones.apache.org/hudson/job/Hadoop-Patch-vesta.apache.org/ws/trunk/build/test/cache
    [exec] [copy] Copying 1 file to http://hudson.zones.apache.org/hudson/job/Hadoop-Patch-vesta.apache.org/ws/trunk/build/test/cache
    [exec] [copy] Copying 1 file to http://hudson.zones.apache.org/hudson/job/Hadoop-Patch-vesta.apache.org/ws/trunk/build/test/cache
    [exec] [copy] Copying 1 file to http://hudson.zones.apache.org/hudson/job/Hadoop-Patch-vesta.apache.org/ws/trunk/build/test/cache
    [exec] [copy] Copying 1 file to http://hudson.zones.apache.org/hudson/job/Hadoop-Patch-vesta.apache.org/ws/trunk/build/test/cache
    [exec] [copy] Copying 1 file to http://hudson.zones.apache.org/hudson/job/Hadoop-Patch-vesta.apache.org/ws/trunk/build/test/cache
    [exec] [copy] Copying 1 file to http://hudson.zones.apache.org/hudson/job/Hadoop-Patch-vesta.apache.org/ws/trunk/build/test/cache
    [exec] [copy] Copying 1 file to http://hudson.zones.apache.org/hudson/job/Hadoop-Patch-vesta.apache.org/ws/trunk/build/test/cache
    [exec] [copy] Copying 1 file to http://hudson.zones.apache.org/hudson/job/Hadoop-Patch-vesta.apache.org/ws/trunk/build/test/cache
    [exec] [copy] Copying 1 file to http://hudson.zones.apache.org/hudson/job/Hadoop-Patch-vesta.apache.org/ws/trunk/build/test/cache
    [exec] [copy] Copying 1 file to http://hudson.zones.apache.org/hudson/job/Hadoop-Patch-vesta.apache.org/ws/trunk/build/test/cache
    [exec]
    [exec] compile-mapred-test:
    [exec] [javac] Compiling 1 source file to http://hudson.zones.apache.org/hudson/job/Hadoop-Patch-vesta.apache.org/ws/trunk/build/test/mapred/classes
    [exec] [javac] Compiling 5 source files to http://hudson.zones.apache.org/hudson/job/Hadoop-Patch-vesta.apache.org/ws/trunk/build/test/mapred/testjar
    [exec] [javac] Note: Some input files use or override a deprecated API.
    [exec] [javac] Note: Recompile with -Xlint:deprecation for details.
    [exec] [delete] Deleting: http://hudson.zones.apache.org/hudson/job/Hadoop-Patch-vesta.apache.org/ws/trunk/build/test/mapred/testjar/testjob.jar
    [exec] [jar] Building jar: http://hudson.zones.apache.org/hudson/job/Hadoop-Patch-vesta.apache.org/ws/trunk/build/test/mapred/testjar/testjob.jar
    [exec] [javac] Compiling 1 source file to http://hudson.zones.apache.org/hudson/job/Hadoop-Patch-vesta.apache.org/ws/trunk/build/test/mapred/testshell
    [exec] [javac] Note: http://hudson.zones.apache.org/hudson/job/Hadoop-Patch-vesta.apache.org/ws/trunk/src/test/mapred/testshell/ExternalMapReduce.java uses or overrides a deprecated API.
    [exec] [javac] Note: Recompile with -Xlint:deprecation for details.
    [exec] [delete] Deleting: http://hudson.zones.apache.org/hudson/job/Hadoop-Patch-vesta.apache.org/ws/trunk/build/test/mapred/testshell/testshell.jar
    [exec] [jar] Building jar: http://hudson.zones.apache.org/hudson/job/Hadoop-Patch-vesta.apache.org/ws/trunk/build/test/mapred/testshell/testshell.jar
    [exec] [delete] Deleting directory http://hudson.zones.apache.org/hudson/job/Hadoop-Patch-vesta.apache.org/ws/trunk/build/test/cache
    [exec] [mkdir] Created dir: http://hudson.zones.apache.org/hudson/job/Hadoop-Patch-vesta.apache.org/ws/trunk/build/test/cache
    [exec] [delete] Deleting directory http://hudson.zones.apache.org/hudson/job/Hadoop-Patch-vesta.apache.org/ws/trunk/build/test/debug
    [exec] [mkdir] Created dir: http://hudson.zones.apache.org/hudson/job/Hadoop-Patch-vesta.apache.org/ws/trunk/build/test/debug
    [exec] [copy] Copying 1 file to http://hudson.zones.apache.org/hudson/job/Hadoop-Patch-vesta.apache.org/ws/trunk/build/test/debug
    [exec] [copy] Copying 1 file to http://hudson.zones.apache.org/hudson/job/Hadoop-Patch-vesta.apache.org/ws/trunk/build/test/cache
    [exec] [copy] Copying 1 file to http://hudson.zones.apache.org/hudson/job/Hadoop-Patch-vesta.apache.org/ws/trunk/build/test/cache
    [exec] [copy] Copying 1 file to http://hudson.zones.apache.org/hudson/job/Hadoop-Patch-vesta.apache.org/ws/trunk/build/test/cache
    [exec] [copy] Copying 1 file to http://hudson.zones.apache.org/hudson/job/Hadoop-Patch-vesta.apache.org/ws/trunk/build/test/cache
    [exec] [copy] Copying 1 file to http://hudson.zones.apache.org/hudson/job/Hadoop-Patch-vesta.apache.org/ws/trunk/build/test/cache
    [exec] [copy] Copying 1 file to http://hudson.zones.apache.org/hudson/job/Hadoop-Patch-vesta.apache.org/ws/trunk/build/test/cache
    [exec] [copy] Copying 1 file to http://hudson.zones.apache.org/hudson/job/Hadoop-Patch-vesta.apache.org/ws/trunk/build/test/cache
    [exec] [copy] Copying 1 file to http://hudson.zones.apache.org/hudson/job/Hadoop-Patch-vesta.apache.org/ws/trunk/build/test/cache
    [exec]
    [exec] compile-hdfs-with-mr-test:
    [exec]
    [exec] test-contrib:
    [exec]
    [exec] test:
    [exec] Trying to override old definition of task macro_tar
    [exec]
    [exec] check-contrib:
    [exec]
    [exec] init:
    [exec] [echo] contrib: hdfsproxy
    [exec]
    [exec] init-contrib:
    [exec]
    [exec] ivy-download:
    [exec] [get] Getting: http://repo2.maven.org/maven2/org/apache/ivy/ivy/2.0.0-rc2/ivy-2.0.0-rc2.jar
    [exec] [get] To: http://hudson.zones.apache.org/hudson/job/Hadoop-Patch-vesta.apache.org/ws/trunk/ivy/ivy-2.0.0-rc2.jar
    [exec] [get] Not modified - so not downloaded
    [exec]
    [exec] ivy-probe-antlib:
    [exec]
    [exec] ivy-init-antlib:
    [exec]
    [exec] ivy-init:
    [exec]
    [exec] ivy-resolve-common:
    [exec] :: loading settings :: file = http://hudson.zones.apache.org/hudson/job/Hadoop-Patch-vesta.apache.org/ws/trunk/ivy/ivysettings.xml
    [exec] [ivy:resolve] :: resolving dependencies :: org.apache.hadoop#hdfsproxy;working@vesta.apache.org
    [exec] [ivy:resolve] confs: [common]
    [exec] [ivy:resolve] found commons-cli#commons-cli;1.2 in maven2
    [exec] [ivy:resolve] found log4j#log4j;1.2.15 in maven2
    [exec] [ivy:resolve] found commons-logging#commons-logging;1.1 in maven2
    [exec] [ivy:resolve] found commons-logging#commons-logging-api;1.0.4 in maven2
    [exec] [ivy:resolve] found junit#junit;3.8.2 in maven2
    [exec] [ivy:resolve] found org.slf4j#slf4j-api;1.4.3 in maven2
    [exec] [ivy:resolve] found org.slf4j#slf4j-log4j12;1.4.3 in maven2
    [exec] [ivy:resolve] found xmlenc#xmlenc;0.52 in maven2
    [exec] [ivy:resolve] found org.mortbay.jetty#jetty;6.1.14 in maven2
    [exec] [ivy:resolve] found org.mortbay.jetty#jetty-util;6.1.14 in maven2
    [exec] [ivy:resolve] found org.mortbay.jetty#servlet-api-2.5;6.1.14 in maven2
    [exec] [ivy:resolve] found org.eclipse.jdt#core;3.1.1 in maven2
    [exec] [ivy:resolve] found org.apache.cactus#cactus.core.framework.uberjar.javaEE.14;1.8.0 in maven2
    [exec] [ivy:resolve] found org.apache.cactus#cactus.integration.ant;1.8.0 in maven2
    [exec] [ivy:resolve] found org.apache.cactus#cactus.integration.shared.api;1.8.0 in maven2
    [exec] [ivy:resolve] found commons-httpclient#commons-httpclient;3.1 in maven2
    [exec] [ivy:resolve] found commons-io#commons-io;1.4 in maven2
    [exec] [ivy:resolve] found commons-lang#commons-lang;2.3 in maven2
    [exec] [ivy:resolve] found commons-codec#commons-codec;1.3 in maven2
    [exec] [ivy:resolve] found aspectj#aspectjrt;1.5.3 in maven2
    [exec] [ivy:resolve] found org.codehaus.cargo#cargo-core-uberjar;0.9 in maven2
    [exec] [ivy:resolve] found org.codehaus.cargo#cargo-ant;0.9 in maven2
    [exec] [ivy:resolve] found javax.servlet#jsp-api;2.0 in maven2
    [exec] [ivy:resolve] found javax.servlet#servlet-api;2.5 in maven2
    [exec] [ivy:resolve] found javax.servlet#jstl;1.1.2 in maven2
    [exec] [ivy:resolve] found taglibs#standard;1.1.2 in maven2
    [exec] [ivy:resolve] found junitperf#junitperf;1.8 in maven2
    [exec] [ivy:resolve] :: resolution report :: resolve 201ms :: artifacts dl 10ms
    [exec] ---------------------------------------------------------------------
    [exec] | | modules || artifacts |
    [exec] | conf | number| search|dwnlded|evicted|| number|dwnlded|
    [exec] ---------------------------------------------------------------------
    [exec] | common | 27 | 0 | 0 | 0 || 27 | 0 |
    [exec] ---------------------------------------------------------------------
    [exec]
    [exec] ivy-retrieve-common:
    [exec] [ivy:retrieve] :: retrieving :: org.apache.hadoop#hdfsproxy [sync]
    [exec] [ivy:retrieve] confs: [common]
    [exec] [ivy:retrieve] 0 artifacts copied, 27 already retrieved (0kB/7ms)
    [exec] No ivy:settings found for the default reference 'ivy.instance'. A default instance will be used
    [exec] :: loading settings :: file = http://hudson.zones.apache.org/hudson/job/Hadoop-Patch-vesta.apache.org/ws/trunk/ivy/ivysettings.xml
    [exec]
    [exec] compile:
    [exec] [echo] contrib: hdfsproxy
    [exec]
    [exec] compile-examples:
    [exec]
    [exec] compile-test:
    [exec] [echo] contrib: hdfsproxy
    [exec] [javac] Compiling 7 source files to http://hudson.zones.apache.org/hudson/job/Hadoop-Patch-vesta.apache.org/ws/trunk/build/contrib/hdfsproxy/test
    [exec]
    [exec] test-junit:
    [exec] [junit] Running org.apache.hadoop.hdfsproxy.TestHdfsProxy
    [exec] [junit] Tests run: 1, Failures: 0, Errors: 1, Time elapsed: 23.206 sec
    [exec] [junit] Test org.apache.hadoop.hdfsproxy.TestHdfsProxy FAILED
    [exec] [junit] Running org.apache.hadoop.hdfsproxy.TestProxyUgiManager
    [exec] [junit] Tests run: 3, Failures: 0, Errors: 0, Time elapsed: 4.126 sec
    [exec]
    [exec] BUILD FAILED
    [exec] http://hudson.zones.apache.org/hudson/job/Hadoop-Patch-vesta.apache.org/ws/trunk/build.xml :1028: The following error occurred while executing this line:
    [exec] http://hudson.zones.apache.org/hudson/job/Hadoop-Patch-vesta.apache.org/ws/trunk/src/contrib/build.xml :51: The following error occurred while executing this line:
    [exec] http://hudson.zones.apache.org/hudson/job/Hadoop-Patch-vesta.apache.org/ws/trunk/src/contrib/hdfsproxy/build.xml :224: Tests failed!
    [exec]
    [exec] Total time: 35 seconds
    [exec]
    [exec]
    [exec]
    [exec]
    [exec] -1 overall. Here are the results of testing the latest attachment
    [exec] http://issues.apache.org/jira/secure/attachment/12409797/HADOOP-5887.2.patch
    [exec] against trunk revision 782083.
    [exec]
    [exec] +1 @author. The patch does not contain any @author tags.
    [exec]
    [exec] +1 tests included. The patch appears to include 19 new or modified tests.
    [exec]
    [exec] +1 javadoc. The javadoc tool did not generate any warning messages.
    [exec]
    [exec] +1 javac. The applied patch does not increase the total number of javac compiler warnings.
    [exec]
    [exec] +1 findbugs. The patch does not introduce any new Findbugs warnings.
    [exec]
    [exec] +1 Eclipse classpath. The patch retains Eclipse classpath integrity.
    [exec]
    [exec] -1 release audit. The applied patch generated 496 release audit warnings (more than the trunk's current 492 warnings).
    [exec]
    [exec] -1 core tests. The patch failed core unit tests.
    [exec]
    [exec] -1 contrib tests. The patch failed contrib unit tests.
    [exec]
    [exec] Test results: http://hudson.zones.apache.org/hudson/job/Hadoop-Patch-vesta.apache.org/469/testReport/
    [exec] Release audit warnings: http://hudson.zones.apache.org/hudson/job/Hadoop-Patch-vesta.apache.org/469/artifact/trunk/patchprocess/releaseAuditDiffWarnings.txt
    [exec] Findbugs warnings: http://hudson.zones.apache.org/hudson/job/Hadoop-Patch-vesta.apache.org/469/artifact/trunk/build/test/findbugs/newPatchFindbugsWarnings.html
    [exec] Checkstyle results: http://hudson.zones.apache.org/hudson/job/Hadoop-Patch-vesta.apache.org/469/artifact/trunk/build/test/checkstyle-errors.html
    [exec] Console output: http://hudson.zones.apache.org/hudson/job/Hadoop-Patch-vesta.apache.org/469/console
    [exec]
    [exec] This message is automatically generated.
    [exec]
    [exec]
    [exec] ======================================================================
    [exec] ======================================================================
    [exec] Adding comment to Jira.
    [exec] ======================================================================
    [exec] ======================================================================
    [exec]
    [exec]
    [exec] % Total % Received % Xferd Average Speed Time Time Time Current
    [exec] Dload Upload Total Spent Left Speed
    [exec]
    [exec] 0 0 0 0 0 0 0 0 --:--:-- --:--:-- --:--:-- 0 0 0 0 0 0 0 0 0 --:--:-- --:--:-- --:--:-- 0
    [exec]
    [exec]
    [exec] ======================================================================
    [exec] ======================================================================
    [exec] Finished build.
    [exec] ======================================================================
    [exec] ======================================================================
    [exec]
    [exec]

    BUILD FAILED
    http://hudson.zones.apache.org/hudson/job/Hadoop-Patch-vesta.apache.org/ws/trunk/build.xml :1878: exec returned: 3

    Total time: 237 minutes 55 seconds
    Recording test results
    Description found: HADOOP-5887
  • Apache Hudson Server at Jun 6, 2009 at 2:16 am
    See http://hudson.zones.apache.org/hudson/job/Hadoop-Patch-vesta.apache.org/470/

    ------------------------------------------
    [...truncated 386861 lines...]
    [exec] ivy-probe-antlib:
    [exec]
    [exec] ivy-init-antlib:
    [exec]
    [exec] ivy-init:
    [exec] :: loading settings :: file = http://hudson.zones.apache.org/hudson/job/Hadoop-Patch-vesta.apache.org/ws/trunk/ivy/ivysettings.xml
    [exec]
    [exec] ivy-resolve-common:
    [exec] [ivy:resolve] :: resolving dependencies :: org.apache.hadoop#vaidya;working@vesta.apache.org
    [exec] [ivy:resolve] confs: [common]
    [exec] [ivy:resolve] found commons-logging#commons-logging;1.0.4 in maven2
    [exec] [ivy:resolve] found log4j#log4j;1.2.15 in maven2
    [exec] [ivy:resolve] :: resolution report :: resolve 18ms :: artifacts dl 1ms
    [exec] ---------------------------------------------------------------------
    [exec] | | modules || artifacts |
    [exec] | conf | number| search|dwnlded|evicted|| number|dwnlded|
    [exec] ---------------------------------------------------------------------
    [exec] | common | 2 | 0 | 0 | 0 || 2 | 0 |
    [exec] ---------------------------------------------------------------------
    [exec]
    [exec] ivy-retrieve-common:
    [exec] [ivy:retrieve] :: retrieving :: org.apache.hadoop#vaidya [sync]
    [exec] [ivy:retrieve] confs: [common]
    [exec] [ivy:retrieve] 0 artifacts copied, 2 already retrieved (0kB/1ms)
    [exec] No ivy:settings found for the default reference 'ivy.instance'. A default instance will be used
    [exec] DEPRECATED: 'ivy.conf.file' is deprecated, use 'ivy.settings.file' instead
    [exec] :: loading settings :: file = http://hudson.zones.apache.org/hudson/job/Hadoop-Patch-vesta.apache.org/ws/trunk/ivy/ivysettings.xml
    [exec]
    [exec] compile:
    [exec] [echo] contrib: vaidya
    [exec]
    [exec] compile-ant-tasks:
    [exec]
    [exec] compile-tools:
    [exec]
    [exec] compile:
    [exec]
    [exec] create-c++-examples-pipes-makefile:
    [exec]
    [exec] compile-c++-examples-pipes:
    [exec]
    [exec] compile-c++-examples:
    [exec]
    [exec] compile-examples:
    [exec]
    [exec] generate-test-records:
    [exec]
    [exec] compile-core-test:
    [exec] [javac] Compiling 7 source files to http://hudson.zones.apache.org/hudson/job/Hadoop-Patch-vesta.apache.org/ws/trunk/build/test/core/classes
    [exec] [javac] Note: Some input files use unchecked or unsafe operations.
    [exec] [javac] Note: Recompile with -Xlint:unchecked for details.
    [exec] [delete] Deleting directory http://hudson.zones.apache.org/hudson/job/Hadoop-Patch-vesta.apache.org/ws/trunk/build/test/cache
    [exec] [mkdir] Created dir: http://hudson.zones.apache.org/hudson/job/Hadoop-Patch-vesta.apache.org/ws/trunk/build/test/cache
    [exec] [copy] Copying 1 file to http://hudson.zones.apache.org/hudson/job/Hadoop-Patch-vesta.apache.org/ws/trunk/build/test/cache
    [exec]
    [exec] compile-hdfs-test:
    [exec] [delete] Deleting directory http://hudson.zones.apache.org/hudson/job/Hadoop-Patch-vesta.apache.org/ws/trunk/build/test/cache
    [exec] [mkdir] Created dir: http://hudson.zones.apache.org/hudson/job/Hadoop-Patch-vesta.apache.org/ws/trunk/build/test/cache
    [exec] [copy] Copying 1 file to http://hudson.zones.apache.org/hudson/job/Hadoop-Patch-vesta.apache.org/ws/trunk/build/test/cache
    [exec] [copy] Copying 1 file to http://hudson.zones.apache.org/hudson/job/Hadoop-Patch-vesta.apache.org/ws/trunk/build/test/cache
    [exec] [copy] Copying 1 file to http://hudson.zones.apache.org/hudson/job/Hadoop-Patch-vesta.apache.org/ws/trunk/build/test/cache
    [exec] [copy] Copying 1 file to http://hudson.zones.apache.org/hudson/job/Hadoop-Patch-vesta.apache.org/ws/trunk/build/test/cache
    [exec] [copy] Copying 1 file to http://hudson.zones.apache.org/hudson/job/Hadoop-Patch-vesta.apache.org/ws/trunk/build/test/cache
    [exec] [copy] Copying 1 file to http://hudson.zones.apache.org/hudson/job/Hadoop-Patch-vesta.apache.org/ws/trunk/build/test/cache
    [exec] [copy] Copying 1 file to http://hudson.zones.apache.org/hudson/job/Hadoop-Patch-vesta.apache.org/ws/trunk/build/test/cache
    [exec] [copy] Copying 1 file to http://hudson.zones.apache.org/hudson/job/Hadoop-Patch-vesta.apache.org/ws/trunk/build/test/cache
    [exec] [copy] Copying 1 file to http://hudson.zones.apache.org/hudson/job/Hadoop-Patch-vesta.apache.org/ws/trunk/build/test/cache
    [exec] [copy] Copying 1 file to http://hudson.zones.apache.org/hudson/job/Hadoop-Patch-vesta.apache.org/ws/trunk/build/test/cache
    [exec]
    [exec] compile-mapred-test:
    [exec] [javac] Compiling 1 source file to http://hudson.zones.apache.org/hudson/job/Hadoop-Patch-vesta.apache.org/ws/trunk/build/test/mapred/classes
    [exec] [javac] Compiling 5 source files to http://hudson.zones.apache.org/hudson/job/Hadoop-Patch-vesta.apache.org/ws/trunk/build/test/mapred/testjar
    [exec] [javac] Note: Some input files use or override a deprecated API.
    [exec] [javac] Note: Recompile with -Xlint:deprecation for details.
    [exec] [delete] Deleting: http://hudson.zones.apache.org/hudson/job/Hadoop-Patch-vesta.apache.org/ws/trunk/build/test/mapred/testjar/testjob.jar
    [exec] [jar] Building jar: http://hudson.zones.apache.org/hudson/job/Hadoop-Patch-vesta.apache.org/ws/trunk/build/test/mapred/testjar/testjob.jar
    [exec] [javac] Compiling 1 source file to http://hudson.zones.apache.org/hudson/job/Hadoop-Patch-vesta.apache.org/ws/trunk/build/test/mapred/testshell
    [exec] [javac] Note: http://hudson.zones.apache.org/hudson/job/Hadoop-Patch-vesta.apache.org/ws/trunk/src/test/mapred/testshell/ExternalMapReduce.java uses or overrides a deprecated API.
    [exec] [javac] Note: Recompile with -Xlint:deprecation for details.
    [exec] [delete] Deleting: http://hudson.zones.apache.org/hudson/job/Hadoop-Patch-vesta.apache.org/ws/trunk/build/test/mapred/testshell/testshell.jar
    [exec] [jar] Building jar: http://hudson.zones.apache.org/hudson/job/Hadoop-Patch-vesta.apache.org/ws/trunk/build/test/mapred/testshell/testshell.jar
    [exec] [delete] Deleting directory http://hudson.zones.apache.org/hudson/job/Hadoop-Patch-vesta.apache.org/ws/trunk/build/test/cache
    [exec] [mkdir] Created dir: http://hudson.zones.apache.org/hudson/job/Hadoop-Patch-vesta.apache.org/ws/trunk/build/test/cache
    [exec] [delete] Deleting directory http://hudson.zones.apache.org/hudson/job/Hadoop-Patch-vesta.apache.org/ws/trunk/build/test/debug
    [exec] [mkdir] Created dir: http://hudson.zones.apache.org/hudson/job/Hadoop-Patch-vesta.apache.org/ws/trunk/build/test/debug
    [exec] [copy] Copying 1 file to http://hudson.zones.apache.org/hudson/job/Hadoop-Patch-vesta.apache.org/ws/trunk/build/test/debug
    [exec] [copy] Copying 1 file to http://hudson.zones.apache.org/hudson/job/Hadoop-Patch-vesta.apache.org/ws/trunk/build/test/cache
    [exec] [copy] Copying 1 file to http://hudson.zones.apache.org/hudson/job/Hadoop-Patch-vesta.apache.org/ws/trunk/build/test/cache
    [exec] [copy] Copying 1 file to http://hudson.zones.apache.org/hudson/job/Hadoop-Patch-vesta.apache.org/ws/trunk/build/test/cache
    [exec] [copy] Copying 1 file to http://hudson.zones.apache.org/hudson/job/Hadoop-Patch-vesta.apache.org/ws/trunk/build/test/cache
    [exec] [copy] Copying 1 file to http://hudson.zones.apache.org/hudson/job/Hadoop-Patch-vesta.apache.org/ws/trunk/build/test/cache
    [exec] [copy] Copying 1 file to http://hudson.zones.apache.org/hudson/job/Hadoop-Patch-vesta.apache.org/ws/trunk/build/test/cache
    [exec] [copy] Copying 1 file to http://hudson.zones.apache.org/hudson/job/Hadoop-Patch-vesta.apache.org/ws/trunk/build/test/cache
    [exec] [copy] Copying 1 file to http://hudson.zones.apache.org/hudson/job/Hadoop-Patch-vesta.apache.org/ws/trunk/build/test/cache
    [exec]
    [exec] compile-hdfs-with-mr-test:
    [exec]
    [exec] test-contrib:
    [exec]
    [exec] test:
    [exec] Trying to override old definition of task macro_tar
    [exec]
    [exec] check-contrib:
    [exec]
    [exec] init:
    [exec] [echo] contrib: hdfsproxy
    [exec]
    [exec] init-contrib:
    [exec]
    [exec] ivy-download:
    [exec] [get] Getting: http://repo2.maven.org/maven2/org/apache/ivy/ivy/2.0.0-rc2/ivy-2.0.0-rc2.jar
    [exec] [get] To: http://hudson.zones.apache.org/hudson/job/Hadoop-Patch-vesta.apache.org/ws/trunk/ivy/ivy-2.0.0-rc2.jar
    [exec] [get] Not modified - so not downloaded
    [exec]
    [exec] ivy-probe-antlib:
    [exec]
    [exec] ivy-init-antlib:
    [exec]
    [exec] ivy-init:
    [exec]
    [exec] ivy-resolve-common:
    [exec] :: loading settings :: file = http://hudson.zones.apache.org/hudson/job/Hadoop-Patch-vesta.apache.org/ws/trunk/ivy/ivysettings.xml
    [exec] [ivy:resolve] :: resolving dependencies :: org.apache.hadoop#hdfsproxy;working@vesta.apache.org
    [exec] [ivy:resolve] confs: [common]
    [exec] [ivy:resolve] found commons-cli#commons-cli;1.2 in maven2
    [exec] [ivy:resolve] found log4j#log4j;1.2.15 in maven2
    [exec] [ivy:resolve] found commons-logging#commons-logging;1.1 in maven2
    [exec] [ivy:resolve] found commons-logging#commons-logging-api;1.0.4 in maven2
    [exec] [ivy:resolve] found junit#junit;3.8.2 in maven2
    [exec] [ivy:resolve] found org.slf4j#slf4j-api;1.4.3 in maven2
    [exec] [ivy:resolve] found org.slf4j#slf4j-log4j12;1.4.3 in maven2
    [exec] [ivy:resolve] found xmlenc#xmlenc;0.52 in maven2
    [exec] [ivy:resolve] found org.mortbay.jetty#jetty;6.1.14 in maven2
    [exec] [ivy:resolve] found org.mortbay.jetty#jetty-util;6.1.14 in maven2
    [exec] [ivy:resolve] found org.mortbay.jetty#servlet-api-2.5;6.1.14 in maven2
    [exec] [ivy:resolve] found org.eclipse.jdt#core;3.1.1 in maven2
    [exec] [ivy:resolve] found org.apache.cactus#cactus.core.framework.uberjar.javaEE.14;1.8.0 in maven2
    [exec] [ivy:resolve] found org.apache.cactus#cactus.integration.ant;1.8.0 in maven2
    [exec] [ivy:resolve] found org.apache.cactus#cactus.integration.shared.api;1.8.0 in maven2
    [exec] [ivy:resolve] found commons-httpclient#commons-httpclient;3.1 in maven2
    [exec] [ivy:resolve] found commons-io#commons-io;1.4 in maven2
    [exec] [ivy:resolve] found commons-lang#commons-lang;2.3 in maven2
    [exec] [ivy:resolve] found commons-codec#commons-codec;1.3 in maven2
    [exec] [ivy:resolve] found aspectj#aspectjrt;1.5.3 in maven2
    [exec] [ivy:resolve] found org.codehaus.cargo#cargo-core-uberjar;0.9 in maven2
    [exec] [ivy:resolve] found org.codehaus.cargo#cargo-ant;0.9 in maven2
    [exec] [ivy:resolve] found javax.servlet#jsp-api;2.0 in maven2
    [exec] [ivy:resolve] found javax.servlet#servlet-api;2.5 in maven2
    [exec] [ivy:resolve] found javax.servlet#jstl;1.1.2 in maven2
    [exec] [ivy:resolve] found taglibs#standard;1.1.2 in maven2
    [exec] [ivy:resolve] found junitperf#junitperf;1.8 in maven2
    [exec] [ivy:resolve] :: resolution report :: resolve 199ms :: artifacts dl 10ms
    [exec] ---------------------------------------------------------------------
    [exec] | | modules || artifacts |
    [exec] | conf | number| search|dwnlded|evicted|| number|dwnlded|
    [exec] ---------------------------------------------------------------------
    [exec] | common | 27 | 0 | 0 | 0 || 27 | 0 |
    [exec] ---------------------------------------------------------------------
    [exec]
    [exec] ivy-retrieve-common:
    [exec] [ivy:retrieve] :: retrieving :: org.apache.hadoop#hdfsproxy [sync]
    [exec] [ivy:retrieve] confs: [common]
    [exec] [ivy:retrieve] 0 artifacts copied, 27 already retrieved (0kB/7ms)
    [exec] No ivy:settings found for the default reference 'ivy.instance'. A default instance will be used
    [exec] :: loading settings :: file = http://hudson.zones.apache.org/hudson/job/Hadoop-Patch-vesta.apache.org/ws/trunk/ivy/ivysettings.xml
    [exec]
    [exec] compile:
    [exec] [echo] contrib: hdfsproxy
    [exec]
    [exec] compile-examples:
    [exec]
    [exec] compile-test:
    [exec] [echo] contrib: hdfsproxy
    [exec] [javac] Compiling 7 source files to http://hudson.zones.apache.org/hudson/job/Hadoop-Patch-vesta.apache.org/ws/trunk/build/contrib/hdfsproxy/test
    [exec]
    [exec] test-junit:
    [exec] [junit] Running org.apache.hadoop.hdfsproxy.TestHdfsProxy
    [exec] [junit] Tests run: 1, Failures: 0, Errors: 1, Time elapsed: 26.81 sec
    [exec] [junit] Test org.apache.hadoop.hdfsproxy.TestHdfsProxy FAILED
    [exec] [junit] Running org.apache.hadoop.hdfsproxy.TestProxyUgiManager
    [exec] [junit] Tests run: 3, Failures: 0, Errors: 0, Time elapsed: 4.166 sec
    [exec]
    [exec] BUILD FAILED
    [exec] http://hudson.zones.apache.org/hudson/job/Hadoop-Patch-vesta.apache.org/ws/trunk/build.xml :1028: The following error occurred while executing this line:
    [exec] http://hudson.zones.apache.org/hudson/job/Hadoop-Patch-vesta.apache.org/ws/trunk/src/contrib/build.xml :51: The following error occurred while executing this line:
    [exec] http://hudson.zones.apache.org/hudson/job/Hadoop-Patch-vesta.apache.org/ws/trunk/src/contrib/hdfsproxy/build.xml :224: Tests failed!
    [exec]
    [exec] Total time: 39 seconds
    [exec]
    [exec]
    [exec]
    [exec]
    [exec] -1 overall. Here are the results of testing the latest attachment
    [exec] http://issues.apache.org/jira/secure/attachment/12409811/HADOOP-4768-6.patch
    [exec] against trunk revision 782083.
    [exec]
    [exec] +1 @author. The patch does not contain any @author tags.
    [exec]
    [exec] +1 tests included. The patch appears to include 13 new or modified tests.
    [exec]
    [exec] +1 javadoc. The javadoc tool did not generate any warning messages.
    [exec]
    [exec] +1 javac. The applied patch does not increase the total number of javac compiler warnings.
    [exec]
    [exec] +1 findbugs. The patch does not introduce any new Findbugs warnings.
    [exec]
    [exec] +1 Eclipse classpath. The patch retains Eclipse classpath integrity.
    [exec]
    [exec] +1 release audit. The applied patch does not increase the total number of release audit warnings.
    [exec]
    [exec] +1 core tests. The patch passed core unit tests.
    [exec]
    [exec] -1 contrib tests. The patch failed contrib unit tests.
    [exec]
    [exec] Test results: http://hudson.zones.apache.org/hudson/job/Hadoop-Patch-vesta.apache.org/470/testReport/
    [exec] Findbugs warnings: http://hudson.zones.apache.org/hudson/job/Hadoop-Patch-vesta.apache.org/470/artifact/trunk/build/test/findbugs/newPatchFindbugsWarnings.html
    [exec] Checkstyle results: http://hudson.zones.apache.org/hudson/job/Hadoop-Patch-vesta.apache.org/470/artifact/trunk/build/test/checkstyle-errors.html
    [exec] Console output: http://hudson.zones.apache.org/hudson/job/Hadoop-Patch-vesta.apache.org/470/console
    [exec]
    [exec] This message is automatically generated.
    [exec]
    [exec]
    [exec] ======================================================================
    [exec] ======================================================================
    [exec] Adding comment to Jira.
    [exec] ======================================================================
    [exec] ======================================================================
    [exec]
    [exec]
    [exec] % Total % Received % Xferd Average Speed Time Time Time Current
    [exec] Dload Upload Total Spent Left Speed
    [exec]
    [exec] 0 0 0 0 0 0 0 0 --:--:-- --:--:-- --:--:-- 0 0 0 0 0 0 0 0 0 --:--:-- --:--:-- --:--:-- 0
    [exec]
    [exec]
    [exec] ======================================================================
    [exec] ======================================================================
    [exec] Finished build.
    [exec] ======================================================================
    [exec] ======================================================================
    [exec]
    [exec]

    BUILD FAILED
    http://hudson.zones.apache.org/hudson/job/Hadoop-Patch-vesta.apache.org/ws/trunk/build.xml :1878: exec returned: 1

    Total time: 242 minutes 58 seconds
    Recording test results
    Description found: HADOOP-4768

Related Discussions

Discussion Navigation
viewthread | post
Discussion Overview
groupcommon-dev @
categorieshadoop
postedJun 4, '09 at 1:18p
activeJun 6, '09 at 2:16a
posts9
users1
websitehadoop.apache.org...
irc#hadoop

1 user in discussion

Apache Hudson Server: 9 posts

People

Translate

site design / logo © 2022 Grokbase