FAQ
See <http://hudson.zones.apache.org/hudson/job/Cayenne-30/./cayenneTestConnection=HSQLDB,jdk=JDK%201.6%20(latest)/1/>

------------------------------------------
[...truncated 76975 lines...]
[INFO] [compiler:compile]
[INFO] No sources to compile
[INFO] [resources:testResources]
[INFO] Using default encoding to copy filtered resources.
[INFO] [compiler:testCompile]
[INFO] No sources to compile
[INFO] [surefire:test]
[INFO] No tests to run.
[INFO] [jar:jar]
[INFO] Building jar: /zonestorage/hudson/home/hudson/hudson/jobs/Cayenne-30/workspace/cayenneTestConnection/HSQLDB/jdk/JDK 1.6 (latest)/STABLE-3.0/modeler/cayenne-modeler-java/target/cayenne-modeler-java-3.0-SNAPSHOT.jar
[INFO] [install:install]
[INFO] Installing /zonestorage/hudson/home/hudson/hudson/jobs/Cayenne-30/workspace/cayenneTestConnection/HSQLDB/jdk/JDK 1.6 (latest)/STABLE-3.0/modeler/cayenne-modeler-java/target/cayenne-modeler-java-3.0-SNAPSHOT.jar to /export/home/hudson/.m2/repository/org/apache/cayenne/cayenne-modeler-java/3.0-SNAPSHOT/cayenne-modeler-java-3.0-SNAPSHOT.jar
[INFO] ------------------------------------------------------------------------
[INFO] Building Cayenne Modeler Parent
[INFO] task-segment: [clean, install]
[INFO] ------------------------------------------------------------------------
[INFO] [clean:clean]
[INFO] [site:attach-descriptor]
[INFO] [install:install]
[INFO] Installing /zonestorage/hudson/home/hudson/hudson/jobs/Cayenne-30/workspace/cayenneTestConnection/HSQLDB/jdk/JDK 1.6 (latest)/STABLE-3.0/modeler/pom.xml to /export/home/hudson/.m2/repository/org/apache/cayenne/parents/cayenne-modeler-parent/3.0-SNAPSHOT/cayenne-modeler-parent-3.0-SNAPSHOT.pom
[INFO] ------------------------------------------------------------------------
[INFO] Building Cayenne Tutorial
[INFO] task-segment: [clean, install]
[INFO] ------------------------------------------------------------------------
[INFO] [clean:clean]
[INFO] [resources:resources]
[INFO] Using default encoding to copy filtered resources.
[INFO] [compiler:compile]
[INFO] Compiling 9 source files to /zonestorage/hudson/home/hudson/hudson/jobs/Cayenne-30/workspace/cayenneTestConnection/HSQLDB/jdk/JDK 1.6 (latest)/STABLE-3.0/tutorials/tutorial/target/classes
[INFO] ------------------------------------------------------------------------
[ERROR] BUILD FAILURE
[INFO] ------------------------------------------------------------------------
[INFO] Compilation failure

/zonestorage/hudson/home/hudson/hudson/jobs/Cayenne-30/workspace/cayenneTestConnection/HSQLDB/jdk/JDK 1.6 (latest)/STABLE-3.0/tutorials/tutorial/src/main/java/org/apache/cayenne/tutorial/persistent/auto/_Painting.java:[3,25] cannot find symbol
symbol : class CayenneDataObject
location: package org.apache.cayenne

/zonestorage/hudson/home/hudson/hudson/jobs/Cayenne-30/workspace/cayenneTestConnection/HSQLDB/jdk/JDK 1.6 (latest)/STABLE-3.0/tutorials/tutorial/src/main/java/org/apache/cayenne/tutorial/persistent/auto/_Painting.java:[13,40] cannot find symbol
symbol: class CayenneDataObject
public abstract class _Painting extends CayenneDataObject {

/zonestorage/hudson/home/hudson/hudson/jobs/Cayenne-30/workspace/cayenneTestConnection/HSQLDB/jdk/JDK 1.6 (latest)/STABLE-3.0/tutorials/tutorial/src/main/java/org/apache/cayenne/tutorial/persistent/auto/_Artist.java:[6,25] cannot find symbol
symbol : class CayenneDataObject
location: package org.apache.cayenne

/zonestorage/hudson/home/hudson/hudson/jobs/Cayenne-30/workspace/cayenneTestConnection/HSQLDB/jdk/JDK 1.6 (latest)/STABLE-3.0/tutorials/tutorial/src/main/java/org/apache/cayenne/tutorial/persistent/auto/_Artist.java:[15,38] cannot find symbol
symbol: class CayenneDataObject
public abstract class _Artist extends CayenneDataObject {

/zonestorage/hudson/home/hudson/hudson/jobs/Cayenne-30/workspace/cayenneTestConnection/HSQLDB/jdk/JDK 1.6 (latest)/STABLE-3.0/tutorials/tutorial/src/main/java/org/apache/cayenne/tutorial/persistent/auto/_Gallery.java:[5,25] cannot find symbol
symbol : class CayenneDataObject
location: package org.apache.cayenne

/zonestorage/hudson/home/hudson/hudson/jobs/Cayenne-30/workspace/cayenneTestConnection/HSQLDB/jdk/JDK 1.6 (latest)/STABLE-3.0/tutorials/tutorial/src/main/java/org/apache/cayenne/tutorial/persistent/auto/_Gallery.java:[14,39] cannot find symbol
symbol: class CayenneDataObject
public abstract class _Gallery extends CayenneDataObject {

/zonestorage/hudson/home/hudson/hudson/jobs/Cayenne-30/workspace/cayenneTestConnection/HSQLDB/jdk/JDK 1.6 (latest)/STABLE-3.0/tutorials/tutorial/src/main/java/org/apache/cayenne/tutorial/Main.java:[26,25] cannot find symbol
symbol : class DataObjectUtils
location: package org.apache.cayenne

/zonestorage/hudson/home/hudson/hudson/jobs/Cayenne-30/workspace/cayenneTestConnection/HSQLDB/jdk/JDK 1.6 (latest)/STABLE-3.0/tutorials/tutorial/src/main/java/org/apache/cayenne/tutorial/Main.java:[27,25] cannot find symbol
symbol : class ObjectContext
location: package org.apache.cayenne

/zonestorage/hudson/home/hudson/hudson/jobs/Cayenne-30/workspace/cayenneTestConnection/HSQLDB/jdk/JDK 1.6 (latest)/STABLE-3.0/tutorials/tutorial/src/main/java/org/apache/cayenne/tutorial/Main.java:[28,32] package org.apache.cayenne.access does not exist

/zonestorage/hudson/home/hudson/hudson/jobs/Cayenne-30/workspace/cayenneTestConnection/HSQLDB/jdk/JDK 1.6 (latest)/STABLE-3.0/tutorials/tutorial/src/main/java/org/apache/cayenne/tutorial/Main.java:[29,29] package org.apache.cayenne.exp does not exist

/zonestorage/hudson/home/hudson/hudson/jobs/Cayenne-30/workspace/cayenneTestConnection/HSQLDB/jdk/JDK 1.6 (latest)/STABLE-3.0/tutorials/tutorial/src/main/java/org/apache/cayenne/tutorial/Main.java:[30,29] package org.apache.cayenne.exp does not exist

/zonestorage/hudson/home/hudson/hudson/jobs/Cayenne-30/workspace/cayenneTestConnection/HSQLDB/jdk/JDK 1.6 (latest)/STABLE-3.0/tutorials/tutorial/src/main/java/org/apache/cayenne/tutorial/Main.java:[31,31] package org.apache.cayenne.query does not exist

/zonestorage/hudson/home/hudson/hudson/jobs/Cayenne-30/workspace/cayenneTestConnection/HSQLDB/jdk/JDK 1.6 (latest)/STABLE-3.0/tutorials/tutorial/src/main/java/org/apache/cayenne/tutorial/Main.java:[48,32] cannot find symbol
symbol : class ObjectContext
location: class org.apache.cayenne.tutorial.Main

/zonestorage/hudson/home/hudson/hudson/jobs/Cayenne-30/workspace/cayenneTestConnection/HSQLDB/jdk/JDK 1.6 (latest)/STABLE-3.0/tutorials/tutorial/src/main/java/org/apache/cayenne/tutorial/Main.java:[76,28] cannot find symbol
symbol : class ObjectContext
location: class org.apache.cayenne.tutorial.Main

/zonestorage/hudson/home/hudson/hudson/jobs/Cayenne-30/workspace/cayenneTestConnection/HSQLDB/jdk/JDK 1.6 (latest)/STABLE-3.0/tutorials/tutorial/src/main/java/org/apache/cayenne/tutorial/Main.java:[97,28] cannot find symbol
symbol : class ObjectContext
location: class org.apache.cayenne.tutorial.Main

/zonestorage/hudson/home/hudson/hudson/jobs/Cayenne-30/workspace/cayenneTestConnection/HSQLDB/jdk/JDK 1.6 (latest)/STABLE-3.0/tutorials/tutorial/src/main/java/org/apache/cayenne/tutorial/persistent/auto/_Painting.java:[22,8] cannot find symbol
symbol : method writeProperty(java.lang.String,java.lang.String)
location: class org.apache.cayenne.tutorial.persistent.auto._Painting

/zonestorage/hudson/home/hudson/hudson/jobs/Cayenne-30/workspace/cayenneTestConnection/HSQLDB/jdk/JDK 1.6 (latest)/STABLE-3.0/tutorials/tutorial/src/main/java/org/apache/cayenne/tutorial/persistent/auto/_Painting.java:[25,23] cannot find symbol
symbol : method readProperty(java.lang.String)
location: class org.apache.cayenne.tutorial.persistent.auto._Painting

/zonestorage/hudson/home/hudson/hudson/jobs/Cayenne-30/workspace/cayenneTestConnection/HSQLDB/jdk/JDK 1.6 (latest)/STABLE-3.0/tutorials/tutorial/src/main/java/org/apache/cayenne/tutorial/persistent/auto/_Painting.java:[29,8] cannot find symbol
symbol : method setToOneTarget(java.lang.String,org.apache.cayenne.tutorial.persistent.Artist,boolean)
location: class org.apache.cayenne.tutorial.persistent.auto._Painting

/zonestorage/hudson/home/hudson/hudson/jobs/Cayenne-30/workspace/cayenneTestConnection/HSQLDB/jdk/JDK 1.6 (latest)/STABLE-3.0/tutorials/tutorial/src/main/java/org/apache/cayenne/tutorial/persistent/auto/_Painting.java:[33,23] cannot find symbol
symbol : method readProperty(java.lang.String)
location: class org.apache.cayenne.tutorial.persistent.auto._Painting

/zonestorage/hudson/home/hudson/hudson/jobs/Cayenne-30/workspace/cayenneTestConnection/HSQLDB/jdk/JDK 1.6 (latest)/STABLE-3.0/tutorials/tutorial/src/main/java/org/apache/cayenne/tutorial/persistent/auto/_Painting.java:[38,8] cannot find symbol
symbol : method setToOneTarget(java.lang.String,org.apache.cayenne.tutorial.persistent.Gallery,boolean)
location: class org.apache.cayenne.tutorial.persistent.auto._Painting

/zonestorage/hudson/home/hudson/hudson/jobs/Cayenne-30/workspace/cayenneTestConnection/HSQLDB/jdk/JDK 1.6 (latest)/STABLE-3.0/tutorials/tutorial/src/main/java/org/apache/cayenne/tutorial/persistent/auto/_Painting.java:[42,24] cannot find symbol
symbol : method readProperty(java.lang.String)
location: class org.apache.cayenne.tutorial.persistent.auto._Painting

/zonestorage/hudson/home/hudson/hudson/jobs/Cayenne-30/workspace/cayenneTestConnection/HSQLDB/jdk/JDK 1.6 (latest)/STABLE-3.0/tutorials/tutorial/src/main/java/org/apache/cayenne/tutorial/persistent/auto/_Artist.java:[24,8] cannot find symbol
symbol : method writeProperty(java.lang.String,java.util.Date)
location: class org.apache.cayenne.tutorial.persistent.auto._Artist

/zonestorage/hudson/home/hudson/hudson/jobs/Cayenne-30/workspace/cayenneTestConnection/HSQLDB/jdk/JDK 1.6 (latest)/STABLE-3.0/tutorials/tutorial/src/main/java/org/apache/cayenne/tutorial/persistent/auto/_Artist.java:[27,21] cannot find symbol
symbol : method readProperty(java.lang.String)
location: class org.apache.cayenne.tutorial.persistent.auto._Artist

/zonestorage/hudson/home/hudson/hudson/jobs/Cayenne-30/workspace/cayenneTestConnection/HSQLDB/jdk/JDK 1.6 (latest)/STABLE-3.0/tutorials/tutorial/src/main/java/org/apache/cayenne/tutorial/persistent/auto/_Artist.java:[31,8] cannot find symbol
symbol : method writeProperty(java.lang.String,java.lang.String)
location: class org.apache.cayenne.tutorial.persistent.auto._Artist

/zonestorage/hudson/home/hudson/hudson/jobs/Cayenne-30/workspace/cayenneTestConnection/HSQLDB/jdk/JDK 1.6 (latest)/STABLE-3.0/tutorials/tutorial/src/main/java/org/apache/cayenne/tutorial/persistent/auto/_Artist.java:[34,23] cannot find symbol
symbol : method readProperty(java.lang.String)
location: class org.apache.cayenne.tutorial.persistent.auto._Artist

/zonestorage/hudson/home/hudson/hudson/jobs/Cayenne-30/workspace/cayenneTestConnection/HSQLDB/jdk/JDK 1.6 (latest)/STABLE-3.0/tutorials/tutorial/src/main/java/org/apache/cayenne/tutorial/persistent/auto/_Artist.java:[38,8] cannot find symbol
symbol : method addToManyTarget(java.lang.String,org.apache.cayenne.tutorial.persistent.Painting,boolean)
location: class org.apache.cayenne.tutorial.persistent.auto._Artist

/zonestorage/hudson/home/hudson/hudson/jobs/Cayenne-30/workspace/cayenneTestConnection/HSQLDB/jdk/JDK 1.6 (latest)/STABLE-3.0/tutorials/tutorial/src/main/java/org/apache/cayenne/tutorial/persistent/auto/_Artist.java:[41,8] cannot find symbol
symbol : method removeToManyTarget(java.lang.String,org.apache.cayenne.tutorial.persistent.Painting,boolean)
location: class org.apache.cayenne.tutorial.persistent.auto._Artist

/zonestorage/hudson/home/hudson/hudson/jobs/Cayenne-30/workspace/cayenneTestConnection/HSQLDB/jdk/JDK 1.6 (latest)/STABLE-3.0/tutorials/tutorial/src/main/java/org/apache/cayenne/tutorial/persistent/auto/_Artist.java:[44,16] type parameter org.apache.cayenne.tutorial.persistent.Painting is not within its bound

/zonestorage/hudson/home/hudson/hudson/jobs/Cayenne-30/workspace/cayenneTestConnection/HSQLDB/jdk/JDK 1.6 (latest)/STABLE-3.0/tutorials/tutorial/src/main/java/org/apache/cayenne/tutorial/persistent/auto/_Artist.java:[45,31] cannot find symbol
symbol : method readProperty(java.lang.String)
location: class org.apache.cayenne.tutorial.persistent.auto._Artist

/zonestorage/hudson/home/hudson/hudson/jobs/Cayenne-30/workspace/cayenneTestConnection/HSQLDB/jdk/JDK 1.6 (latest)/STABLE-3.0/tutorials/tutorial/src/main/java/org/apache/cayenne/tutorial/persistent/auto/_Gallery.java:[22,8] cannot find symbol
symbol : method writeProperty(java.lang.String,java.lang.String)
location: class org.apache.cayenne.tutorial.persistent.auto._Gallery

/zonestorage/hudson/home/hudson/hudson/jobs/Cayenne-30/workspace/cayenneTestConnection/HSQLDB/jdk/JDK 1.6 (latest)/STABLE-3.0/tutorials/tutorial/src/main/java/org/apache/cayenne/tutorial/persistent/auto/_Gallery.java:[25,23] cannot find symbol
symbol : method readProperty(java.lang.String)
location: class org.apache.cayenne.tutorial.persistent.auto._Gallery

/zonestorage/hudson/home/hudson/hudson/jobs/Cayenne-30/workspace/cayenneTestConnection/HSQLDB/jdk/JDK 1.6 (latest)/STABLE-3.0/tutorials/tutorial/src/main/java/org/apache/cayenne/tutorial/persistent/auto/_Gallery.java:[29,8] cannot find symbol
symbol : method addToManyTarget(java.lang.String,org.apache.cayenne.tutorial.persistent.Painting,boolean)
location: class org.apache.cayenne.tutorial.persistent.auto._Gallery

/zonestorage/hudson/home/hudson/hudson/jobs/Cayenne-30/workspace/cayenneTestConnection/HSQLDB/jdk/JDK 1.6 (latest)/STABLE-3.0/tutorials/tutorial/src/main/java/org/apache/cayenne/tutorial/persistent/auto/_Gallery.java:[32,8] cannot find symbol
symbol : method removeToManyTarget(java.lang.String,org.apache.cayenne.tutorial.persistent.Painting,boolean)
location: class org.apache.cayenne.tutorial.persistent.auto._Gallery

/zonestorage/hudson/home/hudson/hudson/jobs/Cayenne-30/workspace/cayenneTestConnection/HSQLDB/jdk/JDK 1.6 (latest)/STABLE-3.0/tutorials/tutorial/src/main/java/org/apache/cayenne/tutorial/persistent/auto/_Gallery.java:[35,16] type parameter org.apache.cayenne.tutorial.persistent.Painting is not within its bound

/zonestorage/hudson/home/hudson/hudson/jobs/Cayenne-30/workspace/cayenneTestConnection/HSQLDB/jdk/JDK 1.6 (latest)/STABLE-3.0/tutorials/tutorial/src/main/java/org/apache/cayenne/tutorial/persistent/auto/_Gallery.java:[36,31] cannot find symbol
symbol : method readProperty(java.lang.String)
location: class org.apache.cayenne.tutorial.persistent.auto._Gallery

/zonestorage/hudson/home/hudson/hudson/jobs/Cayenne-30/workspace/cayenneTestConnection/HSQLDB/jdk/JDK 1.6 (latest)/STABLE-3.0/tutorials/tutorial/src/main/java/org/apache/cayenne/tutorial/Main.java:[41,2] cannot find symbol
symbol : class ObjectContext
location: class org.apache.cayenne.tutorial.Main

/zonestorage/hudson/home/hudson/hudson/jobs/Cayenne-30/workspace/cayenneTestConnection/HSQLDB/jdk/JDK 1.6 (latest)/STABLE-3.0/tutorials/tutorial/src/main/java/org/apache/cayenne/tutorial/Main.java:[41,26] cannot find symbol
symbol : variable DataContext
location: class org.apache.cayenne.tutorial.Main

/zonestorage/hudson/home/hudson/hudson/jobs/Cayenne-30/workspace/cayenneTestConnection/HSQLDB/jdk/JDK 1.6 (latest)/STABLE-3.0/tutorials/tutorial/src/main/java/org/apache/cayenne/tutorial/Main.java:[78,2] cannot find symbol
symbol : class SelectQuery
location: class org.apache.cayenne.tutorial.Main

/zonestorage/hudson/home/hudson/hudson/jobs/Cayenne-30/workspace/cayenneTestConnection/HSQLDB/jdk/JDK 1.6 (latest)/STABLE-3.0/tutorials/tutorial/src/main/java/org/apache/cayenne/tutorial/Main.java:[78,28] cannot find symbol
symbol : class SelectQuery
location: class org.apache.cayenne.tutorial.Main

/zonestorage/hudson/home/hudson/hudson/jobs/Cayenne-30/workspace/cayenneTestConnection/HSQLDB/jdk/JDK 1.6 (latest)/STABLE-3.0/tutorials/tutorial/src/main/java/org/apache/cayenne/tutorial/Main.java:[79,7] type parameter org.apache.cayenne.tutorial.persistent.Painting is not within its bound

/zonestorage/hudson/home/hudson/hudson/jobs/Cayenne-30/workspace/cayenneTestConnection/HSQLDB/jdk/JDK 1.6 (latest)/STABLE-3.0/tutorials/tutorial/src/main/java/org/apache/cayenne/tutorial/Main.java:[81,2] cannot find symbol
symbol : class Expression
location: class org.apache.cayenne.tutorial.Main

/zonestorage/hudson/home/hudson/hudson/jobs/Cayenne-30/workspace/cayenneTestConnection/HSQLDB/jdk/JDK 1.6 (latest)/STABLE-3.0/tutorials/tutorial/src/main/java/org/apache/cayenne/tutorial/Main.java:[81,26] cannot find symbol
symbol : variable ExpressionFactory
location: class org.apache.cayenne.tutorial.Main

/zonestorage/hudson/home/hudson/hudson/jobs/Cayenne-30/workspace/cayenneTestConnection/HSQLDB/jdk/JDK 1.6 (latest)/STABLE-3.0/tutorials/tutorial/src/main/java/org/apache/cayenne/tutorial/Main.java:[83,2] cannot find symbol
symbol : class SelectQuery
location: class org.apache.cayenne.tutorial.Main

/zonestorage/hudson/home/hudson/hudson/jobs/Cayenne-30/workspace/cayenneTestConnection/HSQLDB/jdk/JDK 1.6 (latest)/STABLE-3.0/tutorials/tutorial/src/main/java/org/apache/cayenne/tutorial/Main.java:[83,28] cannot find symbol
symbol : class SelectQuery
location: class org.apache.cayenne.tutorial.Main

/zonestorage/hudson/home/hudson/hudson/jobs/Cayenne-30/workspace/cayenneTestConnection/HSQLDB/jdk/JDK 1.6 (latest)/STABLE-3.0/tutorials/tutorial/src/main/java/org/apache/cayenne/tutorial/Main.java:[84,7] type parameter org.apache.cayenne.tutorial.persistent.Painting is not within its bound

/zonestorage/hudson/home/hudson/hudson/jobs/Cayenne-30/workspace/cayenneTestConnection/HSQLDB/jdk/JDK 1.6 (latest)/STABLE-3.0/tutorials/tutorial/src/main/java/org/apache/cayenne/tutorial/Main.java:[89,2] cannot find symbol
symbol : class Expression
location: class org.apache.cayenne.tutorial.Main

/zonestorage/hudson/home/hudson/hudson/jobs/Cayenne-30/workspace/cayenneTestConnection/HSQLDB/jdk/JDK 1.6 (latest)/STABLE-3.0/tutorials/tutorial/src/main/java/org/apache/cayenne/tutorial/Main.java:[89,26] cannot find symbol
symbol : variable Expression
location: class org.apache.cayenne.tutorial.Main

/zonestorage/hudson/home/hudson/hudson/jobs/Cayenne-30/workspace/cayenneTestConnection/HSQLDB/jdk/JDK 1.6 (latest)/STABLE-3.0/tutorials/tutorial/src/main/java/org/apache/cayenne/tutorial/Main.java:[93,2] cannot find symbol
symbol : class SelectQuery
location: class org.apache.cayenne.tutorial.Main

/zonestorage/hudson/home/hudson/hudson/jobs/Cayenne-30/workspace/cayenneTestConnection/HSQLDB/jdk/JDK 1.6 (latest)/STABLE-3.0/tutorials/tutorial/src/main/java/org/apache/cayenne/tutorial/Main.java:[93,28] cannot find symbol
symbol : class SelectQuery
location: class org.apache.cayenne.tutorial.Main

/zonestorage/hudson/home/hudson/hudson/jobs/Cayenne-30/workspace/cayenneTestConnection/HSQLDB/jdk/JDK 1.6 (latest)/STABLE-3.0/tutorials/tutorial/src/main/java/org/apache/cayenne/tutorial/Main.java:[94,7] type parameter org.apache.cayenne.tutorial.persistent.Painting is not within its bound

/zonestorage/hudson/home/hudson/hudson/jobs/Cayenne-30/workspace/cayenneTestConnection/HSQLDB/jdk/JDK 1.6 (latest)/STABLE-3.0/tutorials/tutorial/src/main/java/org/apache/cayenne/tutorial/Main.java:[99,2] cannot find symbol
symbol : class Expression
location: class org.apache.cayenne.tutorial.Main

/zonestorage/hudson/home/hudson/hudson/jobs/Cayenne-30/workspace/cayenneTestConnection/HSQLDB/jdk/JDK 1.6 (latest)/STABLE-3.0/tutorials/tutorial/src/main/java/org/apache/cayenne/tutorial/Main.java:[99,25] cannot find symbol
symbol : variable ExpressionFactory
location: class org.apache.cayenne.tutorial.Main

/zonestorage/hudson/home/hudson/hudson/jobs/Cayenne-30/workspace/cayenneTestConnection/HSQLDB/jdk/JDK 1.6 (latest)/STABLE-3.0/tutorials/tutorial/src/main/java/org/apache/cayenne/tutorial/Main.java:[101,2] cannot find symbol
symbol : class SelectQuery
location: class org.apache.cayenne.tutorial.Main

/zonestorage/hudson/home/hudson/hudson/jobs/Cayenne-30/workspace/cayenneTestConnection/HSQLDB/jdk/JDK 1.6 (latest)/STABLE-3.0/tutorials/tutorial/src/main/java/org/apache/cayenne/tutorial/Main.java:[101,35] cannot find symbol
symbol : class SelectQuery
location: class org.apache.cayenne.tutorial.Main

/zonestorage/hudson/home/hudson/hudson/jobs/Cayenne-30/workspace/cayenneTestConnection/HSQLDB/jdk/JDK 1.6 (latest)/STABLE-3.0/tutorials/tutorial/src/main/java/org/apache/cayenne/tutorial/Main.java:[102,28] cannot find symbol
symbol : variable DataObjectUtils
location: class org.apache.cayenne.tutorial.Main

/zonestorage/hudson/home/hudson/hudson/jobs/Cayenne-30/workspace/cayenneTestConnection/HSQLDB/jdk/JDK 1.6 (latest)/STABLE-3.0/tutorials/tutorial/src/main/java/org/apache/cayenne/tutorial/Main.java:[105,14] operator != cannot be applied to org.apache.cayenne.tutorial.persistent.Artist,<nulltype>


[INFO] ------------------------------------------------------------------------
[INFO] For more information, run Maven with the -e switch
[INFO] ------------------------------------------------------------------------
[INFO] Total time: 7 minutes 35 seconds
[INFO] Finished at: Sat Dec 26 23:12:45 UTC 2009
[INFO] Final Memory: 62M/208M
[INFO] ------------------------------------------------------------------------
[locks-and-latches] Releasing all the locks
[locks-and-latches] All the locks released
Recording test results

Search Discussions

  • Apache Hudson Server at Dec 27, 2009 at 2:04 pm
    See <http://hudson.zones.apache.org/hudson/job/Cayenne-30/./cayenneTestConnection=HSQLDB,jdk=JDK%201.6%20(latest)/2/changes>

    Changes:

    [aadamchik] CAY-1343 Exclude asm jars from compile maven dependencies

    ------------------------------------------
    [...truncated 72397 lines...]
    [INFO] No sources to compile
    [INFO] [resources:testResources]
    [INFO] Using default encoding to copy filtered resources.
    [INFO] [compiler:testCompile]
    [INFO] No sources to compile
    [INFO] [surefire:test]
    [INFO] No tests to run.
    [INFO] [jar:jar]
    [INFO] Building jar: /zonestorage/hudson/home/hudson/hudson/jobs/Cayenne-30/workspace/cayenneTestConnection/HSQLDB/jdk/JDK 1.6 (latest)/STABLE-3.0/modeler/cayenne-modeler-java/target/cayenne-modeler-java-3.0-SNAPSHOT.jar
    [INFO] [install:install]
    [INFO] Installing /zonestorage/hudson/home/hudson/hudson/jobs/Cayenne-30/workspace/cayenneTestConnection/HSQLDB/jdk/JDK 1.6 (latest)/STABLE-3.0/modeler/cayenne-modeler-java/target/cayenne-modeler-java-3.0-SNAPSHOT.jar to /export/home/hudson/.m2/repository/org/apache/cayenne/cayenne-modeler-java/3.0-SNAPSHOT/cayenne-modeler-java-3.0-SNAPSHOT.jar
    [INFO] ------------------------------------------------------------------------
    [INFO] Building Cayenne Modeler Parent
    [INFO] task-segment: [clean, install]
    [INFO] ------------------------------------------------------------------------
    [INFO] [clean:clean]
    [INFO] [site:attach-descriptor]
    [INFO] [install:install]
    [INFO] Installing /zonestorage/hudson/home/hudson/hudson/jobs/Cayenne-30/workspace/cayenneTestConnection/HSQLDB/jdk/JDK 1.6 (latest)/STABLE-3.0/modeler/pom.xml to /export/home/hudson/.m2/repository/org/apache/cayenne/parents/cayenne-modeler-parent/3.0-SNAPSHOT/cayenne-modeler-parent-3.0-SNAPSHOT.pom
    [INFO] ------------------------------------------------------------------------
    [INFO] Building Cayenne Tutorial
    [INFO] task-segment: [clean, install]
    [INFO] ------------------------------------------------------------------------
    [INFO] [clean:clean]
    [INFO] Deleting directory /zonestorage/hudson/home/hudson/hudson/jobs/Cayenne-30/workspace/cayenneTestConnection/HSQLDB/jdk/JDK 1.6 (latest)/STABLE-3.0/tutorials/tutorial/target
    [INFO] [resources:resources]
    [INFO] Using default encoding to copy filtered resources.
    [INFO] [compiler:compile]
    [INFO] Compiling 9 source files to /zonestorage/hudson/home/hudson/hudson/jobs/Cayenne-30/workspace/cayenneTestConnection/HSQLDB/jdk/JDK 1.6 (latest)/STABLE-3.0/tutorials/tutorial/target/classes
    [INFO] ------------------------------------------------------------------------
    [ERROR] BUILD FAILURE
    [INFO] ------------------------------------------------------------------------
    [INFO] Compilation failure

    /zonestorage/hudson/home/hudson/hudson/jobs/Cayenne-30/workspace/cayenneTestConnection/HSQLDB/jdk/JDK 1.6 (latest)/STABLE-3.0/tutorials/tutorial/src/main/java/org/apache/cayenne/tutorial/persistent/auto/_Painting.java:[3,25] cannot find symbol
    symbol : class CayenneDataObject
    location: package org.apache.cayenne

    /zonestorage/hudson/home/hudson/hudson/jobs/Cayenne-30/workspace/cayenneTestConnection/HSQLDB/jdk/JDK 1.6 (latest)/STABLE-3.0/tutorials/tutorial/src/main/java/org/apache/cayenne/tutorial/persistent/auto/_Painting.java:[13,40] cannot find symbol
    symbol: class CayenneDataObject
    public abstract class _Painting extends CayenneDataObject {

    /zonestorage/hudson/home/hudson/hudson/jobs/Cayenne-30/workspace/cayenneTestConnection/HSQLDB/jdk/JDK 1.6 (latest)/STABLE-3.0/tutorials/tutorial/src/main/java/org/apache/cayenne/tutorial/persistent/auto/_Artist.java:[6,25] cannot find symbol
    symbol : class CayenneDataObject
    location: package org.apache.cayenne

    /zonestorage/hudson/home/hudson/hudson/jobs/Cayenne-30/workspace/cayenneTestConnection/HSQLDB/jdk/JDK 1.6 (latest)/STABLE-3.0/tutorials/tutorial/src/main/java/org/apache/cayenne/tutorial/persistent/auto/_Artist.java:[15,38] cannot find symbol
    symbol: class CayenneDataObject
    public abstract class _Artist extends CayenneDataObject {

    /zonestorage/hudson/home/hudson/hudson/jobs/Cayenne-30/workspace/cayenneTestConnection/HSQLDB/jdk/JDK 1.6 (latest)/STABLE-3.0/tutorials/tutorial/src/main/java/org/apache/cayenne/tutorial/persistent/auto/_Gallery.java:[5,25] cannot find symbol
    symbol : class CayenneDataObject
    location: package org.apache.cayenne

    /zonestorage/hudson/home/hudson/hudson/jobs/Cayenne-30/workspace/cayenneTestConnection/HSQLDB/jdk/JDK 1.6 (latest)/STABLE-3.0/tutorials/tutorial/src/main/java/org/apache/cayenne/tutorial/persistent/auto/_Gallery.java:[14,39] cannot find symbol
    symbol: class CayenneDataObject
    public abstract class _Gallery extends CayenneDataObject {

    /zonestorage/hudson/home/hudson/hudson/jobs/Cayenne-30/workspace/cayenneTestConnection/HSQLDB/jdk/JDK 1.6 (latest)/STABLE-3.0/tutorials/tutorial/src/main/java/org/apache/cayenne/tutorial/Main.java:[26,25] cannot find symbol
    symbol : class DataObjectUtils
    location: package org.apache.cayenne

    /zonestorage/hudson/home/hudson/hudson/jobs/Cayenne-30/workspace/cayenneTestConnection/HSQLDB/jdk/JDK 1.6 (latest)/STABLE-3.0/tutorials/tutorial/src/main/java/org/apache/cayenne/tutorial/Main.java:[27,25] cannot find symbol
    symbol : class ObjectContext
    location: package org.apache.cayenne

    /zonestorage/hudson/home/hudson/hudson/jobs/Cayenne-30/workspace/cayenneTestConnection/HSQLDB/jdk/JDK 1.6 (latest)/STABLE-3.0/tutorials/tutorial/src/main/java/org/apache/cayenne/tutorial/Main.java:[28,32] package org.apache.cayenne.access does not exist

    /zonestorage/hudson/home/hudson/hudson/jobs/Cayenne-30/workspace/cayenneTestConnection/HSQLDB/jdk/JDK 1.6 (latest)/STABLE-3.0/tutorials/tutorial/src/main/java/org/apache/cayenne/tutorial/Main.java:[29,29] package org.apache.cayenne.exp does not exist

    /zonestorage/hudson/home/hudson/hudson/jobs/Cayenne-30/workspace/cayenneTestConnection/HSQLDB/jdk/JDK 1.6 (latest)/STABLE-3.0/tutorials/tutorial/src/main/java/org/apache/cayenne/tutorial/Main.java:[30,29] package org.apache.cayenne.exp does not exist

    /zonestorage/hudson/home/hudson/hudson/jobs/Cayenne-30/workspace/cayenneTestConnection/HSQLDB/jdk/JDK 1.6 (latest)/STABLE-3.0/tutorials/tutorial/src/main/java/org/apache/cayenne/tutorial/Main.java:[31,31] package org.apache.cayenne.query does not exist

    /zonestorage/hudson/home/hudson/hudson/jobs/Cayenne-30/workspace/cayenneTestConnection/HSQLDB/jdk/JDK 1.6 (latest)/STABLE-3.0/tutorials/tutorial/src/main/java/org/apache/cayenne/tutorial/Main.java:[48,32] cannot find symbol
    symbol : class ObjectContext
    location: class org.apache.cayenne.tutorial.Main

    /zonestorage/hudson/home/hudson/hudson/jobs/Cayenne-30/workspace/cayenneTestConnection/HSQLDB/jdk/JDK 1.6 (latest)/STABLE-3.0/tutorials/tutorial/src/main/java/org/apache/cayenne/tutorial/Main.java:[76,28] cannot find symbol
    symbol : class ObjectContext
    location: class org.apache.cayenne.tutorial.Main

    /zonestorage/hudson/home/hudson/hudson/jobs/Cayenne-30/workspace/cayenneTestConnection/HSQLDB/jdk/JDK 1.6 (latest)/STABLE-3.0/tutorials/tutorial/src/main/java/org/apache/cayenne/tutorial/Main.java:[97,28] cannot find symbol
    symbol : class ObjectContext
    location: class org.apache.cayenne.tutorial.Main

    /zonestorage/hudson/home/hudson/hudson/jobs/Cayenne-30/workspace/cayenneTestConnection/HSQLDB/jdk/JDK 1.6 (latest)/STABLE-3.0/tutorials/tutorial/src/main/java/org/apache/cayenne/tutorial/persistent/auto/_Painting.java:[22,8] cannot find symbol
    symbol : method writeProperty(java.lang.String,java.lang.String)
    location: class org.apache.cayenne.tutorial.persistent.auto._Painting

    /zonestorage/hudson/home/hudson/hudson/jobs/Cayenne-30/workspace/cayenneTestConnection/HSQLDB/jdk/JDK 1.6 (latest)/STABLE-3.0/tutorials/tutorial/src/main/java/org/apache/cayenne/tutorial/persistent/auto/_Painting.java:[25,23] cannot find symbol
    symbol : method readProperty(java.lang.String)
    location: class org.apache.cayenne.tutorial.persistent.auto._Painting

    /zonestorage/hudson/home/hudson/hudson/jobs/Cayenne-30/workspace/cayenneTestConnection/HSQLDB/jdk/JDK 1.6 (latest)/STABLE-3.0/tutorials/tutorial/src/main/java/org/apache/cayenne/tutorial/persistent/auto/_Painting.java:[29,8] cannot find symbol
    symbol : method setToOneTarget(java.lang.String,org.apache.cayenne.tutorial.persistent.Artist,boolean)
    location: class org.apache.cayenne.tutorial.persistent.auto._Painting

    /zonestorage/hudson/home/hudson/hudson/jobs/Cayenne-30/workspace/cayenneTestConnection/HSQLDB/jdk/JDK 1.6 (latest)/STABLE-3.0/tutorials/tutorial/src/main/java/org/apache/cayenne/tutorial/persistent/auto/_Painting.java:[33,23] cannot find symbol
    symbol : method readProperty(java.lang.String)
    location: class org.apache.cayenne.tutorial.persistent.auto._Painting

    /zonestorage/hudson/home/hudson/hudson/jobs/Cayenne-30/workspace/cayenneTestConnection/HSQLDB/jdk/JDK 1.6 (latest)/STABLE-3.0/tutorials/tutorial/src/main/java/org/apache/cayenne/tutorial/persistent/auto/_Painting.java:[38,8] cannot find symbol
    symbol : method setToOneTarget(java.lang.String,org.apache.cayenne.tutorial.persistent.Gallery,boolean)
    location: class org.apache.cayenne.tutorial.persistent.auto._Painting

    /zonestorage/hudson/home/hudson/hudson/jobs/Cayenne-30/workspace/cayenneTestConnection/HSQLDB/jdk/JDK 1.6 (latest)/STABLE-3.0/tutorials/tutorial/src/main/java/org/apache/cayenne/tutorial/persistent/auto/_Painting.java:[42,24] cannot find symbol
    symbol : method readProperty(java.lang.String)
    location: class org.apache.cayenne.tutorial.persistent.auto._Painting

    /zonestorage/hudson/home/hudson/hudson/jobs/Cayenne-30/workspace/cayenneTestConnection/HSQLDB/jdk/JDK 1.6 (latest)/STABLE-3.0/tutorials/tutorial/src/main/java/org/apache/cayenne/tutorial/persistent/auto/_Artist.java:[24,8] cannot find symbol
    symbol : method writeProperty(java.lang.String,java.util.Date)
    location: class org.apache.cayenne.tutorial.persistent.auto._Artist

    /zonestorage/hudson/home/hudson/hudson/jobs/Cayenne-30/workspace/cayenneTestConnection/HSQLDB/jdk/JDK 1.6 (latest)/STABLE-3.0/tutorials/tutorial/src/main/java/org/apache/cayenne/tutorial/persistent/auto/_Artist.java:[27,21] cannot find symbol
    symbol : method readProperty(java.lang.String)
    location: class org.apache.cayenne.tutorial.persistent.auto._Artist

    /zonestorage/hudson/home/hudson/hudson/jobs/Cayenne-30/workspace/cayenneTestConnection/HSQLDB/jdk/JDK 1.6 (latest)/STABLE-3.0/tutorials/tutorial/src/main/java/org/apache/cayenne/tutorial/persistent/auto/_Artist.java:[31,8] cannot find symbol
    symbol : method writeProperty(java.lang.String,java.lang.String)
    location: class org.apache.cayenne.tutorial.persistent.auto._Artist

    /zonestorage/hudson/home/hudson/hudson/jobs/Cayenne-30/workspace/cayenneTestConnection/HSQLDB/jdk/JDK 1.6 (latest)/STABLE-3.0/tutorials/tutorial/src/main/java/org/apache/cayenne/tutorial/persistent/auto/_Artist.java:[34,23] cannot find symbol
    symbol : method readProperty(java.lang.String)
    location: class org.apache.cayenne.tutorial.persistent.auto._Artist

    /zonestorage/hudson/home/hudson/hudson/jobs/Cayenne-30/workspace/cayenneTestConnection/HSQLDB/jdk/JDK 1.6 (latest)/STABLE-3.0/tutorials/tutorial/src/main/java/org/apache/cayenne/tutorial/persistent/auto/_Artist.java:[38,8] cannot find symbol
    symbol : method addToManyTarget(java.lang.String,org.apache.cayenne.tutorial.persistent.Painting,boolean)
    location: class org.apache.cayenne.tutorial.persistent.auto._Artist

    /zonestorage/hudson/home/hudson/hudson/jobs/Cayenne-30/workspace/cayenneTestConnection/HSQLDB/jdk/JDK 1.6 (latest)/STABLE-3.0/tutorials/tutorial/src/main/java/org/apache/cayenne/tutorial/persistent/auto/_Artist.java:[41,8] cannot find symbol
    symbol : method removeToManyTarget(java.lang.String,org.apache.cayenne.tutorial.persistent.Painting,boolean)
    location: class org.apache.cayenne.tutorial.persistent.auto._Artist

    /zonestorage/hudson/home/hudson/hudson/jobs/Cayenne-30/workspace/cayenneTestConnection/HSQLDB/jdk/JDK 1.6 (latest)/STABLE-3.0/tutorials/tutorial/src/main/java/org/apache/cayenne/tutorial/persistent/auto/_Artist.java:[44,16] type parameter org.apache.cayenne.tutorial.persistent.Painting is not within its bound

    /zonestorage/hudson/home/hudson/hudson/jobs/Cayenne-30/workspace/cayenneTestConnection/HSQLDB/jdk/JDK 1.6 (latest)/STABLE-3.0/tutorials/tutorial/src/main/java/org/apache/cayenne/tutorial/persistent/auto/_Artist.java:[45,31] cannot find symbol
    symbol : method readProperty(java.lang.String)
    location: class org.apache.cayenne.tutorial.persistent.auto._Artist

    /zonestorage/hudson/home/hudson/hudson/jobs/Cayenne-30/workspace/cayenneTestConnection/HSQLDB/jdk/JDK 1.6 (latest)/STABLE-3.0/tutorials/tutorial/src/main/java/org/apache/cayenne/tutorial/persistent/auto/_Gallery.java:[22,8] cannot find symbol
    symbol : method writeProperty(java.lang.String,java.lang.String)
    location: class org.apache.cayenne.tutorial.persistent.auto._Gallery

    /zonestorage/hudson/home/hudson/hudson/jobs/Cayenne-30/workspace/cayenneTestConnection/HSQLDB/jdk/JDK 1.6 (latest)/STABLE-3.0/tutorials/tutorial/src/main/java/org/apache/cayenne/tutorial/persistent/auto/_Gallery.java:[25,23] cannot find symbol
    symbol : method readProperty(java.lang.String)
    location: class org.apache.cayenne.tutorial.persistent.auto._Gallery

    /zonestorage/hudson/home/hudson/hudson/jobs/Cayenne-30/workspace/cayenneTestConnection/HSQLDB/jdk/JDK 1.6 (latest)/STABLE-3.0/tutorials/tutorial/src/main/java/org/apache/cayenne/tutorial/persistent/auto/_Gallery.java:[29,8] cannot find symbol
    symbol : method addToManyTarget(java.lang.String,org.apache.cayenne.tutorial.persistent.Painting,boolean)
    location: class org.apache.cayenne.tutorial.persistent.auto._Gallery

    /zonestorage/hudson/home/hudson/hudson/jobs/Cayenne-30/workspace/cayenneTestConnection/HSQLDB/jdk/JDK 1.6 (latest)/STABLE-3.0/tutorials/tutorial/src/main/java/org/apache/cayenne/tutorial/persistent/auto/_Gallery.java:[32,8] cannot find symbol
    symbol : method removeToManyTarget(java.lang.String,org.apache.cayenne.tutorial.persistent.Painting,boolean)
    location: class org.apache.cayenne.tutorial.persistent.auto._Gallery

    /zonestorage/hudson/home/hudson/hudson/jobs/Cayenne-30/workspace/cayenneTestConnection/HSQLDB/jdk/JDK 1.6 (latest)/STABLE-3.0/tutorials/tutorial/src/main/java/org/apache/cayenne/tutorial/persistent/auto/_Gallery.java:[35,16] type parameter org.apache.cayenne.tutorial.persistent.Painting is not within its bound

    /zonestorage/hudson/home/hudson/hudson/jobs/Cayenne-30/workspace/cayenneTestConnection/HSQLDB/jdk/JDK 1.6 (latest)/STABLE-3.0/tutorials/tutorial/src/main/java/org/apache/cayenne/tutorial/persistent/auto/_Gallery.java:[36,31] cannot find symbol
    symbol : method readProperty(java.lang.String)
    location: class org.apache.cayenne.tutorial.persistent.auto._Gallery

    /zonestorage/hudson/home/hudson/hudson/jobs/Cayenne-30/workspace/cayenneTestConnection/HSQLDB/jdk/JDK 1.6 (latest)/STABLE-3.0/tutorials/tutorial/src/main/java/org/apache/cayenne/tutorial/Main.java:[41,2] cannot find symbol
    symbol : class ObjectContext
    location: class org.apache.cayenne.tutorial.Main

    /zonestorage/hudson/home/hudson/hudson/jobs/Cayenne-30/workspace/cayenneTestConnection/HSQLDB/jdk/JDK 1.6 (latest)/STABLE-3.0/tutorials/tutorial/src/main/java/org/apache/cayenne/tutorial/Main.java:[41,26] cannot find symbol
    symbol : variable DataContext
    location: class org.apache.cayenne.tutorial.Main

    /zonestorage/hudson/home/hudson/hudson/jobs/Cayenne-30/workspace/cayenneTestConnection/HSQLDB/jdk/JDK 1.6 (latest)/STABLE-3.0/tutorials/tutorial/src/main/java/org/apache/cayenne/tutorial/Main.java:[78,2] cannot find symbol
    symbol : class SelectQuery
    location: class org.apache.cayenne.tutorial.Main

    /zonestorage/hudson/home/hudson/hudson/jobs/Cayenne-30/workspace/cayenneTestConnection/HSQLDB/jdk/JDK 1.6 (latest)/STABLE-3.0/tutorials/tutorial/src/main/java/org/apache/cayenne/tutorial/Main.java:[78,28] cannot find symbol
    symbol : class SelectQuery
    location: class org.apache.cayenne.tutorial.Main

    /zonestorage/hudson/home/hudson/hudson/jobs/Cayenne-30/workspace/cayenneTestConnection/HSQLDB/jdk/JDK 1.6 (latest)/STABLE-3.0/tutorials/tutorial/src/main/java/org/apache/cayenne/tutorial/Main.java:[79,7] type parameter org.apache.cayenne.tutorial.persistent.Painting is not within its bound

    /zonestorage/hudson/home/hudson/hudson/jobs/Cayenne-30/workspace/cayenneTestConnection/HSQLDB/jdk/JDK 1.6 (latest)/STABLE-3.0/tutorials/tutorial/src/main/java/org/apache/cayenne/tutorial/Main.java:[81,2] cannot find symbol
    symbol : class Expression
    location: class org.apache.cayenne.tutorial.Main

    /zonestorage/hudson/home/hudson/hudson/jobs/Cayenne-30/workspace/cayenneTestConnection/HSQLDB/jdk/JDK 1.6 (latest)/STABLE-3.0/tutorials/tutorial/src/main/java/org/apache/cayenne/tutorial/Main.java:[81,26] cannot find symbol
    symbol : variable ExpressionFactory
    location: class org.apache.cayenne.tutorial.Main

    /zonestorage/hudson/home/hudson/hudson/jobs/Cayenne-30/workspace/cayenneTestConnection/HSQLDB/jdk/JDK 1.6 (latest)/STABLE-3.0/tutorials/tutorial/src/main/java/org/apache/cayenne/tutorial/Main.java:[83,2] cannot find symbol
    symbol : class SelectQuery
    location: class org.apache.cayenne.tutorial.Main

    /zonestorage/hudson/home/hudson/hudson/jobs/Cayenne-30/workspace/cayenneTestConnection/HSQLDB/jdk/JDK 1.6 (latest)/STABLE-3.0/tutorials/tutorial/src/main/java/org/apache/cayenne/tutorial/Main.java:[83,28] cannot find symbol
    symbol : class SelectQuery
    location: class org.apache.cayenne.tutorial.Main

    /zonestorage/hudson/home/hudson/hudson/jobs/Cayenne-30/workspace/cayenneTestConnection/HSQLDB/jdk/JDK 1.6 (latest)/STABLE-3.0/tutorials/tutorial/src/main/java/org/apache/cayenne/tutorial/Main.java:[84,7] type parameter org.apache.cayenne.tutorial.persistent.Painting is not within its bound

    /zonestorage/hudson/home/hudson/hudson/jobs/Cayenne-30/workspace/cayenneTestConnection/HSQLDB/jdk/JDK 1.6 (latest)/STABLE-3.0/tutorials/tutorial/src/main/java/org/apache/cayenne/tutorial/Main.java:[89,2] cannot find symbol
    symbol : class Expression
    location: class org.apache.cayenne.tutorial.Main

    /zonestorage/hudson/home/hudson/hudson/jobs/Cayenne-30/workspace/cayenneTestConnection/HSQLDB/jdk/JDK 1.6 (latest)/STABLE-3.0/tutorials/tutorial/src/main/java/org/apache/cayenne/tutorial/Main.java:[89,26] cannot find symbol
    symbol : variable Expression
    location: class org.apache.cayenne.tutorial.Main

    /zonestorage/hudson/home/hudson/hudson/jobs/Cayenne-30/workspace/cayenneTestConnection/HSQLDB/jdk/JDK 1.6 (latest)/STABLE-3.0/tutorials/tutorial/src/main/java/org/apache/cayenne/tutorial/Main.java:[93,2] cannot find symbol
    symbol : class SelectQuery
    location: class org.apache.cayenne.tutorial.Main

    /zonestorage/hudson/home/hudson/hudson/jobs/Cayenne-30/workspace/cayenneTestConnection/HSQLDB/jdk/JDK 1.6 (latest)/STABLE-3.0/tutorials/tutorial/src/main/java/org/apache/cayenne/tutorial/Main.java:[93,28] cannot find symbol
    symbol : class SelectQuery
    location: class org.apache.cayenne.tutorial.Main

    /zonestorage/hudson/home/hudson/hudson/jobs/Cayenne-30/workspace/cayenneTestConnection/HSQLDB/jdk/JDK 1.6 (latest)/STABLE-3.0/tutorials/tutorial/src/main/java/org/apache/cayenne/tutorial/Main.java:[94,7] type parameter org.apache.cayenne.tutorial.persistent.Painting is not within its bound

    /zonestorage/hudson/home/hudson/hudson/jobs/Cayenne-30/workspace/cayenneTestConnection/HSQLDB/jdk/JDK 1.6 (latest)/STABLE-3.0/tutorials/tutorial/src/main/java/org/apache/cayenne/tutorial/Main.java:[99,2] cannot find symbol
    symbol : class Expression
    location: class org.apache.cayenne.tutorial.Main

    /zonestorage/hudson/home/hudson/hudson/jobs/Cayenne-30/workspace/cayenneTestConnection/HSQLDB/jdk/JDK 1.6 (latest)/STABLE-3.0/tutorials/tutorial/src/main/java/org/apache/cayenne/tutorial/Main.java:[99,25] cannot find symbol
    symbol : variable ExpressionFactory
    location: class org.apache.cayenne.tutorial.Main

    /zonestorage/hudson/home/hudson/hudson/jobs/Cayenne-30/workspace/cayenneTestConnection/HSQLDB/jdk/JDK 1.6 (latest)/STABLE-3.0/tutorials/tutorial/src/main/java/org/apache/cayenne/tutorial/Main.java:[101,2] cannot find symbol
    symbol : class SelectQuery
    location: class org.apache.cayenne.tutorial.Main

    /zonestorage/hudson/home/hudson/hudson/jobs/Cayenne-30/workspace/cayenneTestConnection/HSQLDB/jdk/JDK 1.6 (latest)/STABLE-3.0/tutorials/tutorial/src/main/java/org/apache/cayenne/tutorial/Main.java:[101,35] cannot find symbol
    symbol : class SelectQuery
    location: class org.apache.cayenne.tutorial.Main

    /zonestorage/hudson/home/hudson/hudson/jobs/Cayenne-30/workspace/cayenneTestConnection/HSQLDB/jdk/JDK 1.6 (latest)/STABLE-3.0/tutorials/tutorial/src/main/java/org/apache/cayenne/tutorial/Main.java:[102,28] cannot find symbol
    symbol : variable DataObjectUtils
    location: class org.apache.cayenne.tutorial.Main

    /zonestorage/hudson/home/hudson/hudson/jobs/Cayenne-30/workspace/cayenneTestConnection/HSQLDB/jdk/JDK 1.6 (latest)/STABLE-3.0/tutorials/tutorial/src/main/java/org/apache/cayenne/tutorial/Main.java:[105,14] operator != cannot be applied to org.apache.cayenne.tutorial.persistent.Artist,<nulltype>


    [INFO] ------------------------------------------------------------------------
    [INFO] For more information, run Maven with the -e switch
    [INFO] ------------------------------------------------------------------------
    [INFO] Total time: 6 minutes 36 seconds
    [INFO] Finished at: Sun Dec 27 14:02:24 UTC 2009
    [INFO] Final Memory: 63M/223M
    [INFO] ------------------------------------------------------------------------
    [locks-and-latches] Releasing all the locks
    [locks-and-latches] All the locks released
    Recording test results
  • Apache Hudson Server at Dec 27, 2009 at 6:43 pm
    See <http://hudson.zones.apache.org/hudson/job/Cayenne-30/./cayenneTestConnection=HSQLDB,jdk=JDK%201.6%20(latest)/3/changes>

    Changes:

    [aadamchik] CAY-1326 Document Cayenne Embeddables Feature

    ------------------------------------------
    [...truncated 72400 lines...]
    [INFO] No sources to compile
    [INFO] [resources:testResources]
    [INFO] Using default encoding to copy filtered resources.
    [INFO] [compiler:testCompile]
    [INFO] No sources to compile
    [INFO] [surefire:test]
    [INFO] No tests to run.
    [INFO] [jar:jar]
    [INFO] Building jar: /zonestorage/hudson/home/hudson/hudson/jobs/Cayenne-30/workspace/cayenneTestConnection/HSQLDB/jdk/JDK 1.6 (latest)/STABLE-3.0/modeler/cayenne-modeler-java/target/cayenne-modeler-java-3.0-SNAPSHOT.jar
    [INFO] [install:install]
    [INFO] Installing /zonestorage/hudson/home/hudson/hudson/jobs/Cayenne-30/workspace/cayenneTestConnection/HSQLDB/jdk/JDK 1.6 (latest)/STABLE-3.0/modeler/cayenne-modeler-java/target/cayenne-modeler-java-3.0-SNAPSHOT.jar to /export/home/hudson/.m2/repository/org/apache/cayenne/cayenne-modeler-java/3.0-SNAPSHOT/cayenne-modeler-java-3.0-SNAPSHOT.jar
    [INFO] ------------------------------------------------------------------------
    [INFO] Building Cayenne Modeler Parent
    [INFO] task-segment: [clean, install]
    [INFO] ------------------------------------------------------------------------
    [INFO] [clean:clean]
    [INFO] [site:attach-descriptor]
    [INFO] [install:install]
    [INFO] Installing /zonestorage/hudson/home/hudson/hudson/jobs/Cayenne-30/workspace/cayenneTestConnection/HSQLDB/jdk/JDK 1.6 (latest)/STABLE-3.0/modeler/pom.xml to /export/home/hudson/.m2/repository/org/apache/cayenne/parents/cayenne-modeler-parent/3.0-SNAPSHOT/cayenne-modeler-parent-3.0-SNAPSHOT.pom
    [INFO] ------------------------------------------------------------------------
    [INFO] Building Cayenne Tutorial
    [INFO] task-segment: [clean, install]
    [INFO] ------------------------------------------------------------------------
    [INFO] [clean:clean]
    [INFO] Deleting directory /zonestorage/hudson/home/hudson/hudson/jobs/Cayenne-30/workspace/cayenneTestConnection/HSQLDB/jdk/JDK 1.6 (latest)/STABLE-3.0/tutorials/tutorial/target
    [INFO] [resources:resources]
    [INFO] Using default encoding to copy filtered resources.
    [INFO] [compiler:compile]
    [INFO] Compiling 9 source files to /zonestorage/hudson/home/hudson/hudson/jobs/Cayenne-30/workspace/cayenneTestConnection/HSQLDB/jdk/JDK 1.6 (latest)/STABLE-3.0/tutorials/tutorial/target/classes
    [INFO] ------------------------------------------------------------------------
    [ERROR] BUILD FAILURE
    [INFO] ------------------------------------------------------------------------
    [INFO] Compilation failure

    /zonestorage/hudson/home/hudson/hudson/jobs/Cayenne-30/workspace/cayenneTestConnection/HSQLDB/jdk/JDK 1.6 (latest)/STABLE-3.0/tutorials/tutorial/src/main/java/org/apache/cayenne/tutorial/persistent/auto/_Painting.java:[3,25] cannot find symbol
    symbol : class CayenneDataObject
    location: package org.apache.cayenne

    /zonestorage/hudson/home/hudson/hudson/jobs/Cayenne-30/workspace/cayenneTestConnection/HSQLDB/jdk/JDK 1.6 (latest)/STABLE-3.0/tutorials/tutorial/src/main/java/org/apache/cayenne/tutorial/persistent/auto/_Painting.java:[13,40] cannot find symbol
    symbol: class CayenneDataObject
    public abstract class _Painting extends CayenneDataObject {

    /zonestorage/hudson/home/hudson/hudson/jobs/Cayenne-30/workspace/cayenneTestConnection/HSQLDB/jdk/JDK 1.6 (latest)/STABLE-3.0/tutorials/tutorial/src/main/java/org/apache/cayenne/tutorial/persistent/auto/_Artist.java:[6,25] cannot find symbol
    symbol : class CayenneDataObject
    location: package org.apache.cayenne

    /zonestorage/hudson/home/hudson/hudson/jobs/Cayenne-30/workspace/cayenneTestConnection/HSQLDB/jdk/JDK 1.6 (latest)/STABLE-3.0/tutorials/tutorial/src/main/java/org/apache/cayenne/tutorial/persistent/auto/_Artist.java:[15,38] cannot find symbol
    symbol: class CayenneDataObject
    public abstract class _Artist extends CayenneDataObject {

    /zonestorage/hudson/home/hudson/hudson/jobs/Cayenne-30/workspace/cayenneTestConnection/HSQLDB/jdk/JDK 1.6 (latest)/STABLE-3.0/tutorials/tutorial/src/main/java/org/apache/cayenne/tutorial/persistent/auto/_Gallery.java:[5,25] cannot find symbol
    symbol : class CayenneDataObject
    location: package org.apache.cayenne

    /zonestorage/hudson/home/hudson/hudson/jobs/Cayenne-30/workspace/cayenneTestConnection/HSQLDB/jdk/JDK 1.6 (latest)/STABLE-3.0/tutorials/tutorial/src/main/java/org/apache/cayenne/tutorial/persistent/auto/_Gallery.java:[14,39] cannot find symbol
    symbol: class CayenneDataObject
    public abstract class _Gallery extends CayenneDataObject {

    /zonestorage/hudson/home/hudson/hudson/jobs/Cayenne-30/workspace/cayenneTestConnection/HSQLDB/jdk/JDK 1.6 (latest)/STABLE-3.0/tutorials/tutorial/src/main/java/org/apache/cayenne/tutorial/Main.java:[26,25] cannot find symbol
    symbol : class DataObjectUtils
    location: package org.apache.cayenne

    /zonestorage/hudson/home/hudson/hudson/jobs/Cayenne-30/workspace/cayenneTestConnection/HSQLDB/jdk/JDK 1.6 (latest)/STABLE-3.0/tutorials/tutorial/src/main/java/org/apache/cayenne/tutorial/Main.java:[27,25] cannot find symbol
    symbol : class ObjectContext
    location: package org.apache.cayenne

    /zonestorage/hudson/home/hudson/hudson/jobs/Cayenne-30/workspace/cayenneTestConnection/HSQLDB/jdk/JDK 1.6 (latest)/STABLE-3.0/tutorials/tutorial/src/main/java/org/apache/cayenne/tutorial/Main.java:[28,32] package org.apache.cayenne.access does not exist

    /zonestorage/hudson/home/hudson/hudson/jobs/Cayenne-30/workspace/cayenneTestConnection/HSQLDB/jdk/JDK 1.6 (latest)/STABLE-3.0/tutorials/tutorial/src/main/java/org/apache/cayenne/tutorial/Main.java:[29,29] package org.apache.cayenne.exp does not exist

    /zonestorage/hudson/home/hudson/hudson/jobs/Cayenne-30/workspace/cayenneTestConnection/HSQLDB/jdk/JDK 1.6 (latest)/STABLE-3.0/tutorials/tutorial/src/main/java/org/apache/cayenne/tutorial/Main.java:[30,29] package org.apache.cayenne.exp does not exist

    /zonestorage/hudson/home/hudson/hudson/jobs/Cayenne-30/workspace/cayenneTestConnection/HSQLDB/jdk/JDK 1.6 (latest)/STABLE-3.0/tutorials/tutorial/src/main/java/org/apache/cayenne/tutorial/Main.java:[31,31] package org.apache.cayenne.query does not exist

    /zonestorage/hudson/home/hudson/hudson/jobs/Cayenne-30/workspace/cayenneTestConnection/HSQLDB/jdk/JDK 1.6 (latest)/STABLE-3.0/tutorials/tutorial/src/main/java/org/apache/cayenne/tutorial/Main.java:[48,32] cannot find symbol
    symbol : class ObjectContext
    location: class org.apache.cayenne.tutorial.Main

    /zonestorage/hudson/home/hudson/hudson/jobs/Cayenne-30/workspace/cayenneTestConnection/HSQLDB/jdk/JDK 1.6 (latest)/STABLE-3.0/tutorials/tutorial/src/main/java/org/apache/cayenne/tutorial/Main.java:[76,28] cannot find symbol
    symbol : class ObjectContext
    location: class org.apache.cayenne.tutorial.Main

    /zonestorage/hudson/home/hudson/hudson/jobs/Cayenne-30/workspace/cayenneTestConnection/HSQLDB/jdk/JDK 1.6 (latest)/STABLE-3.0/tutorials/tutorial/src/main/java/org/apache/cayenne/tutorial/Main.java:[97,28] cannot find symbol
    symbol : class ObjectContext
    location: class org.apache.cayenne.tutorial.Main

    /zonestorage/hudson/home/hudson/hudson/jobs/Cayenne-30/workspace/cayenneTestConnection/HSQLDB/jdk/JDK 1.6 (latest)/STABLE-3.0/tutorials/tutorial/src/main/java/org/apache/cayenne/tutorial/persistent/auto/_Painting.java:[22,8] cannot find symbol
    symbol : method writeProperty(java.lang.String,java.lang.String)
    location: class org.apache.cayenne.tutorial.persistent.auto._Painting

    /zonestorage/hudson/home/hudson/hudson/jobs/Cayenne-30/workspace/cayenneTestConnection/HSQLDB/jdk/JDK 1.6 (latest)/STABLE-3.0/tutorials/tutorial/src/main/java/org/apache/cayenne/tutorial/persistent/auto/_Painting.java:[25,23] cannot find symbol
    symbol : method readProperty(java.lang.String)
    location: class org.apache.cayenne.tutorial.persistent.auto._Painting

    /zonestorage/hudson/home/hudson/hudson/jobs/Cayenne-30/workspace/cayenneTestConnection/HSQLDB/jdk/JDK 1.6 (latest)/STABLE-3.0/tutorials/tutorial/src/main/java/org/apache/cayenne/tutorial/persistent/auto/_Painting.java:[29,8] cannot find symbol
    symbol : method setToOneTarget(java.lang.String,org.apache.cayenne.tutorial.persistent.Artist,boolean)
    location: class org.apache.cayenne.tutorial.persistent.auto._Painting

    /zonestorage/hudson/home/hudson/hudson/jobs/Cayenne-30/workspace/cayenneTestConnection/HSQLDB/jdk/JDK 1.6 (latest)/STABLE-3.0/tutorials/tutorial/src/main/java/org/apache/cayenne/tutorial/persistent/auto/_Painting.java:[33,23] cannot find symbol
    symbol : method readProperty(java.lang.String)
    location: class org.apache.cayenne.tutorial.persistent.auto._Painting

    /zonestorage/hudson/home/hudson/hudson/jobs/Cayenne-30/workspace/cayenneTestConnection/HSQLDB/jdk/JDK 1.6 (latest)/STABLE-3.0/tutorials/tutorial/src/main/java/org/apache/cayenne/tutorial/persistent/auto/_Painting.java:[38,8] cannot find symbol
    symbol : method setToOneTarget(java.lang.String,org.apache.cayenne.tutorial.persistent.Gallery,boolean)
    location: class org.apache.cayenne.tutorial.persistent.auto._Painting

    /zonestorage/hudson/home/hudson/hudson/jobs/Cayenne-30/workspace/cayenneTestConnection/HSQLDB/jdk/JDK 1.6 (latest)/STABLE-3.0/tutorials/tutorial/src/main/java/org/apache/cayenne/tutorial/persistent/auto/_Painting.java:[42,24] cannot find symbol
    symbol : method readProperty(java.lang.String)
    location: class org.apache.cayenne.tutorial.persistent.auto._Painting

    /zonestorage/hudson/home/hudson/hudson/jobs/Cayenne-30/workspace/cayenneTestConnection/HSQLDB/jdk/JDK 1.6 (latest)/STABLE-3.0/tutorials/tutorial/src/main/java/org/apache/cayenne/tutorial/persistent/auto/_Artist.java:[24,8] cannot find symbol
    symbol : method writeProperty(java.lang.String,java.util.Date)
    location: class org.apache.cayenne.tutorial.persistent.auto._Artist

    /zonestorage/hudson/home/hudson/hudson/jobs/Cayenne-30/workspace/cayenneTestConnection/HSQLDB/jdk/JDK 1.6 (latest)/STABLE-3.0/tutorials/tutorial/src/main/java/org/apache/cayenne/tutorial/persistent/auto/_Artist.java:[27,21] cannot find symbol
    symbol : method readProperty(java.lang.String)
    location: class org.apache.cayenne.tutorial.persistent.auto._Artist

    /zonestorage/hudson/home/hudson/hudson/jobs/Cayenne-30/workspace/cayenneTestConnection/HSQLDB/jdk/JDK 1.6 (latest)/STABLE-3.0/tutorials/tutorial/src/main/java/org/apache/cayenne/tutorial/persistent/auto/_Artist.java:[31,8] cannot find symbol
    symbol : method writeProperty(java.lang.String,java.lang.String)
    location: class org.apache.cayenne.tutorial.persistent.auto._Artist

    /zonestorage/hudson/home/hudson/hudson/jobs/Cayenne-30/workspace/cayenneTestConnection/HSQLDB/jdk/JDK 1.6 (latest)/STABLE-3.0/tutorials/tutorial/src/main/java/org/apache/cayenne/tutorial/persistent/auto/_Artist.java:[34,23] cannot find symbol
    symbol : method readProperty(java.lang.String)
    location: class org.apache.cayenne.tutorial.persistent.auto._Artist

    /zonestorage/hudson/home/hudson/hudson/jobs/Cayenne-30/workspace/cayenneTestConnection/HSQLDB/jdk/JDK 1.6 (latest)/STABLE-3.0/tutorials/tutorial/src/main/java/org/apache/cayenne/tutorial/persistent/auto/_Artist.java:[38,8] cannot find symbol
    symbol : method addToManyTarget(java.lang.String,org.apache.cayenne.tutorial.persistent.Painting,boolean)
    location: class org.apache.cayenne.tutorial.persistent.auto._Artist

    /zonestorage/hudson/home/hudson/hudson/jobs/Cayenne-30/workspace/cayenneTestConnection/HSQLDB/jdk/JDK 1.6 (latest)/STABLE-3.0/tutorials/tutorial/src/main/java/org/apache/cayenne/tutorial/persistent/auto/_Artist.java:[41,8] cannot find symbol
    symbol : method removeToManyTarget(java.lang.String,org.apache.cayenne.tutorial.persistent.Painting,boolean)
    location: class org.apache.cayenne.tutorial.persistent.auto._Artist

    /zonestorage/hudson/home/hudson/hudson/jobs/Cayenne-30/workspace/cayenneTestConnection/HSQLDB/jdk/JDK 1.6 (latest)/STABLE-3.0/tutorials/tutorial/src/main/java/org/apache/cayenne/tutorial/persistent/auto/_Artist.java:[44,16] type parameter org.apache.cayenne.tutorial.persistent.Painting is not within its bound

    /zonestorage/hudson/home/hudson/hudson/jobs/Cayenne-30/workspace/cayenneTestConnection/HSQLDB/jdk/JDK 1.6 (latest)/STABLE-3.0/tutorials/tutorial/src/main/java/org/apache/cayenne/tutorial/persistent/auto/_Artist.java:[45,31] cannot find symbol
    symbol : method readProperty(java.lang.String)
    location: class org.apache.cayenne.tutorial.persistent.auto._Artist

    /zonestorage/hudson/home/hudson/hudson/jobs/Cayenne-30/workspace/cayenneTestConnection/HSQLDB/jdk/JDK 1.6 (latest)/STABLE-3.0/tutorials/tutorial/src/main/java/org/apache/cayenne/tutorial/persistent/auto/_Gallery.java:[22,8] cannot find symbol
    symbol : method writeProperty(java.lang.String,java.lang.String)
    location: class org.apache.cayenne.tutorial.persistent.auto._Gallery

    /zonestorage/hudson/home/hudson/hudson/jobs/Cayenne-30/workspace/cayenneTestConnection/HSQLDB/jdk/JDK 1.6 (latest)/STABLE-3.0/tutorials/tutorial/src/main/java/org/apache/cayenne/tutorial/persistent/auto/_Gallery.java:[25,23] cannot find symbol
    symbol : method readProperty(java.lang.String)
    location: class org.apache.cayenne.tutorial.persistent.auto._Gallery

    /zonestorage/hudson/home/hudson/hudson/jobs/Cayenne-30/workspace/cayenneTestConnection/HSQLDB/jdk/JDK 1.6 (latest)/STABLE-3.0/tutorials/tutorial/src/main/java/org/apache/cayenne/tutorial/persistent/auto/_Gallery.java:[29,8] cannot find symbol
    symbol : method addToManyTarget(java.lang.String,org.apache.cayenne.tutorial.persistent.Painting,boolean)
    location: class org.apache.cayenne.tutorial.persistent.auto._Gallery

    /zonestorage/hudson/home/hudson/hudson/jobs/Cayenne-30/workspace/cayenneTestConnection/HSQLDB/jdk/JDK 1.6 (latest)/STABLE-3.0/tutorials/tutorial/src/main/java/org/apache/cayenne/tutorial/persistent/auto/_Gallery.java:[32,8] cannot find symbol
    symbol : method removeToManyTarget(java.lang.String,org.apache.cayenne.tutorial.persistent.Painting,boolean)
    location: class org.apache.cayenne.tutorial.persistent.auto._Gallery

    /zonestorage/hudson/home/hudson/hudson/jobs/Cayenne-30/workspace/cayenneTestConnection/HSQLDB/jdk/JDK 1.6 (latest)/STABLE-3.0/tutorials/tutorial/src/main/java/org/apache/cayenne/tutorial/persistent/auto/_Gallery.java:[35,16] type parameter org.apache.cayenne.tutorial.persistent.Painting is not within its bound

    /zonestorage/hudson/home/hudson/hudson/jobs/Cayenne-30/workspace/cayenneTestConnection/HSQLDB/jdk/JDK 1.6 (latest)/STABLE-3.0/tutorials/tutorial/src/main/java/org/apache/cayenne/tutorial/persistent/auto/_Gallery.java:[36,31] cannot find symbol
    symbol : method readProperty(java.lang.String)
    location: class org.apache.cayenne.tutorial.persistent.auto._Gallery

    /zonestorage/hudson/home/hudson/hudson/jobs/Cayenne-30/workspace/cayenneTestConnection/HSQLDB/jdk/JDK 1.6 (latest)/STABLE-3.0/tutorials/tutorial/src/main/java/org/apache/cayenne/tutorial/Main.java:[41,2] cannot find symbol
    symbol : class ObjectContext
    location: class org.apache.cayenne.tutorial.Main

    /zonestorage/hudson/home/hudson/hudson/jobs/Cayenne-30/workspace/cayenneTestConnection/HSQLDB/jdk/JDK 1.6 (latest)/STABLE-3.0/tutorials/tutorial/src/main/java/org/apache/cayenne/tutorial/Main.java:[41,26] cannot find symbol
    symbol : variable DataContext
    location: class org.apache.cayenne.tutorial.Main

    /zonestorage/hudson/home/hudson/hudson/jobs/Cayenne-30/workspace/cayenneTestConnection/HSQLDB/jdk/JDK 1.6 (latest)/STABLE-3.0/tutorials/tutorial/src/main/java/org/apache/cayenne/tutorial/Main.java:[78,2] cannot find symbol
    symbol : class SelectQuery
    location: class org.apache.cayenne.tutorial.Main

    /zonestorage/hudson/home/hudson/hudson/jobs/Cayenne-30/workspace/cayenneTestConnection/HSQLDB/jdk/JDK 1.6 (latest)/STABLE-3.0/tutorials/tutorial/src/main/java/org/apache/cayenne/tutorial/Main.java:[78,28] cannot find symbol
    symbol : class SelectQuery
    location: class org.apache.cayenne.tutorial.Main

    /zonestorage/hudson/home/hudson/hudson/jobs/Cayenne-30/workspace/cayenneTestConnection/HSQLDB/jdk/JDK 1.6 (latest)/STABLE-3.0/tutorials/tutorial/src/main/java/org/apache/cayenne/tutorial/Main.java:[79,7] type parameter org.apache.cayenne.tutorial.persistent.Painting is not within its bound

    /zonestorage/hudson/home/hudson/hudson/jobs/Cayenne-30/workspace/cayenneTestConnection/HSQLDB/jdk/JDK 1.6 (latest)/STABLE-3.0/tutorials/tutorial/src/main/java/org/apache/cayenne/tutorial/Main.java:[81,2] cannot find symbol
    symbol : class Expression
    location: class org.apache.cayenne.tutorial.Main

    /zonestorage/hudson/home/hudson/hudson/jobs/Cayenne-30/workspace/cayenneTestConnection/HSQLDB/jdk/JDK 1.6 (latest)/STABLE-3.0/tutorials/tutorial/src/main/java/org/apache/cayenne/tutorial/Main.java:[81,26] cannot find symbol
    symbol : variable ExpressionFactory
    location: class org.apache.cayenne.tutorial.Main

    /zonestorage/hudson/home/hudson/hudson/jobs/Cayenne-30/workspace/cayenneTestConnection/HSQLDB/jdk/JDK 1.6 (latest)/STABLE-3.0/tutorials/tutorial/src/main/java/org/apache/cayenne/tutorial/Main.java:[83,2] cannot find symbol
    symbol : class SelectQuery
    location: class org.apache.cayenne.tutorial.Main

    /zonestorage/hudson/home/hudson/hudson/jobs/Cayenne-30/workspace/cayenneTestConnection/HSQLDB/jdk/JDK 1.6 (latest)/STABLE-3.0/tutorials/tutorial/src/main/java/org/apache/cayenne/tutorial/Main.java:[83,28] cannot find symbol
    symbol : class SelectQuery
    location: class org.apache.cayenne.tutorial.Main

    /zonestorage/hudson/home/hudson/hudson/jobs/Cayenne-30/workspace/cayenneTestConnection/HSQLDB/jdk/JDK 1.6 (latest)/STABLE-3.0/tutorials/tutorial/src/main/java/org/apache/cayenne/tutorial/Main.java:[84,7] type parameter org.apache.cayenne.tutorial.persistent.Painting is not within its bound

    /zonestorage/hudson/home/hudson/hudson/jobs/Cayenne-30/workspace/cayenneTestConnection/HSQLDB/jdk/JDK 1.6 (latest)/STABLE-3.0/tutorials/tutorial/src/main/java/org/apache/cayenne/tutorial/Main.java:[89,2] cannot find symbol
    symbol : class Expression
    location: class org.apache.cayenne.tutorial.Main

    /zonestorage/hudson/home/hudson/hudson/jobs/Cayenne-30/workspace/cayenneTestConnection/HSQLDB/jdk/JDK 1.6 (latest)/STABLE-3.0/tutorials/tutorial/src/main/java/org/apache/cayenne/tutorial/Main.java:[89,26] cannot find symbol
    symbol : variable Expression
    location: class org.apache.cayenne.tutorial.Main

    /zonestorage/hudson/home/hudson/hudson/jobs/Cayenne-30/workspace/cayenneTestConnection/HSQLDB/jdk/JDK 1.6 (latest)/STABLE-3.0/tutorials/tutorial/src/main/java/org/apache/cayenne/tutorial/Main.java:[93,2] cannot find symbol
    symbol : class SelectQuery
    location: class org.apache.cayenne.tutorial.Main

    /zonestorage/hudson/home/hudson/hudson/jobs/Cayenne-30/workspace/cayenneTestConnection/HSQLDB/jdk/JDK 1.6 (latest)/STABLE-3.0/tutorials/tutorial/src/main/java/org/apache/cayenne/tutorial/Main.java:[93,28] cannot find symbol
    symbol : class SelectQuery
    location: class org.apache.cayenne.tutorial.Main

    /zonestorage/hudson/home/hudson/hudson/jobs/Cayenne-30/workspace/cayenneTestConnection/HSQLDB/jdk/JDK 1.6 (latest)/STABLE-3.0/tutorials/tutorial/src/main/java/org/apache/cayenne/tutorial/Main.java:[94,7] type parameter org.apache.cayenne.tutorial.persistent.Painting is not within its bound

    /zonestorage/hudson/home/hudson/hudson/jobs/Cayenne-30/workspace/cayenneTestConnection/HSQLDB/jdk/JDK 1.6 (latest)/STABLE-3.0/tutorials/tutorial/src/main/java/org/apache/cayenne/tutorial/Main.java:[99,2] cannot find symbol
    symbol : class Expression
    location: class org.apache.cayenne.tutorial.Main

    /zonestorage/hudson/home/hudson/hudson/jobs/Cayenne-30/workspace/cayenneTestConnection/HSQLDB/jdk/JDK 1.6 (latest)/STABLE-3.0/tutorials/tutorial/src/main/java/org/apache/cayenne/tutorial/Main.java:[99,25] cannot find symbol
    symbol : variable ExpressionFactory
    location: class org.apache.cayenne.tutorial.Main

    /zonestorage/hudson/home/hudson/hudson/jobs/Cayenne-30/workspace/cayenneTestConnection/HSQLDB/jdk/JDK 1.6 (latest)/STABLE-3.0/tutorials/tutorial/src/main/java/org/apache/cayenne/tutorial/Main.java:[101,2] cannot find symbol
    symbol : class SelectQuery
    location: class org.apache.cayenne.tutorial.Main

    /zonestorage/hudson/home/hudson/hudson/jobs/Cayenne-30/workspace/cayenneTestConnection/HSQLDB/jdk/JDK 1.6 (latest)/STABLE-3.0/tutorials/tutorial/src/main/java/org/apache/cayenne/tutorial/Main.java:[101,35] cannot find symbol
    symbol : class SelectQuery
    location: class org.apache.cayenne.tutorial.Main

    /zonestorage/hudson/home/hudson/hudson/jobs/Cayenne-30/workspace/cayenneTestConnection/HSQLDB/jdk/JDK 1.6 (latest)/STABLE-3.0/tutorials/tutorial/src/main/java/org/apache/cayenne/tutorial/Main.java:[102,28] cannot find symbol
    symbol : variable DataObjectUtils
    location: class org.apache.cayenne.tutorial.Main

    /zonestorage/hudson/home/hudson/hudson/jobs/Cayenne-30/workspace/cayenneTestConnection/HSQLDB/jdk/JDK 1.6 (latest)/STABLE-3.0/tutorials/tutorial/src/main/java/org/apache/cayenne/tutorial/Main.java:[105,14] operator != cannot be applied to org.apache.cayenne.tutorial.persistent.Artist,<nulltype>


    [INFO] ------------------------------------------------------------------------
    [INFO] For more information, run Maven with the -e switch
    [INFO] ------------------------------------------------------------------------
    [INFO] Total time: 6 minutes 40 seconds
    [INFO] Finished at: Sun Dec 27 18:41:18 UTC 2009
    [INFO] Final Memory: 62M/239M
    [INFO] ------------------------------------------------------------------------
    [locks-and-latches] Releasing all the locks
    [locks-and-latches] All the locks released
    Recording test results
  • Apache Hudson Server at Dec 28, 2009 at 7:40 am
    See <http://hudson.zones.apache.org/hudson/job/Cayenne-30/./cayenneTestConnection=HSQLDB,jdk=JDK%201.6%20(latest)/4/changes>

    Changes:

    [andrey] evading maven error

    ------------------------------------------
    [...truncated 72397 lines...]
    [INFO] No sources to compile
    [INFO] [resources:testResources]
    [INFO] Using default encoding to copy filtered resources.
    [INFO] [compiler:testCompile]
    [INFO] No sources to compile
    [INFO] [surefire:test]
    [INFO] No tests to run.
    [INFO] [jar:jar]
    [INFO] Building jar: /zonestorage/hudson/home/hudson/hudson/jobs/Cayenne-30/workspace/cayenneTestConnection/HSQLDB/jdk/JDK 1.6 (latest)/STABLE-3.0/modeler/cayenne-modeler-java/target/cayenne-modeler-java-3.0-SNAPSHOT.jar
    [INFO] [install:install]
    [INFO] Installing /zonestorage/hudson/home/hudson/hudson/jobs/Cayenne-30/workspace/cayenneTestConnection/HSQLDB/jdk/JDK 1.6 (latest)/STABLE-3.0/modeler/cayenne-modeler-java/target/cayenne-modeler-java-3.0-SNAPSHOT.jar to /export/home/hudson/.m2/repository/org/apache/cayenne/cayenne-modeler-java/3.0-SNAPSHOT/cayenne-modeler-java-3.0-SNAPSHOT.jar
    [INFO] ------------------------------------------------------------------------
    [INFO] Building Cayenne Modeler Parent
    [INFO] task-segment: [clean, install]
    [INFO] ------------------------------------------------------------------------
    [INFO] [clean:clean]
    [INFO] [site:attach-descriptor]
    [INFO] [install:install]
    [INFO] Installing /zonestorage/hudson/home/hudson/hudson/jobs/Cayenne-30/workspace/cayenneTestConnection/HSQLDB/jdk/JDK 1.6 (latest)/STABLE-3.0/modeler/pom.xml to /export/home/hudson/.m2/repository/org/apache/cayenne/parents/cayenne-modeler-parent/3.0-SNAPSHOT/cayenne-modeler-parent-3.0-SNAPSHOT.pom
    [INFO] ------------------------------------------------------------------------
    [INFO] Building Cayenne Tutorial
    [INFO] task-segment: [clean, install]
    [INFO] ------------------------------------------------------------------------
    [INFO] [clean:clean]
    [INFO] Deleting directory /zonestorage/hudson/home/hudson/hudson/jobs/Cayenne-30/workspace/cayenneTestConnection/HSQLDB/jdk/JDK 1.6 (latest)/STABLE-3.0/tutorials/tutorial/target
    [INFO] [resources:resources]
    [INFO] Using default encoding to copy filtered resources.
    [INFO] [compiler:compile]
    [INFO] Compiling 9 source files to /zonestorage/hudson/home/hudson/hudson/jobs/Cayenne-30/workspace/cayenneTestConnection/HSQLDB/jdk/JDK 1.6 (latest)/STABLE-3.0/tutorials/tutorial/target/classes
    [INFO] ------------------------------------------------------------------------
    [ERROR] BUILD FAILURE
    [INFO] ------------------------------------------------------------------------
    [INFO] Compilation failure

    /zonestorage/hudson/home/hudson/hudson/jobs/Cayenne-30/workspace/cayenneTestConnection/HSQLDB/jdk/JDK 1.6 (latest)/STABLE-3.0/tutorials/tutorial/src/main/java/org/apache/cayenne/tutorial/persistent/auto/_Painting.java:[3,25] cannot find symbol
    symbol : class CayenneDataObject
    location: package org.apache.cayenne

    /zonestorage/hudson/home/hudson/hudson/jobs/Cayenne-30/workspace/cayenneTestConnection/HSQLDB/jdk/JDK 1.6 (latest)/STABLE-3.0/tutorials/tutorial/src/main/java/org/apache/cayenne/tutorial/persistent/auto/_Painting.java:[13,40] cannot find symbol
    symbol: class CayenneDataObject
    public abstract class _Painting extends CayenneDataObject {

    /zonestorage/hudson/home/hudson/hudson/jobs/Cayenne-30/workspace/cayenneTestConnection/HSQLDB/jdk/JDK 1.6 (latest)/STABLE-3.0/tutorials/tutorial/src/main/java/org/apache/cayenne/tutorial/persistent/auto/_Artist.java:[6,25] cannot find symbol
    symbol : class CayenneDataObject
    location: package org.apache.cayenne

    /zonestorage/hudson/home/hudson/hudson/jobs/Cayenne-30/workspace/cayenneTestConnection/HSQLDB/jdk/JDK 1.6 (latest)/STABLE-3.0/tutorials/tutorial/src/main/java/org/apache/cayenne/tutorial/persistent/auto/_Artist.java:[15,38] cannot find symbol
    symbol: class CayenneDataObject
    public abstract class _Artist extends CayenneDataObject {

    /zonestorage/hudson/home/hudson/hudson/jobs/Cayenne-30/workspace/cayenneTestConnection/HSQLDB/jdk/JDK 1.6 (latest)/STABLE-3.0/tutorials/tutorial/src/main/java/org/apache/cayenne/tutorial/persistent/auto/_Gallery.java:[5,25] cannot find symbol
    symbol : class CayenneDataObject
    location: package org.apache.cayenne

    /zonestorage/hudson/home/hudson/hudson/jobs/Cayenne-30/workspace/cayenneTestConnection/HSQLDB/jdk/JDK 1.6 (latest)/STABLE-3.0/tutorials/tutorial/src/main/java/org/apache/cayenne/tutorial/persistent/auto/_Gallery.java:[14,39] cannot find symbol
    symbol: class CayenneDataObject
    public abstract class _Gallery extends CayenneDataObject {

    /zonestorage/hudson/home/hudson/hudson/jobs/Cayenne-30/workspace/cayenneTestConnection/HSQLDB/jdk/JDK 1.6 (latest)/STABLE-3.0/tutorials/tutorial/src/main/java/org/apache/cayenne/tutorial/Main.java:[26,25] cannot find symbol
    symbol : class DataObjectUtils
    location: package org.apache.cayenne

    /zonestorage/hudson/home/hudson/hudson/jobs/Cayenne-30/workspace/cayenneTestConnection/HSQLDB/jdk/JDK 1.6 (latest)/STABLE-3.0/tutorials/tutorial/src/main/java/org/apache/cayenne/tutorial/Main.java:[27,25] cannot find symbol
    symbol : class ObjectContext
    location: package org.apache.cayenne

    /zonestorage/hudson/home/hudson/hudson/jobs/Cayenne-30/workspace/cayenneTestConnection/HSQLDB/jdk/JDK 1.6 (latest)/STABLE-3.0/tutorials/tutorial/src/main/java/org/apache/cayenne/tutorial/Main.java:[28,32] package org.apache.cayenne.access does not exist

    /zonestorage/hudson/home/hudson/hudson/jobs/Cayenne-30/workspace/cayenneTestConnection/HSQLDB/jdk/JDK 1.6 (latest)/STABLE-3.0/tutorials/tutorial/src/main/java/org/apache/cayenne/tutorial/Main.java:[29,29] package org.apache.cayenne.exp does not exist

    /zonestorage/hudson/home/hudson/hudson/jobs/Cayenne-30/workspace/cayenneTestConnection/HSQLDB/jdk/JDK 1.6 (latest)/STABLE-3.0/tutorials/tutorial/src/main/java/org/apache/cayenne/tutorial/Main.java:[30,29] package org.apache.cayenne.exp does not exist

    /zonestorage/hudson/home/hudson/hudson/jobs/Cayenne-30/workspace/cayenneTestConnection/HSQLDB/jdk/JDK 1.6 (latest)/STABLE-3.0/tutorials/tutorial/src/main/java/org/apache/cayenne/tutorial/Main.java:[31,31] package org.apache.cayenne.query does not exist

    /zonestorage/hudson/home/hudson/hudson/jobs/Cayenne-30/workspace/cayenneTestConnection/HSQLDB/jdk/JDK 1.6 (latest)/STABLE-3.0/tutorials/tutorial/src/main/java/org/apache/cayenne/tutorial/Main.java:[48,32] cannot find symbol
    symbol : class ObjectContext
    location: class org.apache.cayenne.tutorial.Main

    /zonestorage/hudson/home/hudson/hudson/jobs/Cayenne-30/workspace/cayenneTestConnection/HSQLDB/jdk/JDK 1.6 (latest)/STABLE-3.0/tutorials/tutorial/src/main/java/org/apache/cayenne/tutorial/Main.java:[76,28] cannot find symbol
    symbol : class ObjectContext
    location: class org.apache.cayenne.tutorial.Main

    /zonestorage/hudson/home/hudson/hudson/jobs/Cayenne-30/workspace/cayenneTestConnection/HSQLDB/jdk/JDK 1.6 (latest)/STABLE-3.0/tutorials/tutorial/src/main/java/org/apache/cayenne/tutorial/Main.java:[97,28] cannot find symbol
    symbol : class ObjectContext
    location: class org.apache.cayenne.tutorial.Main

    /zonestorage/hudson/home/hudson/hudson/jobs/Cayenne-30/workspace/cayenneTestConnection/HSQLDB/jdk/JDK 1.6 (latest)/STABLE-3.0/tutorials/tutorial/src/main/java/org/apache/cayenne/tutorial/persistent/auto/_Painting.java:[22,8] cannot find symbol
    symbol : method writeProperty(java.lang.String,java.lang.String)
    location: class org.apache.cayenne.tutorial.persistent.auto._Painting

    /zonestorage/hudson/home/hudson/hudson/jobs/Cayenne-30/workspace/cayenneTestConnection/HSQLDB/jdk/JDK 1.6 (latest)/STABLE-3.0/tutorials/tutorial/src/main/java/org/apache/cayenne/tutorial/persistent/auto/_Painting.java:[25,23] cannot find symbol
    symbol : method readProperty(java.lang.String)
    location: class org.apache.cayenne.tutorial.persistent.auto._Painting

    /zonestorage/hudson/home/hudson/hudson/jobs/Cayenne-30/workspace/cayenneTestConnection/HSQLDB/jdk/JDK 1.6 (latest)/STABLE-3.0/tutorials/tutorial/src/main/java/org/apache/cayenne/tutorial/persistent/auto/_Painting.java:[29,8] cannot find symbol
    symbol : method setToOneTarget(java.lang.String,org.apache.cayenne.tutorial.persistent.Artist,boolean)
    location: class org.apache.cayenne.tutorial.persistent.auto._Painting

    /zonestorage/hudson/home/hudson/hudson/jobs/Cayenne-30/workspace/cayenneTestConnection/HSQLDB/jdk/JDK 1.6 (latest)/STABLE-3.0/tutorials/tutorial/src/main/java/org/apache/cayenne/tutorial/persistent/auto/_Painting.java:[33,23] cannot find symbol
    symbol : method readProperty(java.lang.String)
    location: class org.apache.cayenne.tutorial.persistent.auto._Painting

    /zonestorage/hudson/home/hudson/hudson/jobs/Cayenne-30/workspace/cayenneTestConnection/HSQLDB/jdk/JDK 1.6 (latest)/STABLE-3.0/tutorials/tutorial/src/main/java/org/apache/cayenne/tutorial/persistent/auto/_Painting.java:[38,8] cannot find symbol
    symbol : method setToOneTarget(java.lang.String,org.apache.cayenne.tutorial.persistent.Gallery,boolean)
    location: class org.apache.cayenne.tutorial.persistent.auto._Painting

    /zonestorage/hudson/home/hudson/hudson/jobs/Cayenne-30/workspace/cayenneTestConnection/HSQLDB/jdk/JDK 1.6 (latest)/STABLE-3.0/tutorials/tutorial/src/main/java/org/apache/cayenne/tutorial/persistent/auto/_Painting.java:[42,24] cannot find symbol
    symbol : method readProperty(java.lang.String)
    location: class org.apache.cayenne.tutorial.persistent.auto._Painting

    /zonestorage/hudson/home/hudson/hudson/jobs/Cayenne-30/workspace/cayenneTestConnection/HSQLDB/jdk/JDK 1.6 (latest)/STABLE-3.0/tutorials/tutorial/src/main/java/org/apache/cayenne/tutorial/persistent/auto/_Artist.java:[24,8] cannot find symbol
    symbol : method writeProperty(java.lang.String,java.util.Date)
    location: class org.apache.cayenne.tutorial.persistent.auto._Artist

    /zonestorage/hudson/home/hudson/hudson/jobs/Cayenne-30/workspace/cayenneTestConnection/HSQLDB/jdk/JDK 1.6 (latest)/STABLE-3.0/tutorials/tutorial/src/main/java/org/apache/cayenne/tutorial/persistent/auto/_Artist.java:[27,21] cannot find symbol
    symbol : method readProperty(java.lang.String)
    location: class org.apache.cayenne.tutorial.persistent.auto._Artist

    /zonestorage/hudson/home/hudson/hudson/jobs/Cayenne-30/workspace/cayenneTestConnection/HSQLDB/jdk/JDK 1.6 (latest)/STABLE-3.0/tutorials/tutorial/src/main/java/org/apache/cayenne/tutorial/persistent/auto/_Artist.java:[31,8] cannot find symbol
    symbol : method writeProperty(java.lang.String,java.lang.String)
    location: class org.apache.cayenne.tutorial.persistent.auto._Artist

    /zonestorage/hudson/home/hudson/hudson/jobs/Cayenne-30/workspace/cayenneTestConnection/HSQLDB/jdk/JDK 1.6 (latest)/STABLE-3.0/tutorials/tutorial/src/main/java/org/apache/cayenne/tutorial/persistent/auto/_Artist.java:[34,23] cannot find symbol
    symbol : method readProperty(java.lang.String)
    location: class org.apache.cayenne.tutorial.persistent.auto._Artist

    /zonestorage/hudson/home/hudson/hudson/jobs/Cayenne-30/workspace/cayenneTestConnection/HSQLDB/jdk/JDK 1.6 (latest)/STABLE-3.0/tutorials/tutorial/src/main/java/org/apache/cayenne/tutorial/persistent/auto/_Artist.java:[38,8] cannot find symbol
    symbol : method addToManyTarget(java.lang.String,org.apache.cayenne.tutorial.persistent.Painting,boolean)
    location: class org.apache.cayenne.tutorial.persistent.auto._Artist

    /zonestorage/hudson/home/hudson/hudson/jobs/Cayenne-30/workspace/cayenneTestConnection/HSQLDB/jdk/JDK 1.6 (latest)/STABLE-3.0/tutorials/tutorial/src/main/java/org/apache/cayenne/tutorial/persistent/auto/_Artist.java:[41,8] cannot find symbol
    symbol : method removeToManyTarget(java.lang.String,org.apache.cayenne.tutorial.persistent.Painting,boolean)
    location: class org.apache.cayenne.tutorial.persistent.auto._Artist

    /zonestorage/hudson/home/hudson/hudson/jobs/Cayenne-30/workspace/cayenneTestConnection/HSQLDB/jdk/JDK 1.6 (latest)/STABLE-3.0/tutorials/tutorial/src/main/java/org/apache/cayenne/tutorial/persistent/auto/_Artist.java:[44,16] type parameter org.apache.cayenne.tutorial.persistent.Painting is not within its bound

    /zonestorage/hudson/home/hudson/hudson/jobs/Cayenne-30/workspace/cayenneTestConnection/HSQLDB/jdk/JDK 1.6 (latest)/STABLE-3.0/tutorials/tutorial/src/main/java/org/apache/cayenne/tutorial/persistent/auto/_Artist.java:[45,31] cannot find symbol
    symbol : method readProperty(java.lang.String)
    location: class org.apache.cayenne.tutorial.persistent.auto._Artist

    /zonestorage/hudson/home/hudson/hudson/jobs/Cayenne-30/workspace/cayenneTestConnection/HSQLDB/jdk/JDK 1.6 (latest)/STABLE-3.0/tutorials/tutorial/src/main/java/org/apache/cayenne/tutorial/persistent/auto/_Gallery.java:[22,8] cannot find symbol
    symbol : method writeProperty(java.lang.String,java.lang.String)
    location: class org.apache.cayenne.tutorial.persistent.auto._Gallery

    /zonestorage/hudson/home/hudson/hudson/jobs/Cayenne-30/workspace/cayenneTestConnection/HSQLDB/jdk/JDK 1.6 (latest)/STABLE-3.0/tutorials/tutorial/src/main/java/org/apache/cayenne/tutorial/persistent/auto/_Gallery.java:[25,23] cannot find symbol
    symbol : method readProperty(java.lang.String)
    location: class org.apache.cayenne.tutorial.persistent.auto._Gallery

    /zonestorage/hudson/home/hudson/hudson/jobs/Cayenne-30/workspace/cayenneTestConnection/HSQLDB/jdk/JDK 1.6 (latest)/STABLE-3.0/tutorials/tutorial/src/main/java/org/apache/cayenne/tutorial/persistent/auto/_Gallery.java:[29,8] cannot find symbol
    symbol : method addToManyTarget(java.lang.String,org.apache.cayenne.tutorial.persistent.Painting,boolean)
    location: class org.apache.cayenne.tutorial.persistent.auto._Gallery

    /zonestorage/hudson/home/hudson/hudson/jobs/Cayenne-30/workspace/cayenneTestConnection/HSQLDB/jdk/JDK 1.6 (latest)/STABLE-3.0/tutorials/tutorial/src/main/java/org/apache/cayenne/tutorial/persistent/auto/_Gallery.java:[32,8] cannot find symbol
    symbol : method removeToManyTarget(java.lang.String,org.apache.cayenne.tutorial.persistent.Painting,boolean)
    location: class org.apache.cayenne.tutorial.persistent.auto._Gallery

    /zonestorage/hudson/home/hudson/hudson/jobs/Cayenne-30/workspace/cayenneTestConnection/HSQLDB/jdk/JDK 1.6 (latest)/STABLE-3.0/tutorials/tutorial/src/main/java/org/apache/cayenne/tutorial/persistent/auto/_Gallery.java:[35,16] type parameter org.apache.cayenne.tutorial.persistent.Painting is not within its bound

    /zonestorage/hudson/home/hudson/hudson/jobs/Cayenne-30/workspace/cayenneTestConnection/HSQLDB/jdk/JDK 1.6 (latest)/STABLE-3.0/tutorials/tutorial/src/main/java/org/apache/cayenne/tutorial/persistent/auto/_Gallery.java:[36,31] cannot find symbol
    symbol : method readProperty(java.lang.String)
    location: class org.apache.cayenne.tutorial.persistent.auto._Gallery

    /zonestorage/hudson/home/hudson/hudson/jobs/Cayenne-30/workspace/cayenneTestConnection/HSQLDB/jdk/JDK 1.6 (latest)/STABLE-3.0/tutorials/tutorial/src/main/java/org/apache/cayenne/tutorial/Main.java:[41,2] cannot find symbol
    symbol : class ObjectContext
    location: class org.apache.cayenne.tutorial.Main

    /zonestorage/hudson/home/hudson/hudson/jobs/Cayenne-30/workspace/cayenneTestConnection/HSQLDB/jdk/JDK 1.6 (latest)/STABLE-3.0/tutorials/tutorial/src/main/java/org/apache/cayenne/tutorial/Main.java:[41,26] cannot find symbol
    symbol : variable DataContext
    location: class org.apache.cayenne.tutorial.Main

    /zonestorage/hudson/home/hudson/hudson/jobs/Cayenne-30/workspace/cayenneTestConnection/HSQLDB/jdk/JDK 1.6 (latest)/STABLE-3.0/tutorials/tutorial/src/main/java/org/apache/cayenne/tutorial/Main.java:[78,2] cannot find symbol
    symbol : class SelectQuery
    location: class org.apache.cayenne.tutorial.Main

    /zonestorage/hudson/home/hudson/hudson/jobs/Cayenne-30/workspace/cayenneTestConnection/HSQLDB/jdk/JDK 1.6 (latest)/STABLE-3.0/tutorials/tutorial/src/main/java/org/apache/cayenne/tutorial/Main.java:[78,28] cannot find symbol
    symbol : class SelectQuery
    location: class org.apache.cayenne.tutorial.Main

    /zonestorage/hudson/home/hudson/hudson/jobs/Cayenne-30/workspace/cayenneTestConnection/HSQLDB/jdk/JDK 1.6 (latest)/STABLE-3.0/tutorials/tutorial/src/main/java/org/apache/cayenne/tutorial/Main.java:[79,7] type parameter org.apache.cayenne.tutorial.persistent.Painting is not within its bound

    /zonestorage/hudson/home/hudson/hudson/jobs/Cayenne-30/workspace/cayenneTestConnection/HSQLDB/jdk/JDK 1.6 (latest)/STABLE-3.0/tutorials/tutorial/src/main/java/org/apache/cayenne/tutorial/Main.java:[81,2] cannot find symbol
    symbol : class Expression
    location: class org.apache.cayenne.tutorial.Main

    /zonestorage/hudson/home/hudson/hudson/jobs/Cayenne-30/workspace/cayenneTestConnection/HSQLDB/jdk/JDK 1.6 (latest)/STABLE-3.0/tutorials/tutorial/src/main/java/org/apache/cayenne/tutorial/Main.java:[81,26] cannot find symbol
    symbol : variable ExpressionFactory
    location: class org.apache.cayenne.tutorial.Main

    /zonestorage/hudson/home/hudson/hudson/jobs/Cayenne-30/workspace/cayenneTestConnection/HSQLDB/jdk/JDK 1.6 (latest)/STABLE-3.0/tutorials/tutorial/src/main/java/org/apache/cayenne/tutorial/Main.java:[83,2] cannot find symbol
    symbol : class SelectQuery
    location: class org.apache.cayenne.tutorial.Main

    /zonestorage/hudson/home/hudson/hudson/jobs/Cayenne-30/workspace/cayenneTestConnection/HSQLDB/jdk/JDK 1.6 (latest)/STABLE-3.0/tutorials/tutorial/src/main/java/org/apache/cayenne/tutorial/Main.java:[83,28] cannot find symbol
    symbol : class SelectQuery
    location: class org.apache.cayenne.tutorial.Main

    /zonestorage/hudson/home/hudson/hudson/jobs/Cayenne-30/workspace/cayenneTestConnection/HSQLDB/jdk/JDK 1.6 (latest)/STABLE-3.0/tutorials/tutorial/src/main/java/org/apache/cayenne/tutorial/Main.java:[84,7] type parameter org.apache.cayenne.tutorial.persistent.Painting is not within its bound

    /zonestorage/hudson/home/hudson/hudson/jobs/Cayenne-30/workspace/cayenneTestConnection/HSQLDB/jdk/JDK 1.6 (latest)/STABLE-3.0/tutorials/tutorial/src/main/java/org/apache/cayenne/tutorial/Main.java:[89,2] cannot find symbol
    symbol : class Expression
    location: class org.apache.cayenne.tutorial.Main

    /zonestorage/hudson/home/hudson/hudson/jobs/Cayenne-30/workspace/cayenneTestConnection/HSQLDB/jdk/JDK 1.6 (latest)/STABLE-3.0/tutorials/tutorial/src/main/java/org/apache/cayenne/tutorial/Main.java:[89,26] cannot find symbol
    symbol : variable Expression
    location: class org.apache.cayenne.tutorial.Main

    /zonestorage/hudson/home/hudson/hudson/jobs/Cayenne-30/workspace/cayenneTestConnection/HSQLDB/jdk/JDK 1.6 (latest)/STABLE-3.0/tutorials/tutorial/src/main/java/org/apache/cayenne/tutorial/Main.java:[93,2] cannot find symbol
    symbol : class SelectQuery
    location: class org.apache.cayenne.tutorial.Main

    /zonestorage/hudson/home/hudson/hudson/jobs/Cayenne-30/workspace/cayenneTestConnection/HSQLDB/jdk/JDK 1.6 (latest)/STABLE-3.0/tutorials/tutorial/src/main/java/org/apache/cayenne/tutorial/Main.java:[93,28] cannot find symbol
    symbol : class SelectQuery
    location: class org.apache.cayenne.tutorial.Main

    /zonestorage/hudson/home/hudson/hudson/jobs/Cayenne-30/workspace/cayenneTestConnection/HSQLDB/jdk/JDK 1.6 (latest)/STABLE-3.0/tutorials/tutorial/src/main/java/org/apache/cayenne/tutorial/Main.java:[94,7] type parameter org.apache.cayenne.tutorial.persistent.Painting is not within its bound

    /zonestorage/hudson/home/hudson/hudson/jobs/Cayenne-30/workspace/cayenneTestConnection/HSQLDB/jdk/JDK 1.6 (latest)/STABLE-3.0/tutorials/tutorial/src/main/java/org/apache/cayenne/tutorial/Main.java:[99,2] cannot find symbol
    symbol : class Expression
    location: class org.apache.cayenne.tutorial.Main

    /zonestorage/hudson/home/hudson/hudson/jobs/Cayenne-30/workspace/cayenneTestConnection/HSQLDB/jdk/JDK 1.6 (latest)/STABLE-3.0/tutorials/tutorial/src/main/java/org/apache/cayenne/tutorial/Main.java:[99,25] cannot find symbol
    symbol : variable ExpressionFactory
    location: class org.apache.cayenne.tutorial.Main

    /zonestorage/hudson/home/hudson/hudson/jobs/Cayenne-30/workspace/cayenneTestConnection/HSQLDB/jdk/JDK 1.6 (latest)/STABLE-3.0/tutorials/tutorial/src/main/java/org/apache/cayenne/tutorial/Main.java:[101,2] cannot find symbol
    symbol : class SelectQuery
    location: class org.apache.cayenne.tutorial.Main

    /zonestorage/hudson/home/hudson/hudson/jobs/Cayenne-30/workspace/cayenneTestConnection/HSQLDB/jdk/JDK 1.6 (latest)/STABLE-3.0/tutorials/tutorial/src/main/java/org/apache/cayenne/tutorial/Main.java:[101,35] cannot find symbol
    symbol : class SelectQuery
    location: class org.apache.cayenne.tutorial.Main

    /zonestorage/hudson/home/hudson/hudson/jobs/Cayenne-30/workspace/cayenneTestConnection/HSQLDB/jdk/JDK 1.6 (latest)/STABLE-3.0/tutorials/tutorial/src/main/java/org/apache/cayenne/tutorial/Main.java:[102,28] cannot find symbol
    symbol : variable DataObjectUtils
    location: class org.apache.cayenne.tutorial.Main

    /zonestorage/hudson/home/hudson/hudson/jobs/Cayenne-30/workspace/cayenneTestConnection/HSQLDB/jdk/JDK 1.6 (latest)/STABLE-3.0/tutorials/tutorial/src/main/java/org/apache/cayenne/tutorial/Main.java:[105,14] operator != cannot be applied to org.apache.cayenne.tutorial.persistent.Artist,<nulltype>


    [INFO] ------------------------------------------------------------------------
    [INFO] For more information, run Maven with the -e switch
    [INFO] ------------------------------------------------------------------------
    [INFO] Total time: 9 minutes 54 seconds
    [INFO] Finished at: Mon Dec 28 07:39:09 UTC 2009
    [INFO] Final Memory: 62M/220M
    [INFO] ------------------------------------------------------------------------
    [locks-and-latches] Releasing all the locks
    [locks-and-latches] All the locks released
    Recording test results
  • Apache Hudson Server at Dec 29, 2009 at 11:47 am
    See <http://hudson.zones.apache.org/hudson/job/Cayenne-30/./cayenneTestConnection=HSQLDB,jdk=JDK%201.6%20(latest)/5/changes>

    Changes:

    [andrey] CAY-1351 EntityResolver.getEmbeddable(...) always returns null

    ------------------------------------------
    [...truncated 72395 lines...]
    [INFO] No sources to compile
    [INFO] [resources:testResources]
    [INFO] Using default encoding to copy filtered resources.
    [INFO] [compiler:testCompile]
    [INFO] No sources to compile
    [INFO] [surefire:test]
    [INFO] No tests to run.
    [INFO] [jar:jar]
    [INFO] Building jar: /zonestorage/hudson/home/hudson/hudson/jobs/Cayenne-30/workspace/cayenneTestConnection/HSQLDB/jdk/JDK 1.6 (latest)/STABLE-3.0/modeler/cayenne-modeler-java/target/cayenne-modeler-java-3.0-SNAPSHOT.jar
    [INFO] [install:install]
    [INFO] Installing /zonestorage/hudson/home/hudson/hudson/jobs/Cayenne-30/workspace/cayenneTestConnection/HSQLDB/jdk/JDK 1.6 (latest)/STABLE-3.0/modeler/cayenne-modeler-java/target/cayenne-modeler-java-3.0-SNAPSHOT.jar to /export/home/hudson/.m2/repository/org/apache/cayenne/cayenne-modeler-java/3.0-SNAPSHOT/cayenne-modeler-java-3.0-SNAPSHOT.jar
    [INFO] ------------------------------------------------------------------------
    [INFO] Building Cayenne Modeler Parent
    [INFO] task-segment: [clean, install]
    [INFO] ------------------------------------------------------------------------
    [INFO] [clean:clean]
    [INFO] [site:attach-descriptor]
    [INFO] [install:install]
    [INFO] Installing /zonestorage/hudson/home/hudson/hudson/jobs/Cayenne-30/workspace/cayenneTestConnection/HSQLDB/jdk/JDK 1.6 (latest)/STABLE-3.0/modeler/pom.xml to /export/home/hudson/.m2/repository/org/apache/cayenne/parents/cayenne-modeler-parent/3.0-SNAPSHOT/cayenne-modeler-parent-3.0-SNAPSHOT.pom
    [INFO] ------------------------------------------------------------------------
    [INFO] Building Cayenne Tutorial
    [INFO] task-segment: [clean, install]
    [INFO] ------------------------------------------------------------------------
    [INFO] [clean:clean]
    [INFO] Deleting directory /zonestorage/hudson/home/hudson/hudson/jobs/Cayenne-30/workspace/cayenneTestConnection/HSQLDB/jdk/JDK 1.6 (latest)/STABLE-3.0/tutorials/tutorial/target
    [INFO] [resources:resources]
    [INFO] Using default encoding to copy filtered resources.
    [INFO] [compiler:compile]
    [INFO] Compiling 9 source files to /zonestorage/hudson/home/hudson/hudson/jobs/Cayenne-30/workspace/cayenneTestConnection/HSQLDB/jdk/JDK 1.6 (latest)/STABLE-3.0/tutorials/tutorial/target/classes
    [INFO] ------------------------------------------------------------------------
    [ERROR] BUILD FAILURE
    [INFO] ------------------------------------------------------------------------
    [INFO] Compilation failure

    /zonestorage/hudson/home/hudson/hudson/jobs/Cayenne-30/workspace/cayenneTestConnection/HSQLDB/jdk/JDK 1.6 (latest)/STABLE-3.0/tutorials/tutorial/src/main/java/org/apache/cayenne/tutorial/persistent/auto/_Painting.java:[3,25] cannot find symbol
    symbol : class CayenneDataObject
    location: package org.apache.cayenne

    /zonestorage/hudson/home/hudson/hudson/jobs/Cayenne-30/workspace/cayenneTestConnection/HSQLDB/jdk/JDK 1.6 (latest)/STABLE-3.0/tutorials/tutorial/src/main/java/org/apache/cayenne/tutorial/persistent/auto/_Painting.java:[13,40] cannot find symbol
    symbol: class CayenneDataObject
    public abstract class _Painting extends CayenneDataObject {

    /zonestorage/hudson/home/hudson/hudson/jobs/Cayenne-30/workspace/cayenneTestConnection/HSQLDB/jdk/JDK 1.6 (latest)/STABLE-3.0/tutorials/tutorial/src/main/java/org/apache/cayenne/tutorial/persistent/auto/_Artist.java:[6,25] cannot find symbol
    symbol : class CayenneDataObject
    location: package org.apache.cayenne

    /zonestorage/hudson/home/hudson/hudson/jobs/Cayenne-30/workspace/cayenneTestConnection/HSQLDB/jdk/JDK 1.6 (latest)/STABLE-3.0/tutorials/tutorial/src/main/java/org/apache/cayenne/tutorial/persistent/auto/_Artist.java:[15,38] cannot find symbol
    symbol: class CayenneDataObject
    public abstract class _Artist extends CayenneDataObject {

    /zonestorage/hudson/home/hudson/hudson/jobs/Cayenne-30/workspace/cayenneTestConnection/HSQLDB/jdk/JDK 1.6 (latest)/STABLE-3.0/tutorials/tutorial/src/main/java/org/apache/cayenne/tutorial/persistent/auto/_Gallery.java:[5,25] cannot find symbol
    symbol : class CayenneDataObject
    location: package org.apache.cayenne

    /zonestorage/hudson/home/hudson/hudson/jobs/Cayenne-30/workspace/cayenneTestConnection/HSQLDB/jdk/JDK 1.6 (latest)/STABLE-3.0/tutorials/tutorial/src/main/java/org/apache/cayenne/tutorial/persistent/auto/_Gallery.java:[14,39] cannot find symbol
    symbol: class CayenneDataObject
    public abstract class _Gallery extends CayenneDataObject {

    /zonestorage/hudson/home/hudson/hudson/jobs/Cayenne-30/workspace/cayenneTestConnection/HSQLDB/jdk/JDK 1.6 (latest)/STABLE-3.0/tutorials/tutorial/src/main/java/org/apache/cayenne/tutorial/Main.java:[26,25] cannot find symbol
    symbol : class DataObjectUtils
    location: package org.apache.cayenne

    /zonestorage/hudson/home/hudson/hudson/jobs/Cayenne-30/workspace/cayenneTestConnection/HSQLDB/jdk/JDK 1.6 (latest)/STABLE-3.0/tutorials/tutorial/src/main/java/org/apache/cayenne/tutorial/Main.java:[27,25] cannot find symbol
    symbol : class ObjectContext
    location: package org.apache.cayenne

    /zonestorage/hudson/home/hudson/hudson/jobs/Cayenne-30/workspace/cayenneTestConnection/HSQLDB/jdk/JDK 1.6 (latest)/STABLE-3.0/tutorials/tutorial/src/main/java/org/apache/cayenne/tutorial/Main.java:[28,32] package org.apache.cayenne.access does not exist

    /zonestorage/hudson/home/hudson/hudson/jobs/Cayenne-30/workspace/cayenneTestConnection/HSQLDB/jdk/JDK 1.6 (latest)/STABLE-3.0/tutorials/tutorial/src/main/java/org/apache/cayenne/tutorial/Main.java:[29,29] package org.apache.cayenne.exp does not exist

    /zonestorage/hudson/home/hudson/hudson/jobs/Cayenne-30/workspace/cayenneTestConnection/HSQLDB/jdk/JDK 1.6 (latest)/STABLE-3.0/tutorials/tutorial/src/main/java/org/apache/cayenne/tutorial/Main.java:[30,29] package org.apache.cayenne.exp does not exist

    /zonestorage/hudson/home/hudson/hudson/jobs/Cayenne-30/workspace/cayenneTestConnection/HSQLDB/jdk/JDK 1.6 (latest)/STABLE-3.0/tutorials/tutorial/src/main/java/org/apache/cayenne/tutorial/Main.java:[31,31] package org.apache.cayenne.query does not exist

    /zonestorage/hudson/home/hudson/hudson/jobs/Cayenne-30/workspace/cayenneTestConnection/HSQLDB/jdk/JDK 1.6 (latest)/STABLE-3.0/tutorials/tutorial/src/main/java/org/apache/cayenne/tutorial/Main.java:[48,32] cannot find symbol
    symbol : class ObjectContext
    location: class org.apache.cayenne.tutorial.Main

    /zonestorage/hudson/home/hudson/hudson/jobs/Cayenne-30/workspace/cayenneTestConnection/HSQLDB/jdk/JDK 1.6 (latest)/STABLE-3.0/tutorials/tutorial/src/main/java/org/apache/cayenne/tutorial/Main.java:[76,28] cannot find symbol
    symbol : class ObjectContext
    location: class org.apache.cayenne.tutorial.Main

    /zonestorage/hudson/home/hudson/hudson/jobs/Cayenne-30/workspace/cayenneTestConnection/HSQLDB/jdk/JDK 1.6 (latest)/STABLE-3.0/tutorials/tutorial/src/main/java/org/apache/cayenne/tutorial/Main.java:[97,28] cannot find symbol
    symbol : class ObjectContext
    location: class org.apache.cayenne.tutorial.Main

    /zonestorage/hudson/home/hudson/hudson/jobs/Cayenne-30/workspace/cayenneTestConnection/HSQLDB/jdk/JDK 1.6 (latest)/STABLE-3.0/tutorials/tutorial/src/main/java/org/apache/cayenne/tutorial/persistent/auto/_Painting.java:[22,8] cannot find symbol
    symbol : method writeProperty(java.lang.String,java.lang.String)
    location: class org.apache.cayenne.tutorial.persistent.auto._Painting

    /zonestorage/hudson/home/hudson/hudson/jobs/Cayenne-30/workspace/cayenneTestConnection/HSQLDB/jdk/JDK 1.6 (latest)/STABLE-3.0/tutorials/tutorial/src/main/java/org/apache/cayenne/tutorial/persistent/auto/_Painting.java:[25,23] cannot find symbol
    symbol : method readProperty(java.lang.String)
    location: class org.apache.cayenne.tutorial.persistent.auto._Painting

    /zonestorage/hudson/home/hudson/hudson/jobs/Cayenne-30/workspace/cayenneTestConnection/HSQLDB/jdk/JDK 1.6 (latest)/STABLE-3.0/tutorials/tutorial/src/main/java/org/apache/cayenne/tutorial/persistent/auto/_Painting.java:[29,8] cannot find symbol
    symbol : method setToOneTarget(java.lang.String,org.apache.cayenne.tutorial.persistent.Artist,boolean)
    location: class org.apache.cayenne.tutorial.persistent.auto._Painting

    /zonestorage/hudson/home/hudson/hudson/jobs/Cayenne-30/workspace/cayenneTestConnection/HSQLDB/jdk/JDK 1.6 (latest)/STABLE-3.0/tutorials/tutorial/src/main/java/org/apache/cayenne/tutorial/persistent/auto/_Painting.java:[33,23] cannot find symbol
    symbol : method readProperty(java.lang.String)
    location: class org.apache.cayenne.tutorial.persistent.auto._Painting

    /zonestorage/hudson/home/hudson/hudson/jobs/Cayenne-30/workspace/cayenneTestConnection/HSQLDB/jdk/JDK 1.6 (latest)/STABLE-3.0/tutorials/tutorial/src/main/java/org/apache/cayenne/tutorial/persistent/auto/_Painting.java:[38,8] cannot find symbol
    symbol : method setToOneTarget(java.lang.String,org.apache.cayenne.tutorial.persistent.Gallery,boolean)
    location: class org.apache.cayenne.tutorial.persistent.auto._Painting

    /zonestorage/hudson/home/hudson/hudson/jobs/Cayenne-30/workspace/cayenneTestConnection/HSQLDB/jdk/JDK 1.6 (latest)/STABLE-3.0/tutorials/tutorial/src/main/java/org/apache/cayenne/tutorial/persistent/auto/_Painting.java:[42,24] cannot find symbol
    symbol : method readProperty(java.lang.String)
    location: class org.apache.cayenne.tutorial.persistent.auto._Painting

    /zonestorage/hudson/home/hudson/hudson/jobs/Cayenne-30/workspace/cayenneTestConnection/HSQLDB/jdk/JDK 1.6 (latest)/STABLE-3.0/tutorials/tutorial/src/main/java/org/apache/cayenne/tutorial/persistent/auto/_Artist.java:[24,8] cannot find symbol
    symbol : method writeProperty(java.lang.String,java.util.Date)
    location: class org.apache.cayenne.tutorial.persistent.auto._Artist

    /zonestorage/hudson/home/hudson/hudson/jobs/Cayenne-30/workspace/cayenneTestConnection/HSQLDB/jdk/JDK 1.6 (latest)/STABLE-3.0/tutorials/tutorial/src/main/java/org/apache/cayenne/tutorial/persistent/auto/_Artist.java:[27,21] cannot find symbol
    symbol : method readProperty(java.lang.String)
    location: class org.apache.cayenne.tutorial.persistent.auto._Artist

    /zonestorage/hudson/home/hudson/hudson/jobs/Cayenne-30/workspace/cayenneTestConnection/HSQLDB/jdk/JDK 1.6 (latest)/STABLE-3.0/tutorials/tutorial/src/main/java/org/apache/cayenne/tutorial/persistent/auto/_Artist.java:[31,8] cannot find symbol
    symbol : method writeProperty(java.lang.String,java.lang.String)
    location: class org.apache.cayenne.tutorial.persistent.auto._Artist

    /zonestorage/hudson/home/hudson/hudson/jobs/Cayenne-30/workspace/cayenneTestConnection/HSQLDB/jdk/JDK 1.6 (latest)/STABLE-3.0/tutorials/tutorial/src/main/java/org/apache/cayenne/tutorial/persistent/auto/_Artist.java:[34,23] cannot find symbol
    symbol : method readProperty(java.lang.String)
    location: class org.apache.cayenne.tutorial.persistent.auto._Artist

    /zonestorage/hudson/home/hudson/hudson/jobs/Cayenne-30/workspace/cayenneTestConnection/HSQLDB/jdk/JDK 1.6 (latest)/STABLE-3.0/tutorials/tutorial/src/main/java/org/apache/cayenne/tutorial/persistent/auto/_Artist.java:[38,8] cannot find symbol
    symbol : method addToManyTarget(java.lang.String,org.apache.cayenne.tutorial.persistent.Painting,boolean)
    location: class org.apache.cayenne.tutorial.persistent.auto._Artist

    /zonestorage/hudson/home/hudson/hudson/jobs/Cayenne-30/workspace/cayenneTestConnection/HSQLDB/jdk/JDK 1.6 (latest)/STABLE-3.0/tutorials/tutorial/src/main/java/org/apache/cayenne/tutorial/persistent/auto/_Artist.java:[41,8] cannot find symbol
    symbol : method removeToManyTarget(java.lang.String,org.apache.cayenne.tutorial.persistent.Painting,boolean)
    location: class org.apache.cayenne.tutorial.persistent.auto._Artist

    /zonestorage/hudson/home/hudson/hudson/jobs/Cayenne-30/workspace/cayenneTestConnection/HSQLDB/jdk/JDK 1.6 (latest)/STABLE-3.0/tutorials/tutorial/src/main/java/org/apache/cayenne/tutorial/persistent/auto/_Artist.java:[44,16] type parameter org.apache.cayenne.tutorial.persistent.Painting is not within its bound

    /zonestorage/hudson/home/hudson/hudson/jobs/Cayenne-30/workspace/cayenneTestConnection/HSQLDB/jdk/JDK 1.6 (latest)/STABLE-3.0/tutorials/tutorial/src/main/java/org/apache/cayenne/tutorial/persistent/auto/_Artist.java:[45,31] cannot find symbol
    symbol : method readProperty(java.lang.String)
    location: class org.apache.cayenne.tutorial.persistent.auto._Artist

    /zonestorage/hudson/home/hudson/hudson/jobs/Cayenne-30/workspace/cayenneTestConnection/HSQLDB/jdk/JDK 1.6 (latest)/STABLE-3.0/tutorials/tutorial/src/main/java/org/apache/cayenne/tutorial/persistent/auto/_Gallery.java:[22,8] cannot find symbol
    symbol : method writeProperty(java.lang.String,java.lang.String)
    location: class org.apache.cayenne.tutorial.persistent.auto._Gallery

    /zonestorage/hudson/home/hudson/hudson/jobs/Cayenne-30/workspace/cayenneTestConnection/HSQLDB/jdk/JDK 1.6 (latest)/STABLE-3.0/tutorials/tutorial/src/main/java/org/apache/cayenne/tutorial/persistent/auto/_Gallery.java:[25,23] cannot find symbol
    symbol : method readProperty(java.lang.String)
    location: class org.apache.cayenne.tutorial.persistent.auto._Gallery

    /zonestorage/hudson/home/hudson/hudson/jobs/Cayenne-30/workspace/cayenneTestConnection/HSQLDB/jdk/JDK 1.6 (latest)/STABLE-3.0/tutorials/tutorial/src/main/java/org/apache/cayenne/tutorial/persistent/auto/_Gallery.java:[29,8] cannot find symbol
    symbol : method addToManyTarget(java.lang.String,org.apache.cayenne.tutorial.persistent.Painting,boolean)
    location: class org.apache.cayenne.tutorial.persistent.auto._Gallery

    /zonestorage/hudson/home/hudson/hudson/jobs/Cayenne-30/workspace/cayenneTestConnection/HSQLDB/jdk/JDK 1.6 (latest)/STABLE-3.0/tutorials/tutorial/src/main/java/org/apache/cayenne/tutorial/persistent/auto/_Gallery.java:[32,8] cannot find symbol
    symbol : method removeToManyTarget(java.lang.String,org.apache.cayenne.tutorial.persistent.Painting,boolean)
    location: class org.apache.cayenne.tutorial.persistent.auto._Gallery

    /zonestorage/hudson/home/hudson/hudson/jobs/Cayenne-30/workspace/cayenneTestConnection/HSQLDB/jdk/JDK 1.6 (latest)/STABLE-3.0/tutorials/tutorial/src/main/java/org/apache/cayenne/tutorial/persistent/auto/_Gallery.java:[35,16] type parameter org.apache.cayenne.tutorial.persistent.Painting is not within its bound

    /zonestorage/hudson/home/hudson/hudson/jobs/Cayenne-30/workspace/cayenneTestConnection/HSQLDB/jdk/JDK 1.6 (latest)/STABLE-3.0/tutorials/tutorial/src/main/java/org/apache/cayenne/tutorial/persistent/auto/_Gallery.java:[36,31] cannot find symbol
    symbol : method readProperty(java.lang.String)
    location: class org.apache.cayenne.tutorial.persistent.auto._Gallery

    /zonestorage/hudson/home/hudson/hudson/jobs/Cayenne-30/workspace/cayenneTestConnection/HSQLDB/jdk/JDK 1.6 (latest)/STABLE-3.0/tutorials/tutorial/src/main/java/org/apache/cayenne/tutorial/Main.java:[41,2] cannot find symbol
    symbol : class ObjectContext
    location: class org.apache.cayenne.tutorial.Main

    /zonestorage/hudson/home/hudson/hudson/jobs/Cayenne-30/workspace/cayenneTestConnection/HSQLDB/jdk/JDK 1.6 (latest)/STABLE-3.0/tutorials/tutorial/src/main/java/org/apache/cayenne/tutorial/Main.java:[41,26] cannot find symbol
    symbol : variable DataContext
    location: class org.apache.cayenne.tutorial.Main

    /zonestorage/hudson/home/hudson/hudson/jobs/Cayenne-30/workspace/cayenneTestConnection/HSQLDB/jdk/JDK 1.6 (latest)/STABLE-3.0/tutorials/tutorial/src/main/java/org/apache/cayenne/tutorial/Main.java:[78,2] cannot find symbol
    symbol : class SelectQuery
    location: class org.apache.cayenne.tutorial.Main

    /zonestorage/hudson/home/hudson/hudson/jobs/Cayenne-30/workspace/cayenneTestConnection/HSQLDB/jdk/JDK 1.6 (latest)/STABLE-3.0/tutorials/tutorial/src/main/java/org/apache/cayenne/tutorial/Main.java:[78,28] cannot find symbol
    symbol : class SelectQuery
    location: class org.apache.cayenne.tutorial.Main

    /zonestorage/hudson/home/hudson/hudson/jobs/Cayenne-30/workspace/cayenneTestConnection/HSQLDB/jdk/JDK 1.6 (latest)/STABLE-3.0/tutorials/tutorial/src/main/java/org/apache/cayenne/tutorial/Main.java:[79,7] type parameter org.apache.cayenne.tutorial.persistent.Painting is not within its bound

    /zonestorage/hudson/home/hudson/hudson/jobs/Cayenne-30/workspace/cayenneTestConnection/HSQLDB/jdk/JDK 1.6 (latest)/STABLE-3.0/tutorials/tutorial/src/main/java/org/apache/cayenne/tutorial/Main.java:[81,2] cannot find symbol
    symbol : class Expression
    location: class org.apache.cayenne.tutorial.Main

    /zonestorage/hudson/home/hudson/hudson/jobs/Cayenne-30/workspace/cayenneTestConnection/HSQLDB/jdk/JDK 1.6 (latest)/STABLE-3.0/tutorials/tutorial/src/main/java/org/apache/cayenne/tutorial/Main.java:[81,26] cannot find symbol
    symbol : variable ExpressionFactory
    location: class org.apache.cayenne.tutorial.Main

    /zonestorage/hudson/home/hudson/hudson/jobs/Cayenne-30/workspace/cayenneTestConnection/HSQLDB/jdk/JDK 1.6 (latest)/STABLE-3.0/tutorials/tutorial/src/main/java/org/apache/cayenne/tutorial/Main.java:[83,2] cannot find symbol
    symbol : class SelectQuery
    location: class org.apache.cayenne.tutorial.Main

    /zonestorage/hudson/home/hudson/hudson/jobs/Cayenne-30/workspace/cayenneTestConnection/HSQLDB/jdk/JDK 1.6 (latest)/STABLE-3.0/tutorials/tutorial/src/main/java/org/apache/cayenne/tutorial/Main.java:[83,28] cannot find symbol
    symbol : class SelectQuery
    location: class org.apache.cayenne.tutorial.Main

    /zonestorage/hudson/home/hudson/hudson/jobs/Cayenne-30/workspace/cayenneTestConnection/HSQLDB/jdk/JDK 1.6 (latest)/STABLE-3.0/tutorials/tutorial/src/main/java/org/apache/cayenne/tutorial/Main.java:[84,7] type parameter org.apache.cayenne.tutorial.persistent.Painting is not within its bound

    /zonestorage/hudson/home/hudson/hudson/jobs/Cayenne-30/workspace/cayenneTestConnection/HSQLDB/jdk/JDK 1.6 (latest)/STABLE-3.0/tutorials/tutorial/src/main/java/org/apache/cayenne/tutorial/Main.java:[89,2] cannot find symbol
    symbol : class Expression
    location: class org.apache.cayenne.tutorial.Main

    /zonestorage/hudson/home/hudson/hudson/jobs/Cayenne-30/workspace/cayenneTestConnection/HSQLDB/jdk/JDK 1.6 (latest)/STABLE-3.0/tutorials/tutorial/src/main/java/org/apache/cayenne/tutorial/Main.java:[89,26] cannot find symbol
    symbol : variable Expression
    location: class org.apache.cayenne.tutorial.Main

    /zonestorage/hudson/home/hudson/hudson/jobs/Cayenne-30/workspace/cayenneTestConnection/HSQLDB/jdk/JDK 1.6 (latest)/STABLE-3.0/tutorials/tutorial/src/main/java/org/apache/cayenne/tutorial/Main.java:[93,2] cannot find symbol
    symbol : class SelectQuery
    location: class org.apache.cayenne.tutorial.Main

    /zonestorage/hudson/home/hudson/hudson/jobs/Cayenne-30/workspace/cayenneTestConnection/HSQLDB/jdk/JDK 1.6 (latest)/STABLE-3.0/tutorials/tutorial/src/main/java/org/apache/cayenne/tutorial/Main.java:[93,28] cannot find symbol
    symbol : class SelectQuery
    location: class org.apache.cayenne.tutorial.Main

    /zonestorage/hudson/home/hudson/hudson/jobs/Cayenne-30/workspace/cayenneTestConnection/HSQLDB/jdk/JDK 1.6 (latest)/STABLE-3.0/tutorials/tutorial/src/main/java/org/apache/cayenne/tutorial/Main.java:[94,7] type parameter org.apache.cayenne.tutorial.persistent.Painting is not within its bound

    /zonestorage/hudson/home/hudson/hudson/jobs/Cayenne-30/workspace/cayenneTestConnection/HSQLDB/jdk/JDK 1.6 (latest)/STABLE-3.0/tutorials/tutorial/src/main/java/org/apache/cayenne/tutorial/Main.java:[99,2] cannot find symbol
    symbol : class Expression
    location: class org.apache.cayenne.tutorial.Main

    /zonestorage/hudson/home/hudson/hudson/jobs/Cayenne-30/workspace/cayenneTestConnection/HSQLDB/jdk/JDK 1.6 (latest)/STABLE-3.0/tutorials/tutorial/src/main/java/org/apache/cayenne/tutorial/Main.java:[99,25] cannot find symbol
    symbol : variable ExpressionFactory
    location: class org.apache.cayenne.tutorial.Main

    /zonestorage/hudson/home/hudson/hudson/jobs/Cayenne-30/workspace/cayenneTestConnection/HSQLDB/jdk/JDK 1.6 (latest)/STABLE-3.0/tutorials/tutorial/src/main/java/org/apache/cayenne/tutorial/Main.java:[101,2] cannot find symbol
    symbol : class SelectQuery
    location: class org.apache.cayenne.tutorial.Main

    /zonestorage/hudson/home/hudson/hudson/jobs/Cayenne-30/workspace/cayenneTestConnection/HSQLDB/jdk/JDK 1.6 (latest)/STABLE-3.0/tutorials/tutorial/src/main/java/org/apache/cayenne/tutorial/Main.java:[101,35] cannot find symbol
    symbol : class SelectQuery
    location: class org.apache.cayenne.tutorial.Main

    /zonestorage/hudson/home/hudson/hudson/jobs/Cayenne-30/workspace/cayenneTestConnection/HSQLDB/jdk/JDK 1.6 (latest)/STABLE-3.0/tutorials/tutorial/src/main/java/org/apache/cayenne/tutorial/Main.java:[102,28] cannot find symbol
    symbol : variable DataObjectUtils
    location: class org.apache.cayenne.tutorial.Main

    /zonestorage/hudson/home/hudson/hudson/jobs/Cayenne-30/workspace/cayenneTestConnection/HSQLDB/jdk/JDK 1.6 (latest)/STABLE-3.0/tutorials/tutorial/src/main/java/org/apache/cayenne/tutorial/Main.java:[105,14] operator != cannot be applied to org.apache.cayenne.tutorial.persistent.Artist,<nulltype>


    [INFO] ------------------------------------------------------------------------
    [INFO] For more information, run Maven with the -e switch
    [INFO] ------------------------------------------------------------------------
    [INFO] Total time: 11 minutes 27 seconds
    [INFO] Finished at: Tue Dec 29 11:45:59 UTC 2009
    [INFO] Final Memory: 62M/217M
    [INFO] ------------------------------------------------------------------------
    [locks-and-latches] Releasing all the locks
    [locks-and-latches] All the locks released
    Recording test results
  • Apache Hudson Server at Dec 29, 2009 at 2:50 pm
    See <http://hudson.zones.apache.org/hudson/job/Cayenne-30/./cayenneTestConnection=HSQLDB,jdk=JDK%201.6%20(latest)/6/changes>

    Changes:

    [aadamchik] CAY-1349 SelectQuery 'fetchSize' setting is not propagated to disjoint prefetches

    ------------------------------------------
    [...truncated 72402 lines...]
    [INFO] No sources to compile
    [INFO] [resources:testResources]
    [INFO] Using default encoding to copy filtered resources.
    [INFO] [compiler:testCompile]
    [INFO] No sources to compile
    [INFO] [surefire:test]
    [INFO] No tests to run.
    [INFO] [jar:jar]
    [INFO] Building jar: /zonestorage/hudson/home/hudson/hudson/jobs/Cayenne-30/workspace/cayenneTestConnection/HSQLDB/jdk/JDK 1.6 (latest)/STABLE-3.0/modeler/cayenne-modeler-java/target/cayenne-modeler-java-3.0-SNAPSHOT.jar
    [INFO] [install:install]
    [INFO] Installing /zonestorage/hudson/home/hudson/hudson/jobs/Cayenne-30/workspace/cayenneTestConnection/HSQLDB/jdk/JDK 1.6 (latest)/STABLE-3.0/modeler/cayenne-modeler-java/target/cayenne-modeler-java-3.0-SNAPSHOT.jar to /export/home/hudson/.m2/repository/org/apache/cayenne/cayenne-modeler-java/3.0-SNAPSHOT/cayenne-modeler-java-3.0-SNAPSHOT.jar
    [INFO] ------------------------------------------------------------------------
    [INFO] Building Cayenne Modeler Parent
    [INFO] task-segment: [clean, install]
    [INFO] ------------------------------------------------------------------------
    [INFO] [clean:clean]
    [INFO] [site:attach-descriptor]
    [INFO] [install:install]
    [INFO] Installing /zonestorage/hudson/home/hudson/hudson/jobs/Cayenne-30/workspace/cayenneTestConnection/HSQLDB/jdk/JDK 1.6 (latest)/STABLE-3.0/modeler/pom.xml to /export/home/hudson/.m2/repository/org/apache/cayenne/parents/cayenne-modeler-parent/3.0-SNAPSHOT/cayenne-modeler-parent-3.0-SNAPSHOT.pom
    [INFO] ------------------------------------------------------------------------
    [INFO] Building Cayenne Tutorial
    [INFO] task-segment: [clean, install]
    [INFO] ------------------------------------------------------------------------
    [INFO] [clean:clean]
    [INFO] Deleting directory /zonestorage/hudson/home/hudson/hudson/jobs/Cayenne-30/workspace/cayenneTestConnection/HSQLDB/jdk/JDK 1.6 (latest)/STABLE-3.0/tutorials/tutorial/target
    [INFO] [resources:resources]
    [INFO] Using default encoding to copy filtered resources.
    [INFO] [compiler:compile]
    [INFO] Compiling 9 source files to /zonestorage/hudson/home/hudson/hudson/jobs/Cayenne-30/workspace/cayenneTestConnection/HSQLDB/jdk/JDK 1.6 (latest)/STABLE-3.0/tutorials/tutorial/target/classes
    [INFO] ------------------------------------------------------------------------
    [ERROR] BUILD FAILURE
    [INFO] ------------------------------------------------------------------------
    [INFO] Compilation failure

    /zonestorage/hudson/home/hudson/hudson/jobs/Cayenne-30/workspace/cayenneTestConnection/HSQLDB/jdk/JDK 1.6 (latest)/STABLE-3.0/tutorials/tutorial/src/main/java/org/apache/cayenne/tutorial/persistent/auto/_Painting.java:[3,25] cannot find symbol
    symbol : class CayenneDataObject
    location: package org.apache.cayenne

    /zonestorage/hudson/home/hudson/hudson/jobs/Cayenne-30/workspace/cayenneTestConnection/HSQLDB/jdk/JDK 1.6 (latest)/STABLE-3.0/tutorials/tutorial/src/main/java/org/apache/cayenne/tutorial/persistent/auto/_Painting.java:[13,40] cannot find symbol
    symbol: class CayenneDataObject
    public abstract class _Painting extends CayenneDataObject {

    /zonestorage/hudson/home/hudson/hudson/jobs/Cayenne-30/workspace/cayenneTestConnection/HSQLDB/jdk/JDK 1.6 (latest)/STABLE-3.0/tutorials/tutorial/src/main/java/org/apache/cayenne/tutorial/persistent/auto/_Artist.java:[6,25] cannot find symbol
    symbol : class CayenneDataObject
    location: package org.apache.cayenne

    /zonestorage/hudson/home/hudson/hudson/jobs/Cayenne-30/workspace/cayenneTestConnection/HSQLDB/jdk/JDK 1.6 (latest)/STABLE-3.0/tutorials/tutorial/src/main/java/org/apache/cayenne/tutorial/persistent/auto/_Artist.java:[15,38] cannot find symbol
    symbol: class CayenneDataObject
    public abstract class _Artist extends CayenneDataObject {

    /zonestorage/hudson/home/hudson/hudson/jobs/Cayenne-30/workspace/cayenneTestConnection/HSQLDB/jdk/JDK 1.6 (latest)/STABLE-3.0/tutorials/tutorial/src/main/java/org/apache/cayenne/tutorial/persistent/auto/_Gallery.java:[5,25] cannot find symbol
    symbol : class CayenneDataObject
    location: package org.apache.cayenne

    /zonestorage/hudson/home/hudson/hudson/jobs/Cayenne-30/workspace/cayenneTestConnection/HSQLDB/jdk/JDK 1.6 (latest)/STABLE-3.0/tutorials/tutorial/src/main/java/org/apache/cayenne/tutorial/persistent/auto/_Gallery.java:[14,39] cannot find symbol
    symbol: class CayenneDataObject
    public abstract class _Gallery extends CayenneDataObject {

    /zonestorage/hudson/home/hudson/hudson/jobs/Cayenne-30/workspace/cayenneTestConnection/HSQLDB/jdk/JDK 1.6 (latest)/STABLE-3.0/tutorials/tutorial/src/main/java/org/apache/cayenne/tutorial/Main.java:[26,25] cannot find symbol
    symbol : class DataObjectUtils
    location: package org.apache.cayenne

    /zonestorage/hudson/home/hudson/hudson/jobs/Cayenne-30/workspace/cayenneTestConnection/HSQLDB/jdk/JDK 1.6 (latest)/STABLE-3.0/tutorials/tutorial/src/main/java/org/apache/cayenne/tutorial/Main.java:[27,25] cannot find symbol
    symbol : class ObjectContext
    location: package org.apache.cayenne

    /zonestorage/hudson/home/hudson/hudson/jobs/Cayenne-30/workspace/cayenneTestConnection/HSQLDB/jdk/JDK 1.6 (latest)/STABLE-3.0/tutorials/tutorial/src/main/java/org/apache/cayenne/tutorial/Main.java:[28,32] package org.apache.cayenne.access does not exist

    /zonestorage/hudson/home/hudson/hudson/jobs/Cayenne-30/workspace/cayenneTestConnection/HSQLDB/jdk/JDK 1.6 (latest)/STABLE-3.0/tutorials/tutorial/src/main/java/org/apache/cayenne/tutorial/Main.java:[29,29] package org.apache.cayenne.exp does not exist

    /zonestorage/hudson/home/hudson/hudson/jobs/Cayenne-30/workspace/cayenneTestConnection/HSQLDB/jdk/JDK 1.6 (latest)/STABLE-3.0/tutorials/tutorial/src/main/java/org/apache/cayenne/tutorial/Main.java:[30,29] package org.apache.cayenne.exp does not exist

    /zonestorage/hudson/home/hudson/hudson/jobs/Cayenne-30/workspace/cayenneTestConnection/HSQLDB/jdk/JDK 1.6 (latest)/STABLE-3.0/tutorials/tutorial/src/main/java/org/apache/cayenne/tutorial/Main.java:[31,31] package org.apache.cayenne.query does not exist

    /zonestorage/hudson/home/hudson/hudson/jobs/Cayenne-30/workspace/cayenneTestConnection/HSQLDB/jdk/JDK 1.6 (latest)/STABLE-3.0/tutorials/tutorial/src/main/java/org/apache/cayenne/tutorial/Main.java:[48,32] cannot find symbol
    symbol : class ObjectContext
    location: class org.apache.cayenne.tutorial.Main

    /zonestorage/hudson/home/hudson/hudson/jobs/Cayenne-30/workspace/cayenneTestConnection/HSQLDB/jdk/JDK 1.6 (latest)/STABLE-3.0/tutorials/tutorial/src/main/java/org/apache/cayenne/tutorial/Main.java:[76,28] cannot find symbol
    symbol : class ObjectContext
    location: class org.apache.cayenne.tutorial.Main

    /zonestorage/hudson/home/hudson/hudson/jobs/Cayenne-30/workspace/cayenneTestConnection/HSQLDB/jdk/JDK 1.6 (latest)/STABLE-3.0/tutorials/tutorial/src/main/java/org/apache/cayenne/tutorial/Main.java:[97,28] cannot find symbol
    symbol : class ObjectContext
    location: class org.apache.cayenne.tutorial.Main

    /zonestorage/hudson/home/hudson/hudson/jobs/Cayenne-30/workspace/cayenneTestConnection/HSQLDB/jdk/JDK 1.6 (latest)/STABLE-3.0/tutorials/tutorial/src/main/java/org/apache/cayenne/tutorial/persistent/auto/_Painting.java:[22,8] cannot find symbol
    symbol : method writeProperty(java.lang.String,java.lang.String)
    location: class org.apache.cayenne.tutorial.persistent.auto._Painting

    /zonestorage/hudson/home/hudson/hudson/jobs/Cayenne-30/workspace/cayenneTestConnection/HSQLDB/jdk/JDK 1.6 (latest)/STABLE-3.0/tutorials/tutorial/src/main/java/org/apache/cayenne/tutorial/persistent/auto/_Painting.java:[25,23] cannot find symbol
    symbol : method readProperty(java.lang.String)
    location: class org.apache.cayenne.tutorial.persistent.auto._Painting

    /zonestorage/hudson/home/hudson/hudson/jobs/Cayenne-30/workspace/cayenneTestConnection/HSQLDB/jdk/JDK 1.6 (latest)/STABLE-3.0/tutorials/tutorial/src/main/java/org/apache/cayenne/tutorial/persistent/auto/_Painting.java:[29,8] cannot find symbol
    symbol : method setToOneTarget(java.lang.String,org.apache.cayenne.tutorial.persistent.Artist,boolean)
    location: class org.apache.cayenne.tutorial.persistent.auto._Painting

    /zonestorage/hudson/home/hudson/hudson/jobs/Cayenne-30/workspace/cayenneTestConnection/HSQLDB/jdk/JDK 1.6 (latest)/STABLE-3.0/tutorials/tutorial/src/main/java/org/apache/cayenne/tutorial/persistent/auto/_Painting.java:[33,23] cannot find symbol
    symbol : method readProperty(java.lang.String)
    location: class org.apache.cayenne.tutorial.persistent.auto._Painting

    /zonestorage/hudson/home/hudson/hudson/jobs/Cayenne-30/workspace/cayenneTestConnection/HSQLDB/jdk/JDK 1.6 (latest)/STABLE-3.0/tutorials/tutorial/src/main/java/org/apache/cayenne/tutorial/persistent/auto/_Painting.java:[38,8] cannot find symbol
    symbol : method setToOneTarget(java.lang.String,org.apache.cayenne.tutorial.persistent.Gallery,boolean)
    location: class org.apache.cayenne.tutorial.persistent.auto._Painting

    /zonestorage/hudson/home/hudson/hudson/jobs/Cayenne-30/workspace/cayenneTestConnection/HSQLDB/jdk/JDK 1.6 (latest)/STABLE-3.0/tutorials/tutorial/src/main/java/org/apache/cayenne/tutorial/persistent/auto/_Painting.java:[42,24] cannot find symbol
    symbol : method readProperty(java.lang.String)
    location: class org.apache.cayenne.tutorial.persistent.auto._Painting

    /zonestorage/hudson/home/hudson/hudson/jobs/Cayenne-30/workspace/cayenneTestConnection/HSQLDB/jdk/JDK 1.6 (latest)/STABLE-3.0/tutorials/tutorial/src/main/java/org/apache/cayenne/tutorial/persistent/auto/_Artist.java:[24,8] cannot find symbol
    symbol : method writeProperty(java.lang.String,java.util.Date)
    location: class org.apache.cayenne.tutorial.persistent.auto._Artist

    /zonestorage/hudson/home/hudson/hudson/jobs/Cayenne-30/workspace/cayenneTestConnection/HSQLDB/jdk/JDK 1.6 (latest)/STABLE-3.0/tutorials/tutorial/src/main/java/org/apache/cayenne/tutorial/persistent/auto/_Artist.java:[27,21] cannot find symbol
    symbol : method readProperty(java.lang.String)
    location: class org.apache.cayenne.tutorial.persistent.auto._Artist

    /zonestorage/hudson/home/hudson/hudson/jobs/Cayenne-30/workspace/cayenneTestConnection/HSQLDB/jdk/JDK 1.6 (latest)/STABLE-3.0/tutorials/tutorial/src/main/java/org/apache/cayenne/tutorial/persistent/auto/_Artist.java:[31,8] cannot find symbol
    symbol : method writeProperty(java.lang.String,java.lang.String)
    location: class org.apache.cayenne.tutorial.persistent.auto._Artist

    /zonestorage/hudson/home/hudson/hudson/jobs/Cayenne-30/workspace/cayenneTestConnection/HSQLDB/jdk/JDK 1.6 (latest)/STABLE-3.0/tutorials/tutorial/src/main/java/org/apache/cayenne/tutorial/persistent/auto/_Artist.java:[34,23] cannot find symbol
    symbol : method readProperty(java.lang.String)
    location: class org.apache.cayenne.tutorial.persistent.auto._Artist

    /zonestorage/hudson/home/hudson/hudson/jobs/Cayenne-30/workspace/cayenneTestConnection/HSQLDB/jdk/JDK 1.6 (latest)/STABLE-3.0/tutorials/tutorial/src/main/java/org/apache/cayenne/tutorial/persistent/auto/_Artist.java:[38,8] cannot find symbol
    symbol : method addToManyTarget(java.lang.String,org.apache.cayenne.tutorial.persistent.Painting,boolean)
    location: class org.apache.cayenne.tutorial.persistent.auto._Artist

    /zonestorage/hudson/home/hudson/hudson/jobs/Cayenne-30/workspace/cayenneTestConnection/HSQLDB/jdk/JDK 1.6 (latest)/STABLE-3.0/tutorials/tutorial/src/main/java/org/apache/cayenne/tutorial/persistent/auto/_Artist.java:[41,8] cannot find symbol
    symbol : method removeToManyTarget(java.lang.String,org.apache.cayenne.tutorial.persistent.Painting,boolean)
    location: class org.apache.cayenne.tutorial.persistent.auto._Artist

    /zonestorage/hudson/home/hudson/hudson/jobs/Cayenne-30/workspace/cayenneTestConnection/HSQLDB/jdk/JDK 1.6 (latest)/STABLE-3.0/tutorials/tutorial/src/main/java/org/apache/cayenne/tutorial/persistent/auto/_Artist.java:[44,16] type parameter org.apache.cayenne.tutorial.persistent.Painting is not within its bound

    /zonestorage/hudson/home/hudson/hudson/jobs/Cayenne-30/workspace/cayenneTestConnection/HSQLDB/jdk/JDK 1.6 (latest)/STABLE-3.0/tutorials/tutorial/src/main/java/org/apache/cayenne/tutorial/persistent/auto/_Artist.java:[45,31] cannot find symbol
    symbol : method readProperty(java.lang.String)
    location: class org.apache.cayenne.tutorial.persistent.auto._Artist

    /zonestorage/hudson/home/hudson/hudson/jobs/Cayenne-30/workspace/cayenneTestConnection/HSQLDB/jdk/JDK 1.6 (latest)/STABLE-3.0/tutorials/tutorial/src/main/java/org/apache/cayenne/tutorial/persistent/auto/_Gallery.java:[22,8] cannot find symbol
    symbol : method writeProperty(java.lang.String,java.lang.String)
    location: class org.apache.cayenne.tutorial.persistent.auto._Gallery

    /zonestorage/hudson/home/hudson/hudson/jobs/Cayenne-30/workspace/cayenneTestConnection/HSQLDB/jdk/JDK 1.6 (latest)/STABLE-3.0/tutorials/tutorial/src/main/java/org/apache/cayenne/tutorial/persistent/auto/_Gallery.java:[25,23] cannot find symbol
    symbol : method readProperty(java.lang.String)
    location: class org.apache.cayenne.tutorial.persistent.auto._Gallery

    /zonestorage/hudson/home/hudson/hudson/jobs/Cayenne-30/workspace/cayenneTestConnection/HSQLDB/jdk/JDK 1.6 (latest)/STABLE-3.0/tutorials/tutorial/src/main/java/org/apache/cayenne/tutorial/persistent/auto/_Gallery.java:[29,8] cannot find symbol
    symbol : method addToManyTarget(java.lang.String,org.apache.cayenne.tutorial.persistent.Painting,boolean)
    location: class org.apache.cayenne.tutorial.persistent.auto._Gallery

    /zonestorage/hudson/home/hudson/hudson/jobs/Cayenne-30/workspace/cayenneTestConnection/HSQLDB/jdk/JDK 1.6 (latest)/STABLE-3.0/tutorials/tutorial/src/main/java/org/apache/cayenne/tutorial/persistent/auto/_Gallery.java:[32,8] cannot find symbol
    symbol : method removeToManyTarget(java.lang.String,org.apache.cayenne.tutorial.persistent.Painting,boolean)
    location: class org.apache.cayenne.tutorial.persistent.auto._Gallery

    /zonestorage/hudson/home/hudson/hudson/jobs/Cayenne-30/workspace/cayenneTestConnection/HSQLDB/jdk/JDK 1.6 (latest)/STABLE-3.0/tutorials/tutorial/src/main/java/org/apache/cayenne/tutorial/persistent/auto/_Gallery.java:[35,16] type parameter org.apache.cayenne.tutorial.persistent.Painting is not within its bound

    /zonestorage/hudson/home/hudson/hudson/jobs/Cayenne-30/workspace/cayenneTestConnection/HSQLDB/jdk/JDK 1.6 (latest)/STABLE-3.0/tutorials/tutorial/src/main/java/org/apache/cayenne/tutorial/persistent/auto/_Gallery.java:[36,31] cannot find symbol
    symbol : method readProperty(java.lang.String)
    location: class org.apache.cayenne.tutorial.persistent.auto._Gallery

    /zonestorage/hudson/home/hudson/hudson/jobs/Cayenne-30/workspace/cayenneTestConnection/HSQLDB/jdk/JDK 1.6 (latest)/STABLE-3.0/tutorials/tutorial/src/main/java/org/apache/cayenne/tutorial/Main.java:[41,2] cannot find symbol
    symbol : class ObjectContext
    location: class org.apache.cayenne.tutorial.Main

    /zonestorage/hudson/home/hudson/hudson/jobs/Cayenne-30/workspace/cayenneTestConnection/HSQLDB/jdk/JDK 1.6 (latest)/STABLE-3.0/tutorials/tutorial/src/main/java/org/apache/cayenne/tutorial/Main.java:[41,26] cannot find symbol
    symbol : variable DataContext
    location: class org.apache.cayenne.tutorial.Main

    /zonestorage/hudson/home/hudson/hudson/jobs/Cayenne-30/workspace/cayenneTestConnection/HSQLDB/jdk/JDK 1.6 (latest)/STABLE-3.0/tutorials/tutorial/src/main/java/org/apache/cayenne/tutorial/Main.java:[78,2] cannot find symbol
    symbol : class SelectQuery
    location: class org.apache.cayenne.tutorial.Main

    /zonestorage/hudson/home/hudson/hudson/jobs/Cayenne-30/workspace/cayenneTestConnection/HSQLDB/jdk/JDK 1.6 (latest)/STABLE-3.0/tutorials/tutorial/src/main/java/org/apache/cayenne/tutorial/Main.java:[78,28] cannot find symbol
    symbol : class SelectQuery
    location: class org.apache.cayenne.tutorial.Main

    /zonestorage/hudson/home/hudson/hudson/jobs/Cayenne-30/workspace/cayenneTestConnection/HSQLDB/jdk/JDK 1.6 (latest)/STABLE-3.0/tutorials/tutorial/src/main/java/org/apache/cayenne/tutorial/Main.java:[79,7] type parameter org.apache.cayenne.tutorial.persistent.Painting is not within its bound

    /zonestorage/hudson/home/hudson/hudson/jobs/Cayenne-30/workspace/cayenneTestConnection/HSQLDB/jdk/JDK 1.6 (latest)/STABLE-3.0/tutorials/tutorial/src/main/java/org/apache/cayenne/tutorial/Main.java:[81,2] cannot find symbol
    symbol : class Expression
    location: class org.apache.cayenne.tutorial.Main

    /zonestorage/hudson/home/hudson/hudson/jobs/Cayenne-30/workspace/cayenneTestConnection/HSQLDB/jdk/JDK 1.6 (latest)/STABLE-3.0/tutorials/tutorial/src/main/java/org/apache/cayenne/tutorial/Main.java:[81,26] cannot find symbol
    symbol : variable ExpressionFactory
    location: class org.apache.cayenne.tutorial.Main

    /zonestorage/hudson/home/hudson/hudson/jobs/Cayenne-30/workspace/cayenneTestConnection/HSQLDB/jdk/JDK 1.6 (latest)/STABLE-3.0/tutorials/tutorial/src/main/java/org/apache/cayenne/tutorial/Main.java:[83,2] cannot find symbol
    symbol : class SelectQuery
    location: class org.apache.cayenne.tutorial.Main

    /zonestorage/hudson/home/hudson/hudson/jobs/Cayenne-30/workspace/cayenneTestConnection/HSQLDB/jdk/JDK 1.6 (latest)/STABLE-3.0/tutorials/tutorial/src/main/java/org/apache/cayenne/tutorial/Main.java:[83,28] cannot find symbol
    symbol : class SelectQuery
    location: class org.apache.cayenne.tutorial.Main

    /zonestorage/hudson/home/hudson/hudson/jobs/Cayenne-30/workspace/cayenneTestConnection/HSQLDB/jdk/JDK 1.6 (latest)/STABLE-3.0/tutorials/tutorial/src/main/java/org/apache/cayenne/tutorial/Main.java:[84,7] type parameter org.apache.cayenne.tutorial.persistent.Painting is not within its bound

    /zonestorage/hudson/home/hudson/hudson/jobs/Cayenne-30/workspace/cayenneTestConnection/HSQLDB/jdk/JDK 1.6 (latest)/STABLE-3.0/tutorials/tutorial/src/main/java/org/apache/cayenne/tutorial/Main.java:[89,2] cannot find symbol
    symbol : class Expression
    location: class org.apache.cayenne.tutorial.Main

    /zonestorage/hudson/home/hudson/hudson/jobs/Cayenne-30/workspace/cayenneTestConnection/HSQLDB/jdk/JDK 1.6 (latest)/STABLE-3.0/tutorials/tutorial/src/main/java/org/apache/cayenne/tutorial/Main.java:[89,26] cannot find symbol
    symbol : variable Expression
    location: class org.apache.cayenne.tutorial.Main

    /zonestorage/hudson/home/hudson/hudson/jobs/Cayenne-30/workspace/cayenneTestConnection/HSQLDB/jdk/JDK 1.6 (latest)/STABLE-3.0/tutorials/tutorial/src/main/java/org/apache/cayenne/tutorial/Main.java:[93,2] cannot find symbol
    symbol : class SelectQuery
    location: class org.apache.cayenne.tutorial.Main

    /zonestorage/hudson/home/hudson/hudson/jobs/Cayenne-30/workspace/cayenneTestConnection/HSQLDB/jdk/JDK 1.6 (latest)/STABLE-3.0/tutorials/tutorial/src/main/java/org/apache/cayenne/tutorial/Main.java:[93,28] cannot find symbol
    symbol : class SelectQuery
    location: class org.apache.cayenne.tutorial.Main

    /zonestorage/hudson/home/hudson/hudson/jobs/Cayenne-30/workspace/cayenneTestConnection/HSQLDB/jdk/JDK 1.6 (latest)/STABLE-3.0/tutorials/tutorial/src/main/java/org/apache/cayenne/tutorial/Main.java:[94,7] type parameter org.apache.cayenne.tutorial.persistent.Painting is not within its bound

    /zonestorage/hudson/home/hudson/hudson/jobs/Cayenne-30/workspace/cayenneTestConnection/HSQLDB/jdk/JDK 1.6 (latest)/STABLE-3.0/tutorials/tutorial/src/main/java/org/apache/cayenne/tutorial/Main.java:[99,2] cannot find symbol
    symbol : class Expression
    location: class org.apache.cayenne.tutorial.Main

    /zonestorage/hudson/home/hudson/hudson/jobs/Cayenne-30/workspace/cayenneTestConnection/HSQLDB/jdk/JDK 1.6 (latest)/STABLE-3.0/tutorials/tutorial/src/main/java/org/apache/cayenne/tutorial/Main.java:[99,25] cannot find symbol
    symbol : variable ExpressionFactory
    location: class org.apache.cayenne.tutorial.Main

    /zonestorage/hudson/home/hudson/hudson/jobs/Cayenne-30/workspace/cayenneTestConnection/HSQLDB/jdk/JDK 1.6 (latest)/STABLE-3.0/tutorials/tutorial/src/main/java/org/apache/cayenne/tutorial/Main.java:[101,2] cannot find symbol
    symbol : class SelectQuery
    location: class org.apache.cayenne.tutorial.Main

    /zonestorage/hudson/home/hudson/hudson/jobs/Cayenne-30/workspace/cayenneTestConnection/HSQLDB/jdk/JDK 1.6 (latest)/STABLE-3.0/tutorials/tutorial/src/main/java/org/apache/cayenne/tutorial/Main.java:[101,35] cannot find symbol
    symbol : class SelectQuery
    location: class org.apache.cayenne.tutorial.Main

    /zonestorage/hudson/home/hudson/hudson/jobs/Cayenne-30/workspace/cayenneTestConnection/HSQLDB/jdk/JDK 1.6 (latest)/STABLE-3.0/tutorials/tutorial/src/main/java/org/apache/cayenne/tutorial/Main.java:[102,28] cannot find symbol
    symbol : variable DataObjectUtils
    location: class org.apache.cayenne.tutorial.Main

    /zonestorage/hudson/home/hudson/hudson/jobs/Cayenne-30/workspace/cayenneTestConnection/HSQLDB/jdk/JDK 1.6 (latest)/STABLE-3.0/tutorials/tutorial/src/main/java/org/apache/cayenne/tutorial/Main.java:[105,14] operator != cannot be applied to org.apache.cayenne.tutorial.persistent.Artist,<nulltype>


    [INFO] ------------------------------------------------------------------------
    [INFO] For more information, run Maven with the -e switch
    [INFO] ------------------------------------------------------------------------
    [INFO] Total time: 8 minutes 13 seconds
    [INFO] Finished at: Tue Dec 29 14:48:40 UTC 2009
    [INFO] Final Memory: 67M/235M
    [INFO] ------------------------------------------------------------------------
    [locks-and-latches] Releasing all the locks
    [locks-and-latches] All the locks released
    Recording test results
  • Apache Hudson Server at Dec 29, 2009 at 5:44 pm
    See <http://hudson.zones.apache.org/hudson/job/Cayenne-30/./cayenneTestConnection=HSQLDB,jdk=JDK%201.6%20(latest)/7/changes>

    Changes:

    [oltka] CAY-1353

    fix

    (cherry picked from commit 2e05d40869cd5dedd1df2eeeb2b9663a9d16d22a)

    ------------------------------------------
    [...truncated 72396 lines...]
    [INFO] No sources to compile
    [INFO] [resources:testResources]
    [INFO] Using default encoding to copy filtered resources.
    [INFO] [compiler:testCompile]
    [INFO] No sources to compile
    [INFO] [surefire:test]
    [INFO] No tests to run.
    [INFO] [jar:jar]
    [INFO] Building jar: /zonestorage/hudson/home/hudson/hudson/jobs/Cayenne-30/workspace/cayenneTestConnection/HSQLDB/jdk/JDK 1.6 (latest)/STABLE-3.0/modeler/cayenne-modeler-java/target/cayenne-modeler-java-3.0-SNAPSHOT.jar
    [INFO] [install:install]
    [INFO] Installing /zonestorage/hudson/home/hudson/hudson/jobs/Cayenne-30/workspace/cayenneTestConnection/HSQLDB/jdk/JDK 1.6 (latest)/STABLE-3.0/modeler/cayenne-modeler-java/target/cayenne-modeler-java-3.0-SNAPSHOT.jar to /export/home/hudson/.m2/repository/org/apache/cayenne/cayenne-modeler-java/3.0-SNAPSHOT/cayenne-modeler-java-3.0-SNAPSHOT.jar
    [INFO] ------------------------------------------------------------------------
    [INFO] Building Cayenne Modeler Parent
    [INFO] task-segment: [clean, install]
    [INFO] ------------------------------------------------------------------------
    [INFO] [clean:clean]
    [INFO] [site:attach-descriptor]
    [INFO] [install:install]
    [INFO] Installing /zonestorage/hudson/home/hudson/hudson/jobs/Cayenne-30/workspace/cayenneTestConnection/HSQLDB/jdk/JDK 1.6 (latest)/STABLE-3.0/modeler/pom.xml to /export/home/hudson/.m2/repository/org/apache/cayenne/parents/cayenne-modeler-parent/3.0-SNAPSHOT/cayenne-modeler-parent-3.0-SNAPSHOT.pom
    [INFO] ------------------------------------------------------------------------
    [INFO] Building Cayenne Tutorial
    [INFO] task-segment: [clean, install]
    [INFO] ------------------------------------------------------------------------
    [INFO] [clean:clean]
    [INFO] Deleting directory /zonestorage/hudson/home/hudson/hudson/jobs/Cayenne-30/workspace/cayenneTestConnection/HSQLDB/jdk/JDK 1.6 (latest)/STABLE-3.0/tutorials/tutorial/target
    [INFO] [resources:resources]
    [INFO] Using default encoding to copy filtered resources.
    [INFO] [compiler:compile]
    [INFO] Compiling 9 source files to /zonestorage/hudson/home/hudson/hudson/jobs/Cayenne-30/workspace/cayenneTestConnection/HSQLDB/jdk/JDK 1.6 (latest)/STABLE-3.0/tutorials/tutorial/target/classes
    [INFO] ------------------------------------------------------------------------
    [ERROR] BUILD FAILURE
    [INFO] ------------------------------------------------------------------------
    [INFO] Compilation failure

    /zonestorage/hudson/home/hudson/hudson/jobs/Cayenne-30/workspace/cayenneTestConnection/HSQLDB/jdk/JDK 1.6 (latest)/STABLE-3.0/tutorials/tutorial/src/main/java/org/apache/cayenne/tutorial/persistent/auto/_Painting.java:[3,25] cannot find symbol
    symbol : class CayenneDataObject
    location: package org.apache.cayenne

    /zonestorage/hudson/home/hudson/hudson/jobs/Cayenne-30/workspace/cayenneTestConnection/HSQLDB/jdk/JDK 1.6 (latest)/STABLE-3.0/tutorials/tutorial/src/main/java/org/apache/cayenne/tutorial/persistent/auto/_Painting.java:[13,40] cannot find symbol
    symbol: class CayenneDataObject
    public abstract class _Painting extends CayenneDataObject {

    /zonestorage/hudson/home/hudson/hudson/jobs/Cayenne-30/workspace/cayenneTestConnection/HSQLDB/jdk/JDK 1.6 (latest)/STABLE-3.0/tutorials/tutorial/src/main/java/org/apache/cayenne/tutorial/persistent/auto/_Artist.java:[6,25] cannot find symbol
    symbol : class CayenneDataObject
    location: package org.apache.cayenne

    /zonestorage/hudson/home/hudson/hudson/jobs/Cayenne-30/workspace/cayenneTestConnection/HSQLDB/jdk/JDK 1.6 (latest)/STABLE-3.0/tutorials/tutorial/src/main/java/org/apache/cayenne/tutorial/persistent/auto/_Artist.java:[15,38] cannot find symbol
    symbol: class CayenneDataObject
    public abstract class _Artist extends CayenneDataObject {

    /zonestorage/hudson/home/hudson/hudson/jobs/Cayenne-30/workspace/cayenneTestConnection/HSQLDB/jdk/JDK 1.6 (latest)/STABLE-3.0/tutorials/tutorial/src/main/java/org/apache/cayenne/tutorial/persistent/auto/_Gallery.java:[5,25] cannot find symbol
    symbol : class CayenneDataObject
    location: package org.apache.cayenne

    /zonestorage/hudson/home/hudson/hudson/jobs/Cayenne-30/workspace/cayenneTestConnection/HSQLDB/jdk/JDK 1.6 (latest)/STABLE-3.0/tutorials/tutorial/src/main/java/org/apache/cayenne/tutorial/persistent/auto/_Gallery.java:[14,39] cannot find symbol
    symbol: class CayenneDataObject
    public abstract class _Gallery extends CayenneDataObject {

    /zonestorage/hudson/home/hudson/hudson/jobs/Cayenne-30/workspace/cayenneTestConnection/HSQLDB/jdk/JDK 1.6 (latest)/STABLE-3.0/tutorials/tutorial/src/main/java/org/apache/cayenne/tutorial/Main.java:[26,25] cannot find symbol
    symbol : class DataObjectUtils
    location: package org.apache.cayenne

    /zonestorage/hudson/home/hudson/hudson/jobs/Cayenne-30/workspace/cayenneTestConnection/HSQLDB/jdk/JDK 1.6 (latest)/STABLE-3.0/tutorials/tutorial/src/main/java/org/apache/cayenne/tutorial/Main.java:[27,25] cannot find symbol
    symbol : class ObjectContext
    location: package org.apache.cayenne

    /zonestorage/hudson/home/hudson/hudson/jobs/Cayenne-30/workspace/cayenneTestConnection/HSQLDB/jdk/JDK 1.6 (latest)/STABLE-3.0/tutorials/tutorial/src/main/java/org/apache/cayenne/tutorial/Main.java:[28,32] package org.apache.cayenne.access does not exist

    /zonestorage/hudson/home/hudson/hudson/jobs/Cayenne-30/workspace/cayenneTestConnection/HSQLDB/jdk/JDK 1.6 (latest)/STABLE-3.0/tutorials/tutorial/src/main/java/org/apache/cayenne/tutorial/Main.java:[29,29] package org.apache.cayenne.exp does not exist

    /zonestorage/hudson/home/hudson/hudson/jobs/Cayenne-30/workspace/cayenneTestConnection/HSQLDB/jdk/JDK 1.6 (latest)/STABLE-3.0/tutorials/tutorial/src/main/java/org/apache/cayenne/tutorial/Main.java:[30,29] package org.apache.cayenne.exp does not exist

    /zonestorage/hudson/home/hudson/hudson/jobs/Cayenne-30/workspace/cayenneTestConnection/HSQLDB/jdk/JDK 1.6 (latest)/STABLE-3.0/tutorials/tutorial/src/main/java/org/apache/cayenne/tutorial/Main.java:[31,31] package org.apache.cayenne.query does not exist

    /zonestorage/hudson/home/hudson/hudson/jobs/Cayenne-30/workspace/cayenneTestConnection/HSQLDB/jdk/JDK 1.6 (latest)/STABLE-3.0/tutorials/tutorial/src/main/java/org/apache/cayenne/tutorial/Main.java:[48,32] cannot find symbol
    symbol : class ObjectContext
    location: class org.apache.cayenne.tutorial.Main

    /zonestorage/hudson/home/hudson/hudson/jobs/Cayenne-30/workspace/cayenneTestConnection/HSQLDB/jdk/JDK 1.6 (latest)/STABLE-3.0/tutorials/tutorial/src/main/java/org/apache/cayenne/tutorial/Main.java:[76,28] cannot find symbol
    symbol : class ObjectContext
    location: class org.apache.cayenne.tutorial.Main

    /zonestorage/hudson/home/hudson/hudson/jobs/Cayenne-30/workspace/cayenneTestConnection/HSQLDB/jdk/JDK 1.6 (latest)/STABLE-3.0/tutorials/tutorial/src/main/java/org/apache/cayenne/tutorial/Main.java:[97,28] cannot find symbol
    symbol : class ObjectContext
    location: class org.apache.cayenne.tutorial.Main

    /zonestorage/hudson/home/hudson/hudson/jobs/Cayenne-30/workspace/cayenneTestConnection/HSQLDB/jdk/JDK 1.6 (latest)/STABLE-3.0/tutorials/tutorial/src/main/java/org/apache/cayenne/tutorial/persistent/auto/_Painting.java:[22,8] cannot find symbol
    symbol : method writeProperty(java.lang.String,java.lang.String)
    location: class org.apache.cayenne.tutorial.persistent.auto._Painting

    /zonestorage/hudson/home/hudson/hudson/jobs/Cayenne-30/workspace/cayenneTestConnection/HSQLDB/jdk/JDK 1.6 (latest)/STABLE-3.0/tutorials/tutorial/src/main/java/org/apache/cayenne/tutorial/persistent/auto/_Painting.java:[25,23] cannot find symbol
    symbol : method readProperty(java.lang.String)
    location: class org.apache.cayenne.tutorial.persistent.auto._Painting

    /zonestorage/hudson/home/hudson/hudson/jobs/Cayenne-30/workspace/cayenneTestConnection/HSQLDB/jdk/JDK 1.6 (latest)/STABLE-3.0/tutorials/tutorial/src/main/java/org/apache/cayenne/tutorial/persistent/auto/_Painting.java:[29,8] cannot find symbol
    symbol : method setToOneTarget(java.lang.String,org.apache.cayenne.tutorial.persistent.Artist,boolean)
    location: class org.apache.cayenne.tutorial.persistent.auto._Painting

    /zonestorage/hudson/home/hudson/hudson/jobs/Cayenne-30/workspace/cayenneTestConnection/HSQLDB/jdk/JDK 1.6 (latest)/STABLE-3.0/tutorials/tutorial/src/main/java/org/apache/cayenne/tutorial/persistent/auto/_Painting.java:[33,23] cannot find symbol
    symbol : method readProperty(java.lang.String)
    location: class org.apache.cayenne.tutorial.persistent.auto._Painting

    /zonestorage/hudson/home/hudson/hudson/jobs/Cayenne-30/workspace/cayenneTestConnection/HSQLDB/jdk/JDK 1.6 (latest)/STABLE-3.0/tutorials/tutorial/src/main/java/org/apache/cayenne/tutorial/persistent/auto/_Painting.java:[38,8] cannot find symbol
    symbol : method setToOneTarget(java.lang.String,org.apache.cayenne.tutorial.persistent.Gallery,boolean)
    location: class org.apache.cayenne.tutorial.persistent.auto._Painting

    /zonestorage/hudson/home/hudson/hudson/jobs/Cayenne-30/workspace/cayenneTestConnection/HSQLDB/jdk/JDK 1.6 (latest)/STABLE-3.0/tutorials/tutorial/src/main/java/org/apache/cayenne/tutorial/persistent/auto/_Painting.java:[42,24] cannot find symbol
    symbol : method readProperty(java.lang.String)
    location: class org.apache.cayenne.tutorial.persistent.auto._Painting

    /zonestorage/hudson/home/hudson/hudson/jobs/Cayenne-30/workspace/cayenneTestConnection/HSQLDB/jdk/JDK 1.6 (latest)/STABLE-3.0/tutorials/tutorial/src/main/java/org/apache/cayenne/tutorial/persistent/auto/_Artist.java:[24,8] cannot find symbol
    symbol : method writeProperty(java.lang.String,java.util.Date)
    location: class org.apache.cayenne.tutorial.persistent.auto._Artist

    /zonestorage/hudson/home/hudson/hudson/jobs/Cayenne-30/workspace/cayenneTestConnection/HSQLDB/jdk/JDK 1.6 (latest)/STABLE-3.0/tutorials/tutorial/src/main/java/org/apache/cayenne/tutorial/persistent/auto/_Artist.java:[27,21] cannot find symbol
    symbol : method readProperty(java.lang.String)
    location: class org.apache.cayenne.tutorial.persistent.auto._Artist

    /zonestorage/hudson/home/hudson/hudson/jobs/Cayenne-30/workspace/cayenneTestConnection/HSQLDB/jdk/JDK 1.6 (latest)/STABLE-3.0/tutorials/tutorial/src/main/java/org/apache/cayenne/tutorial/persistent/auto/_Artist.java:[31,8] cannot find symbol
    symbol : method writeProperty(java.lang.String,java.lang.String)
    location: class org.apache.cayenne.tutorial.persistent.auto._Artist

    /zonestorage/hudson/home/hudson/hudson/jobs/Cayenne-30/workspace/cayenneTestConnection/HSQLDB/jdk/JDK 1.6 (latest)/STABLE-3.0/tutorials/tutorial/src/main/java/org/apache/cayenne/tutorial/persistent/auto/_Artist.java:[34,23] cannot find symbol
    symbol : method readProperty(java.lang.String)
    location: class org.apache.cayenne.tutorial.persistent.auto._Artist

    /zonestorage/hudson/home/hudson/hudson/jobs/Cayenne-30/workspace/cayenneTestConnection/HSQLDB/jdk/JDK 1.6 (latest)/STABLE-3.0/tutorials/tutorial/src/main/java/org/apache/cayenne/tutorial/persistent/auto/_Artist.java:[38,8] cannot find symbol
    symbol : method addToManyTarget(java.lang.String,org.apache.cayenne.tutorial.persistent.Painting,boolean)
    location: class org.apache.cayenne.tutorial.persistent.auto._Artist

    /zonestorage/hudson/home/hudson/hudson/jobs/Cayenne-30/workspace/cayenneTestConnection/HSQLDB/jdk/JDK 1.6 (latest)/STABLE-3.0/tutorials/tutorial/src/main/java/org/apache/cayenne/tutorial/persistent/auto/_Artist.java:[41,8] cannot find symbol
    symbol : method removeToManyTarget(java.lang.String,org.apache.cayenne.tutorial.persistent.Painting,boolean)
    location: class org.apache.cayenne.tutorial.persistent.auto._Artist

    /zonestorage/hudson/home/hudson/hudson/jobs/Cayenne-30/workspace/cayenneTestConnection/HSQLDB/jdk/JDK 1.6 (latest)/STABLE-3.0/tutorials/tutorial/src/main/java/org/apache/cayenne/tutorial/persistent/auto/_Artist.java:[44,16] type parameter org.apache.cayenne.tutorial.persistent.Painting is not within its bound

    /zonestorage/hudson/home/hudson/hudson/jobs/Cayenne-30/workspace/cayenneTestConnection/HSQLDB/jdk/JDK 1.6 (latest)/STABLE-3.0/tutorials/tutorial/src/main/java/org/apache/cayenne/tutorial/persistent/auto/_Artist.java:[45,31] cannot find symbol
    symbol : method readProperty(java.lang.String)
    location: class org.apache.cayenne.tutorial.persistent.auto._Artist

    /zonestorage/hudson/home/hudson/hudson/jobs/Cayenne-30/workspace/cayenneTestConnection/HSQLDB/jdk/JDK 1.6 (latest)/STABLE-3.0/tutorials/tutorial/src/main/java/org/apache/cayenne/tutorial/persistent/auto/_Gallery.java:[22,8] cannot find symbol
    symbol : method writeProperty(java.lang.String,java.lang.String)
    location: class org.apache.cayenne.tutorial.persistent.auto._Gallery

    /zonestorage/hudson/home/hudson/hudson/jobs/Cayenne-30/workspace/cayenneTestConnection/HSQLDB/jdk/JDK 1.6 (latest)/STABLE-3.0/tutorials/tutorial/src/main/java/org/apache/cayenne/tutorial/persistent/auto/_Gallery.java:[25,23] cannot find symbol
    symbol : method readProperty(java.lang.String)
    location: class org.apache.cayenne.tutorial.persistent.auto._Gallery

    /zonestorage/hudson/home/hudson/hudson/jobs/Cayenne-30/workspace/cayenneTestConnection/HSQLDB/jdk/JDK 1.6 (latest)/STABLE-3.0/tutorials/tutorial/src/main/java/org/apache/cayenne/tutorial/persistent/auto/_Gallery.java:[29,8] cannot find symbol
    symbol : method addToManyTarget(java.lang.String,org.apache.cayenne.tutorial.persistent.Painting,boolean)
    location: class org.apache.cayenne.tutorial.persistent.auto._Gallery

    /zonestorage/hudson/home/hudson/hudson/jobs/Cayenne-30/workspace/cayenneTestConnection/HSQLDB/jdk/JDK 1.6 (latest)/STABLE-3.0/tutorials/tutorial/src/main/java/org/apache/cayenne/tutorial/persistent/auto/_Gallery.java:[32,8] cannot find symbol
    symbol : method removeToManyTarget(java.lang.String,org.apache.cayenne.tutorial.persistent.Painting,boolean)
    location: class org.apache.cayenne.tutorial.persistent.auto._Gallery

    /zonestorage/hudson/home/hudson/hudson/jobs/Cayenne-30/workspace/cayenneTestConnection/HSQLDB/jdk/JDK 1.6 (latest)/STABLE-3.0/tutorials/tutorial/src/main/java/org/apache/cayenne/tutorial/persistent/auto/_Gallery.java:[35,16] type parameter org.apache.cayenne.tutorial.persistent.Painting is not within its bound

    /zonestorage/hudson/home/hudson/hudson/jobs/Cayenne-30/workspace/cayenneTestConnection/HSQLDB/jdk/JDK 1.6 (latest)/STABLE-3.0/tutorials/tutorial/src/main/java/org/apache/cayenne/tutorial/persistent/auto/_Gallery.java:[36,31] cannot find symbol
    symbol : method readProperty(java.lang.String)
    location: class org.apache.cayenne.tutorial.persistent.auto._Gallery

    /zonestorage/hudson/home/hudson/hudson/jobs/Cayenne-30/workspace/cayenneTestConnection/HSQLDB/jdk/JDK 1.6 (latest)/STABLE-3.0/tutorials/tutorial/src/main/java/org/apache/cayenne/tutorial/Main.java:[41,2] cannot find symbol
    symbol : class ObjectContext
    location: class org.apache.cayenne.tutorial.Main

    /zonestorage/hudson/home/hudson/hudson/jobs/Cayenne-30/workspace/cayenneTestConnection/HSQLDB/jdk/JDK 1.6 (latest)/STABLE-3.0/tutorials/tutorial/src/main/java/org/apache/cayenne/tutorial/Main.java:[41,26] cannot find symbol
    symbol : variable DataContext
    location: class org.apache.cayenne.tutorial.Main

    /zonestorage/hudson/home/hudson/hudson/jobs/Cayenne-30/workspace/cayenneTestConnection/HSQLDB/jdk/JDK 1.6 (latest)/STABLE-3.0/tutorials/tutorial/src/main/java/org/apache/cayenne/tutorial/Main.java:[78,2] cannot find symbol
    symbol : class SelectQuery
    location: class org.apache.cayenne.tutorial.Main

    /zonestorage/hudson/home/hudson/hudson/jobs/Cayenne-30/workspace/cayenneTestConnection/HSQLDB/jdk/JDK 1.6 (latest)/STABLE-3.0/tutorials/tutorial/src/main/java/org/apache/cayenne/tutorial/Main.java:[78,28] cannot find symbol
    symbol : class SelectQuery
    location: class org.apache.cayenne.tutorial.Main

    /zonestorage/hudson/home/hudson/hudson/jobs/Cayenne-30/workspace/cayenneTestConnection/HSQLDB/jdk/JDK 1.6 (latest)/STABLE-3.0/tutorials/tutorial/src/main/java/org/apache/cayenne/tutorial/Main.java:[79,7] type parameter org.apache.cayenne.tutorial.persistent.Painting is not within its bound

    /zonestorage/hudson/home/hudson/hudson/jobs/Cayenne-30/workspace/cayenneTestConnection/HSQLDB/jdk/JDK 1.6 (latest)/STABLE-3.0/tutorials/tutorial/src/main/java/org/apache/cayenne/tutorial/Main.java:[81,2] cannot find symbol
    symbol : class Expression
    location: class org.apache.cayenne.tutorial.Main

    /zonestorage/hudson/home/hudson/hudson/jobs/Cayenne-30/workspace/cayenneTestConnection/HSQLDB/jdk/JDK 1.6 (latest)/STABLE-3.0/tutorials/tutorial/src/main/java/org/apache/cayenne/tutorial/Main.java:[81,26] cannot find symbol
    symbol : variable ExpressionFactory
    location: class org.apache.cayenne.tutorial.Main

    /zonestorage/hudson/home/hudson/hudson/jobs/Cayenne-30/workspace/cayenneTestConnection/HSQLDB/jdk/JDK 1.6 (latest)/STABLE-3.0/tutorials/tutorial/src/main/java/org/apache/cayenne/tutorial/Main.java:[83,2] cannot find symbol
    symbol : class SelectQuery
    location: class org.apache.cayenne.tutorial.Main

    /zonestorage/hudson/home/hudson/hudson/jobs/Cayenne-30/workspace/cayenneTestConnection/HSQLDB/jdk/JDK 1.6 (latest)/STABLE-3.0/tutorials/tutorial/src/main/java/org/apache/cayenne/tutorial/Main.java:[83,28] cannot find symbol
    symbol : class SelectQuery
    location: class org.apache.cayenne.tutorial.Main

    /zonestorage/hudson/home/hudson/hudson/jobs/Cayenne-30/workspace/cayenneTestConnection/HSQLDB/jdk/JDK 1.6 (latest)/STABLE-3.0/tutorials/tutorial/src/main/java/org/apache/cayenne/tutorial/Main.java:[84,7] type parameter org.apache.cayenne.tutorial.persistent.Painting is not within its bound

    /zonestorage/hudson/home/hudson/hudson/jobs/Cayenne-30/workspace/cayenneTestConnection/HSQLDB/jdk/JDK 1.6 (latest)/STABLE-3.0/tutorials/tutorial/src/main/java/org/apache/cayenne/tutorial/Main.java:[89,2] cannot find symbol
    symbol : class Expression
    location: class org.apache.cayenne.tutorial.Main

    /zonestorage/hudson/home/hudson/hudson/jobs/Cayenne-30/workspace/cayenneTestConnection/HSQLDB/jdk/JDK 1.6 (latest)/STABLE-3.0/tutorials/tutorial/src/main/java/org/apache/cayenne/tutorial/Main.java:[89,26] cannot find symbol
    symbol : variable Expression
    location: class org.apache.cayenne.tutorial.Main

    /zonestorage/hudson/home/hudson/hudson/jobs/Cayenne-30/workspace/cayenneTestConnection/HSQLDB/jdk/JDK 1.6 (latest)/STABLE-3.0/tutorials/tutorial/src/main/java/org/apache/cayenne/tutorial/Main.java:[93,2] cannot find symbol
    symbol : class SelectQuery
    location: class org.apache.cayenne.tutorial.Main

    /zonestorage/hudson/home/hudson/hudson/jobs/Cayenne-30/workspace/cayenneTestConnection/HSQLDB/jdk/JDK 1.6 (latest)/STABLE-3.0/tutorials/tutorial/src/main/java/org/apache/cayenne/tutorial/Main.java:[93,28] cannot find symbol
    symbol : class SelectQuery
    location: class org.apache.cayenne.tutorial.Main

    /zonestorage/hudson/home/hudson/hudson/jobs/Cayenne-30/workspace/cayenneTestConnection/HSQLDB/jdk/JDK 1.6 (latest)/STABLE-3.0/tutorials/tutorial/src/main/java/org/apache/cayenne/tutorial/Main.java:[94,7] type parameter org.apache.cayenne.tutorial.persistent.Painting is not within its bound

    /zonestorage/hudson/home/hudson/hudson/jobs/Cayenne-30/workspace/cayenneTestConnection/HSQLDB/jdk/JDK 1.6 (latest)/STABLE-3.0/tutorials/tutorial/src/main/java/org/apache/cayenne/tutorial/Main.java:[99,2] cannot find symbol
    symbol : class Expression
    location: class org.apache.cayenne.tutorial.Main

    /zonestorage/hudson/home/hudson/hudson/jobs/Cayenne-30/workspace/cayenneTestConnection/HSQLDB/jdk/JDK 1.6 (latest)/STABLE-3.0/tutorials/tutorial/src/main/java/org/apache/cayenne/tutorial/Main.java:[99,25] cannot find symbol
    symbol : variable ExpressionFactory
    location: class org.apache.cayenne.tutorial.Main

    /zonestorage/hudson/home/hudson/hudson/jobs/Cayenne-30/workspace/cayenneTestConnection/HSQLDB/jdk/JDK 1.6 (latest)/STABLE-3.0/tutorials/tutorial/src/main/java/org/apache/cayenne/tutorial/Main.java:[101,2] cannot find symbol
    symbol : class SelectQuery
    location: class org.apache.cayenne.tutorial.Main

    /zonestorage/hudson/home/hudson/hudson/jobs/Cayenne-30/workspace/cayenneTestConnection/HSQLDB/jdk/JDK 1.6 (latest)/STABLE-3.0/tutorials/tutorial/src/main/java/org/apache/cayenne/tutorial/Main.java:[101,35] cannot find symbol
    symbol : class SelectQuery
    location: class org.apache.cayenne.tutorial.Main

    /zonestorage/hudson/home/hudson/hudson/jobs/Cayenne-30/workspace/cayenneTestConnection/HSQLDB/jdk/JDK 1.6 (latest)/STABLE-3.0/tutorials/tutorial/src/main/java/org/apache/cayenne/tutorial/Main.java:[102,28] cannot find symbol
    symbol : variable DataObjectUtils
    location: class org.apache.cayenne.tutorial.Main

    /zonestorage/hudson/home/hudson/hudson/jobs/Cayenne-30/workspace/cayenneTestConnection/HSQLDB/jdk/JDK 1.6 (latest)/STABLE-3.0/tutorials/tutorial/src/main/java/org/apache/cayenne/tutorial/Main.java:[105,14] operator != cannot be applied to org.apache.cayenne.tutorial.persistent.Artist,<nulltype>


    [INFO] ------------------------------------------------------------------------
    [INFO] For more information, run Maven with the -e switch
    [INFO] ------------------------------------------------------------------------
    [INFO] Total time: 6 minutes 46 seconds
    [INFO] Finished at: Tue Dec 29 17:43:40 UTC 2009
    [INFO] Final Memory: 63M/233M
    [INFO] ------------------------------------------------------------------------
    [locks-and-latches] Releasing all the locks
    [locks-and-latches] All the locks released
    Recording test results
  • Apache Hudson Server at Dec 30, 2009 at 12:39 pm
    See <http://hudson.zones.apache.org/hudson/job/Cayenne-30/./cayenneTestConnection=HSQLDB,jdk=JDK%201.6%20(latest)/8/changes>

    Changes:

    [oltka] * add note

    ------------------------------------------
    [...truncated 125360 lines...]
    2450396/?
    2452817/?
    2455076/?
    2457334/?
    2459692/?
    2462091/?
    2464260/?
    2466777/?
    2469413/?
    2471898/?
    2474346/?
    2476974/?
    2479432/?
    2482411/?
    2484698/?
    2487175/?
    2489794/?
    2492338/?
    2494818/?
    2497340/?
    2499788/?
    2502175/?
    2504631/?
    2506993/?
    2508969/?
    2510909/?
    2512189/?
    [INFO] [compiler:compile]
    [INFO] Compiling 9 source files to <http://hudson.zones.apache.org/hudson/job/Cayenne-30/./cayenneTestConnection=HSQLDB,jdk=JDK%201.6%20(latest)/ws/STABLE-3.0/tutorials/tutorial/target/classes>
    [INFO] ------------------------------------------------------------------------
    [ERROR] BUILD FAILURE
    [INFO] ------------------------------------------------------------------------
    [INFO] Compilation failure

    <http://hudson.zones.apache.org/hudson/job/Cayenne-30/./cayenneTestConnection=HSQLDB,jdk=JDK%201.6%20(latest)/ws/STABLE-3.0/tutorials/tutorial/src/main/java/org/apache/cayenne/tutorial/persistent/auto/_Painting.java>:[3,25] cannot find symbol
    symbol : class CayenneDataObject
    location: package org.apache.cayenne

    <http://hudson.zones.apache.org/hudson/job/Cayenne-30/./cayenneTestConnection=HSQLDB,jdk=JDK%201.6%20(latest)/ws/STABLE-3.0/tutorials/tutorial/src/main/java/org/apache/cayenne/tutorial/persistent/auto/_Painting.java>:[13,40] cannot find symbol
    symbol: class CayenneDataObject
    public abstract class _Painting extends CayenneDataObject {

    <http://hudson.zones.apache.org/hudson/job/Cayenne-30/./cayenneTestConnection=HSQLDB,jdk=JDK%201.6%20(latest)/ws/STABLE-3.0/tutorials/tutorial/src/main/java/org/apache/cayenne/tutorial/persistent/auto/_Artist.java>:[6,25] cannot find symbol
    symbol : class CayenneDataObject
    location: package org.apache.cayenne

    <http://hudson.zones.apache.org/hudson/job/Cayenne-30/./cayenneTestConnection=HSQLDB,jdk=JDK%201.6%20(latest)/ws/STABLE-3.0/tutorials/tutorial/src/main/java/org/apache/cayenne/tutorial/persistent/auto/_Artist.java>:[15,38] cannot find symbol
    symbol: class CayenneDataObject
    public abstract class _Artist extends CayenneDataObject {

    <http://hudson.zones.apache.org/hudson/job/Cayenne-30/./cayenneTestConnection=HSQLDB,jdk=JDK%201.6%20(latest)/ws/STABLE-3.0/tutorials/tutorial/src/main/java/org/apache/cayenne/tutorial/persistent/auto/_Gallery.java>:[5,25] cannot find symbol
    symbol : class CayenneDataObject
    location: package org.apache.cayenne

    <http://hudson.zones.apache.org/hudson/job/Cayenne-30/./cayenneTestConnection=HSQLDB,jdk=JDK%201.6%20(latest)/ws/STABLE-3.0/tutorials/tutorial/src/main/java/org/apache/cayenne/tutorial/persistent/auto/_Gallery.java>:[14,39] cannot find symbol
    symbol: class CayenneDataObject
    public abstract class _Gallery extends CayenneDataObject {

    <http://hudson.zones.apache.org/hudson/job/Cayenne-30/./cayenneTestConnection=HSQLDB,jdk=JDK%201.6%20(latest)/ws/STABLE-3.0/tutorials/tutorial/src/main/java/org/apache/cayenne/tutorial/Main.java>:[26,25] cannot find symbol
    symbol : class DataObjectUtils
    location: package org.apache.cayenne

    <http://hudson.zones.apache.org/hudson/job/Cayenne-30/./cayenneTestConnection=HSQLDB,jdk=JDK%201.6%20(latest)/ws/STABLE-3.0/tutorials/tutorial/src/main/java/org/apache/cayenne/tutorial/Main.java>:[27,25] cannot find symbol
    symbol : class ObjectContext
    location: package org.apache.cayenne

    <http://hudson.zones.apache.org/hudson/job/Cayenne-30/./cayenneTestConnection=HSQLDB,jdk=JDK%201.6%20(latest)/ws/STABLE-3.0/tutorials/tutorial/src/main/java/org/apache/cayenne/tutorial/Main.java>:[28,32] package org.apache.cayenne.access does not exist

    <http://hudson.zones.apache.org/hudson/job/Cayenne-30/./cayenneTestConnection=HSQLDB,jdk=JDK%201.6%20(latest)/ws/STABLE-3.0/tutorials/tutorial/src/main/java/org/apache/cayenne/tutorial/Main.java>:[29,29] package org.apache.cayenne.exp does not exist

    <http://hudson.zones.apache.org/hudson/job/Cayenne-30/./cayenneTestConnection=HSQLDB,jdk=JDK%201.6%20(latest)/ws/STABLE-3.0/tutorials/tutorial/src/main/java/org/apache/cayenne/tutorial/Main.java>:[30,29] package org.apache.cayenne.exp does not exist

    <http://hudson.zones.apache.org/hudson/job/Cayenne-30/./cayenneTestConnection=HSQLDB,jdk=JDK%201.6%20(latest)/ws/STABLE-3.0/tutorials/tutorial/src/main/java/org/apache/cayenne/tutorial/Main.java>:[31,31] package org.apache.cayenne.query does not exist

    <http://hudson.zones.apache.org/hudson/job/Cayenne-30/./cayenneTestConnection=HSQLDB,jdk=JDK%201.6%20(latest)/ws/STABLE-3.0/tutorials/tutorial/src/main/java/org/apache/cayenne/tutorial/Main.java>:[48,32] cannot find symbol
    symbol : class ObjectContext
    location: class org.apache.cayenne.tutorial.Main

    <http://hudson.zones.apache.org/hudson/job/Cayenne-30/./cayenneTestConnection=HSQLDB,jdk=JDK%201.6%20(latest)/ws/STABLE-3.0/tutorials/tutorial/src/main/java/org/apache/cayenne/tutorial/Main.java>:[76,28] cannot find symbol
    symbol : class ObjectContext
    location: class org.apache.cayenne.tutorial.Main

    <http://hudson.zones.apache.org/hudson/job/Cayenne-30/./cayenneTestConnection=HSQLDB,jdk=JDK%201.6%20(latest)/ws/STABLE-3.0/tutorials/tutorial/src/main/java/org/apache/cayenne/tutorial/Main.java>:[97,28] cannot find symbol
    symbol : class ObjectContext
    location: class org.apache.cayenne.tutorial.Main

    <http://hudson.zones.apache.org/hudson/job/Cayenne-30/./cayenneTestConnection=HSQLDB,jdk=JDK%201.6%20(latest)/ws/STABLE-3.0/tutorials/tutorial/src/main/java/org/apache/cayenne/tutorial/persistent/auto/_Painting.java>:[22,8] cannot find symbol
    symbol : method writeProperty(java.lang.String,java.lang.String)
    location: class org.apache.cayenne.tutorial.persistent.auto._Painting

    <http://hudson.zones.apache.org/hudson/job/Cayenne-30/./cayenneTestConnection=HSQLDB,jdk=JDK%201.6%20(latest)/ws/STABLE-3.0/tutorials/tutorial/src/main/java/org/apache/cayenne/tutorial/persistent/auto/_Painting.java>:[25,23] cannot find symbol
    symbol : method readProperty(java.lang.String)
    location: class org.apache.cayenne.tutorial.persistent.auto._Painting

    <http://hudson.zones.apache.org/hudson/job/Cayenne-30/./cayenneTestConnection=HSQLDB,jdk=JDK%201.6%20(latest)/ws/STABLE-3.0/tutorials/tutorial/src/main/java/org/apache/cayenne/tutorial/persistent/auto/_Painting.java>:[29,8] cannot find symbol
    symbol : method setToOneTarget(java.lang.String,org.apache.cayenne.tutorial.persistent.Artist,boolean)
    location: class org.apache.cayenne.tutorial.persistent.auto._Painting

    <http://hudson.zones.apache.org/hudson/job/Cayenne-30/./cayenneTestConnection=HSQLDB,jdk=JDK%201.6%20(latest)/ws/STABLE-3.0/tutorials/tutorial/src/main/java/org/apache/cayenne/tutorial/persistent/auto/_Painting.java>:[33,23] cannot find symbol
    symbol : method readProperty(java.lang.String)
    location: class org.apache.cayenne.tutorial.persistent.auto._Painting

    <http://hudson.zones.apache.org/hudson/job/Cayenne-30/./cayenneTestConnection=HSQLDB,jdk=JDK%201.6%20(latest)/ws/STABLE-3.0/tutorials/tutorial/src/main/java/org/apache/cayenne/tutorial/persistent/auto/_Painting.java>:[38,8] cannot find symbol
    symbol : method setToOneTarget(java.lang.String,org.apache.cayenne.tutorial.persistent.Gallery,boolean)
    location: class org.apache.cayenne.tutorial.persistent.auto._Painting

    <http://hudson.zones.apache.org/hudson/job/Cayenne-30/./cayenneTestConnection=HSQLDB,jdk=JDK%201.6%20(latest)/ws/STABLE-3.0/tutorials/tutorial/src/main/java/org/apache/cayenne/tutorial/persistent/auto/_Painting.java>:[42,24] cannot find symbol
    symbol : method readProperty(java.lang.String)
    location: class org.apache.cayenne.tutorial.persistent.auto._Painting

    <http://hudson.zones.apache.org/hudson/job/Cayenne-30/./cayenneTestConnection=HSQLDB,jdk=JDK%201.6%20(latest)/ws/STABLE-3.0/tutorials/tutorial/src/main/java/org/apache/cayenne/tutorial/persistent/auto/_Artist.java>:[24,8] cannot find symbol
    symbol : method writeProperty(java.lang.String,java.util.Date)
    location: class org.apache.cayenne.tutorial.persistent.auto._Artist

    <http://hudson.zones.apache.org/hudson/job/Cayenne-30/./cayenneTestConnection=HSQLDB,jdk=JDK%201.6%20(latest)/ws/STABLE-3.0/tutorials/tutorial/src/main/java/org/apache/cayenne/tutorial/persistent/auto/_Artist.java>:[27,21] cannot find symbol
    symbol : method readProperty(java.lang.String)
    location: class org.apache.cayenne.tutorial.persistent.auto._Artist

    <http://hudson.zones.apache.org/hudson/job/Cayenne-30/./cayenneTestConnection=HSQLDB,jdk=JDK%201.6%20(latest)/ws/STABLE-3.0/tutorials/tutorial/src/main/java/org/apache/cayenne/tutorial/persistent/auto/_Artist.java>:[31,8] cannot find symbol
    symbol : method writeProperty(java.lang.String,java.lang.String)
    location: class org.apache.cayenne.tutorial.persistent.auto._Artist

    <http://hudson.zones.apache.org/hudson/job/Cayenne-30/./cayenneTestConnection=HSQLDB,jdk=JDK%201.6%20(latest)/ws/STABLE-3.0/tutorials/tutorial/src/main/java/org/apache/cayenne/tutorial/persistent/auto/_Artist.java>:[34,23] cannot find symbol
    symbol : method readProperty(java.lang.String)
    location: class org.apache.cayenne.tutorial.persistent.auto._Artist

    <http://hudson.zones.apache.org/hudson/job/Cayenne-30/./cayenneTestConnection=HSQLDB,jdk=JDK%201.6%20(latest)/ws/STABLE-3.0/tutorials/tutorial/src/main/java/org/apache/cayenne/tutorial/persistent/auto/_Artist.java>:[38,8] cannot find symbol
    symbol : method addToManyTarget(java.lang.String,org.apache.cayenne.tutorial.persistent.Painting,boolean)
    location: class org.apache.cayenne.tutorial.persistent.auto._Artist

    <http://hudson.zones.apache.org/hudson/job/Cayenne-30/./cayenneTestConnection=HSQLDB,jdk=JDK%201.6%20(latest)/ws/STABLE-3.0/tutorials/tutorial/src/main/java/org/apache/cayenne/tutorial/persistent/auto/_Artist.java>:[41,8] cannot find symbol
    symbol : method removeToManyTarget(java.lang.String,org.apache.cayenne.tutorial.persistent.Painting,boolean)
    location: class org.apache.cayenne.tutorial.persistent.auto._Artist

    <http://hudson.zones.apache.org/hudson/job/Cayenne-30/./cayenneTestConnection=HSQLDB,jdk=JDK%201.6%20(latest)/ws/STABLE-3.0/tutorials/tutorial/src/main/java/org/apache/cayenne/tutorial/persistent/auto/_Artist.java>:[44,16] type parameter org.apache.cayenne.tutorial.persistent.Painting is not within its bound

    <http://hudson.zones.apache.org/hudson/job/Cayenne-30/./cayenneTestConnection=HSQLDB,jdk=JDK%201.6%20(latest)/ws/STABLE-3.0/tutorials/tutorial/src/main/java/org/apache/cayenne/tutorial/persistent/auto/_Artist.java>:[45,31] cannot find symbol
    symbol : method readProperty(java.lang.String)
    location: class org.apache.cayenne.tutorial.persistent.auto._Artist

    <http://hudson.zones.apache.org/hudson/job/Cayenne-30/./cayenneTestConnection=HSQLDB,jdk=JDK%201.6%20(latest)/ws/STABLE-3.0/tutorials/tutorial/src/main/java/org/apache/cayenne/tutorial/persistent/auto/_Gallery.java>:[22,8] cannot find symbol
    symbol : method writeProperty(java.lang.String,java.lang.String)
    location: class org.apache.cayenne.tutorial.persistent.auto._Gallery

    <http://hudson.zones.apache.org/hudson/job/Cayenne-30/./cayenneTestConnection=HSQLDB,jdk=JDK%201.6%20(latest)/ws/STABLE-3.0/tutorials/tutorial/src/main/java/org/apache/cayenne/tutorial/persistent/auto/_Gallery.java>:[25,23] cannot find symbol
    symbol : method readProperty(java.lang.String)
    location: class org.apache.cayenne.tutorial.persistent.auto._Gallery

    <http://hudson.zones.apache.org/hudson/job/Cayenne-30/./cayenneTestConnection=HSQLDB,jdk=JDK%201.6%20(latest)/ws/STABLE-3.0/tutorials/tutorial/src/main/java/org/apache/cayenne/tutorial/persistent/auto/_Gallery.java>:[29,8] cannot find symbol
    symbol : method addToManyTarget(java.lang.String,org.apache.cayenne.tutorial.persistent.Painting,boolean)
    location: class org.apache.cayenne.tutorial.persistent.auto._Gallery

    <http://hudson.zones.apache.org/hudson/job/Cayenne-30/./cayenneTestConnection=HSQLDB,jdk=JDK%201.6%20(latest)/ws/STABLE-3.0/tutorials/tutorial/src/main/java/org/apache/cayenne/tutorial/persistent/auto/_Gallery.java>:[32,8] cannot find symbol
    symbol : method removeToManyTarget(java.lang.String,org.apache.cayenne.tutorial.persistent.Painting,boolean)
    location: class org.apache.cayenne.tutorial.persistent.auto._Gallery

    <http://hudson.zones.apache.org/hudson/job/Cayenne-30/./cayenneTestConnection=HSQLDB,jdk=JDK%201.6%20(latest)/ws/STABLE-3.0/tutorials/tutorial/src/main/java/org/apache/cayenne/tutorial/persistent/auto/_Gallery.java>:[35,16] type parameter org.apache.cayenne.tutorial.persistent.Painting is not within its bound

    <http://hudson.zones.apache.org/hudson/job/Cayenne-30/./cayenneTestConnection=HSQLDB,jdk=JDK%201.6%20(latest)/ws/STABLE-3.0/tutorials/tutorial/src/main/java/org/apache/cayenne/tutorial/persistent/auto/_Gallery.java>:[36,31] cannot find symbol
    symbol : method readProperty(java.lang.String)
    location: class org.apache.cayenne.tutorial.persistent.auto._Gallery

    <http://hudson.zones.apache.org/hudson/job/Cayenne-30/./cayenneTestConnection=HSQLDB,jdk=JDK%201.6%20(latest)/ws/STABLE-3.0/tutorials/tutorial/src/main/java/org/apache/cayenne/tutorial/Main.java>:[41,2] cannot find symbol
    symbol : class ObjectContext
    location: class org.apache.cayenne.tutorial.Main

    <http://hudson.zones.apache.org/hudson/job/Cayenne-30/./cayenneTestConnection=HSQLDB,jdk=JDK%201.6%20(latest)/ws/STABLE-3.0/tutorials/tutorial/src/main/java/org/apache/cayenne/tutorial/Main.java>:[41,26] cannot find symbol
    symbol : variable DataContext
    location: class org.apache.cayenne.tutorial.Main

    <http://hudson.zones.apache.org/hudson/job/Cayenne-30/./cayenneTestConnection=HSQLDB,jdk=JDK%201.6%20(latest)/ws/STABLE-3.0/tutorials/tutorial/src/main/java/org/apache/cayenne/tutorial/Main.java>:[78,2] cannot find symbol
    symbol : class SelectQuery
    location: class org.apache.cayenne.tutorial.Main

    <http://hudson.zones.apache.org/hudson/job/Cayenne-30/./cayenneTestConnection=HSQLDB,jdk=JDK%201.6%20(latest)/ws/STABLE-3.0/tutorials/tutorial/src/main/java/org/apache/cayenne/tutorial/Main.java>:[78,28] cannot find symbol
    symbol : class SelectQuery
    location: class org.apache.cayenne.tutorial.Main

    <http://hudson.zones.apache.org/hudson/job/Cayenne-30/./cayenneTestConnection=HSQLDB,jdk=JDK%201.6%20(latest)/ws/STABLE-3.0/tutorials/tutorial/src/main/java/org/apache/cayenne/tutorial/Main.java>:[79,7] type parameter org.apache.cayenne.tutorial.persistent.Painting is not within its bound

    <http://hudson.zones.apache.org/hudson/job/Cayenne-30/./cayenneTestConnection=HSQLDB,jdk=JDK%201.6%20(latest)/ws/STABLE-3.0/tutorials/tutorial/src/main/java/org/apache/cayenne/tutorial/Main.java>:[81,2] cannot find symbol
    symbol : class Expression
    location: class org.apache.cayenne.tutorial.Main

    <http://hudson.zones.apache.org/hudson/job/Cayenne-30/./cayenneTestConnection=HSQLDB,jdk=JDK%201.6%20(latest)/ws/STABLE-3.0/tutorials/tutorial/src/main/java/org/apache/cayenne/tutorial/Main.java>:[81,26] cannot find symbol
    symbol : variable ExpressionFactory
    location: class org.apache.cayenne.tutorial.Main

    <http://hudson.zones.apache.org/hudson/job/Cayenne-30/./cayenneTestConnection=HSQLDB,jdk=JDK%201.6%20(latest)/ws/STABLE-3.0/tutorials/tutorial/src/main/java/org/apache/cayenne/tutorial/Main.java>:[83,2] cannot find symbol
    symbol : class SelectQuery
    location: class org.apache.cayenne.tutorial.Main

    <http://hudson.zones.apache.org/hudson/job/Cayenne-30/./cayenneTestConnection=HSQLDB,jdk=JDK%201.6%20(latest)/ws/STABLE-3.0/tutorials/tutorial/src/main/java/org/apache/cayenne/tutorial/Main.java>:[83,28] cannot find symbol
    symbol : class SelectQuery
    location: class org.apache.cayenne.tutorial.Main

    <http://hudson.zones.apache.org/hudson/job/Cayenne-30/./cayenneTestConnection=HSQLDB,jdk=JDK%201.6%20(latest)/ws/STABLE-3.0/tutorials/tutorial/src/main/java/org/apache/cayenne/tutorial/Main.java>:[84,7] type parameter org.apache.cayenne.tutorial.persistent.Painting is not within its bound

    <http://hudson.zones.apache.org/hudson/job/Cayenne-30/./cayenneTestConnection=HSQLDB,jdk=JDK%201.6%20(latest)/ws/STABLE-3.0/tutorials/tutorial/src/main/java/org/apache/cayenne/tutorial/Main.java>:[89,2] cannot find symbol
    symbol : class Expression
    location: class org.apache.cayenne.tutorial.Main

    <http://hudson.zones.apache.org/hudson/job/Cayenne-30/./cayenneTestConnection=HSQLDB,jdk=JDK%201.6%20(latest)/ws/STABLE-3.0/tutorials/tutorial/src/main/java/org/apache/cayenne/tutorial/Main.java>:[89,26] cannot find symbol
    symbol : variable Expression
    location: class org.apache.cayenne.tutorial.Main

    <http://hudson.zones.apache.org/hudson/job/Cayenne-30/./cayenneTestConnection=HSQLDB,jdk=JDK%201.6%20(latest)/ws/STABLE-3.0/tutorials/tutorial/src/main/java/org/apache/cayenne/tutorial/Main.java>:[93,2] cannot find symbol
    symbol : class SelectQuery
    location: class org.apache.cayenne.tutorial.Main

    <http://hudson.zones.apache.org/hudson/job/Cayenne-30/./cayenneTestConnection=HSQLDB,jdk=JDK%201.6%20(latest)/ws/STABLE-3.0/tutorials/tutorial/src/main/java/org/apache/cayenne/tutorial/Main.java>:[93,28] cannot find symbol
    symbol : class SelectQuery
    location: class org.apache.cayenne.tutorial.Main

    <http://hudson.zones.apache.org/hudson/job/Cayenne-30/./cayenneTestConnection=HSQLDB,jdk=JDK%201.6%20(latest)/ws/STABLE-3.0/tutorials/tutorial/src/main/java/org/apache/cayenne/tutorial/Main.java>:[94,7] type parameter org.apache.cayenne.tutorial.persistent.Painting is not within its bound

    <http://hudson.zones.apache.org/hudson/job/Cayenne-30/./cayenneTestConnection=HSQLDB,jdk=JDK%201.6%20(latest)/ws/STABLE-3.0/tutorials/tutorial/src/main/java/org/apache/cayenne/tutorial/Main.java>:[99,2] cannot find symbol
    symbol : class Expression
    location: class org.apache.cayenne.tutorial.Main

    <http://hudson.zones.apache.org/hudson/job/Cayenne-30/./cayenneTestConnection=HSQLDB,jdk=JDK%201.6%20(latest)/ws/STABLE-3.0/tutorials/tutorial/src/main/java/org/apache/cayenne/tutorial/Main.java>:[99,25] cannot find symbol
    symbol : variable ExpressionFactory
    location: class org.apache.cayenne.tutorial.Main

    <http://hudson.zones.apache.org/hudson/job/Cayenne-30/./cayenneTestConnection=HSQLDB,jdk=JDK%201.6%20(latest)/ws/STABLE-3.0/tutorials/tutorial/src/main/java/org/apache/cayenne/tutorial/Main.java>:[101,2] cannot find symbol
    symbol : class SelectQuery
    location: class org.apache.cayenne.tutorial.Main

    <http://hudson.zones.apache.org/hudson/job/Cayenne-30/./cayenneTestConnection=HSQLDB,jdk=JDK%201.6%20(latest)/ws/STABLE-3.0/tutorials/tutorial/src/main/java/org/apache/cayenne/tutorial/Main.java>:[101,35] cannot find symbol
    symbol : class SelectQuery
    location: class org.apache.cayenne.tutorial.Main

    <http://hudson.zones.apache.org/hudson/job/Cayenne-30/./cayenneTestConnection=HSQLDB,jdk=JDK%201.6%20(latest)/ws/STABLE-3.0/tutorials/tutorial/src/main/java/org/apache/cayenne/tutorial/Main.java>:[102,28] cannot find symbol
    symbol : variable DataObjectUtils
    location: class org.apache.cayenne.tutorial.Main

    <http://hudson.zones.apache.org/hudson/job/Cayenne-30/./cayenneTestConnection=HSQLDB,jdk=JDK%201.6%20(latest)/ws/STABLE-3.0/tutorials/tutorial/src/main/java/org/apache/cayenne/tutorial/Main.java>:[105,14] operator != cannot be applied to org.apache.cayenne.tutorial.persistent.Artist,<nulltype>


    [INFO] ------------------------------------------------------------------------
    [INFO] For more information, run Maven with the -e switch
    [INFO] ------------------------------------------------------------------------
    [INFO] Total time: 4 minutes 40 seconds
    [INFO] Finished at: Wed Dec 30 12:43:30 UTC 2009
    [INFO] Final Memory: 58M/209M
    [INFO] ------------------------------------------------------------------------
    [locks-and-latches] Releasing all the locks
    [locks-and-latches] All the locks released
    Recording test results

Related Discussions

Discussion Navigation
viewthread | post
Discussion Overview
groupdev @
categoriescayenne
postedDec 26, '09 at 11:13p
activeDec 30, '09 at 3:33p
posts9
users1
websitecayenne.apache.org

1 user in discussion

Apache Hudson Server: 9 posts

People

Translate

site design / logo © 2022 Grokbase