Grokbase Groups Lucene dev June 2016
FAQ
Build: https://builds.apache.org/job/Lucene-Solr-Tests-5.5-Java7/32/

1 tests failed.
FAILED: org.apache.solr.core.TestArbitraryIndexDir.testLoadNewIndexDir

Error Message:
Exception during query

Stack Trace:
java.lang.RuntimeException: Exception during query
  at __randomizedtesting.SeedInfo.seed([5799954607B011D0:BEC32E7E99298178]:0)
  at org.apache.solr.SolrTestCaseJ4.assertQ(SolrTestCaseJ4.java:754)
  at org.apache.solr.core.TestArbitraryIndexDir.testLoadNewIndexDir(TestArbitraryIndexDir.java:107)
  at sun.reflect.NativeMethodAccessorImpl.invoke0(Native Method)
  at sun.reflect.NativeMethodAccessorImpl.invoke(NativeMethodAccessorImpl.java:57)
  at sun.reflect.DelegatingMethodAccessorImpl.invoke(DelegatingMethodAccessorImpl.java:43)
  at java.lang.reflect.Method.invoke(Method.java:606)
  at com.carrotsearch.randomizedtesting.RandomizedRunner.invoke(RandomizedRunner.java:1764)
  at com.carrotsearch.randomizedtesting.RandomizedRunner$8.evaluate(RandomizedRunner.java:871)
  at com.carrotsearch.randomizedtesting.RandomizedRunner$9.evaluate(RandomizedRunner.java:907)
  at com.carrotsearch.randomizedtesting.RandomizedRunner$10.evaluate(RandomizedRunner.java:921)
  at com.carrotsearch.randomizedtesting.rules.SystemPropertiesRestoreRule$1.evaluate(SystemPropertiesRestoreRule.java:57)
  at com.carrotsearch.randomizedtesting.rules.SystemPropertiesRestoreRule$1.evaluate(SystemPropertiesRestoreRule.java:57)
  at org.apache.lucene.util.TestRuleSetupTeardownChained$1.evaluate(TestRuleSetupTeardownChained.java:49)
  at org.apache.lucene.util.AbstractBeforeAfterRule$1.evaluate(AbstractBeforeAfterRule.java:45)
  at org.apache.lucene.util.TestRuleThreadAndTestName$1.evaluate(TestRuleThreadAndTestName.java:48)
  at org.apache.lucene.util.TestRuleIgnoreAfterMaxFailures$1.evaluate(TestRuleIgnoreAfterMaxFailures.java:64)
  at org.apache.lucene.util.TestRuleMarkFailure$1.evaluate(TestRuleMarkFailure.java:47)
  at com.carrotsearch.randomizedtesting.rules.StatementAdapter.evaluate(StatementAdapter.java:36)
  at com.carrotsearch.randomizedtesting.ThreadLeakControl$StatementRunner.run(ThreadLeakControl.java:367)
  at com.carrotsearch.randomizedtesting.ThreadLeakControl.forkTimeoutingTask(ThreadLeakControl.java:809)
  at com.carrotsearch.randomizedtesting.ThreadLeakControl$3.evaluate(ThreadLeakControl.java:460)
  at com.carrotsearch.randomizedtesting.RandomizedRunner.runSingleTest(RandomizedRunner.java:880)
  at com.carrotsearch.randomizedtesting.RandomizedRunner$5.evaluate(RandomizedRunner.java:781)
  at com.carrotsearch.randomizedtesting.RandomizedRunner$6.evaluate(RandomizedRunner.java:816)
  at com.carrotsearch.randomizedtesting.RandomizedRunner$7.evaluate(RandomizedRunner.java:827)
  at com.carrotsearch.randomizedtesting.rules.StatementAdapter.evaluate(StatementAdapter.java:36)
  at com.carrotsearch.randomizedtesting.rules.SystemPropertiesRestoreRule$1.evaluate(SystemPropertiesRestoreRule.java:57)
  at org.apache.lucene.util.AbstractBeforeAfterRule$1.evaluate(AbstractBeforeAfterRule.java:45)
  at com.carrotsearch.randomizedtesting.rules.StatementAdapter.evaluate(StatementAdapter.java:36)
  at org.apache.lucene.util.TestRuleStoreClassName$1.evaluate(TestRuleStoreClassName.java:41)
  at com.carrotsearch.randomizedtesting.rules.NoShadowingOrOverridesOnMethodsRule$1.evaluate(NoShadowingOrOverridesOnMethodsRule.java:40)
  at com.carrotsearch.randomizedtesting.rules.NoShadowingOrOverridesOnMethodsRule$1.evaluate(NoShadowingOrOverridesOnMethodsRule.java:40)
  at com.carrotsearch.randomizedtesting.rules.StatementAdapter.evaluate(StatementAdapter.java:36)
  at com.carrotsearch.randomizedtesting.rules.StatementAdapter.evaluate(StatementAdapter.java:36)
  at com.carrotsearch.randomizedtesting.rules.StatementAdapter.evaluate(StatementAdapter.java:36)
  at org.apache.lucene.util.TestRuleAssertionsRequired$1.evaluate(TestRuleAssertionsRequired.java:53)
  at org.apache.lucene.util.TestRuleMarkFailure$1.evaluate(TestRuleMarkFailure.java:47)
  at org.apache.lucene.util.TestRuleIgnoreAfterMaxFailures$1.evaluate(TestRuleIgnoreAfterMaxFailures.java:64)
  at org.apache.lucene.util.TestRuleIgnoreTestSuites$1.evaluate(TestRuleIgnoreTestSuites.java:54)
  at com.carrotsearch.randomizedtesting.rules.StatementAdapter.evaluate(StatementAdapter.java:36)
  at com.carrotsearch.randomizedtesting.ThreadLeakControl$StatementRunner.run(ThreadLeakControl.java:367)
  at java.lang.Thread.run(Thread.java:745)
Caused by: java.lang.RuntimeException: REQUEST FAILED: xpath=*[count(//doc)=1]
  xml response was: <?xml version="1.0" encoding="UTF-8"?>
<response>
<lst name="responseHeader"><int name="status">0</int><int name="QTime">0</int></lst><result name="response" numFound="0" start="0"></result>
</response>

  request was:rows=20&start=0&q=id:2&qt=standard&version=2.2
  at org.apache.solr.SolrTestCaseJ4.assertQ(SolrTestCaseJ4.java:747)
  ... 41 more




Build Log:
[...truncated 11655 lines...]
    [junit4] Suite: org.apache.solr.core.TestArbitraryIndexDir
    [junit4] 2> Creating dataDir: /x1/jenkins/jenkins-slave/workspace/Lucene-Solr-Tests-5.5-Java7/solr/build/solr-core/test/J2/temp/solr.core.TestArbitraryIndexDir_5799954607B011D0-001/init-core-data-001
    [junit4] 2> 1224742 INFO (SUITE-TestArbitraryIndexDir-seed#[5799954607B011D0]-worker) [ ] o.a.s.SolrTestCaseJ4 Randomized ssl (false) and clientAuth (false)
    [junit4] 2> 1224748 INFO (TEST-TestArbitraryIndexDir.testLoadNewIndexDir-seed#[5799954607B011D0]) [ ] o.a.s.SolrTestCaseJ4 ###Starting testLoadNewIndexDir
    [junit4] 2> 1224748 INFO (TEST-TestArbitraryIndexDir.testLoadNewIndexDir-seed#[5799954607B011D0]) [ ] o.a.s.SolrTestCaseJ4 ####initCore
    [junit4] 2> 1224748 INFO (TEST-TestArbitraryIndexDir.testLoadNewIndexDir-seed#[5799954607B011D0]) [ ] o.a.s.c.SolrResourceLoader new SolrResourceLoader for directory: '/x1/jenkins/jenkins-slave/workspace/Lucene-Solr-Tests-5.5-Java7/solr/core/src/test-files/solr/collection1'
    [junit4] 2> 1224748 INFO (TEST-TestArbitraryIndexDir.testLoadNewIndexDir-seed#[5799954607B011D0]) [ ] o.a.s.c.SolrResourceLoader JNDI not configured for solr (NoInitialContextEx)
    [junit4] 2> 1224748 INFO (TEST-TestArbitraryIndexDir.testLoadNewIndexDir-seed#[5799954607B011D0]) [ ] o.a.s.c.SolrResourceLoader using system property solr.solr.home: /x1/jenkins/jenkins-slave/workspace/Lucene-Solr-Tests-5.5-Java7/solr/core/src/test-files/solr
    [junit4] 2> 1224748 INFO (TEST-TestArbitraryIndexDir.testLoadNewIndexDir-seed#[5799954607B011D0]) [ ] o.a.s.c.SolrResourceLoader Adding 'file:/x1/jenkins/jenkins-slave/workspace/Lucene-Solr-Tests-5.5-Java7/solr/core/src/test-files/solr/collection1/lib/classes/' to classloader
    [junit4] 2> 1224748 INFO (TEST-TestArbitraryIndexDir.testLoadNewIndexDir-seed#[5799954607B011D0]) [ ] o.a.s.c.SolrResourceLoader Adding 'file:/x1/jenkins/jenkins-slave/workspace/Lucene-Solr-Tests-5.5-Java7/solr/core/src/test-files/solr/collection1/lib/README' to classloader
    [junit4] 2> 1224779 INFO (TEST-TestArbitraryIndexDir.testLoadNewIndexDir-seed#[5799954607B011D0]) [ ] o.a.s.c.SolrConfig current version of requestparams : -1
    [junit4] 2> 1224807 INFO (TEST-TestArbitraryIndexDir.testLoadNewIndexDir-seed#[5799954607B011D0]) [ ] o.a.s.c.SolrConfig Using Lucene MatchVersion: 5.5.2
    [junit4] 2> 1224837 INFO (TEST-TestArbitraryIndexDir.testLoadNewIndexDir-seed#[5799954607B011D0]) [ ] o.a.s.c.SolrConfig Loaded SolrConfig: solrconfig.xml
    [junit4] 2> 1224841 INFO (TEST-TestArbitraryIndexDir.testLoadNewIndexDir-seed#[5799954607B011D0]) [ ] o.a.s.s.IndexSchema [null] Schema name=test
    [junit4] 2> 1225027 INFO (TEST-TestArbitraryIndexDir.testLoadNewIndexDir-seed#[5799954607B011D0]) [ ] o.a.s.s.IndexSchema default search field in schema is text
    [junit4] 2> 1225028 INFO (TEST-TestArbitraryIndexDir.testLoadNewIndexDir-seed#[5799954607B011D0]) [ ] o.a.s.s.IndexSchema unique key field: id
    [junit4] 2> 1225029 WARN (TEST-TestArbitraryIndexDir.testLoadNewIndexDir-seed#[5799954607B011D0]) [ ] o.a.s.s.IndexSchema Field text is not multivalued and destination for multiple copyFields (2)
    [junit4] 2> 1225033 INFO (TEST-TestArbitraryIndexDir.testLoadNewIndexDir-seed#[5799954607B011D0]) [ ] o.a.s.s.FileExchangeRateProvider Reloading exchange rates from file currency.xml
    [junit4] 2> 1225035 INFO (TEST-TestArbitraryIndexDir.testLoadNewIndexDir-seed#[5799954607B011D0]) [ ] o.a.s.s.FileExchangeRateProvider Reloading exchange rates from file currency.xml
    [junit4] 2> 1225036 INFO (TEST-TestArbitraryIndexDir.testLoadNewIndexDir-seed#[5799954607B011D0]) [ ] o.a.s.c.SolrResourceLoader JNDI not configured for solr (NoInitialContextEx)
    [junit4] 2> 1225036 INFO (TEST-TestArbitraryIndexDir.testLoadNewIndexDir-seed#[5799954607B011D0]) [ ] o.a.s.c.SolrResourceLoader using system property solr.solr.home: /x1/jenkins/jenkins-slave/workspace/Lucene-Solr-Tests-5.5-Java7/solr/core/src/test-files/solr
    [junit4] 2> 1225036 INFO (TEST-TestArbitraryIndexDir.testLoadNewIndexDir-seed#[5799954607B011D0]) [ ] o.a.s.c.SolrResourceLoader new SolrResourceLoader for directory: '/x1/jenkins/jenkins-slave/workspace/Lucene-Solr-Tests-5.5-Java7/solr/core/src/test-files/solr'
    [junit4] 2> 1225036 INFO (TEST-TestArbitraryIndexDir.testLoadNewIndexDir-seed#[5799954607B011D0]) [ ] o.a.s.c.SolrResourceLoader JNDI not configured for solr (NoInitialContextEx)
    [junit4] 2> 1225036 INFO (TEST-TestArbitraryIndexDir.testLoadNewIndexDir-seed#[5799954607B011D0]) [ ] o.a.s.c.SolrResourceLoader using system property solr.solr.home: /x1/jenkins/jenkins-slave/workspace/Lucene-Solr-Tests-5.5-Java7/solr/core/src/test-files/solr
    [junit4] 2> 1225036 INFO (TEST-TestArbitraryIndexDir.testLoadNewIndexDir-seed#[5799954607B011D0]) [ ] o.a.s.c.CoreContainer New CoreContainer 1870981544
    [junit4] 2> 1225036 INFO (TEST-TestArbitraryIndexDir.testLoadNewIndexDir-seed#[5799954607B011D0]) [ ] o.a.s.c.CoreContainer Loading cores into CoreContainer [instanceDir=/x1/jenkins/jenkins-slave/workspace/Lucene-Solr-Tests-5.5-Java7/solr/core/src/test-files/solr]
    [junit4] 2> 1225055 WARN (TEST-TestArbitraryIndexDir.testLoadNewIndexDir-seed#[5799954607B011D0]) [ ] o.a.s.c.CoreContainer Couldn't add files from /x1/jenkins/jenkins-slave/workspace/Lucene-Solr-Tests-5.5-Java7/solr/core/src/test-files/solr/lib to classpath: /x1/jenkins/jenkins-slave/workspace/Lucene-Solr-Tests-5.5-Java7/solr/core/src/test-files/solr/lib
    [junit4] 2> 1225055 INFO (TEST-TestArbitraryIndexDir.testLoadNewIndexDir-seed#[5799954607B011D0]) [ ] o.a.s.h.c.HttpShardHandlerFactory created with socketTimeout : 600000,connTimeout : 60000,maxConnectionsPerHost : 20,maxConnections : 10000,corePoolSize : 0,maximumPoolSize : 2147483647,maxThreadIdleTime : 5,sizeOfQueue : -1,fairnessPolicy : false,useRetries : false,
    [junit4] 2> 1225056 INFO (TEST-TestArbitraryIndexDir.testLoadNewIndexDir-seed#[5799954607B011D0]) [ ] o.a.s.u.UpdateShardHandler Creating UpdateShardHandler HTTP client with params: socketTimeout=30000&connTimeout=30000&retry=true
    [junit4] 2> 1225056 INFO (TEST-TestArbitraryIndexDir.testLoadNewIndexDir-seed#[5799954607B011D0]) [ ] o.a.s.l.LogWatcher SLF4J impl is org.slf4j.impl.Log4jLoggerFactory
    [junit4] 2> 1225056 INFO (TEST-TestArbitraryIndexDir.testLoadNewIndexDir-seed#[5799954607B011D0]) [ ] o.a.s.l.LogWatcher Registering Log Listener [Log4j (org.slf4j.impl.Log4jLoggerFactory)]
    [junit4] 2> 1225057 INFO (TEST-TestArbitraryIndexDir.testLoadNewIndexDir-seed#[5799954607B011D0]) [ ] o.a.s.c.CoreContainer Security conf doesn't exist. Skipping setup for authorization module.
    [junit4] 2> 1225057 INFO (TEST-TestArbitraryIndexDir.testLoadNewIndexDir-seed#[5799954607B011D0]) [ ] o.a.s.c.CoreContainer No authentication plugin used.
    [junit4] 2> 1225057 INFO (TEST-TestArbitraryIndexDir.testLoadNewIndexDir-seed#[5799954607B011D0]) [ ] o.a.s.c.CoreDescriptor Created CoreDescriptor: {shard=shard1, loadOnStartup=true, transient=false, config=solrconfig.xml, dataDir=/x1/jenkins/jenkins-slave/workspace/Lucene-Solr-Tests-5.5-Java7/solr/build/solr-core/test/J2/temp/solr.core.TestArbitraryIndexDir_5799954607B011D0-001/init-core-data-001, collection=collection1, configSetProperties=configsetprops.json, name=collection1, schema=schema12.xml}
    [junit4] 2> 1225065 INFO (coreLoadExecutor-4575-thread-1) [ ] o.a.s.c.SolrResourceLoader new SolrResourceLoader for directory: '/x1/jenkins/jenkins-slave/workspace/Lucene-Solr-Tests-5.5-Java7/solr/core/src/test-files/solr/collection1'
    [junit4] 2> 1225065 INFO (coreLoadExecutor-4575-thread-1) [ ] o.a.s.c.SolrResourceLoader JNDI not configured for solr (NoInitialContextEx)
    [junit4] 2> 1225065 INFO (coreLoadExecutor-4575-thread-1) [ ] o.a.s.c.SolrResourceLoader using system property solr.solr.home: /x1/jenkins/jenkins-slave/workspace/Lucene-Solr-Tests-5.5-Java7/solr/core/src/test-files/solr
    [junit4] 2> 1225065 INFO (coreLoadExecutor-4575-thread-1) [ ] o.a.s.c.SolrResourceLoader Adding 'file:/x1/jenkins/jenkins-slave/workspace/Lucene-Solr-Tests-5.5-Java7/solr/core/src/test-files/solr/collection1/lib/classes/' to classloader
    [junit4] 2> 1225065 INFO (coreLoadExecutor-4575-thread-1) [ ] o.a.s.c.SolrResourceLoader Adding 'file:/x1/jenkins/jenkins-slave/workspace/Lucene-Solr-Tests-5.5-Java7/solr/core/src/test-files/solr/collection1/lib/README' to classloader
    [junit4] 2> 1225100 INFO (coreLoadExecutor-4575-thread-1) [ ] o.a.s.c.SolrConfig current version of requestparams : -1
    [junit4] 2> 1225130 INFO (coreLoadExecutor-4575-thread-1) [ ] o.a.s.c.SolrConfig Using Lucene MatchVersion: 5.5.2
    [junit4] 2> 1225174 INFO (coreLoadExecutor-4575-thread-1) [ ] o.a.s.c.SolrConfig Loaded SolrConfig: solrconfig.xml
    [junit4] 2> 1225178 INFO (coreLoadExecutor-4575-thread-1) [ ] o.a.s.s.IndexSchema [collection1] Schema name=test
    [junit4] 2> 1225322 INFO (coreLoadExecutor-4575-thread-1) [ ] o.a.s.s.IndexSchema default search field in schema is text
    [junit4] 2> 1225323 INFO (coreLoadExecutor-4575-thread-1) [ ] o.a.s.s.IndexSchema unique key field: id
    [junit4] 2> 1225324 WARN (coreLoadExecutor-4575-thread-1) [ ] o.a.s.s.IndexSchema Field text is not multivalued and destination for multiple copyFields (2)
    [junit4] 2> 1225328 INFO (coreLoadExecutor-4575-thread-1) [ ] o.a.s.s.FileExchangeRateProvider Reloading exchange rates from file currency.xml
    [junit4] 2> 1225329 INFO (coreLoadExecutor-4575-thread-1) [ ] o.a.s.s.FileExchangeRateProvider Reloading exchange rates from file currency.xml
    [junit4] 2> 1225332 INFO (coreLoadExecutor-4575-thread-1) [ ] o.a.s.c.ConfigSetProperties Did not find ConfigSet properties, assuming default properties: Can't find resource 'configsetprops.json' in classpath or '/x1/jenkins/jenkins-slave/workspace/Lucene-Solr-Tests-5.5-Java7/solr/core/src/test-files/solr/collection1'
    [junit4] 2> 1225332 INFO (coreLoadExecutor-4575-thread-1) [ ] o.a.s.c.CoreContainer Creating SolrCore 'collection1' using configuration from instancedir /x1/jenkins/jenkins-slave/workspace/Lucene-Solr-Tests-5.5-Java7/solr/core/src/test-files/solr/collection1
    [junit4] 2> 1225332 INFO (coreLoadExecutor-4575-thread-1) [ x:collection1] o.a.s.c.SolrCore org.apache.solr.core.MockFSDirectoryFactory
    [junit4] 2> 1225332 INFO (coreLoadExecutor-4575-thread-1) [ x:collection1] o.a.s.c.SolrCore [[collection1] ] Opening new SolrCore at [/x1/jenkins/jenkins-slave/workspace/Lucene-Solr-Tests-5.5-Java7/solr/core/src/test-files/solr/collection1], dataDir=[/x1/jenkins/jenkins-slave/workspace/Lucene-Solr-Tests-5.5-Java7/solr/build/solr-core/test/J2/temp/solr.core.TestArbitraryIndexDir_5799954607B011D0-001/init-core-data-001/]
    [junit4] 2> 1225332 INFO (coreLoadExecutor-4575-thread-1) [ x:collection1] o.a.s.c.JmxMonitoredMap JMX monitoring is enabled. Adding Solr mbeans to JMX Server: com.sun.jmx.mbeanserver.JmxMBeanServer@3dfa7867
    [junit4] 2> 1225333 INFO (coreLoadExecutor-4575-thread-1) [ x:collection1] o.a.s.c.CachingDirectoryFactory return new directory for /x1/jenkins/jenkins-slave/workspace/Lucene-Solr-Tests-5.5-Java7/solr/build/solr-core/test/J2/temp/solr.core.TestArbitraryIndexDir_5799954607B011D0-001/init-core-data-001
    [junit4] 2> 1225333 INFO (coreLoadExecutor-4575-thread-1) [ x:collection1] o.a.s.c.SolrCore New index directory detected: old=null new=/x1/jenkins/jenkins-slave/workspace/Lucene-Solr-Tests-5.5-Java7/solr/build/solr-core/test/J2/temp/solr.core.TestArbitraryIndexDir_5799954607B011D0-001/init-core-data-001/index/
    [junit4] 2> 1225333 WARN (coreLoadExecutor-4575-thread-1) [ x:collection1] o.a.s.c.SolrCore [collection1] Solr index directory '/x1/jenkins/jenkins-slave/workspace/Lucene-Solr-Tests-5.5-Java7/solr/build/solr-core/test/J2/temp/solr.core.TestArbitraryIndexDir_5799954607B011D0-001/init-core-data-001/index' doesn't exist. Creating new index...
    [junit4] 2> 1225333 INFO (coreLoadExecutor-4575-thread-1) [ x:collection1] o.a.s.c.CachingDirectoryFactory return new directory for /x1/jenkins/jenkins-slave/workspace/Lucene-Solr-Tests-5.5-Java7/solr/build/solr-core/test/J2/temp/solr.core.TestArbitraryIndexDir_5799954607B011D0-001/init-core-data-001/index
    [junit4] 2> 1225333 INFO (coreLoadExecutor-4575-thread-1) [ x:collection1] o.a.s.u.RandomMergePolicy RandomMergePolicy wrapping class org.apache.lucene.index.TieredMergePolicy: [TieredMergePolicy: maxMergeAtOnce=28, maxMergeAtOnceExplicit=40, maxMergedSegmentMB=91.390625, floorSegmentMB=1.7265625, forceMergeDeletesPctAllowed=21.238277539794755, segmentsPerTier=19.0, maxCFSSegmentSizeMB=8.796093022207999E12, noCFSRatio=0.0
    [junit4] 2> 1225337 INFO (coreLoadExecutor-4575-thread-1) [ x:collection1] o.a.s.c.SolrDeletionPolicy SolrDeletionPolicy.onCommit: commits: num=1
    [junit4] 2> commit{dir=MockDirectoryWrapper(SimpleFSDirectory@/x1/jenkins/jenkins-slave/workspace/Lucene-Solr-Tests-5.5-Java7/solr/build/solr-core/test/J2/temp/solr.core.TestArbitraryIndexDir_5799954607B011D0-001/init-core-data-001/index lockFactory=org.apache.lucene.store.SingleInstanceLockFactory@4bba1310),segFN=segments_1,generation=1}
    [junit4] 2> 1225337 INFO (coreLoadExecutor-4575-thread-1) [ x:collection1] o.a.s.c.SolrDeletionPolicy newest commit generation = 1
    [junit4] 2> 1225337 INFO (OldIndexDirectoryCleanupThreadForCore-collection1) [ x:collection1] o.a.s.c.SolrCore Looking for old index directories to cleanup for core collection1 in /x1/jenkins/jenkins-slave/workspace/Lucene-Solr-Tests-5.5-Java7/solr/build/solr-core/test/J2/temp/solr.core.TestArbitraryIndexDir_5799954607B011D0-001/init-core-data-001/
    [junit4] 2> 1225340 INFO (coreLoadExecutor-4575-thread-1) [ x:collection1] o.a.s.u.p.UpdateRequestProcessorChain creating updateRequestProcessorChain "dedupe"
    [junit4] 2> 1225340 INFO (coreLoadExecutor-4575-thread-1) [ x:collection1] o.a.s.u.p.UpdateRequestProcessorChain inserting DistributedUpdateProcessorFactory into updateRequestProcessorChain "dedupe"
    [junit4] 2> 1225340 INFO (coreLoadExecutor-4575-thread-1) [ x:collection1] o.a.s.u.p.UpdateRequestProcessorChain creating updateRequestProcessorChain "dedupe-allfields"
    [junit4] 2> 1225340 INFO (coreLoadExecutor-4575-thread-1) [ x:collection1] o.a.s.u.p.UpdateRequestProcessorChain inserting DistributedUpdateProcessorFactory into updateRequestProcessorChain "dedupe-allfields"
    [junit4] 2> 1225340 INFO (coreLoadExecutor-4575-thread-1) [ x:collection1] o.a.s.u.p.UpdateRequestProcessorChain creating updateRequestProcessorChain "stored_sig"
    [junit4] 2> 1225340 INFO (coreLoadExecutor-4575-thread-1) [ x:collection1] o.a.s.u.p.UpdateRequestProcessorChain inserting DistributedUpdateProcessorFactory into updateRequestProcessorChain "stored_sig"
    [junit4] 2> 1225340 INFO (coreLoadExecutor-4575-thread-1) [ x:collection1] o.a.s.u.p.UpdateRequestProcessorChain creating updateRequestProcessorChain "uniq-fields"
    [junit4] 2> 1225340 INFO (coreLoadExecutor-4575-thread-1) [ x:collection1] o.a.s.u.p.UpdateRequestProcessorChain inserting DistributedUpdateProcessorFactory into updateRequestProcessorChain "uniq-fields"
    [junit4] 2> 1225340 INFO (coreLoadExecutor-4575-thread-1) [ x:collection1] o.a.s.u.p.UpdateRequestProcessorChain creating updateRequestProcessorChain "distrib-dup-test-chain-explicit"
    [junit4] 2> 1225340 INFO (coreLoadExecutor-4575-thread-1) [ x:collection1] o.a.s.u.p.UpdateRequestProcessorChain creating updateRequestProcessorChain "distrib-dup-test-chain-implicit"
    [junit4] 2> 1225340 INFO (coreLoadExecutor-4575-thread-1) [ x:collection1] o.a.s.u.p.UpdateRequestProcessorChain inserting DistributedUpdateProcessorFactory into updateRequestProcessorChain "distrib-dup-test-chain-implicit"
    [junit4] 2> 1225340 INFO (coreLoadExecutor-4575-thread-1) [ x:collection1] o.a.s.c.SolrCore no updateRequestProcessorChain defined as default, creating implicit default
    [junit4] 2> 1225342 INFO (coreLoadExecutor-4575-thread-1) [ x:collection1] o.a.s.h.l.XMLLoader xsltCacheLifetimeSeconds=60
    [junit4] 2> 1225343 INFO (coreLoadExecutor-4575-thread-1) [ x:collection1] o.a.s.h.l.XMLLoader xsltCacheLifetimeSeconds=60
    [junit4] 2> 1225344 INFO (coreLoadExecutor-4575-thread-1) [ x:collection1] o.a.s.h.l.XMLLoader xsltCacheLifetimeSeconds=60
    [junit4] 2> 1225345 INFO (coreLoadExecutor-4575-thread-1) [ x:collection1] o.a.s.h.l.XMLLoader xsltCacheLifetimeSeconds=60
    [junit4] 2> 1225347 INFO (coreLoadExecutor-4575-thread-1) [ x:collection1] o.a.s.c.PluginBag requestHandler : 'lazy' created with startup=lazy
    [junit4] 2> 1225349 INFO (coreLoadExecutor-4575-thread-1) [ x:collection1] o.a.s.c.RequestHandlers Registered paths: spellCheckWithWordbreak_Direct,/admin/threads,/admin/file,lazy,/admin/mbeans,spellCheckWithWordbreak,/admin/segments,/debug/dump,tvrh,/terms,/update/json,/get,/update,defaults,/search-facet-invariants,/admin/properties,/admin/ping,/update/csv,mltrh,spellCheckCompRH_Direct,/admin/luke,/mlt,/replication,spellCheckCompRH1,/schema,spellCheckCompRH,/config,dismax,mock,/admin/plugins,/search-facet-def,standard,/update/json/docs,/admin/logging,/admin/system
    [junit4] 2> 1225349 WARN (coreLoadExecutor-4575-thread-1) [ x:collection1] o.a.s.c.SolrCore solrconfig.xml uses deprecated <admin/gettableFiles>, Please update your config to use the ShowFileRequestHandler.
    [junit4] 2> 1225350 INFO (coreLoadExecutor-4575-thread-1) [ x:collection1] o.a.s.c.SolrCore Using default statsCache cache: org.apache.solr.search.stats.LocalStatsCache
    [junit4] 2> 1225350 INFO (coreLoadExecutor-4575-thread-1) [ x:collection1] o.a.s.u.CommitTracker Hard AutoCommit: disabled
    [junit4] 2> 1225350 INFO (coreLoadExecutor-4575-thread-1) [ x:collection1] o.a.s.u.CommitTracker Soft AutoCommit: disabled
    [junit4] 2> 1225350 INFO (coreLoadExecutor-4575-thread-1) [ x:collection1] o.a.s.u.RandomMergePolicy RandomMergePolicy wrapping class org.apache.lucene.index.TieredMergePolicy: [TieredMergePolicy: maxMergeAtOnce=34, maxMergeAtOnceExplicit=33, maxMergedSegmentMB=89.6005859375, floorSegmentMB=0.3505859375, forceMergeDeletesPctAllowed=29.130199494702282, segmentsPerTier=22.0, maxCFSSegmentSizeMB=8.796093022207999E12, noCFSRatio=0.1966680193394046
    [junit4] 2> 1225351 INFO (coreLoadExecutor-4575-thread-1) [ x:collection1] o.a.s.c.SolrDeletionPolicy SolrDeletionPolicy.onInit: commits: num=1
    [junit4] 2> commit{dir=MockDirectoryWrapper(SimpleFSDirectory@/x1/jenkins/jenkins-slave/workspace/Lucene-Solr-Tests-5.5-Java7/solr/build/solr-core/test/J2/temp/solr.core.TestArbitraryIndexDir_5799954607B011D0-001/init-core-data-001/index lockFactory=org.apache.lucene.store.SingleInstanceLockFactory@4bba1310),segFN=segments_1,generation=1}
    [junit4] 2> 1225351 INFO (coreLoadExecutor-4575-thread-1) [ x:collection1] o.a.s.c.SolrDeletionPolicy newest commit generation = 1
    [junit4] 2> 1225351 INFO (coreLoadExecutor-4575-thread-1) [ x:collection1] o.a.s.s.SolrIndexSearcher Opening Searcher@6da040[collection1] main
    [junit4] 2> 1225351 INFO (coreLoadExecutor-4575-thread-1) [ x:collection1] o.a.s.r.RestManager Initializing RestManager with initArgs: {storageIO=org.apache.solr.rest.ManagedResourceStorage$InMemoryStorageIO}
    [junit4] 2> 1225351 INFO (coreLoadExecutor-4575-thread-1) [ x:collection1] o.a.s.r.ManagedResourceStorage Reading _rest_managed.json using InMemoryStorage
    [junit4] 2> 1225351 INFO (coreLoadExecutor-4575-thread-1) [ x:collection1] o.a.s.r.RestManager Initializing 0 registered ManagedResources
    [junit4] 2> 1225351 INFO (coreLoadExecutor-4575-thread-1) [ x:collection1] o.a.s.h.c.SpellCheckComponent Initializing spell checkers
    [junit4] 2> 1225355 INFO (coreLoadExecutor-4575-thread-1) [ x:collection1] o.a.s.s.DirectSolrSpellChecker init: {name=direct,classname=DirectSolrSpellChecker,field=lowerfilt,minQueryLength=3}
    [junit4] 2> 1225373 INFO (coreLoadExecutor-4575-thread-1) [ x:collection1] o.a.s.h.ReplicationHandler Commits will be reserved for 10000
    [junit4] 2> 1225373 INFO (searcherExecutor-4576-thread-1-processing-x:collection1) [ x:collection1] o.a.s.h.c.SpellCheckComponent Loading spell index for spellchecker: default
    [junit4] 2> 1225373 INFO (searcherExecutor-4576-thread-1-processing-x:collection1) [ x:collection1] o.a.s.h.c.SpellCheckComponent Loading spell index for spellchecker: direct
    [junit4] 2> 1225373 INFO (searcherExecutor-4576-thread-1-processing-x:collection1) [ x:collection1] o.a.s.h.c.SpellCheckComponent Loading spell index for spellchecker: wordbreak
    [junit4] 2> 1225373 INFO (searcherExecutor-4576-thread-1-processing-x:collection1) [ x:collection1] o.a.s.h.c.SpellCheckComponent Loading spell index for spellchecker: multipleFields
    [junit4] 2> 1225374 INFO (coreLoadExecutor-4575-thread-1) [ x:collection1] o.a.s.c.CoreContainer registering core: collection1
    [junit4] 2> 1225374 INFO (searcherExecutor-4576-thread-1-processing-x:collection1) [ x:collection1] o.a.s.h.c.SpellCheckComponent Loading spell index for spellchecker: jarowinkler
    [junit4] 2> 1225374 INFO (searcherExecutor-4576-thread-1-processing-x:collection1) [ x:collection1] o.a.s.h.c.SpellCheckComponent Loading spell index for spellchecker: external
    [junit4] 2> 1225374 INFO (searcherExecutor-4576-thread-1-processing-x:collection1) [ x:collection1] o.a.s.h.c.SpellCheckComponent Loading spell index for spellchecker: freq
    [junit4] 2> 1225374 INFO (searcherExecutor-4576-thread-1-processing-x:collection1) [ x:collection1] o.a.s.h.c.SpellCheckComponent Loading spell index for spellchecker: fqcn
    [junit4] 2> 1225374 INFO (TEST-TestArbitraryIndexDir.testLoadNewIndexDir-seed#[5799954607B011D0]) [ ] o.a.s.SolrTestCaseJ4 ####initCore end
    [junit4] 2> 1225375 INFO (searcherExecutor-4576-thread-1-processing-x:collection1) [ x:collection1] o.a.s.h.c.SpellCheckComponent Loading spell index for spellchecker: perDict
    [junit4] 2> 1225375 INFO (searcherExecutor-4576-thread-1-processing-x:collection1) [ x:collection1] o.a.s.c.SolrCore [collection1] Registered new searcher Searcher@6da040[collection1] main{ExitableDirectoryReader(UninvertingDirectoryReader())}
    [junit4] 2> 1225375 INFO (TEST-TestArbitraryIndexDir.testLoadNewIndexDir-seed#[5799954607B011D0]) [ ] o.a.s.u.p.LogUpdateProcessorFactory [collection1] webapp=null path=null params={}{add=[1]} 0 0
    [junit4] 2> 1225390 INFO (TEST-TestArbitraryIndexDir.testLoadNewIndexDir-seed#[5799954607B011D0]) [ ] o.a.s.u.DirectUpdateHandler2 start commit{,optimize=false,openSearcher=true,waitSearcher=true,expungeDeletes=false,softCommit=false,prepareCommit=false}
    [junit4] 2> 1225400 INFO (TEST-TestArbitraryIndexDir.testLoadNewIndexDir-seed#[5799954607B011D0]) [ ] o.a.s.c.SolrDeletionPolicy SolrDeletionPolicy.onCommit: commits: num=2
    [junit4] 2> commit{dir=MockDirectoryWrapper(SimpleFSDirectory@/x1/jenkins/jenkins-slave/workspace/Lucene-Solr-Tests-5.5-Java7/solr/build/solr-core/test/J2/temp/solr.core.TestArbitraryIndexDir_5799954607B011D0-001/init-core-data-001/index lockFactory=org.apache.lucene.store.SingleInstanceLockFactory@4bba1310),segFN=segments_1,generation=1}
    [junit4] 2> commit{dir=MockDirectoryWrapper(SimpleFSDirectory@/x1/jenkins/jenkins-slave/workspace/Lucene-Solr-Tests-5.5-Java7/solr/build/solr-core/test/J2/temp/solr.core.TestArbitraryIndexDir_5799954607B011D0-001/init-core-data-001/index lockFactory=org.apache.lucene.store.SingleInstanceLockFactory@4bba1310),segFN=segments_2,generation=2}
    [junit4] 2> 1225400 INFO (TEST-TestArbitraryIndexDir.testLoadNewIndexDir-seed#[5799954607B011D0]) [ ] o.a.s.c.SolrDeletionPolicy newest commit generation = 2
    [junit4] 2> 1225402 INFO (TEST-TestArbitraryIndexDir.testLoadNewIndexDir-seed#[5799954607B011D0]) [ ] o.a.s.c.SolrCore New index directory detected: old=/x1/jenkins/jenkins-slave/workspace/Lucene-Solr-Tests-5.5-Java7/solr/build/solr-core/test/J2/temp/solr.core.TestArbitraryIndexDir_5799954607B011D0-001/init-core-data-001/index/ new=/x1/jenkins/jenkins-slave/workspace/Lucene-Solr-Tests-5.5-Java7/solr/build/solr-core/test/J2/temp/solr.core.TestArbitraryIndexDir_5799954607B011D0-001/init-core-data-001/index_temp
    [junit4] 2> 1225403 INFO (TEST-TestArbitraryIndexDir.testLoadNewIndexDir-seed#[5799954607B011D0]) [ ] o.a.s.s.SolrIndexSearcher Opening Searcher@7d617ee0[collection1] main
    [junit4] 2> 1225403 INFO (TEST-TestArbitraryIndexDir.testLoadNewIndexDir-seed#[5799954607B011D0]) [ ] o.a.s.u.DirectUpdateHandler2 end_commit_flush
    [junit4] 2> 1225404 INFO (searcherExecutor-4576-thread-1) [ ] o.a.s.c.SolrCore [collection1] Registered new searcher Searcher@7d617ee0[collection1] main{ExitableDirectoryReader(UninvertingDirectoryReader(Uninverting(_0(5.5.2):c1)))}
    [junit4] 2> 1225405 INFO (TEST-TestArbitraryIndexDir.testLoadNewIndexDir-seed#[5799954607B011D0]) [ ] o.a.s.u.p.LogUpdateProcessorFactory [collection1] webapp=null path=null params={}{commit=} 0 14
    [junit4] 2> 1225405 INFO (TEST-TestArbitraryIndexDir.testLoadNewIndexDir-seed#[5799954607B011D0]) [ ] o.a.s.c.SolrResourceLoader new SolrResourceLoader for directory: '/x1/jenkins/jenkins-slave/workspace/Lucene-Solr-Tests-5.5-Java7/solr/core/src/test-files/solr/collection1'
    [junit4] 2> 1225405 INFO (TEST-TestArbitraryIndexDir.testLoadNewIndexDir-seed#[5799954607B011D0]) [ ] o.a.s.c.SolrResourceLoader JNDI not configured for solr (NoInitialContextEx)
    [junit4] 2> 1225405 INFO (TEST-TestArbitraryIndexDir.testLoadNewIndexDir-seed#[5799954607B011D0]) [ ] o.a.s.c.SolrResourceLoader using system property solr.solr.home: /x1/jenkins/jenkins-slave/workspace/Lucene-Solr-Tests-5.5-Java7/solr/core/src/test-files/solr
    [junit4] 2> 1225405 INFO (TEST-TestArbitraryIndexDir.testLoadNewIndexDir-seed#[5799954607B011D0]) [ ] o.a.s.c.SolrResourceLoader Adding 'file:/x1/jenkins/jenkins-slave/workspace/Lucene-Solr-Tests-5.5-Java7/solr/core/src/test-files/solr/collection1/lib/classes/' to classloader
    [junit4] 2> 1225405 INFO (TEST-TestArbitraryIndexDir.testLoadNewIndexDir-seed#[5799954607B011D0]) [ ] o.a.s.c.SolrResourceLoader Adding 'file:/x1/jenkins/jenkins-slave/workspace/Lucene-Solr-Tests-5.5-Java7/solr/core/src/test-files/solr/collection1/lib/README' to classloader
    [junit4] 2> 1225441 INFO (TEST-TestArbitraryIndexDir.testLoadNewIndexDir-seed#[5799954607B011D0]) [ ] o.a.s.c.SolrConfig current version of requestparams : -1
    [junit4] 2> 1225453 INFO (TEST-TestArbitraryIndexDir.testLoadNewIndexDir-seed#[5799954607B011D0]) [ ] o.a.s.c.SolrConfig Using Lucene MatchVersion: 5.5.2
    [junit4] 2> 1225480 INFO (TEST-TestArbitraryIndexDir.testLoadNewIndexDir-seed#[5799954607B011D0]) [ ] o.a.s.c.SolrConfig Loaded SolrConfig: solrconfig.xml
    [junit4] 2> 1225485 INFO (TEST-TestArbitraryIndexDir.testLoadNewIndexDir-seed#[5799954607B011D0]) [ ] o.a.s.s.IndexSchema [collection1] Schema name=test
    [junit4] 2> 1225622 INFO (TEST-TestArbitraryIndexDir.testLoadNewIndexDir-seed#[5799954607B011D0]) [ ] o.a.s.s.IndexSchema default search field in schema is text
    [junit4] 2> 1225623 INFO (TEST-TestArbitraryIndexDir.testLoadNewIndexDir-seed#[5799954607B011D0]) [ ] o.a.s.s.IndexSchema unique key field: id
    [junit4] 2> 1225624 WARN (TEST-TestArbitraryIndexDir.testLoadNewIndexDir-seed#[5799954607B011D0]) [ ] o.a.s.s.IndexSchema Field text is not multivalued and destination for multiple copyFields (2)
    [junit4] 2> 1225627 INFO (TEST-TestArbitraryIndexDir.testLoadNewIndexDir-seed#[5799954607B011D0]) [ ] o.a.s.s.FileExchangeRateProvider Reloading exchange rates from file currency.xml
    [junit4] 2> 1225629 INFO (TEST-TestArbitraryIndexDir.testLoadNewIndexDir-seed#[5799954607B011D0]) [ ] o.a.s.s.FileExchangeRateProvider Reloading exchange rates from file currency.xml
    [junit4] 2> 1225631 INFO (TEST-TestArbitraryIndexDir.testLoadNewIndexDir-seed#[5799954607B011D0]) [ ] o.a.s.c.ConfigSetProperties Did not find ConfigSet properties, assuming default properties: Can't find resource 'configsetprops.json' in classpath or '/x1/jenkins/jenkins-slave/workspace/Lucene-Solr-Tests-5.5-Java7/solr/core/src/test-files/solr/collection1'
    [junit4] 2> 1225631 INFO (TEST-TestArbitraryIndexDir.testLoadNewIndexDir-seed#[5799954607B011D0]) [ ] o.a.s.c.CoreContainer Reloading SolrCore 'collection1' using configuration from instancedir /x1/jenkins/jenkins-slave/workspace/Lucene-Solr-Tests-5.5-Java7/solr/core/src/test-files/solr/collection1
    [junit4] 2> 1225632 INFO (TEST-TestArbitraryIndexDir.testLoadNewIndexDir-seed#[5799954607B011D0]) [ x:collection1] o.a.s.c.SolrCore [[collection1] ] Opening new SolrCore at [/x1/jenkins/jenkins-slave/workspace/Lucene-Solr-Tests-5.5-Java7/solr/core/src/test-files/solr/collection1], dataDir=[/x1/jenkins/jenkins-slave/workspace/Lucene-Solr-Tests-5.5-Java7/solr/build/solr-core/test/J2/temp/solr.core.TestArbitraryIndexDir_5799954607B011D0-001/init-core-data-001/]
    [junit4] 2> 1225632 INFO (TEST-TestArbitraryIndexDir.testLoadNewIndexDir-seed#[5799954607B011D0]) [ x:collection1] o.a.s.c.JmxMonitoredMap JMX monitoring is enabled. Adding Solr mbeans to JMX Server: com.sun.jmx.mbeanserver.JmxMBeanServer@3dfa7867
    [junit4] 2> 1225632 INFO (TEST-TestArbitraryIndexDir.testLoadNewIndexDir-seed#[5799954607B011D0]) [ x:collection1] o.a.s.c.SolrCore New index directory detected: old=null new=/x1/jenkins/jenkins-slave/workspace/Lucene-Solr-Tests-5.5-Java7/solr/build/solr-core/test/J2/temp/solr.core.TestArbitraryIndexDir_5799954607B011D0-001/init-core-data-001/index_temp
    [junit4] 2> 1225633 INFO (OldIndexDirectoryCleanupThreadForCore-collection1) [ x:collection1] o.a.s.c.SolrCore Looking for old index directories to cleanup for core collection1 in /x1/jenkins/jenkins-slave/workspace/Lucene-Solr-Tests-5.5-Java7/solr/build/solr-core/test/J2/temp/solr.core.TestArbitraryIndexDir_5799954607B011D0-001/init-core-data-001/
    [junit4] 2> 1225634 INFO (OldIndexDirectoryCleanupThreadForCore-collection1) [ x:collection1] o.a.s.c.DirectoryFactory Found 1 old index directories to clean-up under /x1/jenkins/jenkins-slave/workspace/Lucene-Solr-Tests-5.5-Java7/solr/build/solr-core/test/J2/temp/solr.core.TestArbitraryIndexDir_5799954607B011D0-001/init-core-data-001/
    [junit4] 2> 1225634 WARN (OldIndexDirectoryCleanupThreadForCore-collection1) [ x:collection1] o.a.s.c.CachingDirectoryFactory Cannot delete directory /x1/jenkins/jenkins-slave/workspace/Lucene-Solr-Tests-5.5-Java7/solr/build/solr-core/test/J2/temp/solr.core.TestArbitraryIndexDir_5799954607B011D0-001/init-core-data-001/index as it is still being referenced in the cache!
    [junit4] 2> 1225634 WARN (OldIndexDirectoryCleanupThreadForCore-collection1) [ x:collection1] o.a.s.c.DirectoryFactory Delete old index directory /x1/jenkins/jenkins-slave/workspace/Lucene-Solr-Tests-5.5-Java7/solr/build/solr-core/test/J2/temp/solr.core.TestArbitraryIndexDir_5799954607B011D0-001/init-core-data-001/index failed.
    [junit4] 2> 1225636 INFO (TEST-TestArbitraryIndexDir.testLoadNewIndexDir-seed#[5799954607B011D0]) [ x:collection1] o.a.s.u.p.UpdateRequestProcessorChain creating updateRequestProcessorChain "dedupe"
    [junit4] 2> 1225636 INFO (TEST-TestArbitraryIndexDir.testLoadNewIndexDir-seed#[5799954607B011D0]) [ x:collection1] o.a.s.u.p.UpdateRequestProcessorChain inserting DistributedUpdateProcessorFactory into updateRequestProcessorChain "dedupe"
    [junit4] 2> 1225636 INFO (TEST-TestArbitraryIndexDir.testLoadNewIndexDir-seed#[5799954607B011D0]) [ x:collection1] o.a.s.u.p.UpdateRequestProcessorChain creating updateRequestProcessorChain "dedupe-allfields"
    [junit4] 2> 1225636 INFO (TEST-TestArbitraryIndexDir.testLoadNewIndexDir-seed#[5799954607B011D0]) [ x:collection1] o.a.s.u.p.UpdateRequestProcessorChain inserting DistributedUpdateProcessorFactory into updateRequestProcessorChain "dedupe-allfields"
    [junit4] 2> 1225636 INFO (TEST-TestArbitraryIndexDir.testLoadNewIndexDir-seed#[5799954607B011D0]) [ x:collection1] o.a.s.u.p.UpdateRequestProcessorChain creating updateRequestProcessorChain "stored_sig"
    [junit4] 2> 1225636 INFO (TEST-TestArbitraryIndexDir.testLoadNewIndexDir-seed#[5799954607B011D0]) [ x:collection1] o.a.s.u.p.UpdateRequestProcessorChain inserting DistributedUpdateProcessorFactory into updateRequestProcessorChain "stored_sig"
    [junit4] 2> 1225636 INFO (TEST-TestArbitraryIndexDir.testLoadNewIndexDir-seed#[5799954607B011D0]) [ x:collection1] o.a.s.u.p.UpdateRequestProcessorChain creating updateRequestProcessorChain "uniq-fields"
    [junit4] 2> 1225636 INFO (TEST-TestArbitraryIndexDir.testLoadNewIndexDir-seed#[5799954607B011D0]) [ x:collection1] o.a.s.u.p.UpdateRequestProcessorChain inserting DistributedUpdateProcessorFactory into updateRequestProcessorChain "uniq-fields"
    [junit4] 2> 1225636 INFO (TEST-TestArbitraryIndexDir.testLoadNewIndexDir-seed#[5799954607B011D0]) [ x:collection1] o.a.s.u.p.UpdateRequestProcessorChain creating updateRequestProcessorChain "distrib-dup-test-chain-explicit"
    [junit4] 2> 1225636 INFO (TEST-TestArbitraryIndexDir.testLoadNewIndexDir-seed#[5799954607B011D0]) [ x:collection1] o.a.s.u.p.UpdateRequestProcessorChain creating updateRequestProcessorChain "distrib-dup-test-chain-implicit"
    [junit4] 2> 1225637 INFO (TEST-TestArbitraryIndexDir.testLoadNewIndexDir-seed#[5799954607B011D0]) [ x:collection1] o.a.s.u.p.UpdateRequestProcessorChain inserting DistributedUpdateProcessorFactory into updateRequestProcessorChain "distrib-dup-test-chain-implicit"
    [junit4] 2> 1225637 INFO (TEST-TestArbitraryIndexDir.testLoadNewIndexDir-seed#[5799954607B011D0]) [ x:collection1] o.a.s.c.SolrCore no updateRequestProcessorChain defined as default, creating implicit default
    [junit4] 2> 1225638 INFO (TEST-TestArbitraryIndexDir.testLoadNewIndexDir-seed#[5799954607B011D0]) [ x:collection1] o.a.s.h.l.XMLLoader xsltCacheLifetimeSeconds=60
    [junit4] 2> 1225639 INFO (TEST-TestArbitraryIndexDir.testLoadNewIndexDir-seed#[5799954607B011D0]) [ x:collection1] o.a.s.h.l.XMLLoader xsltCacheLifetimeSeconds=60
    [junit4] 2> 1225640 INFO (TEST-TestArbitraryIndexDir.testLoadNewIndexDir-seed#[5799954607B011D0]) [ x:collection1] o.a.s.h.l.XMLLoader xsltCacheLifetimeSeconds=60
    [junit4] 2> 1225641 INFO (TEST-TestArbitraryIndexDir.testLoadNewIndexDir-seed#[5799954607B011D0]) [ x:collection1] o.a.s.h.l.XMLLoader xsltCacheLifetimeSeconds=60
    [junit4] 2> 1225642 INFO (TEST-TestArbitraryIndexDir.testLoadNewIndexDir-seed#[5799954607B011D0]) [ x:collection1] o.a.s.c.CachingDirectoryFactory return new directory for /x1/jenkins/jenkins-slave/workspace/Lucene-Solr-Tests-5.5-Java7/solr/build/solr-core/test/J2/temp/solr.core.TestArbitraryIndexDir_5799954607B011D0-001/init-core-data-001/index_temp
    [junit4] 2> 1225645 INFO (TEST-TestArbitraryIndexDir.testLoadNewIndexDir-seed#[5799954607B011D0]) [ x:collection1] o.a.s.c.PluginBag requestHandler : 'lazy' created with startup=lazy
    [junit4] 2> 1225646 INFO (TEST-TestArbitraryIndexDir.testLoadNewIndexDir-seed#[5799954607B011D0]) [ x:collection1] o.a.s.c.RequestHandlers Registered paths: spellCheckWithWordbreak_Direct,/admin/threads,/admin/file,lazy,/admin/mbeans,spellCheckWithWordbreak,/admin/segments,/debug/dump,tvrh,/terms,/update/json,/get,/update,defaults,/search-facet-invariants,/admin/properties,/admin/ping,/update/csv,mltrh,spellCheckCompRH_Direct,/admin/luke,/mlt,/replication,spellCheckCompRH1,/schema,spellCheckCompRH,/config,dismax,mock,/admin/plugins,/search-facet-def,standard,/update/json/docs,/admin/logging,/admin/system
    [junit4] 2> 1225647 WARN (TEST-TestArbitraryIndexDir.testLoadNewIndexDir-seed#[5799954607B011D0]) [ x:collection1] o.a.s.c.SolrCore solrconfig.xml uses deprecated <admin/gettableFiles>, Please update your config to use the ShowFileRequestHandler.
    [junit4] 2> 1225648 INFO (TEST-TestArbitraryIndexDir.testLoadNewIndexDir-seed#[5799954607B011D0]) [ x:collection1] o.a.s.c.SolrCore Using default statsCache cache: org.apache.solr.search.stats.LocalStatsCache
    [junit4] 2> 1225648 INFO (TEST-TestArbitraryIndexDir.testLoadNewIndexDir-seed#[5799954607B011D0]) [ x:collection1] o.a.s.u.CommitTracker Hard AutoCommit: disabled
    [junit4] 2> 1225648 INFO (TEST-TestArbitraryIndexDir.testLoadNewIndexDir-seed#[5799954607B011D0]) [ x:collection1] o.a.s.u.CommitTracker Soft AutoCommit: disabled
    [junit4] 2> 1225649 INFO (TEST-TestArbitraryIndexDir.testLoadNewIndexDir-seed#[5799954607B011D0]) [ x:collection1] o.a.s.s.SolrIndexSearcher Opening Searcher@4bec1f59[collection1] main
    [junit4] 2> 1225649 INFO (TEST-TestArbitraryIndexDir.testLoadNewIndexDir-seed#[5799954607B011D0]) [ x:collection1] o.a.s.r.RestManager Initializing RestManager with initArgs: {storageIO=org.apache.solr.rest.ManagedResourceStorage$InMemoryStorageIO}
    [junit4] 2> 1225649 INFO (TEST-TestArbitraryIndexDir.testLoadNewIndexDir-seed#[5799954607B011D0]) [ x:collection1] o.a.s.r.ManagedResourceStorage Reading _rest_managed.json using InMemoryStorage
    [junit4] 2> 1225649 INFO (TEST-TestArbitraryIndexDir.testLoadNewIndexDir-seed#[5799954607B011D0]) [ x:collection1] o.a.s.r.RestManager Initializing 0 registered ManagedResources
    [junit4] 2> 1225649 INFO (TEST-TestArbitraryIndexDir.testLoadNewIndexDir-seed#[5799954607B011D0]) [ x:collection1] o.a.s.h.c.SpellCheckComponent Initializing spell checkers
    [junit4] 2> 1225650 INFO (TEST-TestArbitraryIndexDir.testLoadNewIndexDir-seed#[5799954607B011D0]) [ x:collection1] o.a.s.s.DirectSolrSpellChecker init: {name=direct,classname=DirectSolrSpellChecker,field=lowerfilt,minQueryLength=3}
    [junit4] 2> 1225652 INFO (TEST-TestArbitraryIndexDir.testLoadNewIndexDir-seed#[5799954607B011D0]) [ x:collection1] o.a.s.h.ReplicationHandler Commits will be reserved for 10000
    [junit4] 2> 1225652 INFO (searcherExecutor-4580-thread-1-processing-x:collection1) [ x:collection1] o.a.s.h.c.SpellCheckComponent Loading spell index for spellchecker: default
    [junit4] 2> 1225652 INFO (searcherExecutor-4580-thread-1-processing-x:collection1) [ x:collection1] o.a.s.h.c.SpellCheckComponent Loading spell index for spellchecker: direct
    [junit4] 2> 1225652 INFO (searcherExecutor-4580-thread-1-processing-x:collection1) [ x:collection1] o.a.s.h.c.SpellCheckComponent Loading spell index for spellchecker: wordbreak
    [junit4] 2> 1225652 INFO (searcherExecutor-4580-thread-1-processing-x:collection1) [ x:collection1] o.a.s.h.c.SpellCheckComponent Loading spell index for spellchecker: multipleFields
    [junit4] 2> 1225653 INFO (TEST-TestArbitraryIndexDir.testLoadNewIndexDir-seed#[5799954607B011D0]) [ x:collection1] o.a.s.u.DefaultSolrCoreState Closing old IndexWriter... core=collection1
    [junit4] 2> 1225653 INFO (searcherExecutor-4580-thread-1-processing-x:collection1) [ x:collection1] o.a.s.h.c.SpellCheckComponent Loading spell index for spellchecker: jarowinkler
    [junit4] 2> 1225653 INFO (TEST-TestArbitraryIndexDir.testLoadNewIndexDir-seed#[5799954607B011D0]) [ x:collection1] o.a.s.u.RandomMergePolicy RandomMergePolicy wrapping class org.apache.lucene.index.TieredMergePolicy: [TieredMergePolicy: maxMergeAtOnce=7, maxMergeAtOnceExplicit=2, maxMergedSegmentMB=51.109375, floorSegmentMB=0.306640625, forceMergeDeletesPctAllowed=20.63039621710685, segmentsPerTier=17.0, maxCFSSegmentSizeMB=8.796093022207999E12, noCFSRatio=0.22643420078837054
    [junit4] 2> 1225653 INFO (searcherExecutor-4580-thread-1-processing-x:collection1) [ x:collection1] o.a.s.h.c.SpellCheckComponent Loading spell index for spellchecker: external
    [junit4] 2> 1225654 INFO (searcherExecutor-4580-thread-1-processing-x:collection1) [ x:collection1] o.a.s.h.c.SpellCheckComponent Loading spell index for spellchecker: freq
    [junit4] 2> 1225654 INFO (searcherExecutor-4580-thread-1-processing-x:collection1) [ x:collection1] o.a.s.h.c.SpellCheckComponent Loading spell index for spellchecker: fqcn
    [junit4] 2> 1225655 INFO (TEST-TestArbitraryIndexDir.testLoadNewIndexDir-seed#[5799954607B011D0]) [ x:collection1] o.a.s.c.SolrDeletionPolicy SolrDeletionPolicy.onInit: commits: num=1
    [junit4] 2> commit{dir=MockDirectoryWrapper(MMapDirectory@/x1/jenkins/jenkins-slave/workspace/Lucene-Solr-Tests-5.5-Java7/solr/build/solr-core/test/J2/temp/solr.core.TestArbitraryIndexDir_5799954607B011D0-001/init-core-data-001/index_temp lockFactory=org.apache.lucene.store.SingleInstanceLockFactory@29baa900),segFN=segments_1,generation=1}
    [junit4] 2> 1225655 INFO (TEST-TestArbitraryIndexDir.testLoadNewIndexDir-seed#[5799954607B011D0]) [ x:collection1] o.a.s.c.SolrDeletionPolicy newest commit generation = 1
    [junit4] 2> 1225655 INFO (searcherExecutor-4580-thread-1-processing-x:collection1) [ x:collection1] o.a.s.h.c.SpellCheckComponent Loading spell index for spellchecker: perDict
    [junit4] 2> 1225655 INFO (TEST-TestArbitraryIndexDir.testLoadNewIndexDir-seed#[5799954607B011D0]) [ x:collection1] o.a.s.u.DefaultSolrCoreState New IndexWriter is ready to be used.
    [junit4] 2> 1225656 INFO (searcherExecutor-4580-thread-1-processing-x:collection1) [ x:collection1] o.a.s.c.SolrCore [collection1] Registered new searcher Searcher@4bec1f59[collection1] main{ExitableDirectoryReader(UninvertingDirectoryReader(Uninverting(_0(5.5.2):c1)))}
    [junit4] 2> 1225658 INFO (TEST-TestArbitraryIndexDir.testLoadNewIndexDir-seed#[5799954607B011D0]) [ x:collection1] o.a.s.s.SolrIndexSearcher Opening Searcher@4ff20ee5[collection1] main
    [junit4] 2> 1225658 INFO (TEST-TestArbitraryIndexDir.testLoadNewIndexDir-seed#[5799954607B011D0]) [ x:collection1] o.a.s.c.CoreContainer replacing core: collection1
    [junit4] 2> 1225658 INFO (TEST-TestArbitraryIndexDir.testLoadNewIndexDir-seed#[5799954607B011D0]) [ x:collection1] o.a.s.c.SolrCore [collection1] CLOSING SolrCore org.apache.solr.core.SolrCore@43758358
    [junit4] 2> 1225658 INFO (TEST-TestArbitraryIndexDir.testLoadNewIndexDir-seed#[5799954607B011D0]) [ x:collection1] o.a.s.u.DirectUpdateHandler2 closing DirectUpdateHandler2{commits=1,autocommits=0,soft autocommits=0,optimizes=0,rollbacks=0,expungeDeletes=0,docsPending=0,adds=0,deletesById=0,deletesByQuery=0,errors=0,cumulative_adds=1,cumulative_deletesById=0,cumulative_deletesByQuery=0,cumulative_errors=0}
    [junit4] 2> 1225658 INFO (TEST-TestArbitraryIndexDir.testLoadNewIndexDir-seed#[5799954607B011D0]) [ x:collection1] o.a.s.c.SolrCore [collection1] Closing main searcher on request.
    [junit4] 2> 1225663 INFO (TEST-TestArbitraryIndexDir.testLoadNewIndexDir-seed#[5799954607B011D0]) [ x:collection1] o.a.s.c.S.Request [collection1] webapp=null path=null params={rows=20&start=0&q=id:2&qt=standard&version=2.2} hits=0 status=0 QTime=0
    [junit4] 2> 1225664 ERROR (TEST-TestArbitraryIndexDir.testLoadNewIndexDir-seed#[5799954607B011D0]) [ x:collection1] o.a.s.SolrTestCaseJ4 REQUEST FAILED: xpath=*[count(//doc)=1]
    [junit4] 2> xml response was: <?xml version="1.0" encoding="UTF-8"?>
    [junit4] 2> <response>
    [junit4] 2> <lst name="responseHeader"><int name="status">0</int><int name="QTime">0</int></lst><result name="response" numFound="0" start="0"></result>
    [junit4] 2> </response>
    [junit4] 2>
    [junit4] 2> request was:rows=20&start=0&q=id:2&qt=standard&version=2.2
    [junit4] 2> 1225664 ERROR (TEST-TestArbitraryIndexDir.testLoadNewIndexDir-seed#[5799954607B011D0]) [ x:collection1] o.a.s.SolrTestCaseJ4 REQUEST FAILED: rows=20&start=0&q=id:2&qt=standard&version=2.2:java.lang.RuntimeException: REQUEST FAILED: xpath=*[count(//doc)=1]
    [junit4] 2> xml response was: <?xml version="1.0" encoding="UTF-8"?>
    [junit4] 2> <response>
    [junit4] 2> <lst name="responseHeader"><int name="status">0</int><int name="QTime">0</int></lst><result name="response" numFound="0" start="0"></result>
    [junit4] 2> </response>
    [junit4] 2>
    [junit4] 2> request was:rows=20&start=0&q=id:2&qt=standard&version=2.2
    [junit4] 2> at org.apache.solr.SolrTestCaseJ4.assertQ(SolrTestCaseJ4.java:747)
    [junit4] 2> at org.apache.solr.core.TestArbitraryIndexDir.testLoadNewIndexDir(TestArbitraryIndexDir.java:107)
    [junit4] 2> at sun.reflect.NativeMethodAccessorImpl.invoke0(Native Method)
    [junit4] 2> at sun.reflect.NativeMethodAccessorImpl.invoke(NativeMethodAccessorImpl.java:57)
    [junit4] 2> at sun.reflect.DelegatingMethodAccessorImpl.invoke(DelegatingMethodAccessorImpl.java:43)
    [junit4] 2> at java.lang.reflect.Method.invoke(Method.java:606)
    [junit4] 2> at com.carrotsearch.randomizedtesting.RandomizedRunner.invoke(RandomizedRunner.java:1764)
    [junit4] 2> at com.carrotsearch.randomizedtesting.RandomizedRunner$8.evaluate(RandomizedRunner.java:871)
    [junit4] 2> at com.carrotsearch.randomizedtesting.RandomizedRunner$9.evaluate(RandomizedRunner.java:907)
    [junit4] 2> at com.carrotsearch.randomizedtesting.RandomizedRunner$10.evaluate(RandomizedRunner.java:921)
    [junit4] 2> at com.carrotsearch.randomizedtesting.rules.SystemPropertiesRestoreRule$1.evaluate(SystemPropertiesRestoreRule.java:57)
    [junit4] 2> at com.carrotsearch.randomizedtesting.rules.SystemPropertiesRestoreRule$1.evaluate(SystemPropertiesRestoreRule.java:57)
    [junit4] 2> at org.apache.lucene.util.TestRuleSetupTeardownChained$1.evaluate(TestRuleSetupTeardownChained.java:49)
    [junit4] 2> at org.apache.lucene.util.AbstractBeforeAfterRule$1.evaluate(AbstractBeforeAfterRule.java:45)
    [junit4] 2> at org.apache.lucene.util.TestRuleThreadAndTestName$1.evaluate(TestRuleThreadAndTestName.java:48)
    [junit4] 2> at org.apache.lucene.util.TestRuleIgnoreAfterMaxFailures$1.evaluate(TestRuleIgnoreAfterMaxFailures.java:64)
    [junit4] 2> at org.apache.lucene.util.TestRuleMarkFailure$1.evaluate(TestRuleMarkFailure.java:47)
    [junit4] 2> at com.carrotsearch.randomizedtesting.rules.StatementAdapter.evaluate(StatementAdapter.java:36)
    [junit4] 2> at com.carrotsearch.randomizedtesting.ThreadLeakControl$StatementRunner.run(ThreadLeakControl.java:367)
    [junit4] 2> at com.carrotsearch.randomizedtesting.ThreadLeakControl.forkTimeoutingTask(ThreadLeakControl.java:809)
    [junit4] 2> at com.carrotsearch.randomizedtesting.ThreadLeakControl$3.evaluate(ThreadLeakControl.java:460)
    [junit4] 2> at com.carrotsearch.randomizedtesting.RandomizedRunner.runSingleTest(RandomizedRunner.java:880)
    [junit4] 2> at com.carrotsearch.randomizedtesting.RandomizedRunner$5.evaluate(RandomizedRunner.java:781)
    [junit4] 2> at com.carrotsearch.randomizedtesting.RandomizedRunner$6.evaluate(RandomizedRunner.java:816)
    [junit4] 2> at com.carrotsearch.randomizedtesting.RandomizedRunner$7.evaluate(RandomizedRunner.java:827)
    [junit4] 2> at com.carrotsearch.randomizedtesting.rules.StatementAdapter.evaluate(StatementAdapter.java:36)
    [junit4] 2> at com.carrotsearch.randomizedtesting.rules.SystemPropertiesRestoreRule$1.evaluate(SystemPropertiesRestoreRule.java:57)
    [junit4] 2> at org.apache.lucene.util.AbstractBeforeAfterRule$1.evaluate(AbstractBeforeAfterRule.java:45)
    [junit4] 2> at com.carrotsearch.randomizedtesting.rules.StatementAdapter.evaluate(StatementAdapter.java:36)
    [junit4] 2> at org.apache.lucene.util.TestRuleStoreClassName$1.evaluate(TestRuleStoreClassName.java:41)
    [junit4] 2> at com.carrotsearch.randomizedtesting.rules.NoShadowingOrOverridesOnMethodsRule$1.evaluate(NoShadowingOrOverridesOnMethodsRule.java:40)
    [junit4] 2> at com.carrotsearch.randomizedtesting.rules.NoShadowingOrOverridesOnMethodsRule$1.evaluate(NoShadowingOrOverridesOnMethodsRule.java:40)
    [junit4] 2> at com.carrotsearch.randomizedtesting.rules.StatementAdapter.evaluate(StatementAdapter.java:36)
    [junit4] 2> at com.carrotsearch.randomizedtesting.rules.StatementAdapter.evaluate(StatementAdapter.java:36)
    [junit4] 2> at com.carrotsearch.randomizedtesting.rules.StatementAdapter.evaluate(StatementAdapter.java:36)
    [junit4] 2> at org.apache.lucene.util.TestRuleAssertionsRequired$1.evaluate(TestRuleAssertionsRequired.java:53)
    [junit4] 2> at org.apache.lucene.util.TestRuleMarkFailure$1.evaluate(TestRuleMarkFailure.java:47)
    [junit4] 2> at org.apache.lucene.util.TestRuleIgnoreAfterMaxFailures$1.evaluate(TestRuleIgnoreAfterMaxFailures.java:64)
    [junit4] 2> at org.apache.lucene.util.TestRuleIgnoreTestSuites$1.evaluate(TestRuleIgnoreTestSuites.java:54)
    [junit4] 2> at com.carrotsearch.randomizedtesting.rules.StatementAdapter.evaluate(StatementAdapter.java:36)
    [junit4] 2> at com.carrotsearch.randomizedtesting.ThreadLeakControl$StatementRunner.run(ThreadLeakControl.java:367)
    [junit4] 2> at java.lang.Thread.run(Thread.java:745)
    [junit4] 2>
    [junit4] 2> 1225665 INFO (TEST-TestArbitraryIndexDir.testLoadNewIndexDir-seed#[5799954607B011D0]) [ x:collection1] o.a.s.SolrTestCaseJ4 ###Ending testLoadNewIndexDir
    [junit4] 2> NOTE: reproduce with: ant test -Dtestcase=TestArbitraryIndexDir -Dtests.method=testLoadNewIndexDir -Dtests.seed=5799954607B011D0 -Dtests.multiplier=2 -Dtests.slow=true -Dtests.locale=sr-CS -Dtests.timezone=PNT -Dtests.asserts=true -Dtests.file.encoding=US-ASCII
    [junit4] ERROR 0.92s J2 | TestArbitraryIndexDir.testLoadNewIndexDir <<<
    [junit4] > Throwable #1: java.lang.RuntimeException: Exception during query
    [junit4] > at __randomizedtesting.SeedInfo.seed([5799954607B011D0:BEC32E7E99298178]:0)
    [junit4] > at org.apache.solr.SolrTestCaseJ4.assertQ(SolrTestCaseJ4.java:754)
    [junit4] > at org.apache.solr.core.TestArbitraryIndexDir.testLoadNewIndexDir(TestArbitraryIndexDir.java:107)
    [junit4] > at java.lang.Thread.run(Thread.java:745)
    [junit4] > Caused by: java.lang.RuntimeException: REQUEST FAILED: xpath=*[count(//doc)=1]
    [junit4] > xml response was: <?xml version="1.0" encoding="UTF-8"?>
    [junit4] > <response>
    [junit4] > <lst name="responseHeader"><int name="status">0</int><int name="QTime">0</int></lst><result name="response" numFound="0" start="0"></result>
    [junit4] > </response>
    [junit4] > request was:rows=20&start=0&q=id:2&qt=standard&version=2.2
    [junit4] > at org.apache.solr.SolrTestCaseJ4.assertQ(SolrTestCaseJ4.java:747)
    [junit4] > ... 41 more
    [junit4] 2> 1225666 INFO (searcherExecutor-4580-thread-1-processing-x:collection1) [ x:collection1] o.a.s.c.SolrCore [collection1] Registered new searcher Searcher@4ff20ee5[collection1] main{ExitableDirectoryReader(UninvertingDirectoryReader(Uninverting(_0(5.5.2):c1)))}
    [junit4] 2> 1225666 INFO (SUITE-TestArbitraryIndexDir-seed#[5799954607B011D0]-worker) [ x:collection1] o.a.s.SolrTestCaseJ4 ###deleteCore
    [junit4] 2> 1225666 INFO (SUITE-TestArbitraryIndexDir-seed#[5799954607B011D0]-worker) [ x:collection1] o.a.s.c.CoreContainer Shutting down CoreContainer instance=1870981544
    [junit4] 2> 1225667 INFO (coreCloseExecutor-4584-thread-1-processing-x:collection1) [ x:collection1] o.a.s.c.SolrCore [collection1] CLOSING SolrCore org.apache.solr.core.SolrCore@75462c54
    [junit4] 2> 1225667 INFO (coreCloseExecutor-4584-thread-1-processing-x:collection1) [ x:collection1] o.a.s.u.DirectUpdateHandler2 closing DirectUpdateHandler2{commits=0,autocommits=0,soft autocommits=0,optimizes=0,rollbacks=0,expungeDeletes=0,docsPending=0,adds=0,deletesById=0,deletesByQuery=0,errors=0,cumulative_adds=0,cumulative_deletesById=0,cumulative_deletesByQuery=0,cumulative_errors=0}
    [junit4] 2> 1225667 INFO (coreCloseExecutor-4584-thread-1-processing-x:collection1) [ x:collection1] o.a.s.u.SolrCoreState Closing SolrCoreState
    [junit4] 2> 1225667 INFO (coreCloseExecutor-4584-thread-1-processing-x:collection1) [ x:collection1] o.a.s.u.DefaultSolrCoreState SolrCoreState ref count has reached 0 - closing IndexWriter
    [junit4] 2> 1225667 INFO (coreCloseExecutor-4584-thread-1-processing-x:collection1) [ x:collection1] o.a.s.u.DefaultSolrCoreState closing IndexWriter with IndexWriterCloser
    [junit4] 2> 1225668 INFO (coreCloseExecutor-4584-thread-1-processing-x:collection1) [ x:collection1] o.a.s.c.SolrCore [collection1] Closing main searcher on request.
    [junit4] 2> 1225676 INFO (coreCloseExecutor-4584-thread-1-processing-x:collection1) [ x:collection1] o.a.s.c.CachingDirectoryFactory Closing MockFSDirectoryFactory - 3 directories currently being tracked
    [junit4] 2> 1225676 INFO (coreCloseExecutor-4584-thread-1-processing-x:collection1) [ x:collection1] o.a.s.c.CachingDirectoryFactory looking to close /x1/jenkins/jenkins-slave/workspace/Lucene-Solr-Tests-5.5-Java7/solr/build/solr-core/test/J2/temp/solr.core.TestArbitraryIndexDir_5799954607B011D0-001/init-core-data-001 [CachedDir<<refCount=0;path=/x1/jenkins/jenkins-slave/workspace/Lucene-Solr-Tests-5.5-Java7/solr/build/solr-core/test/J2/temp/solr.core.TestArbitraryIndexDir_5799954607B011D0-001/init-core-data-001;done=false>>]
    [junit4] 2> 1225676 INFO (coreCloseExecutor-4584-thread-1-processing-x:collection1) [ x:collection1] o.a.s.c.CachingDirectoryFactory Closing directory: /x1/jenkins/jenkins-slave/workspace/Lucene-Solr-Tests-5.5-Java7/solr/build/solr-core/test/J2/temp/solr.core.TestArbitraryIndexDir_5799954607B011D0-001/init-core-data-001
    [junit4] 2> 1225677 INFO (coreCloseExecutor-4584-thread-1-processing-x:collection1) [ x:collection1] o.a.s.c.CachingDirectoryFactory looking to close /x1/jenkins/jenkins-slave/workspace/Lucene-Solr-Tests-5.5-Java7/solr/build/solr-core/test/J2/temp/solr.core.TestArbitraryIndexDir_5799954607B011D0-001/init-core-data-001/index [CachedDir<<refCount=0;path=/x1/jenkins/jenkins-slave/workspace/Lucene-Solr-Tests-5.5-Java7/solr/build/solr-core/test/J2/temp/solr.core.TestArbitraryIndexDir_5799954607B011D0-001/init-core-data-001/index;done=false>>]
    [junit4] 2> 1225677 INFO (coreCloseExecutor-4584-thread-1-processing-x:collection1) [ x:collection1] o.a.s.c.CachingDirectoryFactory Closing directory: /x1/jenkins/jenkins-slave/workspace/Lucene-Solr-Tests-5.5-Java7/solr/build/solr-core/test/J2/temp/solr.core.TestArbitraryIndexDir_5799954607B011D0-001/init-core-data-001/index
    [junit4] 2> 1225679 INFO (coreCloseExecutor-4584-thread-1-processing-x:collection1) [ x:collection1] o.a.s.c.CachingDirectoryFactory looking to close /x1/jenkins/jenkins-slave/workspace/Lucene-Solr-Tests-5.5-Java7/solr/build/solr-core/test/J2/temp/solr.core.TestArbitraryIndexDir_5799954607B011D0-001/init-core-data-001/index_temp [CachedDir<<refCount=0;path=/x1/jenkins/jenkins-slave/workspace/Lucene-Solr-Tests-5.5-Java7/solr/build/solr-core/test/J2/temp/solr.core.TestArbitraryIndexDir_5799954607B011D0-001/init-core-data-001/index_temp;done=false>>]
    [junit4] 2> 1225679 INFO (coreCloseExecutor-4584-thread-1-processing-x:collection1) [ x:collection1] o.a.s.c.CachingDirectoryFactory Closing directory: /x1/jenkins/jenkins-slave/workspace/Lucene-Solr-Tests-5.5-Java7/solr/build/solr-core/test/J2/temp/solr.core.TestArbitraryIndexDir_5799954607B011D0-001/init-core-data-001/index_temp
    [junit4] 2> NOTE: leaving temporary files on disk at: /x1/jenkins/jenkins-slave/workspace/Lucene-Solr-Tests-5.5-Java7/solr/build/solr-core/test/J2/temp/solr.core.TestArbitraryIndexDir_5799954607B011D0-001
    [junit4] 2> NOTE: test params are: codec=DummyCompressingStoredFields(storedFieldsFormat=CompressingStoredFieldsFormat(compressionMode=DUMMY, chunkSize=7, maxDocsPerChunk=3, blockSize=10), termVectorsFormat=CompressingTermVectorsFormat(compressionMode=DUMMY, chunkSize=7, blockSize=10)), sim=RandomSimilarity(queryNorm=false,coord=no): {}, locale=sr-CS, timezone=PNT
    [junit4] 2> NOTE: Linux 3.13.0-85-generic amd64/Oracle Corporation 1.7.0_80 (64-bit)/cpus=4,threads=1,free=335626568,total=459800576
    [junit4] 2> NOTE: All tests run in this JVM: [DirectUpdateHandlerTest, TestStressReorder, TestCoreDiscovery, TestReloadAndDeleteDocs, RecoveryZkTest, TestCloudInspectUtil, HdfsWriteToMultipleCollectionsTest, CollectionsAPIAsyncDistributedZkTest, DirectUpdateHandlerOptimizeTest, TestDynamicFieldResource, FullHLLTest, TestUseDocValuesAsStored, TestSuggestSpellingConverter, TestExactStatsCache, SolrCoreCheckLockOnStartupTest, TermVectorComponentDistributedTest, UnloadDistributedZkTest, HdfsBasicDistributedZk2Test, TestFileDictionaryLookup, DistributedFacetPivotSmallTest, TestInitQParser, UpdateParamsTest, QueryParsingTest, TestSolrCLIRunExample, TestReqParamsAPI, TestMiniSolrCloudClusterSSL, CoreMergeIndexesAdminHandlerTest, AnalyticsQueryTest, RecoveryAfterSoftCommitTest, CoreAdminHandlerTest, SegmentsInfoRequestHandlerTest, TestIndexingPerformance, TestGroupingSearch, BigEndianAscendingWordSerializerTest, TestCopyFieldCollectionResource, AutoCommitTest, BadComponentTest, TestSearchPerf, ScriptEngineTest, TestSolrQueryParser, DebugComponentTest, DateRangeFieldTest, WrapperMergePolicyFactoryTest, PKIAuthenticationIntegrationTest, NoCacheHeaderTest, TestBlobHandler, TestTrackingShardHandlerFactory, AddSchemaFieldsUpdateProcessorFactoryTest, SuggesterWFSTTest, XmlUpdateRequestHandlerTest, TestRecovery, TestDefaultStatsCache, TestMiniSolrCloudCluster, ShowFileRequestHandlerTest, DistributedQueryComponentOptimizationTest, TestSolrDeletionPolicy1, SimpleMLTQParserTest, SimpleFacetsTest, BinaryUpdateRequestHandlerTest, ExitableDirectoryReaderTest, TestFastWriter, DocExpirationUpdateProcessorFactoryTest, SharedFSAutoReplicaFailoverUtilsTest, ClusterStateTest, SpatialRPTFieldTypeTest, CircularListTest, TestRestManager, FieldMutatingUpdateProcessorTest, TestManagedSynonymFilterFactory, DateMathParserTest, ZkStateReaderTest, TestSortingResponseWriter, TestSmileRequest, ConjunctionSolrSpellCheckerTest, OverseerTest, TestReloadDeadlock, TestMacros, TestSolrDynamicMBean, TestSolrIndexConfig, TestExtendedDismaxParser, TestCustomSort, TestStressRecovery, DistributedQueueTest, TestIndexSearcher, SolrTestCaseJ4Test, RankQueryTest, BlockJoinFacetRandomTest, TestConfigSetsAPI, LeaderInitiatedRecoveryOnShardRestartTest, DeleteReplicaTest, TestElisionMultitermQuery, TestPHPSerializedResponseWriter, TestSolrJ, BasicDistributedZk2Test, CollectionsAPIDistributedZkTest, LeaderElectionTest, ZkSolrClientTest, TestDistributedSearch, SpellCheckComponentTest, QueryElevationComponentTest, BadIndexSchemaTest, BasicFunctionalityTest, HighlighterTest, CurrencyFieldOpenExchangeTest, SolrIndexSplitterTest, SolrRequestParserTest, SuggesterTSTTest, SuggesterTest, TestStressLucene, TestCSVLoader, PolyFieldTest, WordBreakSolrSpellCheckerTest, SchemaVersionSpecificBehaviorTest, QueryEqualityTest, StatelessScriptUpdateProcessorFactoryTest, DocValuesMultiTest, DistanceFunctionTest, SolrInfoMBeanTest, CacheHeaderTest, LukeRequestHandlerTest, DisMaxRequestHandlerTest, TestWriterPerf, DirectSolrSpellCheckerTest, TestReversedWildcardFilterFactory, DocumentAnalysisRequestHandlerTest, PrimitiveFieldTypeTest, DocumentBuilderTest, MoreLikeThisHandlerTest, TestArbitraryIndexDir]
    [junit4] Completed [343/573 (1!)] on J2 in 0.97s, 1 test, 1 error <<< FAILURES!

[...truncated 732 lines...]
BUILD FAILED
/x1/jenkins/jenkins-slave/workspace/Lucene-Solr-Tests-5.5-Java7/build.xml:750: The following error occurred while executing this line:
/x1/jenkins/jenkins-slave/workspace/Lucene-Solr-Tests-5.5-Java7/build.xml:694: The following error occurred while executing this line:
/x1/jenkins/jenkins-slave/workspace/Lucene-Solr-Tests-5.5-Java7/build.xml:59: The following error occurred while executing this line:
/x1/jenkins/jenkins-slave/workspace/Lucene-Solr-Tests-5.5-Java7/solr/build.xml:233: The following error occurred while executing this line:
/x1/jenkins/jenkins-slave/workspace/Lucene-Solr-Tests-5.5-Java7/solr/common-build.xml:534: The following error occurred while executing this line:
/x1/jenkins/jenkins-slave/workspace/Lucene-Solr-Tests-5.5-Java7/lucene/common-build.xml:1477: The following error occurred while executing this line:
/x1/jenkins/jenkins-slave/workspace/Lucene-Solr-Tests-5.5-Java7/lucene/common-build.xml:1033: There were test failures: 573 suites (7 ignored), 2319 tests, 1 error, 55 ignored (39 assumptions) [seed: 5799954607B011D0]

Total time: 64 minutes 49 seconds
Build step 'Invoke Ant' marked build as failure
Archiving artifacts
Recording test results
Email was triggered for: Failure - Any
Sending email for trigger: Failure - Any

Search Discussions

Related Discussions

Discussion Navigation
viewthread | post
posts ‹ prev | 1 of 1 | next ›
Discussion Overview
groupdev @
categorieslucene
postedJun 18, '16 at 11:37a
activeJun 18, '16 at 11:37a
posts1
users1
websitelucene.apache.org

1 user in discussion

Apache Jenkins Server: 1 post

People

Translate

site design / logo © 2019 Grokbase