Grokbase Groups Lucene dev June 2016
FAQ
Build: http://jenkins.thetaphi.de/job/Lucene-Solr-6.1-Windows/5/
Java: 64bit/jdk1.8.0_92 -XX:-UseCompressedOops -XX:+UseG1GC

2 tests failed.
FAILED: junit.framework.TestSuite.org.apache.solr.schema.TestManagedSchemaAPI

Error Message:
ObjectTracker found 8 object(s) that were not released!!! [TransactionLog, MockDirectoryWrapper, MockDirectoryWrapper, MockDirectoryWrapper, MDCAwareThreadPoolExecutor, MDCAwareThreadPoolExecutor, TransactionLog, MockDirectoryWrapper]

Stack Trace:
java.lang.AssertionError: ObjectTracker found 8 object(s) that were not released!!! [TransactionLog, MockDirectoryWrapper, MockDirectoryWrapper, MockDirectoryWrapper, MDCAwareThreadPoolExecutor, MDCAwareThreadPoolExecutor, TransactionLog, MockDirectoryWrapper]
  at __randomizedtesting.SeedInfo.seed([9450F0C458A7F7C9]:0)
  at org.junit.Assert.fail(Assert.java:93)
  at org.junit.Assert.assertTrue(Assert.java:43)
  at org.junit.Assert.assertNull(Assert.java:551)
  at org.apache.solr.SolrTestCaseJ4.teardownTestCases(SolrTestCaseJ4.java:257)
  at sun.reflect.GeneratedMethodAccessor42.invoke(Unknown Source)
  at sun.reflect.DelegatingMethodAccessorImpl.invoke(DelegatingMethodAccessorImpl.java:43)
  at java.lang.reflect.Method.invoke(Method.java:498)
  at com.carrotsearch.randomizedtesting.RandomizedRunner.invoke(RandomizedRunner.java:1764)
  at com.carrotsearch.randomizedtesting.RandomizedRunner$7.evaluate(RandomizedRunner.java:834)
  at com.carrotsearch.randomizedtesting.rules.StatementAdapter.evaluate(StatementAdapter.java:36)
  at com.carrotsearch.randomizedtesting.rules.SystemPropertiesRestoreRule$1.evaluate(SystemPropertiesRestoreRule.java:57)
  at org.apache.lucene.util.AbstractBeforeAfterRule$1.evaluate(AbstractBeforeAfterRule.java:45)
  at com.carrotsearch.randomizedtesting.rules.StatementAdapter.evaluate(StatementAdapter.java:36)
  at org.apache.lucene.util.TestRuleStoreClassName$1.evaluate(TestRuleStoreClassName.java:41)
  at com.carrotsearch.randomizedtesting.rules.NoShadowingOrOverridesOnMethodsRule$1.evaluate(NoShadowingOrOverridesOnMethodsRule.java:40)
  at com.carrotsearch.randomizedtesting.rules.NoShadowingOrOverridesOnMethodsRule$1.evaluate(NoShadowingOrOverridesOnMethodsRule.java:40)
  at com.carrotsearch.randomizedtesting.rules.StatementAdapter.evaluate(StatementAdapter.java:36)
  at com.carrotsearch.randomizedtesting.rules.StatementAdapter.evaluate(StatementAdapter.java:36)
  at com.carrotsearch.randomizedtesting.rules.StatementAdapter.evaluate(StatementAdapter.java:36)
  at org.apache.lucene.util.TestRuleAssertionsRequired$1.evaluate(TestRuleAssertionsRequired.java:53)
  at org.apache.lucene.util.TestRuleMarkFailure$1.evaluate(TestRuleMarkFailure.java:47)
  at org.apache.lucene.util.TestRuleIgnoreAfterMaxFailures$1.evaluate(TestRuleIgnoreAfterMaxFailures.java:64)
  at org.apache.lucene.util.TestRuleIgnoreTestSuites$1.evaluate(TestRuleIgnoreTestSuites.java:54)
  at com.carrotsearch.randomizedtesting.rules.StatementAdapter.evaluate(StatementAdapter.java:36)
  at com.carrotsearch.randomizedtesting.ThreadLeakControl$StatementRunner.run(ThreadLeakControl.java:367)
  at java.lang.Thread.run(Thread.java:745)


FAILED: junit.framework.TestSuite.org.apache.solr.schema.TestManagedSchemaAPI

Error Message:
Could not remove the following files (in the order of attempts): C:\Users\jenkins\workspace\Lucene-Solr-6.1-Windows\solr\build\solr-core\test\J0\temp\solr.schema.TestManagedSchemaAPI_9450F0C458A7F7C9-001\tempDir-001\node1\testschemaapi_shard1_replica1\data\tlog\tlog.0000000000000000001: java.nio.file.FileSystemException: C:\Users\jenkins\workspace\Lucene-Solr-6.1-Windows\solr\build\solr-core\test\J0\temp\solr.schema.TestManagedSchemaAPI_9450F0C458A7F7C9-001\tempDir-001\node1\testschemaapi_shard1_replica1\data\tlog\tlog.0000000000000000001: The process cannot access the file because it is being used by another process. C:\Users\jenkins\workspace\Lucene-Solr-6.1-Windows\solr\build\solr-core\test\J0\temp\solr.schema.TestManagedSchemaAPI_9450F0C458A7F7C9-001\tempDir-001\node1\testschemaapi_shard1_replica1\data\tlog: java.nio.file.DirectoryNotEmptyException: C:\Users\jenkins\workspace\Lucene-Solr-6.1-Windows\solr\build\solr-core\test\J0\temp\solr.schema.TestManagedSchemaAPI_9450F0C458A7F7C9-001\tempDir-001\node1\testschemaapi_shard1_replica1\data\tlog C:\Users\jenkins\workspace\Lucene-Solr-6.1-Windows\solr\build\solr-core\test\J0\temp\solr.schema.TestManagedSchemaAPI_9450F0C458A7F7C9-001\tempDir-001\node1\testschemaapi_shard1_replica1\data: java.nio.file.DirectoryNotEmptyException: C:\Users\jenkins\workspace\Lucene-Solr-6.1-Windows\solr\build\solr-core\test\J0\temp\solr.schema.TestManagedSchemaAPI_9450F0C458A7F7C9-001\tempDir-001\node1\testschemaapi_shard1_replica1\data C:\Users\jenkins\workspace\Lucene-Solr-6.1-Windows\solr\build\solr-core\test\J0\temp\solr.schema.TestManagedSchemaAPI_9450F0C458A7F7C9-001\tempDir-001\node1\testschemaapi_shard1_replica1: java.nio.file.DirectoryNotEmptyException: C:\Users\jenkins\workspace\Lucene-Solr-6.1-Windows\solr\build\solr-core\test\J0\temp\solr.schema.TestManagedSchemaAPI_9450F0C458A7F7C9-001\tempDir-001\node1\testschemaapi_shard1_replica1 C:\Users\jenkins\workspace\Lucene-Solr-6.1-Windows\solr\build\solr-core\test\J0\temp\solr.schema.TestManagedSchemaAPI_9450F0C458A7F7C9-001\tempDir-001\node1: java.nio.file.DirectoryNotEmptyException: C:\Users\jenkins\workspace\Lucene-Solr-6.1-Windows\solr\build\solr-core\test\J0\temp\solr.schema.TestManagedSchemaAPI_9450F0C458A7F7C9-001\tempDir-001\node1 C:\Users\jenkins\workspace\Lucene-Solr-6.1-Windows\solr\build\solr-core\test\J0\temp\solr.schema.TestManagedSchemaAPI_9450F0C458A7F7C9-001\tempDir-001: java.nio.file.DirectoryNotEmptyException: C:\Users\jenkins\workspace\Lucene-Solr-6.1-Windows\solr\build\solr-core\test\J0\temp\solr.schema.TestManagedSchemaAPI_9450F0C458A7F7C9-001\tempDir-001

Stack Trace:
java.io.IOException: Could not remove the following files (in the order of attempts):
    C:\Users\jenkins\workspace\Lucene-Solr-6.1-Windows\solr\build\solr-core\test\J0\temp\solr.schema.TestManagedSchemaAPI_9450F0C458A7F7C9-001\tempDir-001\node1\testschemaapi_shard1_replica1\data\tlog\tlog.0000000000000000001: java.nio.file.FileSystemException: C:\Users\jenkins\workspace\Lucene-Solr-6.1-Windows\solr\build\solr-core\test\J0\temp\solr.schema.TestManagedSchemaAPI_9450F0C458A7F7C9-001\tempDir-001\node1\testschemaapi_shard1_replica1\data\tlog\tlog.0000000000000000001: The process cannot access the file because it is being used by another process.

    C:\Users\jenkins\workspace\Lucene-Solr-6.1-Windows\solr\build\solr-core\test\J0\temp\solr.schema.TestManagedSchemaAPI_9450F0C458A7F7C9-001\tempDir-001\node1\testschemaapi_shard1_replica1\data\tlog: java.nio.file.DirectoryNotEmptyException: C:\Users\jenkins\workspace\Lucene-Solr-6.1-Windows\solr\build\solr-core\test\J0\temp\solr.schema.TestManagedSchemaAPI_9450F0C458A7F7C9-001\tempDir-001\node1\testschemaapi_shard1_replica1\data\tlog
    C:\Users\jenkins\workspace\Lucene-Solr-6.1-Windows\solr\build\solr-core\test\J0\temp\solr.schema.TestManagedSchemaAPI_9450F0C458A7F7C9-001\tempDir-001\node1\testschemaapi_shard1_replica1\data: java.nio.file.DirectoryNotEmptyException: C:\Users\jenkins\workspace\Lucene-Solr-6.1-Windows\solr\build\solr-core\test\J0\temp\solr.schema.TestManagedSchemaAPI_9450F0C458A7F7C9-001\tempDir-001\node1\testschemaapi_shard1_replica1\data
    C:\Users\jenkins\workspace\Lucene-Solr-6.1-Windows\solr\build\solr-core\test\J0\temp\solr.schema.TestManagedSchemaAPI_9450F0C458A7F7C9-001\tempDir-001\node1\testschemaapi_shard1_replica1: java.nio.file.DirectoryNotEmptyException: C:\Users\jenkins\workspace\Lucene-Solr-6.1-Windows\solr\build\solr-core\test\J0\temp\solr.schema.TestManagedSchemaAPI_9450F0C458A7F7C9-001\tempDir-001\node1\testschemaapi_shard1_replica1
    C:\Users\jenkins\workspace\Lucene-Solr-6.1-Windows\solr\build\solr-core\test\J0\temp\solr.schema.TestManagedSchemaAPI_9450F0C458A7F7C9-001\tempDir-001\node1: java.nio.file.DirectoryNotEmptyException: C:\Users\jenkins\workspace\Lucene-Solr-6.1-Windows\solr\build\solr-core\test\J0\temp\solr.schema.TestManagedSchemaAPI_9450F0C458A7F7C9-001\tempDir-001\node1
    C:\Users\jenkins\workspace\Lucene-Solr-6.1-Windows\solr\build\solr-core\test\J0\temp\solr.schema.TestManagedSchemaAPI_9450F0C458A7F7C9-001\tempDir-001: java.nio.file.DirectoryNotEmptyException: C:\Users\jenkins\workspace\Lucene-Solr-6.1-Windows\solr\build\solr-core\test\J0\temp\solr.schema.TestManagedSchemaAPI_9450F0C458A7F7C9-001\tempDir-001

  at org.apache.lucene.util.IOUtils.rm(IOUtils.java:323)
  at org.apache.lucene.util.TestRuleTemporaryFilesCleanup.afterAlways(TestRuleTemporaryFilesCleanup.java:216)
  at com.carrotsearch.randomizedtesting.rules.TestRuleAdapter$1.afterAlways(TestRuleAdapter.java:31)
  at com.carrotsearch.randomizedtesting.rules.StatementAdapter.evaluate(StatementAdapter.java:43)
  at com.carrotsearch.randomizedtesting.rules.StatementAdapter.evaluate(StatementAdapter.java:36)
  at org.apache.lucene.util.TestRuleAssertionsRequired$1.evaluate(TestRuleAssertionsRequired.java:53)
  at org.apache.lucene.util.TestRuleMarkFailure$1.evaluate(TestRuleMarkFailure.java:47)
  at org.apache.lucene.util.TestRuleIgnoreAfterMaxFailures$1.evaluate(TestRuleIgnoreAfterMaxFailures.java:64)
  at org.apache.lucene.util.TestRuleIgnoreTestSuites$1.evaluate(TestRuleIgnoreTestSuites.java:54)
  at com.carrotsearch.randomizedtesting.rules.StatementAdapter.evaluate(StatementAdapter.java:36)
  at com.carrotsearch.randomizedtesting.ThreadLeakControl$StatementRunner.run(ThreadLeakControl.java:367)
  at java.lang.Thread.run(Thread.java:745)




Build Log:
[...truncated 12349 lines...]
    [junit4] Suite: org.apache.solr.schema.TestManagedSchemaAPI
    [junit4] 2> Creating dataDir: C:\Users\jenkins\workspace\Lucene-Solr-6.1-Windows\solr\build\solr-core\test\J0\temp\solr.schema.TestManagedSchemaAPI_9450F0C458A7F7C9-001\init-core-data-001
    [junit4] 2> 3008691 INFO (SUITE-TestManagedSchemaAPI-seed#[9450F0C458A7F7C9]-worker) [ ] o.a.s.SolrTestCaseJ4 Randomized ssl (true) and clientAuth (false) via: @org.apache.solr.util.RandomizeSSL(reason=, value=NaN, ssl=NaN, clientAuth=NaN)
    [junit4] 2> 3008696 INFO (SUITE-TestManagedSchemaAPI-seed#[9450F0C458A7F7C9]-worker) [ ] o.a.s.c.ZkTestServer STARTING ZK TEST SERVER
    [junit4] 2> 3008697 INFO (Thread-7639) [ ] o.a.s.c.ZkTestServer client port:0.0.0.0/0.0.0.0:0
    [junit4] 2> 3008697 INFO (Thread-7639) [ ] o.a.s.c.ZkTestServer Starting server
    [junit4] 2> 3008797 INFO (SUITE-TestManagedSchemaAPI-seed#[9450F0C458A7F7C9]-worker) [ ] o.a.s.c.ZkTestServer start zk server on port:52233
    [junit4] 2> 3008797 INFO (SUITE-TestManagedSchemaAPI-seed#[9450F0C458A7F7C9]-worker) [ ] o.a.s.c.c.SolrZkClient Using default ZkCredentialsProvider
    [junit4] 2> 3008798 INFO (SUITE-TestManagedSchemaAPI-seed#[9450F0C458A7F7C9]-worker) [ ] o.a.s.c.c.ConnectionManager Waiting for client to connect to ZooKeeper
    [junit4] 2> 3008806 INFO (zkCallback-9779-thread-1) [ ] o.a.s.c.c.ConnectionManager Watcher org.apache.solr.common.cloud.ConnectionManager@4ac4da name:ZooKeeperConnection Watcher:127.0.0.1:52233 got event WatchedEvent state:SyncConnected type:None path:null path:null type:None
    [junit4] 2> 3008806 INFO (SUITE-TestManagedSchemaAPI-seed#[9450F0C458A7F7C9]-worker) [ ] o.a.s.c.c.ConnectionManager Client is connected to ZooKeeper
    [junit4] 2> 3008806 INFO (SUITE-TestManagedSchemaAPI-seed#[9450F0C458A7F7C9]-worker) [ ] o.a.s.c.c.SolrZkClient Using default ZkACLProvider
    [junit4] 2> 3008806 INFO (SUITE-TestManagedSchemaAPI-seed#[9450F0C458A7F7C9]-worker) [ ] o.a.s.c.c.SolrZkClient makePath: /solr/solr.xml
    [junit4] 2> 3008812 INFO (SUITE-TestManagedSchemaAPI-seed#[9450F0C458A7F7C9]-worker) [ ] o.a.s.c.c.SolrZkClient makePath: /solr/clusterprops.json
    [junit4] 2> 3008850 INFO (jetty-launcher-9778-thread-1) [ ] o.e.j.s.Server jetty-9.3.8.v20160314
    [junit4] 2> 3008850 INFO (jetty-launcher-9778-thread-1) [ ] o.e.j.s.h.ContextHandler Started o.e.j.s.ServletContextHandler@76de0610{/solr,null,AVAILABLE}
    [junit4] 2> 3008856 INFO (jetty-launcher-9778-thread-2) [ ] o.e.j.s.Server jetty-9.3.8.v20160314
    [junit4] 2> 3008858 INFO (jetty-launcher-9778-thread-1) [ ] o.e.j.s.ServerConnector Started ServerConnector@61159e8{SSL,[ssl, http/1.1]}{127.0.0.1:52237}
    [junit4] 2> 3008858 INFO (jetty-launcher-9778-thread-1) [ ] o.e.j.s.Server Started @3013580ms
    [junit4] 2> 3008858 INFO (jetty-launcher-9778-thread-1) [ ] o.a.s.c.s.e.JettySolrRunner Jetty properties: {hostContext=/solr, hostPort=52237}
    [junit4] 2> 3008859 INFO (jetty-launcher-9778-thread-2) [ ] o.e.j.s.h.ContextHandler Started o.e.j.s.ServletContextHandler@30cbf2a1{/solr,null,AVAILABLE}
    [junit4] 2> 3008859 INFO (jetty-launcher-9778-thread-1) [ ] o.a.s.s.SolrDispatchFilter SolrDispatchFilter.init(): sun.misc.Launcher$AppClassLoader@73d16e93
    [junit4] 2> 3008859 INFO (jetty-launcher-9778-thread-1) [ ] o.a.s.c.SolrResourceLoader new SolrResourceLoader for directory: 'C:\Users\jenkins\workspace\Lucene-Solr-6.1-Windows\solr\build\solr-core\test\J0\temp\solr.schema.TestManagedSchemaAPI_9450F0C458A7F7C9-001\tempDir-001\node1'
    [junit4] 2> 3008859 INFO (jetty-launcher-9778-thread-1) [ ] o.a.s.c.SolrResourceLoader JNDI not configured for solr (NoInitialContextEx)
    [junit4] 2> 3008859 INFO (jetty-launcher-9778-thread-1) [ ] o.a.s.c.SolrResourceLoader solr home defaulted to 'solr/' (could not find system property or JNDI)
    [junit4] 2> 3008860 INFO (jetty-launcher-9778-thread-1) [ ] o.a.s.c.c.SolrZkClient Using default ZkCredentialsProvider
    [junit4] 2> 3008861 INFO (jetty-launcher-9778-thread-1) [ ] o.a.s.c.c.ConnectionManager Waiting for client to connect to ZooKeeper
    [junit4] 2> 3008862 INFO (jetty-launcher-9778-thread-2) [ ] o.e.j.s.ServerConnector Started ServerConnector@526d1694{SSL,[ssl, http/1.1]}{127.0.0.1:52240}
    [junit4] 2> 3008862 INFO (jetty-launcher-9778-thread-2) [ ] o.e.j.s.Server Started @3013584ms
    [junit4] 2> 3008862 INFO (jetty-launcher-9778-thread-2) [ ] o.a.s.c.s.e.JettySolrRunner Jetty properties: {hostContext=/solr, hostPort=52240}
    [junit4] 2> 3008862 INFO (jetty-launcher-9778-thread-2) [ ] o.a.s.s.SolrDispatchFilter SolrDispatchFilter.init(): sun.misc.Launcher$AppClassLoader@73d16e93
    [junit4] 2> 3008862 INFO (jetty-launcher-9778-thread-2) [ ] o.a.s.c.SolrResourceLoader new SolrResourceLoader for directory: 'C:\Users\jenkins\workspace\Lucene-Solr-6.1-Windows\solr\build\solr-core\test\J0\temp\solr.schema.TestManagedSchemaAPI_9450F0C458A7F7C9-001\tempDir-001\node2'
    [junit4] 2> 3008862 INFO (jetty-launcher-9778-thread-2) [ ] o.a.s.c.SolrResourceLoader JNDI not configured for solr (NoInitialContextEx)
    [junit4] 2> 3008864 INFO (jetty-launcher-9778-thread-2) [ ] o.a.s.c.SolrResourceLoader solr home defaulted to 'solr/' (could not find system property or JNDI)
    [junit4] 2> 3008906 INFO (jetty-launcher-9778-thread-2) [ ] o.a.s.c.c.SolrZkClient Using default ZkCredentialsProvider
    [junit4] 2> 3008910 INFO (jetty-launcher-9778-thread-2) [ ] o.a.s.c.c.ConnectionManager Waiting for client to connect to ZooKeeper
    [junit4] 2> 3008911 INFO (zkCallback-9780-thread-1) [ ] o.a.s.c.c.ConnectionManager Watcher org.apache.solr.common.cloud.ConnectionManager@35ccad3e name:ZooKeeperConnection Watcher:127.0.0.1:52233/solr got event WatchedEvent state:SyncConnected type:None path:null path:null type:None
    [junit4] 2> 3008911 INFO (jetty-launcher-9778-thread-1) [ ] o.a.s.c.c.ConnectionManager Client is connected to ZooKeeper
    [junit4] 2> 3008911 INFO (jetty-launcher-9778-thread-1) [ ] o.a.s.c.c.SolrZkClient Using default ZkACLProvider
    [junit4] 2> 3008912 INFO (jetty-launcher-9778-thread-1) [ ] o.a.s.s.SolrDispatchFilter solr.xml found in ZooKeeper. Loading...
    [junit4] 2> 3008914 INFO (zkCallback-9781-thread-1) [ ] o.a.s.c.c.ConnectionManager Watcher org.apache.solr.common.cloud.ConnectionManager@40225205 name:ZooKeeperConnection Watcher:127.0.0.1:52233/solr got event WatchedEvent state:SyncConnected type:None path:null path:null type:None
    [junit4] 2> 3008914 INFO (jetty-launcher-9778-thread-2) [ ] o.a.s.c.c.ConnectionManager Client is connected to ZooKeeper
    [junit4] 2> 3008914 INFO (jetty-launcher-9778-thread-2) [ ] o.a.s.c.c.SolrZkClient Using default ZkACLProvider
    [junit4] 2> 3008915 INFO (jetty-launcher-9778-thread-2) [ ] o.a.s.s.SolrDispatchFilter solr.xml found in ZooKeeper. Loading...
    [junit4] 2> 3008935 WARN (NIOServerCxn.Factory:0.0.0.0/0.0.0.0:0) [ ] o.a.z.s.NIOServerCnxn caught end of stream exception
    [junit4] 2> EndOfStreamException: Unable to read additional data from client sessionid 0x15540445d160001, likely client has closed socket
    [junit4] 2> at org.apache.zookeeper.server.NIOServerCnxn.doIO(NIOServerCnxn.java:228)
    [junit4] 2> at org.apache.zookeeper.server.NIOServerCnxnFactory.run(NIOServerCnxnFactory.java:208)
    [junit4] 2> at java.lang.Thread.run(Thread.java:745)
    [junit4] 2> 3008938 INFO (jetty-launcher-9778-thread-1) [ ] o.a.s.c.CorePropertiesLocator Config-defined core root directory: C:\Users\jenkins\workspace\Lucene-Solr-6.1-Windows\solr\build\solr-core\test\J0\temp\solr.schema.TestManagedSchemaAPI_9450F0C458A7F7C9-001\tempDir-001\node1\.
    [junit4] 2> 3008938 INFO (jetty-launcher-9778-thread-1) [ ] o.a.s.c.CoreContainer New CoreContainer 1011293975
    [junit4] 2> 3008938 INFO (jetty-launcher-9778-thread-1) [ ] o.a.s.c.CoreContainer Loading cores into CoreContainer [instanceDir=C:\Users\jenkins\workspace\Lucene-Solr-6.1-Windows\solr\build\solr-core\test\J0\temp\solr.schema.TestManagedSchemaAPI_9450F0C458A7F7C9-001\tempDir-001\node1]
    [junit4] 2> 3008939 INFO (jetty-launcher-9778-thread-2) [ ] o.a.s.c.CorePropertiesLocator Config-defined core root directory: C:\Users\jenkins\workspace\Lucene-Solr-6.1-Windows\solr\build\solr-core\test\J0\temp\solr.schema.TestManagedSchemaAPI_9450F0C458A7F7C9-001\tempDir-001\node2\.
    [junit4] 2> 3008939 WARN (jetty-launcher-9778-thread-1) [ ] o.a.s.c.CoreContainer Couldn't add files from C:\Users\jenkins\workspace\Lucene-Solr-6.1-Windows\solr\build\solr-core\test\J0\temp\solr.schema.TestManagedSchemaAPI_9450F0C458A7F7C9-001\tempDir-001\node1\lib to classpath: C:\Users\jenkins\workspace\Lucene-Solr-6.1-Windows\solr\build\solr-core\test\J0\temp\solr.schema.TestManagedSchemaAPI_9450F0C458A7F7C9-001\tempDir-001\node1\lib
    [junit4] 2> 3008939 INFO (jetty-launcher-9778-thread-1) [ ] o.a.s.h.c.HttpShardHandlerFactory created with socketTimeout : 90000,urlScheme : https,connTimeout : 15000,maxConnectionsPerHost : 20,maxConnections : 10000,corePoolSize : 0,maximumPoolSize : 2147483647,maxThreadIdleTime : 5,sizeOfQueue : -1,fairnessPolicy : false,useRetries : false,
    [junit4] 2> 3008939 INFO (jetty-launcher-9778-thread-2) [ ] o.a.s.c.CoreContainer New CoreContainer 1018038645
    [junit4] 2> 3008940 INFO (jetty-launcher-9778-thread-2) [ ] o.a.s.c.CoreContainer Loading cores into CoreContainer [instanceDir=C:\Users\jenkins\workspace\Lucene-Solr-6.1-Windows\solr\build\solr-core\test\J0\temp\solr.schema.TestManagedSchemaAPI_9450F0C458A7F7C9-001\tempDir-001\node2]
    [junit4] 2> 3008941 WARN (jetty-launcher-9778-thread-2) [ ] o.a.s.c.CoreContainer Couldn't add files from C:\Users\jenkins\workspace\Lucene-Solr-6.1-Windows\solr\build\solr-core\test\J0\temp\solr.schema.TestManagedSchemaAPI_9450F0C458A7F7C9-001\tempDir-001\node2\lib to classpath: C:\Users\jenkins\workspace\Lucene-Solr-6.1-Windows\solr\build\solr-core\test\J0\temp\solr.schema.TestManagedSchemaAPI_9450F0C458A7F7C9-001\tempDir-001\node2\lib
    [junit4] 2> 3008941 INFO (jetty-launcher-9778-thread-2) [ ] o.a.s.h.c.HttpShardHandlerFactory created with socketTimeout : 90000,urlScheme : https,connTimeout : 15000,maxConnectionsPerHost : 20,maxConnections : 10000,corePoolSize : 0,maximumPoolSize : 2147483647,maxThreadIdleTime : 5,sizeOfQueue : -1,fairnessPolicy : false,useRetries : false,
    [junit4] 2> 3008946 INFO (jetty-launcher-9778-thread-1) [ ] o.a.s.u.UpdateShardHandler Creating UpdateShardHandler HTTP client with params: socketTimeout=340000&connTimeout=45000&retry=true
    [junit4] 2> 3008946 INFO (jetty-launcher-9778-thread-2) [ ] o.a.s.u.UpdateShardHandler Creating UpdateShardHandler HTTP client with params: socketTimeout=340000&connTimeout=45000&retry=true
    [junit4] 2> 3008948 INFO (jetty-launcher-9778-thread-2) [ ] o.a.s.l.LogWatcher SLF4J impl is org.slf4j.impl.Log4jLoggerFactory
    [junit4] 2> 3008948 INFO (jetty-launcher-9778-thread-1) [ ] o.a.s.l.LogWatcher SLF4J impl is org.slf4j.impl.Log4jLoggerFactory
    [junit4] 2> 3008948 INFO (jetty-launcher-9778-thread-2) [ ] o.a.s.l.LogWatcher Registering Log Listener [Log4j (org.slf4j.impl.Log4jLoggerFactory)]
    [junit4] 2> 3008948 INFO (jetty-launcher-9778-thread-1) [ ] o.a.s.l.LogWatcher Registering Log Listener [Log4j (org.slf4j.impl.Log4jLoggerFactory)]
    [junit4] 2> 3008948 INFO (jetty-launcher-9778-thread-1) [ ] o.a.s.c.ZkContainer Zookeeper client=127.0.0.1:52233/solr
    [junit4] 2> 3008948 INFO (jetty-launcher-9778-thread-2) [ ] o.a.s.c.ZkContainer Zookeeper client=127.0.0.1:52233/solr
    [junit4] 2> 3008948 INFO (jetty-launcher-9778-thread-1) [ ] o.a.s.c.ZkController zkHost includes chroot
    [junit4] 2> 3008948 INFO (jetty-launcher-9778-thread-2) [ ] o.a.s.c.ZkController zkHost includes chroot
    [junit4] 2> 3008948 INFO (jetty-launcher-9778-thread-1) [ ] o.a.s.c.c.SolrZkClient Using default ZkCredentialsProvider
    [junit4] 2> 3008949 INFO (jetty-launcher-9778-thread-2) [ ] o.a.s.c.c.SolrZkClient Using default ZkCredentialsProvider
    [junit4] 2> 3008950 INFO (jetty-launcher-9778-thread-2) [ ] o.a.s.c.c.ConnectionManager Waiting for client to connect to ZooKeeper
    [junit4] 2> 3008950 INFO (jetty-launcher-9778-thread-1) [ ] o.a.s.c.c.ConnectionManager Waiting for client to connect to ZooKeeper
    [junit4] 2> 3008955 INFO (zkCallback-9787-thread-1) [ ] o.a.s.c.c.ConnectionManager Watcher org.apache.solr.common.cloud.ConnectionManager@6d7d836f name:ZooKeeperConnection Watcher:127.0.0.1:52233 got event WatchedEvent state:SyncConnected type:None path:null path:null type:None
    [junit4] 2> 3008955 INFO (zkCallback-9786-thread-1) [ ] o.a.s.c.c.ConnectionManager Watcher org.apache.solr.common.cloud.ConnectionManager@56e57c7a name:ZooKeeperConnection Watcher:127.0.0.1:52233 got event WatchedEvent state:SyncConnected type:None path:null path:null type:None
    [junit4] 2> 3008956 INFO (jetty-launcher-9778-thread-1) [ ] o.a.s.c.c.ConnectionManager Client is connected to ZooKeeper
    [junit4] 2> 3008956 INFO (jetty-launcher-9778-thread-1) [ ] o.a.s.c.c.SolrZkClient Using default ZkACLProvider
    [junit4] 2> 3008956 INFO (jetty-launcher-9778-thread-2) [ ] o.a.s.c.c.ConnectionManager Client is connected to ZooKeeper
    [junit4] 2> 3008956 INFO (jetty-launcher-9778-thread-2) [ ] o.a.s.c.c.SolrZkClient Using default ZkACLProvider
    [junit4] 2> 3008959 INFO (jetty-launcher-9778-thread-2) [n:127.0.0.1:52240_solr ] o.a.s.c.ZkController Added new OnReconnect listener org.apache.solr.cloud.ZkController$$Lambda$54/771350659@57481206
    [junit4] 2> 3008963 INFO (jetty-launcher-9778-thread-1) [n:127.0.0.1:52237_solr ] o.a.s.c.ZkController Added new OnReconnect listener org.apache.solr.cloud.ZkController$$Lambda$54/771350659@15e0c03e
    [junit4] 2> 3008963 INFO (jetty-launcher-9778-thread-2) [n:127.0.0.1:52240_solr ] o.a.s.c.c.ConnectionManager Waiting for client to connect to ZooKeeper
    [junit4] 2> 3008964 INFO (jetty-launcher-9778-thread-1) [n:127.0.0.1:52237_solr ] o.a.s.c.c.ConnectionManager Waiting for client to connect to ZooKeeper
    [junit4] 2> 3008966 INFO (zkCallback-9788-thread-1-processing-n:127.0.0.1:52240_solr) [n:127.0.0.1:52240_solr ] o.a.s.c.c.ConnectionManager Watcher org.apache.solr.common.cloud.ConnectionManager@7f3c112d name:ZooKeeperConnection Watcher:127.0.0.1:52233/solr got event WatchedEvent state:SyncConnected type:None path:null path:null type:None
    [junit4] 2> 3008967 INFO (jetty-launcher-9778-thread-2) [n:127.0.0.1:52240_solr ] o.a.s.c.c.ConnectionManager Client is connected to ZooKeeper
    [junit4] 2> 3008968 INFO (zkCallback-9789-thread-1-processing-n:127.0.0.1:52237_solr) [n:127.0.0.1:52237_solr ] o.a.s.c.c.ConnectionManager Watcher org.apache.solr.common.cloud.ConnectionManager@6cd452d8 name:ZooKeeperConnection Watcher:127.0.0.1:52233/solr got event WatchedEvent state:SyncConnected type:None path:null path:null type:None
    [junit4] 2> 3008968 INFO (jetty-launcher-9778-thread-1) [n:127.0.0.1:52237_solr ] o.a.s.c.c.ConnectionManager Client is connected to ZooKeeper
    [junit4] 2> 3008969 INFO (jetty-launcher-9778-thread-2) [n:127.0.0.1:52240_solr ] o.a.s.c.c.SolrZkClient makePath: /overseer/queue
    [junit4] 2> 3008970 INFO (jetty-launcher-9778-thread-1) [n:127.0.0.1:52237_solr ] o.a.s.c.c.SolrZkClient makePath: /overseer/queue
    [junit4] 2> 3008973 INFO (jetty-launcher-9778-thread-1) [n:127.0.0.1:52237_solr ] o.a.s.c.c.SolrZkClient makePath: /overseer/collection-queue-work
    [junit4] 2> 3008973 INFO (jetty-launcher-9778-thread-2) [n:127.0.0.1:52240_solr ] o.a.s.c.c.SolrZkClient makePath: /overseer/collection-queue-work
    [junit4] 2> 3008978 INFO (jetty-launcher-9778-thread-2) [n:127.0.0.1:52240_solr ] o.a.s.c.c.SolrZkClient makePath: /overseer/collection-map-running
    [junit4] 2> 3008978 INFO (jetty-launcher-9778-thread-1) [n:127.0.0.1:52237_solr ] o.a.s.c.c.SolrZkClient makePath: /overseer/collection-map-running
    [junit4] 2> 3008981 INFO (jetty-launcher-9778-thread-1) [n:127.0.0.1:52237_solr ] o.a.s.c.c.SolrZkClient makePath: /overseer/collection-map-completed
    [junit4] 2> 3008981 INFO (jetty-launcher-9778-thread-2) [n:127.0.0.1:52240_solr ] o.a.s.c.c.SolrZkClient makePath: /overseer/collection-map-completed
    [junit4] 2> 3008984 INFO (jetty-launcher-9778-thread-2) [n:127.0.0.1:52240_solr ] o.a.s.c.c.SolrZkClient makePath: /overseer/collection-map-failure
    [junit4] 2> 3008984 INFO (jetty-launcher-9778-thread-1) [n:127.0.0.1:52237_solr ] o.a.s.c.c.SolrZkClient makePath: /overseer/collection-map-failure
    [junit4] 2> 3008988 INFO (jetty-launcher-9778-thread-1) [n:127.0.0.1:52237_solr ] o.a.s.c.c.SolrZkClient makePath: /live_nodes
    [junit4] 2> 3008988 INFO (jetty-launcher-9778-thread-2) [n:127.0.0.1:52240_solr ] o.a.s.c.c.SolrZkClient makePath: /live_nodes
    [junit4] 2> 3008989 INFO (jetty-launcher-9778-thread-1) [n:127.0.0.1:52237_solr ] o.a.s.c.c.SolrZkClient makePath: /collections
    [junit4] 2> 3008989 INFO (jetty-launcher-9778-thread-2) [n:127.0.0.1:52240_solr ] o.a.s.c.c.SolrZkClient makePath: /collections
    [junit4] 2> 3008990 INFO (jetty-launcher-9778-thread-2) [n:127.0.0.1:52240_solr ] o.a.s.c.c.SolrZkClient makePath: /aliases.json
    [junit4] 2> 3008998 INFO (jetty-launcher-9778-thread-2) [n:127.0.0.1:52240_solr ] o.a.s.c.c.SolrZkClient makePath: /clusterstate.json
    [junit4] 2> 3008998 INFO (jetty-launcher-9778-thread-1) [n:127.0.0.1:52237_solr ] o.a.s.c.c.SolrZkClient makePath: /clusterstate.json
    [junit4] 2> 3009004 INFO (jetty-launcher-9778-thread-2) [n:127.0.0.1:52240_solr ] o.a.s.c.c.SolrZkClient makePath: /security.json
    [junit4] 2> 3009006 INFO (jetty-launcher-9778-thread-1) [n:127.0.0.1:52237_solr ] o.a.s.c.c.SolrZkClient makePath: /security.json
    [junit4] 2> 3009010 INFO (jetty-launcher-9778-thread-2) [n:127.0.0.1:52240_solr ] o.a.s.c.c.ZkStateReader Updating cluster state from ZooKeeper...
    [junit4] 2> 3009010 INFO (jetty-launcher-9778-thread-1) [n:127.0.0.1:52237_solr ] o.a.s.c.c.ZkStateReader Updating cluster state from ZooKeeper...
    [junit4] 2> 3009011 INFO (jetty-launcher-9778-thread-2) [n:127.0.0.1:52240_solr ] o.a.s.c.c.ZkStateReader Loaded cluster properties: {urlScheme=https}
    [junit4] 2> 3009011 INFO (jetty-launcher-9778-thread-1) [n:127.0.0.1:52237_solr ] o.a.s.c.c.ZkStateReader Loaded cluster properties: {urlScheme=https}
    [junit4] 2> 3009011 INFO (jetty-launcher-9778-thread-2) [n:127.0.0.1:52240_solr ] o.a.s.c.c.ZkStateReader Updated live nodes from ZooKeeper... (0) -> (0)
    [junit4] 2> 3009012 INFO (jetty-launcher-9778-thread-1) [n:127.0.0.1:52237_solr ] o.a.s.c.c.ZkStateReader Updated live nodes from ZooKeeper... (0) -> (0)
    [junit4] 2> 3009016 INFO (jetty-launcher-9778-thread-1) [n:127.0.0.1:52237_solr ] o.a.s.c.c.SolrZkClient makePath: /overseer_elect
    [junit4] 2> 3009018 INFO (jetty-launcher-9778-thread-2) [n:127.0.0.1:52240_solr ] o.a.s.c.c.SolrZkClient makePath: /overseer_elect
    [junit4] 2> 3009019 INFO (jetty-launcher-9778-thread-1) [n:127.0.0.1:52237_solr ] o.a.s.c.c.SolrZkClient makePath: /overseer_elect/election
    [junit4] 2> 3009020 INFO (jetty-launcher-9778-thread-2) [n:127.0.0.1:52240_solr ] o.a.s.c.c.SolrZkClient makePath: /overseer_elect/election
    [junit4] 2> 3009023 INFO (jetty-launcher-9778-thread-1) [n:127.0.0.1:52237_solr ] o.a.s.c.Overseer Overseer (id=null) closing
    [junit4] 2> 3009023 INFO (jetty-launcher-9778-thread-2) [n:127.0.0.1:52240_solr ] o.a.s.c.Overseer Overseer (id=null) closing
    [junit4] 2> 3009023 INFO (jetty-launcher-9778-thread-1) [n:127.0.0.1:52237_solr ] o.a.s.c.LeaderElector Joined leadership election with path: /overseer_elect/election/96053629422010374-127.0.0.1:52237_solr-n_0000000000
    [junit4] 2> 3009024 INFO (jetty-launcher-9778-thread-1) [n:127.0.0.1:52237_solr ] o.a.s.c.OverseerElectionContext I am going to be the leader 127.0.0.1:52237_solr
    [junit4] 2> 3009024 INFO (jetty-launcher-9778-thread-2) [n:127.0.0.1:52240_solr ] o.a.s.c.LeaderElector Joined leadership election with path: /overseer_elect/election/96053629422010373-127.0.0.1:52240_solr-n_0000000001
    [junit4] 2> 3009024 INFO (jetty-launcher-9778-thread-1) [n:127.0.0.1:52237_solr ] o.a.s.c.c.SolrZkClient makePath: /overseer_elect/leader
    [junit4] 2> 3009025 INFO (jetty-launcher-9778-thread-2) [n:127.0.0.1:52240_solr ] o.a.s.c.LeaderElector Watching path /overseer_elect/election/96053629422010374-127.0.0.1:52237_solr-n_0000000000 to know if I could be the leader
    [junit4] 2> 3009026 INFO (jetty-launcher-9778-thread-2) [n:127.0.0.1:52240_solr ] o.a.s.c.ZkController Register node as live in ZooKeeper:/live_nodes/127.0.0.1:52240_solr
    [junit4] 2> 3009026 INFO (jetty-launcher-9778-thread-1) [n:127.0.0.1:52237_solr ] o.a.s.c.Overseer Overseer (id=96053629422010374-127.0.0.1:52237_solr-n_0000000000) starting
    [junit4] 2> 3009026 INFO (jetty-launcher-9778-thread-2) [n:127.0.0.1:52240_solr ] o.a.s.c.c.SolrZkClient makePath: /live_nodes/127.0.0.1:52240_solr
    [junit4] 2> 3009029 INFO (zkCallback-9788-thread-1-processing-n:127.0.0.1:52240_solr) [n:127.0.0.1:52240_solr ] o.a.s.c.c.ZkStateReader A live node change: [WatchedEvent state:SyncConnected type:NodeChildrenChanged path:/live_nodes], has occurred - updating... (live nodes size: [0])
    [junit4] 2> 3009029 INFO (zkCallback-9789-thread-1-processing-n:127.0.0.1:52237_solr) [n:127.0.0.1:52237_solr ] o.a.s.c.c.ZkStateReader A live node change: [WatchedEvent state:SyncConnected type:NodeChildrenChanged path:/live_nodes], has occurred - updating... (live nodes size: [0])
    [junit4] 2> 3009031 INFO (jetty-launcher-9778-thread-1) [n:127.0.0.1:52237_solr ] o.a.s.c.c.SolrZkClient makePath: /overseer/queue-work
    [junit4] 2> 3009031 INFO (zkCallback-9788-thread-1-processing-n:127.0.0.1:52240_solr) [n:127.0.0.1:52240_solr ] o.a.s.c.c.ZkStateReader Updated live nodes from ZooKeeper... (0) -> (1)
    [junit4] 2> 3009031 INFO (zkCallback-9789-thread-1-processing-n:127.0.0.1:52237_solr) [n:127.0.0.1:52237_solr ] o.a.s.c.c.ZkStateReader Updated live nodes from ZooKeeper... (0) -> (1)
    [junit4] 2> 3009043 INFO (jetty-launcher-9778-thread-1) [n:127.0.0.1:52237_solr ] o.a.s.c.OverseerAutoReplicaFailoverThread Starting OverseerAutoReplicaFailoverThread autoReplicaFailoverWorkLoopDelay=10000 autoReplicaFailoverWaitAfterExpiration=30000 autoReplicaFailoverBadNodeExpiration=60000
    [junit4] 2> 3009044 INFO (OverseerCollectionConfigSetProcessor-96053629422010374-127.0.0.1:52237_solr-n_0000000000) [n:127.0.0.1:52237_solr ] o.a.s.c.OverseerTaskProcessor Process current queue of overseer operations
    [junit4] 2> 3009044 INFO (jetty-launcher-9778-thread-1) [n:127.0.0.1:52237_solr ] o.a.s.c.ZkController Publish node=127.0.0.1:52237_solr as DOWN
    [junit4] 2> 3009044 INFO (OverseerStateUpdate-96053629422010374-127.0.0.1:52237_solr-n_0000000000) [n:127.0.0.1:52237_solr ] o.a.s.c.Overseer Starting to work on the main queue
    [junit4] 2> 3009048 INFO (OverseerStateUpdate-96053629422010374-127.0.0.1:52237_solr-n_0000000000) [n:127.0.0.1:52237_solr ] o.a.s.c.c.ZkStateReader Updated live nodes from ZooKeeper... (1) -> (1)
    [junit4] 2> 3009050 INFO (OverseerStateUpdate-96053629422010374-127.0.0.1:52237_solr-n_0000000000) [n:127.0.0.1:52237_solr ] o.a.s.c.Overseer processMessage: queueSize: 1, message = {
    [junit4] 2> "operation":"downnode",
    [junit4] 2> "node_name":"127.0.0.1:52237_solr"} current state version: 0
    [junit4] 2> 3009050 INFO (OverseerStateUpdate-96053629422010374-127.0.0.1:52237_solr-n_0000000000) [n:127.0.0.1:52237_solr ] o.a.s.c.o.NodeMutator DownNode state invoked for node: 127.0.0.1:52237_solr
    [junit4] 2> 3009061 INFO (jetty-launcher-9778-thread-2) [n:127.0.0.1:52240_solr ] o.a.s.c.CoreContainer Security conf doesn't exist. Skipping setup for authorization module.
    [junit4] 2> 3009061 INFO (jetty-launcher-9778-thread-2) [n:127.0.0.1:52240_solr ] o.a.s.c.CoreContainer No authentication plugin used.
    [junit4] 2> 3009063 INFO (jetty-launcher-9778-thread-2) [n:127.0.0.1:52240_solr ] o.a.s.c.CorePropertiesLocator Looking for core definitions underneath C:\Users\jenkins\workspace\Lucene-Solr-6.1-Windows\solr\build\solr-core\test\J0\temp\solr.schema.TestManagedSchemaAPI_9450F0C458A7F7C9-001\tempDir-001\node2\.
    [junit4] 2> 3009064 INFO (jetty-launcher-9778-thread-2) [n:127.0.0.1:52240_solr ] o.a.s.c.CorePropertiesLocator Found 0 core definitions
    [junit4] 2> 3009065 INFO (jetty-launcher-9778-thread-2) [n:127.0.0.1:52240_solr ] o.a.s.s.SolrDispatchFilter user.dir=C:\Users\jenkins\workspace\Lucene-Solr-6.1-Windows\solr\build\solr-core\test\J0
    [junit4] 2> 3009065 INFO (jetty-launcher-9778-thread-2) [n:127.0.0.1:52240_solr ] o.a.s.s.SolrDispatchFilter SolrDispatchFilter.init() done
    [junit4] 2> 3010047 INFO (jetty-launcher-9778-thread-1) [n:127.0.0.1:52237_solr ] o.a.s.c.ZkController Register node as live in ZooKeeper:/live_nodes/127.0.0.1:52237_solr
    [junit4] 2> 3010048 INFO (jetty-launcher-9778-thread-1) [n:127.0.0.1:52237_solr ] o.a.s.c.c.SolrZkClient makePath: /live_nodes/127.0.0.1:52237_solr
    [junit4] 2> 3010050 INFO (zkCallback-9788-thread-1-processing-n:127.0.0.1:52240_solr) [n:127.0.0.1:52240_solr ] o.a.s.c.c.ZkStateReader A live node change: [WatchedEvent state:SyncConnected type:NodeChildrenChanged path:/live_nodes], has occurred - updating... (live nodes size: [1])
    [junit4] 2> 3010050 INFO (zkCallback-9789-thread-1-processing-n:127.0.0.1:52237_solr) [n:127.0.0.1:52237_solr ] o.a.s.c.c.ZkStateReader A live node change: [WatchedEvent state:SyncConnected type:NodeChildrenChanged path:/live_nodes], has occurred - updating... (live nodes size: [1])
    [junit4] 2> 3010051 INFO (zkCallback-9788-thread-1-processing-n:127.0.0.1:52240_solr) [n:127.0.0.1:52240_solr ] o.a.s.c.c.ZkStateReader Updated live nodes from ZooKeeper... (1) -> (2)
    [junit4] 2> 3010051 INFO (zkCallback-9789-thread-1-processing-n:127.0.0.1:52237_solr) [n:127.0.0.1:52237_solr ] o.a.s.c.c.ZkStateReader Updated live nodes from ZooKeeper... (1) -> (2)
    [junit4] 2> 3010061 INFO (jetty-launcher-9778-thread-1) [n:127.0.0.1:52237_solr ] o.a.s.c.CoreContainer Security conf doesn't exist. Skipping setup for authorization module.
    [junit4] 2> 3010062 INFO (jetty-launcher-9778-thread-1) [n:127.0.0.1:52237_solr ] o.a.s.c.CoreContainer No authentication plugin used.
    [junit4] 2> 3010062 INFO (jetty-launcher-9778-thread-1) [n:127.0.0.1:52237_solr ] o.a.s.c.CorePropertiesLocator Looking for core definitions underneath C:\Users\jenkins\workspace\Lucene-Solr-6.1-Windows\solr\build\solr-core\test\J0\temp\solr.schema.TestManagedSchemaAPI_9450F0C458A7F7C9-001\tempDir-001\node1\.
    [junit4] 2> 3010063 INFO (jetty-launcher-9778-thread-1) [n:127.0.0.1:52237_solr ] o.a.s.c.CorePropertiesLocator Found 0 core definitions
    [junit4] 2> 3010065 INFO (jetty-launcher-9778-thread-1) [n:127.0.0.1:52237_solr ] o.a.s.s.SolrDispatchFilter user.dir=C:\Users\jenkins\workspace\Lucene-Solr-6.1-Windows\solr\build\solr-core\test\J0
    [junit4] 2> 3010065 INFO (jetty-launcher-9778-thread-1) [n:127.0.0.1:52237_solr ] o.a.s.s.SolrDispatchFilter SolrDispatchFilter.init() done
    [junit4] 2> 3010066 INFO (SUITE-TestManagedSchemaAPI-seed#[9450F0C458A7F7C9]-worker) [ ] o.a.s.c.c.SolrZkClient Using default ZkCredentialsProvider
    [junit4] 2> 3010067 INFO (SUITE-TestManagedSchemaAPI-seed#[9450F0C458A7F7C9]-worker) [ ] o.a.s.c.c.ConnectionManager Waiting for client to connect to ZooKeeper
    [junit4] 2> 3010072 INFO (zkCallback-9792-thread-1) [ ] o.a.s.c.c.ConnectionManager Watcher org.apache.solr.common.cloud.ConnectionManager@524bf0d name:ZooKeeperConnection Watcher:127.0.0.1:52233 got event WatchedEvent state:SyncConnected type:None path:null path:null type:None
    [junit4] 2> 3010072 INFO (SUITE-TestManagedSchemaAPI-seed#[9450F0C458A7F7C9]-worker) [ ] o.a.s.c.c.ConnectionManager Client is connected to ZooKeeper
    [junit4] 2> 3010072 INFO (SUITE-TestManagedSchemaAPI-seed#[9450F0C458A7F7C9]-worker) [ ] o.a.s.c.c.SolrZkClient Using default ZkACLProvider
    [junit4] 2> 3010078 INFO (SUITE-TestManagedSchemaAPI-seed#[9450F0C458A7F7C9]-worker) [ ] o.a.s.c.s.i.CloudSolrClient Final constructed zkHost string: 127.0.0.1:52233/solr
    [junit4] 2> 3010078 INFO (SUITE-TestManagedSchemaAPI-seed#[9450F0C458A7F7C9]-worker) [ ] o.a.s.c.c.SolrZkClient Using default ZkCredentialsProvider
    [junit4] 2> 3010079 INFO (SUITE-TestManagedSchemaAPI-seed#[9450F0C458A7F7C9]-worker) [ ] o.a.s.c.c.ConnectionManager Waiting for client to connect to ZooKeeper
    [junit4] 2> 3010083 INFO (zkCallback-9795-thread-1) [ ] o.a.s.c.c.ConnectionManager Watcher org.apache.solr.common.cloud.ConnectionManager@5a2b5254 name:ZooKeeperConnection Watcher:127.0.0.1:52233/solr got event WatchedEvent state:SyncConnected type:None path:null path:null type:None
    [junit4] 2> 3010083 INFO (SUITE-TestManagedSchemaAPI-seed#[9450F0C458A7F7C9]-worker) [ ] o.a.s.c.c.ConnectionManager Client is connected to ZooKeeper
    [junit4] 2> 3010083 INFO (SUITE-TestManagedSchemaAPI-seed#[9450F0C458A7F7C9]-worker) [ ] o.a.s.c.c.SolrZkClient Using default ZkACLProvider
    [junit4] 2> 3010084 INFO (SUITE-TestManagedSchemaAPI-seed#[9450F0C458A7F7C9]-worker) [ ] o.a.s.c.c.ZkStateReader Updating cluster state from ZooKeeper...
    [junit4] 2> 3010086 INFO (SUITE-TestManagedSchemaAPI-seed#[9450F0C458A7F7C9]-worker) [ ] o.a.s.c.c.ZkStateReader Loaded cluster properties: {urlScheme=https}
    [junit4] 2> 3010087 INFO (SUITE-TestManagedSchemaAPI-seed#[9450F0C458A7F7C9]-worker) [ ] o.a.s.c.c.ZkStateReader Updated live nodes from ZooKeeper... (0) -> (2)
    [junit4] 2> 3010090 INFO (SUITE-TestManagedSchemaAPI-seed#[9450F0C458A7F7C9]-worker) [ ] o.a.s.c.c.SolrZkClient makePath: /configs/conf1/managed-schema
    [junit4] 2> 3010094 INFO (SUITE-TestManagedSchemaAPI-seed#[9450F0C458A7F7C9]-worker) [ ] o.a.s.c.c.SolrZkClient makePath: /configs/conf1/solrconfig.xml
    [junit4] 2> 3010124 INFO (TEST-TestManagedSchemaAPI.test-seed#[9450F0C458A7F7C9]) [ ] o.a.s.SolrTestCaseJ4 ###Starting test
    [junit4] 2> 3010167 INFO (qtp758827352-43751) [n:127.0.0.1:52237_solr ] o.a.s.h.a.CollectionsHandler Invoked Collection Action :create with params replicationFactor=2&collection.configName=conf1&name=testschemaapi&action=CREATE&numShards=1&wt=javabin&version=2 and sendToOCPQueue=true
    [junit4] 2> 3010171 INFO (OverseerCollectionConfigSetProcessor-96053629422010374-127.0.0.1:52237_solr-n_0000000000) [n:127.0.0.1:52237_solr ] o.a.s.c.OverseerTaskProcessor Overseer Collection Message Handler: Get the message id:/overseer/collection-queue-work/qn-0000000000 message:{
    [junit4] 2> "name":"testschemaapi",
    [junit4] 2> "fromApi":"true",
    [junit4] 2> "replicationFactor":"2",
    [junit4] 2> "collection.configName":"conf1",
    [junit4] 2> "numShards":"1",
    [junit4] 2> "stateFormat":"2",
    [junit4] 2> "operation":"create"}
    [junit4] 2> 3010171 INFO (OverseerThreadFactory-11190-thread-1-processing-n:127.0.0.1:52237_solr) [n:127.0.0.1:52237_solr ] o.a.s.c.OverseerCollectionMessageHandler OverseerCollectionMessageHandler.processMessage : create , {
    [junit4] 2> "name":"testschemaapi",
    [junit4] 2> "fromApi":"true",
    [junit4] 2> "replicationFactor":"2",
    [junit4] 2> "collection.configName":"conf1",
    [junit4] 2> "numShards":"1",
    [junit4] 2> "stateFormat":"2",
    [junit4] 2> "operation":"create"}
    [junit4] 2> 3010171 INFO (OverseerThreadFactory-11190-thread-1-processing-n:127.0.0.1:52237_solr) [n:127.0.0.1:52237_solr ] o.a.s.c.OverseerCollectionMessageHandler Create collection testschemaapi
    [junit4] 2> 3010172 INFO (OverseerThreadFactory-11190-thread-1-processing-n:127.0.0.1:52237_solr) [n:127.0.0.1:52237_solr ] o.a.s.c.OverseerCollectionMessageHandler creating collections conf node /collections/testschemaapi
    [junit4] 2> 3010173 INFO (OverseerThreadFactory-11190-thread-1-processing-n:127.0.0.1:52237_solr) [n:127.0.0.1:52237_solr ] o.a.s.c.c.SolrZkClient makePath: /collections/testschemaapi
    [junit4] 2> 3010176 INFO (zkCallback-9788-thread-1-processing-n:127.0.0.1:52240_solr) [n:127.0.0.1:52240_solr ] o.a.s.c.c.ZkStateReader A collections change: [WatchedEvent state:SyncConnected type:NodeChildrenChanged path:/collections], has occurred - updating...
    [junit4] 2> 3010176 INFO (zkCallback-9789-thread-1-processing-n:127.0.0.1:52237_solr) [n:127.0.0.1:52237_solr ] o.a.s.c.c.ZkStateReader A collections change: [WatchedEvent state:SyncConnected type:NodeChildrenChanged path:/collections], has occurred - updating...
    [junit4] 2> 3010176 INFO (zkCallback-9795-thread-1) [ ] o.a.s.c.c.ZkStateReader A collections change: [WatchedEvent state:SyncConnected type:NodeChildrenChanged path:/collections], has occurred - updating...
    [junit4] 2> 3010180 INFO (OverseerStateUpdate-96053629422010374-127.0.0.1:52237_solr-n_0000000000) [n:127.0.0.1:52237_solr ] o.a.s.c.Overseer processMessage: queueSize: 1, message = {
    [junit4] 2> "name":"testschemaapi",
    [junit4] 2> "fromApi":"true",
    [junit4] 2> "replicationFactor":"2",
    [junit4] 2> "collection.configName":"conf1",
    [junit4] 2> "numShards":"1",
    [junit4] 2> "stateFormat":"2",
    [junit4] 2> "operation":"create"} current state version: 0
    [junit4] 2> 3010180 INFO (OverseerStateUpdate-96053629422010374-127.0.0.1:52237_solr-n_0000000000) [n:127.0.0.1:52237_solr ] o.a.s.c.o.ClusterStateMutator building a new cName: testschemaapi
    [junit4] 2> 3010182 INFO (OverseerStateUpdate-96053629422010374-127.0.0.1:52237_solr-n_0000000000) [n:127.0.0.1:52237_solr ] o.a.s.c.o.ZkStateWriter going to create_collection /collections/testschemaapi/state.json
    [junit4] 2> 3010279 INFO (OverseerThreadFactory-11190-thread-1-processing-n:127.0.0.1:52237_solr) [n:127.0.0.1:52237_solr ] o.a.s.c.OverseerCollectionMessageHandler Creating SolrCores for new collection testschemaapi, shardNames [shard1] , replicationFactor : 2
    [junit4] 2> 3010280 INFO (OverseerThreadFactory-11190-thread-1-processing-n:127.0.0.1:52237_solr) [n:127.0.0.1:52237_solr ] o.a.s.c.OverseerCollectionMessageHandler Creating core testschemaapi_shard1_replica1 as part of shard shard1 of collection testschemaapi on 127.0.0.1:52237_solr
    [junit4] 2> 3010280 INFO (OverseerThreadFactory-11190-thread-1-processing-n:127.0.0.1:52237_solr) [n:127.0.0.1:52237_solr ] o.a.s.c.OverseerCollectionMessageHandler Creating core testschemaapi_shard1_replica2 as part of shard shard1 of collection testschemaapi on 127.0.0.1:52240_solr
    [junit4] 2> 3010307 INFO (qtp758827352-43771) [n:127.0.0.1:52237_solr ] o.a.s.h.a.CoreAdminOperation core create command qt=/admin/cores&collection.configName=conf1&name=testschemaapi_shard1_replica1&action=CREATE&numShards=1&collection=testschemaapi&shard=shard1&wt=javabin&version=2
    [junit4] 2> 3010310 INFO (qtp758827352-43771) [n:127.0.0.1:52237_solr ] o.a.s.c.CoreDescriptor Created CoreDescriptor: {name=testschemaapi_shard1_replica1, collection.configName=conf1, config=solrconfig.xml, transient=false, schema=schema.xml, loadOnStartup=true, configSetProperties=configsetprops.json, collection=testschemaapi, numShards=1, dataDir=data\, shard=shard1}
    [junit4] 2> 3010310 INFO (qtp758827352-43771) [n:127.0.0.1:52237_solr c:testschemaapi s:shard1 x:testschemaapi_shard1_replica1] o.a.s.c.ZkController publishing state=down
    [junit4] 2> 3010312 INFO (qtp758827352-43771) [n:127.0.0.1:52237_solr c:testschemaapi s:shard1 x:testschemaapi_shard1_replica1] o.a.s.c.ZkController Registering watch for collection testschemaapi
    [junit4] 2> 3010314 INFO (qtp758827352-43771) [n:127.0.0.1:52237_solr c:testschemaapi s:shard1 x:testschemaapi_shard1_replica1] o.a.s.c.c.ZkStateReader Add data for [testschemaapi] ver [0]
    [junit4] 2> 3010314 INFO (qtp758827352-43771) [n:127.0.0.1:52237_solr c:testschemaapi s:shard1 x:testschemaapi_shard1_replica1] o.a.s.c.ZkController look for our core node name
    [junit4] 2> 3010314 INFO (OverseerStateUpdate-96053629422010374-127.0.0.1:52237_solr-n_0000000000) [n:127.0.0.1:52237_solr ] o.a.s.c.Overseer processMessage: queueSize: 1, message = {
    [junit4] 2> "core":"testschemaapi_shard1_replica1",
    [junit4] 2> "roles":null,
    [junit4] 2> "base_url":"https://127.0.0.1:52237/solr",
    [junit4] 2> "node_name":"127.0.0.1:52237_solr",
    [junit4] 2> "numShards":"1",
    [junit4] 2> "state":"down",
    [junit4] 2> "shard":"shard1",
    [junit4] 2> "collection":"testschemaapi",
    [junit4] 2> "operation":"state"} current state version: 0
    [junit4] 2> 3010315 INFO (OverseerStateUpdate-96053629422010374-127.0.0.1:52237_solr-n_0000000000) [n:127.0.0.1:52237_solr ] o.a.s.c.o.ReplicaMutator Update state numShards=1 message={
    [junit4] 2> "core":"testschemaapi_shard1_replica1",
    [junit4] 2> "roles":null,
    [junit4] 2> "base_url":"https://127.0.0.1:52237/solr",
    [junit4] 2> "node_name":"127.0.0.1:52237_solr",
    [junit4] 2> "numShards":"1",
    [junit4] 2> "state":"down",
    [junit4] 2> "shard":"shard1",
    [junit4] 2> "collection":"testschemaapi",
    [junit4] 2> "operation":"state"}
    [junit4] 2> 3010338 INFO (qtp1679878003-43760) [n:127.0.0.1:52240_solr ] o.a.s.h.a.CoreAdminOperation core create command qt=/admin/cores&collection.configName=conf1&name=testschemaapi_shard1_replica2&action=CREATE&numShards=1&collection=testschemaapi&shard=shard1&wt=javabin&version=2
    [junit4] 2> 3010340 INFO (qtp1679878003-43760) [n:127.0.0.1:52240_solr ] o.a.s.c.CoreDescriptor Created CoreDescriptor: {name=testschemaapi_shard1_replica2, collection.configName=conf1, config=solrconfig.xml, transient=false, schema=schema.xml, loadOnStartup=true, configSetProperties=configsetprops.json, collection=testschemaapi, numShards=1, dataDir=data\, shard=shard1}
    [junit4] 2> 3010341 INFO (qtp1679878003-43760) [n:127.0.0.1:52240_solr c:testschemaapi s:shard1 x:testschemaapi_shard1_replica2] o.a.s.c.ZkController publishing state=down
    [junit4] 2> 3010342 INFO (qtp1679878003-43760) [n:127.0.0.1:52240_solr c:testschemaapi s:shard1 x:testschemaapi_shard1_replica2] o.a.s.c.ZkController Registering watch for collection testschemaapi
    [junit4] 2> 3010343 INFO (OverseerStateUpdate-96053629422010374-127.0.0.1:52237_solr-n_0000000000) [n:127.0.0.1:52237_solr ] o.a.s.c.Overseer processMessage: queueSize: 1, message = {
    [junit4] 2> "core":"testschemaapi_shard1_replica2",
    [junit4] 2> "roles":null,
    [junit4] 2> "base_url":"https://127.0.0.1:52240/solr",
    [junit4] 2> "node_name":"127.0.0.1:52240_solr",
    [junit4] 2> "numShards":"1",
    [junit4] 2> "state":"down",
    [junit4] 2> "shard":"shard1",
    [junit4] 2> "collection":"testschemaapi",
    [junit4] 2> "operation":"state"} current state version: 0
    [junit4] 2> 3010343 INFO (OverseerStateUpdate-96053629422010374-127.0.0.1:52237_solr-n_0000000000) [n:127.0.0.1:52237_solr ] o.a.s.c.o.ReplicaMutator Update state numShards=1 message={
    [junit4] 2> "core":"testschemaapi_shard1_replica2",
    [junit4] 2> "roles":null,
    [junit4] 2> "base_url":"https://127.0.0.1:52240/solr",
    [junit4] 2> "node_name":"127.0.0.1:52240_solr",
    [junit4] 2> "numShards":"1",
    [junit4] 2> "state":"down",
    [junit4] 2> "shard":"shard1",
    [junit4] 2> "collection":"testschemaapi",
    [junit4] 2> "operation":"state"}
    [junit4] 2> 3010343 INFO (qtp1679878003-43760) [n:127.0.0.1:52240_solr c:testschemaapi s:shard1 x:testschemaapi_shard1_replica2] o.a.s.c.c.ZkStateReader Add data for [testschemaapi] ver [0]
    [junit4] 2> 3010344 INFO (qtp1679878003-43760) [n:127.0.0.1:52240_solr c:testschemaapi s:shard1 x:testschemaapi_shard1_replica2] o.a.s.c.ZkController look for our core node name
    [junit4] 2> 3010449 INFO (OverseerStateUpdate-96053629422010374-127.0.0.1:52237_solr-n_0000000000) [n:127.0.0.1:52237_solr ] o.a.s.c.o.ZkStateWriter going to update_collection /collections/testschemaapi/state.json version: 0
    [junit4] 2> 3010449 INFO (zkCallback-9789-thread-3-processing-n:127.0.0.1:52237_solr) [n:127.0.0.1:52237_solr ] o.a.s.c.c.ZkStateReader A cluster state change: [WatchedEvent state:SyncConnected type:NodeDataChanged path:/collections/testschemaapi/state.json] for collection [testschemaapi] has occurred - updating... (live nodes size: [2])
    [junit4] 2> 3010449 INFO (zkCallback-9788-thread-1-processing-n:127.0.0.1:52240_solr) [n:127.0.0.1:52240_solr ] o.a.s.c.c.ZkStateReader A cluster state change: [WatchedEvent state:SyncConnected type:NodeDataChanged path:/collections/testschemaapi/state.json] for collection [testschemaapi] has occurred - updating... (live nodes size: [2])
    [junit4] 2> 3010450 INFO (zkCallback-9789-thread-3-processing-n:127.0.0.1:52237_solr) [n:127.0.0.1:52237_solr ] o.a.s.c.c.ZkStateReader Updating data for [testschemaapi] from [0] to [1]
    [junit4] 2> 3010451 INFO (zkCallback-9788-thread-1-processing-n:127.0.0.1:52240_solr) [n:127.0.0.1:52240_solr ] o.a.s.c.c.ZkStateReader Updating data for [testschemaapi] from [0] to [1]
    [junit4] 2> 3011314 INFO (qtp758827352-43771) [n:127.0.0.1:52237_solr c:testschemaapi s:shard1 x:testschemaapi_shard1_replica1] o.a.s.c.ZkController waiting to find shard id in clusterstate for testschemaapi_shard1_replica1
    [junit4] 2> 3011314 INFO (qtp758827352-43771) [n:127.0.0.1:52237_solr c:testschemaapi s:shard1 x:testschemaapi_shard1_replica1] o.a.s.c.ZkController Check for collection zkNode:testschemaapi
    [junit4] 2> 3011315 INFO (qtp758827352-43771) [n:127.0.0.1:52237_solr c:testschemaapi s:shard1 x:testschemaapi_shard1_replica1] o.a.s.c.ZkController Collection zkNode exists
    [junit4] 2> 3011315 INFO (qtp758827352-43771) [n:127.0.0.1:52237_solr c:testschemaapi s:shard1 x:testschemaapi_shard1_replica1] o.a.s.c.c.ZkStateReader Load collection config from: [/collections/testschemaapi]
    [junit4] 2> 3011316 INFO (qtp758827352-43771) [n:127.0.0.1:52237_solr c:testschemaapi s:shard1 x:testschemaapi_shard1_replica1] o.a.s.c.c.ZkStateReader path=[/collections/testschemaapi] [configName]=[conf1] specified config exists in ZooKeeper
    [junit4] 2> 3011316 INFO (qtp758827352-43771) [n:127.0.0.1:52237_solr c:testschemaapi s:shard1 x:testschemaapi_shard1_replica1] o.a.s.c.SolrResourceLoader new SolrResourceLoader for directory: 'C:\Users\jenkins\workspace\Lucene-Solr-6.1-Windows\solr\build\solr-core\test\J0\temp\solr.schema.TestManagedSchemaAPI_9450F0C458A7F7C9-001\tempDir-001\node1\testschemaapi_shard1_replica1'
    [junit4] 2> 3011316 INFO (qtp758827352-43771) [n:127.0.0.1:52237_solr c:testschemaapi s:shard1 x:testschemaapi_shard1_replica1] o.a.s.c.SolrResourceLoader JNDI not configured for solr (NoInitialContextEx)
    [junit4] 2> 3011316 INFO (qtp758827352-43771) [n:127.0.0.1:52237_solr c:testschemaapi s:shard1 x:testschemaapi_shard1_replica1] o.a.s.c.SolrResourceLoader solr home defaulted to 'solr/' (could not find system property or JNDI)
    [junit4] 2> 3011319 INFO (qtp758827352-43771) [n:127.0.0.1:52237_solr c:testschemaapi s:shard1 x:testschemaapi_shard1_replica1] o.a.s.c.Config loaded config solrconfig.xml with version 0
    [junit4] 2> 3011346 INFO (qtp1679878003-43760) [n:127.0.0.1:52240_solr c:testschemaapi s:shard1 x:testschemaapi_shard1_replica2] o.a.s.c.ZkController waiting to find shard id in clusterstate for testschemaapi_shard1_replica2
    [junit4] 2> 3011346 INFO (qtp1679878003-43760) [n:127.0.0.1:52240_solr c:testschemaapi s:shard1 x:testschemaapi_shard1_replica2] o.a.s.c.ZkController Check for collection zkNode:testschemaapi
    [junit4] 2> 3011347 INFO (qtp1679878003-43760) [n:127.0.0.1:52240_solr c:testschemaapi s:shard1 x:testschemaapi_shard1_replica2] o.a.s.c.ZkController Collection zkNode exists
    [junit4] 2> 3011347 INFO (qtp1679878003-43760) [n:127.0.0.1:52240_solr c:testschemaapi s:shard1 x:testschemaapi_shard1_replica2] o.a.s.c.c.ZkStateReader Load collection config from: [/collections/testschemaapi]
    [junit4] 2> 3011349 INFO (qtp1679878003-43760) [n:127.0.0.1:52240_solr c:testschemaapi s:shard1 x:testschemaapi_shard1_replica2] o.a.s.c.c.ZkStateReader path=[/collections/testschemaapi] [configName]=[conf1] specified config exists in ZooKeeper
    [junit4] 2> 3011349 INFO (qtp1679878003-43760) [n:127.0.0.1:52240_solr c:testschemaapi s:shard1 x:testschemaapi_shard1_replica2] o.a.s.c.SolrResourceLoader new SolrResourceLoader for directory: 'C:\Users\jenkins\workspace\Lucene-Solr-6.1-Windows\solr\build\solr-core\test\J0\temp\solr.schema.TestManagedSchemaAPI_9450F0C458A7F7C9-001\tempDir-001\node2\testschemaapi_shard1_replica2'
    [junit4] 2> 3011349 INFO (qtp758827352-43771) [n:127.0.0.1:52237_solr c:testschemaapi s:shard1 x:testschemaapi_shard1_replica1] o.a.s.c.SolrConfig current version of requestparams : -1
    [junit4] 2> 3011349 INFO (qtp1679878003-43760) [n:127.0.0.1:52240_solr c:testschemaapi s:shard1 x:testschemaapi_shard1_replica2] o.a.s.c.SolrResourceLoader JNDI not configured for solr (NoInitialContextEx)
    [junit4] 2> 3011349 INFO (qtp1679878003-43760) [n:127.0.0.1:52240_solr c:testschemaapi s:shard1 x:testschemaapi_shard1_replica2] o.a.s.c.SolrResourceLoader solr home defaulted to 'solr/' (could not find system property or JNDI)
    [junit4] 2> 3011353 INFO (qtp758827352-43771) [n:127.0.0.1:52237_solr c:testschemaapi s:shard1 x:testschemaapi_shard1_replica1] o.a.s.c.SolrConfig Using Lucene MatchVersion: 6.1.0
    [junit4] 2> 3011354 INFO (qtp1679878003-43760) [n:127.0.0.1:52240_solr c:testschemaapi s:shard1 x:testschemaapi_shard1_replica2] o.a.s.c.Config loaded config solrconfig.xml with version 0
    [junit4] 2> 3011361 INFO (qtp758827352-43771) [n:127.0.0.1:52237_solr c:testschemaapi s:shard1 x:testschemaapi_shard1_replica1] o.a.s.c.SolrConfig Loaded SolrConfig: solrconfig.xml
    [junit4] 2> 3011362 INFO (qtp1679878003-43760) [n:127.0.0.1:52240_solr c:testschemaapi s:shard1 x:testschemaapi_shard1_replica2] o.a.s.c.SolrConfig current version of requestparams : -1
    [junit4] 2> 3011364 INFO (qtp1679878003-43760) [n:127.0.0.1:52240_solr c:testschemaapi s:shard1 x:testschemaapi_shard1_replica2] o.a.s.c.SolrConfig Using Lucene MatchVersion: 6.1.0
    [junit4] 2> 3011369 INFO (qtp1679878003-43760) [n:127.0.0.1:52240_solr c:testschemaapi s:shard1 x:testschemaapi_shard1_replica2] o.a.s.c.SolrConfig Loaded SolrConfig: solrconfig.xml
    [junit4] 2> 3011371 INFO (qtp758827352-43771) [n:127.0.0.1:52237_solr c:testschemaapi s:shard1 x:testschemaapi_shard1_replica1] o.a.s.s.IndexSchema [testschemaapi_shard1_replica1] Schema name=minimal
    [junit4] 2> 3011380 INFO (qtp1679878003-43760) [n:127.0.0.1:52240_solr c:testschemaapi s:shard1 x:testschemaapi_shard1_replica2] o.a.s.s.IndexSchema [testschemaapi_shard1_replica2] Schema name=minimal
    [junit4] 2> 3011382 INFO (qtp758827352-43771) [n:127.0.0.1:52237_solr c:testschemaapi s:shard1 x:testschemaapi_shard1_replica1] o.a.s.s.IndexSchema unique key field: id
    [junit4] 2> 3011384 INFO (qtp1679878003-43760) [n:127.0.0.1:52240_solr c:testschemaapi s:shard1 x:testschemaapi_shard1_replica2] o.a.s.s.IndexSchema unique key field: id
    [junit4] 2> 3011390 INFO (qtp758827352-43771) [n:127.0.0.1:52237_solr c:testschemaapi s:shard1 x:testschemaapi_shard1_replica1] o.a.s.c.ConfigSetProperties Did not find ConfigSet properties, assuming default properties: Can't find resource 'configsetprops.json' in classpath or '/configs/conf1', cwd=C:\Users\jenkins\workspace\Lucene-Solr-6.1-Windows\solr\build\solr-core\test\J0
    [junit4] 2> 3011390 INFO (qtp1679878003-43760) [n:127.0.0.1:52240_solr c:testschemaapi s:shard1 x:testschemaapi_shard1_replica2] o.a.s.c.ConfigSetProperties Did not find ConfigSet properties, assuming default properties: Can't find resource 'configsetprops.json' in classpath or '/configs/conf1', cwd=C:\Users\jenkins\workspace\Lucene-Solr-6.1-Windows\solr\build\solr-core\test\J0
    [junit4] 2> 3011390 INFO (qtp1679878003-43760) [n:127.0.0.1:52240_solr c:testschemaapi s:shard1 x:testschemaapi_shard1_replica2] o.a.s.c.CoreContainer Creating SolrCore 'testschemaapi_shard1_replica2' using configuration from collection testschemaapi
    [junit4] 2> 3011390 INFO (qtp758827352-43771) [n:127.0.0.1:52237_solr c:testschemaapi s:shard1 x:testschemaapi_shard1_replica1] o.a.s.c.CoreContainer Creating SolrCore 'testschemaapi_shard1_replica1' using configuration from collection testschemaapi
    [junit4] 2> 3011391 INFO (qtp1679878003-43760) [n:127.0.0.1:52240_solr c:testschemaapi s:shard1 r:core_node2 x:testschemaapi_shard1_replica2] o.a.s.c.SolrCore org.apache.solr.core.MockDirectoryFactory
    [junit4] 2> 3011391 INFO (qtp758827352-43771) [n:127.0.0.1:52237_solr c:testschemaapi s:shard1 r:core_node1 x:testschemaapi_shard1_replica1] o.a.s.c.SolrCore org.apache.solr.core.MockDirectoryFactory
    [junit4] 2> 3011391 INFO (qtp1679878003-43760) [n:127.0.0.1:52240_solr c:testschemaapi s:shard1 r:core_node2 x:testschemaapi_shard1_replica2] o.a.s.c.SolrCore [[testschemaapi_shard1_replica2] ] Opening new SolrCore at [C:\Users\jenkins\workspace\Lucene-Solr-6.1-Windows\solr\build\solr-core\test\J0\temp\solr.schema.TestManagedSchemaAPI_9450F0C458A7F7C9-001\tempDir-001\node2\testschemaapi_shard1_replica2], dataDir=[C:\Users\jenkins\workspace\Lucene-Solr-6.1-Windows\solr\build\solr-core\test\J0\temp\solr.schema.TestManagedSchemaAPI_9450F0C458A7F7C9-001\tempDir-001\node2\.\testschemaapi_shard1_replica2\data\]
    [junit4] 2> 3011391 INFO (qtp758827352-43771) [n:127.0.0.1:52237_solr c:testschemaapi s:shard1 r:core_node1 x:testschemaapi_shard1_replica1] o.a.s.c.SolrCore [[testschemaapi_shard1_replica1] ] Opening new SolrCore at [C:\Users\jenkins\workspace\Lucene-Solr-6.1-Windows\solr\build\solr-core\test\J0\temp\solr.schema.TestManagedSchemaAPI_9450F0C458A7F7C9-001\tempDir-001\node1\testschemaapi_shard1_replica1], dataDir=[C:\Users\jenkins\workspace\Lucene-Solr-6.1-Windows\solr\build\solr-core\test\J0\temp\solr.schema.TestManagedSchemaAPI_9450F0C458A7F7C9-001\tempDir-001\node1\.\testschemaapi_shard1_replica1\data\]
    [junit4] 2> 3011391 INFO (qtp1679878003-43760) [n:127.0.0.1:52240_solr c:testschemaapi s:shard1 r:core_node2 x:testschemaapi_shard1_replica2] o.a.s.c.SolrCore JMX monitoring not detected for core: testschemaapi_shard1_replica2
    [junit4] 2> 3011391 INFO (qtp758827352-43771) [n:127.0.0.1:52237_solr c:testschemaapi s:shard1 r:core_node1 x:testschemaapi_shard1_replica1] o.a.s.c.SolrCore JMX monitoring not detected for core: testschemaapi_shard1_replica1
    [junit4] 2> 3011392 INFO (qtp1679878003-43760) [n:127.0.0.1:52240_solr c:testschemaapi s:shard1 r:core_node2 x:testschemaapi_shard1_replica2] o.a.s.c.CachingDirectoryFactory return new directory for C:\Users\jenkins\workspace\Lucene-Solr-6.1-Windows\solr\build\solr-core\test\J0\temp\solr.schema.TestManagedSchemaAPI_9450F0C458A7F7C9-001\tempDir-001\node2\.\testschemaapi_shard1_replica2\data\
    [junit4] 2> 3011392 INFO (qtp1679878003-43760) [n:127.0.0.1:52240_solr c:testschemaapi s:shard1 r:core_node2 x:testschemaapi_shard1_replica2] o.a.s.c.SolrCore New index directory detected: old=null new=C:\Users\jenkins\workspace\Lucene-Solr-6.1-Windows\solr\build\solr-core\test\J0\temp\solr.schema.TestManagedSchemaAPI_9450F0C458A7F7C9-001\tempDir-001\node2\.\testschemaapi_shard1_replica2\data\index/
    [junit4] 2> 3011392 WARN (qtp1679878003-43760) [n:127.0.0.1:52240_solr c:testschemaapi s:shard1 r:core_node2 x:testschemaapi_shard1_replica2] o.a.s.c.SolrCore [testschemaapi_shard1_replica2] Solr index directory 'C:\Users\jenkins\workspace\Lucene-Solr-6.1-Windows\solr\build\solr-core\test\J0\temp\solr.schema.TestManagedSchemaAPI_9450F0C458A7F7C9-001\tempDir-001\node2\.\testschemaapi_shard1_replica2\data\index' doesn't exist. Creating new index...
    [junit4] 2> 3011392 INFO (qtp758827352-43771) [n:127.0.0.1:52237_solr c:testschemaapi s:shard1 r:core_node1 x:testschemaapi_shard1_replica1] o.a.s.c.CachingDirectoryFactory return new directory for C:\Users\jenkins\workspace\Lucene-Solr-6.1-Windows\solr\build\solr-core\test\J0\temp\solr.schema.TestManagedSchemaAPI_9450F0C458A7F7C9-001\tempDir-001\node1\.\testschemaapi_shard1_replica1\data\
    [junit4] 2> 3011394 INFO (qtp758827352-43771) [n:127.0.0.1:52237_solr c:testschemaapi s:shard1 r:core_node1 x:testschemaapi_shard1_replica1] o.a.s.c.SolrCore New index directory detected: old=null new=C:\Users\jenkins\workspace\Lucene-Solr-6.1-Windows\solr\build\solr-core\test\J0\temp\solr.schema.TestManagedSchemaAPI_9450F0C458A7F7C9-001\tempDir-001\node1\.\testschemaapi_shard1_replica1\data\index/
    [junit4] 2> 3011394 INFO (qtp1679878003-43760) [n:127.0.0.1:52240_solr c:testschemaapi s:shard1 r:core_node2 x:testschemaapi_shard1_replica2] o.a.s.c.CachingDirectoryFactory return new directory for C:\Users\jenkins\workspace\Lucene-Solr-6.1-Windows\solr\build\solr-core\test\J0\temp\solr.schema.TestManagedSchemaAPI_9450F0C458A7F7C9-001\tempDir-001\node2\.\testschemaapi_shard1_replica2\data\index
    [junit4] 2> 3011394 WARN (qtp758827352-43771) [n:127.0.0.1:52237_solr c:testschemaapi s:shard1 r:core_node1 x:testschemaapi_shard1_replica1] o.a.s.c.SolrCore [testschemaapi_shard1_replica1] Solr index directory 'C:\Users\jenkins\workspace\Lucene-Solr-6.1-Windows\solr\build\solr-core\test\J0\temp\solr.schema.TestManagedSchemaAPI_9450F0C458A7F7C9-001\tempDir-001\node1\.\testschemaapi_shard1_replica1\data\index' doesn't exist. Creating new index...
    [junit4] 2> 3011394 INFO (qtp1679878003-43760) [n:127.0.0.1:52240_solr c:testschemaapi s:shard1 r:core_node2 x:testschemaapi_shard1_replica2] o.a.s.c.SolrDeletionPolicy SolrDeletionPolicy.onCommit: commits: num=1
    [junit4] 2> commit{dir=MockDirectoryWrapper(RAMDirectory@37d3f55f lockFactory=org.apache.lucene.store.SingleInstanceLockFactory@3e59aeba),segFN=segments_1,generation=1}
    [junit4] 2> 3011394 INFO (qtp1679878003-43760) [n:127.0.0.1:52240_solr c:testschemaapi s:shard1 r:core_node2 x:testschemaapi_shard1_replica2] o.a.s.c.SolrDeletionPolicy newest commit generation = 1
    [junit4] 2> 3011394 INFO (qtp758827352-43771) [n:127.0.0.1:52237_solr c:testschemaapi s:shard1 r:core_node1 x:testschemaapi_shard1_replica1] o.a.s.c.CachingDirectoryFactory return new directory for C:\Users\jenkins\workspace\Lucene-Solr-6.1-Windows\solr\build\solr-core\test\J0\temp\solr.schema.TestManagedSchemaAPI_9450F0C458A7F7C9-001\tempDir-001\node1\.\testschemaapi_shard1_replica1\data\index
    [junit4] 2> 3011394 INFO (OldIndexDirectoryCleanupThreadForCore-testschemaapi_shard1_replica2) [n:127.0.0.1:52240_solr c:testschemaapi s:shard1 r:core_node2 x:testschemaapi_shard1_replica2] o.a.s.c.SolrCore Looking for old index directories to cleanup for core testschemaapi_shard1_replica2 in C:\Users\jenkins\workspace\Lucene-Solr-6.1-Windows\solr\build\solr-core\test\J0\temp\solr.schema.TestManagedSchemaAPI_9450F0C458A7F7C9-001\tempDir-001\node2\.\testschemaapi_shard1_replica2\data\
    [junit4] 2> 3011396 INFO (qtp1679878003-43760) [n:127.0.0.1:52240_solr c:testschemaapi s:shard1 r:core_node2 x:testschemaapi_shard1_replica2] o.a.s.c.SolrCore no updateRequestProcessorChain defined as default, creating implicit default
    [junit4] 2> 3011396 INFO (qtp758827352-43771) [n:127.0.0.1:52237_solr c:testschemaapi s:shard1 r:core_node1 x:testschemaapi_shard1_replica1] o.a.s.c.SolrDeletionPolicy SolrDeletionPolicy.onCommit: commits: num=1
    [junit4] 2> commit{dir=MockDirectoryWrapper(RAMDirectory@6ec97518 lockFactory=org.apache.lucene.store.SingleInstanceLockFactory@6c6e7468),segFN=segments_1,generation=1}
    [junit4] 2> 3011396 INFO (qtp758827352-43771) [n:127.0.0.1:52237_solr c:testschemaapi s:shard1 r:core_node1 x:testschemaapi_shard1_replica1] o.a.s.c.SolrDeletionPolicy newest commit generation = 1
    [junit4] 2> 3011397 INFO (OldIndexDirectoryCleanupThreadForCore-testschemaapi_shard1_replica1) [n:127.0.0.1:52237_solr c:testschemaapi s:shard1 r:core_node1 x:testschemaapi_shard1_replica1] o.a.s.c.SolrCore Looking for old index directories to cleanup for core testschemaapi_shard1_replica1 in C:\Users\jenkins\workspace\Lucene-Solr-6.1-Windows\solr\build\solr-core\test\J0\temp\solr.schema.TestManagedSchemaAPI_9450F0C458A7F7C9-001\tempDir-001\node1\.\testschemaapi_shard1_replica1\data\
    [junit4] 2> 3011398 INFO (qtp758827352-43771) [n:127.0.0.1:52237_solr c:testschemaapi s:shard1 r:core_node1 x:testschemaapi_shard1_replica1] o.a.s.c.SolrCore no updateRequestProcessorChain defined as default, creating implicit default
    [junit4] 2> 3011400 WARN (OldIndexDirectoryCleanupThreadForCore-testschemaapi_shard1_replica2) [n:127.0.0.1:52240_solr c:testschemaapi s:shard1 r:core_node2 x:testschemaapi_shard1_replica2] o.a.s.c.DirectoryFactory C:\Users\jenkins\workspace\Lucene-Solr-6.1-Windows\solr\build\solr-core\test\J0\temp\solr.schema.TestManagedSchemaAPI_9450F0C458A7F7C9-001\tempDir-001\node2\.\testschemaapi_shard1_replica2\data\ does not point to a valid data directory; skipping clean-up of old index directories.
    [junit4] 2> 3011401 WARN (OldIndexDirectoryCleanupThreadForCore-testschemaapi_shard1_replica1) [n:127.0.0.1:52237_solr c:testschemaapi s:shard1 r:core_node1 x:testschemaapi_shard1_replica1] o.a.s.c.DirectoryFactory C:\Users\jenkins\workspace\Lucene-Solr-6.1-Windows\solr\build\solr-core\test\J0\temp\solr.schema.TestManagedSchemaAPI_9450F0C458A7F7C9-001\tempDir-001\node1\.\testschemaapi_shard1_replica1\data\ does not point to a valid data directory; skipping clean-up of old index directories.
    [junit4] 2> 3011411 INFO (qtp758827352-43771) [n:127.0.0.1:52237_solr c:testschemaapi s:shard1 r:core_node1 x:testschemaapi_shard1_replica1] o.a.s.h.l.XMLLoader xsltCacheLifetimeSeconds=60
    [junit4] 2> 3011411 INFO (qtp1679878003-43760) [n:127.0.0.1:52240_solr c:testschemaapi s:shard1 r:core_node2 x:testschemaapi_shard1_replica2] o.a.s.h.l.XMLLoader xsltCacheLifetimeSeconds=60
    [junit4] 2> 3011413 INFO (qtp758827352-43771) [n:127.0.0.1:52237_solr c:testschemaapi s:shard1 r:core_node1 x:testschemaapi_shard1_replica1] o.a.s.h.l.XMLLoader xsltCacheLifetimeSeconds=60
    [junit4] 2> 3011413 INFO (qtp1679878003-43760) [n:127.0.0.1:52240_solr c:testschemaapi s:shard1 r:core_node2 x:testschemaapi_shard1_replica2] o.a.s.h.l.XMLLoader xsltCacheLifetimeSeconds=60
    [junit4] 2> 3011415 INFO (qtp758827352-43771) [n:127.0.0.1:52237_solr c:testschemaapi s:shard1 r:core_node1 x:testschemaapi_shard1_replica1] o.a.s.h.l.XMLLoader xsltCacheLifetimeSeconds=60
    [junit4] 2> 3011415 INFO (qtp1679878003-43760) [n:127.0.0.1:52240_solr c:testschemaapi s:shard1 r:core_node2 x:testschemaapi_shard1_replica2] o.a.s.h.l.XMLLoader xsltCacheLifetimeSeconds=60
    [junit4] 2> 3011416 INFO (qtp758827352-43771) [n:127.0.0.1:52237_solr c:testschemaapi s:shard1 r:core_node1 x:testschemaapi_shard1_replica1] o.a.s.h.l.XMLLoader xsltCacheLifetimeSeconds=60
    [junit4] 2> 3011417 INFO (qtp1679878003-43760) [n:127.0.0.1:52240_solr c:testschemaapi s:shard1 r:core_node2 x:testschemaapi_shard1_replica2] o.a.s.h.l.XMLLoader xsltCacheLifetimeSeconds=60
    [junit4] 2> 3011419 INFO (qtp758827352-43771) [n:127.0.0.1:52237_solr c:testschemaapi s:shard1 r:core_node1 x:testschemaapi_shard1_replica1] o.a.s.c.RequestHandlers Registered paths: /admin/mbeans,/update/csv,/sql,/update/json/docs,/admin/luke,/graph,/export,/select,/admin/segments,/get,/admin/system,/replication,/admin/properties,/config,/stream,/schema,/admin/plugins,/admin/logging,/update/json,/admin/ping,/admin/threads,/update,/admin/file
    [junit4] 2> 3011419 INFO (qtp758827352-43771) [n:127.0.0.1:52237_solr c:testschemaapi s:shard1 r:core_node1 x:testschemaapi_shard1_replica1] o.a.s.c.SolrCore Using default statsCache cache: org.apache.solr.search.stats.LocalStatsCache
    [junit4] 2> 3011419 INFO (qtp1679878003-43760) [n:127.0.0.1:52240_solr c:testschemaapi s:shard1 r:core_node2 x:testschemaapi_shard1_replica2] o.a.s.c.RequestHandlers Registered paths: /admin/mbeans,/update/csv,/sql,/update/json/docs,/admin/luke,/graph,/export,/select,/admin/segments,/get,/admin/system,/replication,/admin/properties,/config,/stream,/schema,/admin/plugins,/admin/logging,/update/json,/admin/ping,/admin/threads,/update,/admin/file
    [junit4] 2> 3011419 INFO (qtp1679878003-43760) [n:127.0.0.1:52240_solr c:testschemaapi s:shard1 r:core_node2 x:testschemaapi_shard1_replica2] o.a.s.c.SolrCore Using default statsCache cache: org.apache.solr.search.stats.LocalStatsCache
    [junit4] 2> 3011421 INFO (qtp758827352-43771) [n:127.0.0.1:52237_solr c:testschemaapi s:shard1 r:core_node1 x:testschemaapi_shard1_replica1] o.a.s.u.UpdateHandler Using UpdateLog implementation: org.apache.solr.update.UpdateLog
    [junit4] 2> 3011421 INFO (qtp1679878003-43760) [n:127.0.0.1:52240_solr c:testschemaapi s:shard1 r:core_node2 x:testschemaapi_shard1_replica2] o.a.s.u.UpdateHandler Using UpdateLog implementation: org.apache.solr.update.UpdateLog
    [junit4] 2> 3011421 INFO (qtp1679878003-43760) [n:127.0.0.1:52240_solr c:testschemaapi s:shard1 r:core_node2 x:testschemaapi_shard1_replica2] o.a.s.u.UpdateLog Initializing UpdateLog: dataDir=null defaultSyncLevel=FLUSH numRecordsToKeep=100 maxNumLogsToKeep=10 numVersionBuckets=65536
    [junit4] 2> 3011421 INFO (qtp758827352-43771) [n:127.0.0.1:52237_solr c:testschemaapi s:shard1 r:core_node1 x:testschemaapi_shard1_replica1] o.a.s.u.UpdateLog Initializing UpdateLog: dataDir=null defaultSyncLevel=FLUSH numRecordsToKeep=100 maxNumLogsToKeep=10 numVersionBuckets=65536
    [junit4] 2> 3011425 INFO (qtp1679878003-43760) [n:127.0.0.1:52240_solr c:testschemaapi s:shard1 r:core_node2 x:testschemaapi_shard1_replica2] o.a.s.u.CommitTracker Hard AutoCommit: disabled
    [junit4] 2> 3011425 INFO (qtp1679878003-43760) [n:127.0.0.1:52240_solr c:testschemaapi s:shard1 r:core_node2 x:testschemaapi_shard1_replica2] o.a.s.u.CommitTracker Soft AutoCommit: disabled
    [junit4] 2> 3011426 INFO (qtp758827352-43771) [n:127.0.0.1:52237_solr c:testschemaapi s:shard1 r:core_node1 x:testschemaapi_shard1_replica1] o.a.s.u.CommitTracker Hard AutoCommit: disabled
    [junit4] 2> 3011426 INFO (qtp758827352-43771) [n:127.0.0.1:52237_solr c:testschemaapi s:shard1 r:core_node1 x:testschemaapi_shard1_replica1] o.a.s.u.CommitTracker Soft AutoCommit: disabled
    [junit4] 2> 3011428 INFO (qtp1679878003-43760) [n:127.0.0.1:52240_solr c:testschemaapi s:shard1 r:core_node2 x:testschemaapi_shard1_replica2] o.a.s.c.SolrDeletionPolicy SolrDeletionPolicy.onInit: commits: num=1
    [junit4] 2> commit{dir=MockDirectoryWrapper(RAMDirectory@37d3f55f lockFactory=org.apache.lucene.store.SingleInstanceLockFactory@3e59aeba),segFN=segments_1,generation=1}
    [junit4] 2> 3011428 INFO (qtp1679878003-43760) [n:127.0.0.1:52240_solr c:testschemaapi s:shard1 r:core_node2 x:testschemaapi_shard1_replica2] o.a.s.c.SolrDeletionPolicy newest commit generation = 1
    [junit4] 2> 3011428 INFO (qtp1679878003-43760) [n:127.0.0.1:52240_solr c:testschemaapi s:shard1 r:core_node2 x:testschemaapi_shard1_replica2] o.a.s.s.SolrIndexSearcher Opening [Searcher@3470cfb9[testschemaapi_shard1_replica2] main]
    [junit4] 2> 3011428 INFO (qtp1679878003-43760) [n:127.0.0.1:52240_solr c:testschemaapi s:shard1 r:core_node2 x:testschemaapi_shard1_replica2] o.a.s.c.c.ZkStateReader Load collection config from: [/collections/testschemaapi]
    [junit4] 2> 3011429 INFO (qtp758827352-43771) [n:127.0.0.1:52237_solr c:testschemaapi s:shard1 r:core_node1 x:testschemaapi_shard1_replica1] o.a.s.c.SolrDeletionPolicy SolrDeletionPolicy.onInit: commits: num=1
    [junit4] 2> commit{dir=MockDirectoryWrapper(RAMDirectory@6ec97518 lockFactory=org.apache.lucene.store.SingleInstanceLockFactory@6c6e7468),segFN=segments_1,generation=1}
    [junit4] 2> 3011429 INFO (qtp758827352-43771) [n:127.0.0.1:52237_solr c:testschemaapi s:shard1 r:core_node1 x:testschemaapi_shard1_replica1] o.a.s.c.SolrDeletionPolicy newest commit generation = 1
    [junit4] 2> 3011429 INFO (qtp758827352-43771) [n:127.0.0.1:52237_solr c:testschemaapi s:shard1 r:core_node1 x:testschemaapi_shard1_replica1] o.a.s.s.SolrIndexSearcher Opening [Searcher@2b52578[testschemaapi_shard1_replica1] main]
    [junit4] 2> 3011429 INFO (qtp758827352-43771) [n:127.0.0.1:52237_solr c:testschemaapi s:shard1 r:core_node1 x:testschemaapi_shard1_replica1] o.a.s.c.c.ZkStateReader Load collection config from: [/collections/testschemaapi]
    [junit4] 2> 3011431 INFO (qtp1679878003-43760) [n:127.0.0.1:52240_solr c:testschemaapi s:shard1 r:core_node2 x:testschemaapi_shard1_replica2] o.a.s.c.c.ZkStateReader path=[/collections/testschemaapi] [configName]=[conf1] specified config exists in ZooKeeper
    [junit4] 2> 3011431 INFO (qtp1679878003-43760) [n:127.0.0.1:52240_solr c:testschemaapi s:shard1 r:core_node2 x:testschemaapi_shard1_replica2] o.a.s.r.ManagedResourceStorage Setting up ZooKeeper-based storage for the RestManager with znodeBase: /configs/conf1
    [junit4] 2> 3011432 INFO (qtp758827352-43771) [n:127.0.0.1:52237_solr c:testschemaapi s:shard1 r:core_node1 x:testschemaapi_shard1_replica1] o.a.s.c.c.ZkStateReader path=[/collections/testschemaapi] [configName]=[conf1] specified config exists in ZooKeeper
    [junit4] 2> 3011432 INFO (qtp1679878003-43760) [n:127.0.0.1:52240_solr c:testschemaapi s:shard1 r:core_node2 x:testschemaapi_shard1_replica2] o.a.s.r.ManagedResourceStorage Configured ZooKeeperStorageIO with znodeBase: /configs/conf1
    [junit4] 2> 3011432 INFO (qtp758827352-43771) [n:127.0.0.1:52237_solr c:testschemaapi s:shard1 r:core_node1 x:testschemaapi_shard1_replica1] o.a.s.r.ManagedResourceStorage Setting up ZooKeeper-based storage for the RestManager with znodeBase: /configs/conf1
    [junit4] 2> 3011432 INFO (qtp1679878003-43760) [n:127.0.0.1:52240_solr c:testschemaapi s:shard1 r:core_node2 x:testschemaapi_shard1_replica2] o.a.s.r.RestManager Initializing RestManager with initArgs: {}
    [junit4] 2> 3011432 INFO (qtp1679878003-43760) [n:127.0.0.1:52240_solr c:testschemaapi s:shard1 r:core_node2 x:testschemaapi_shard1_replica2] o.a.s.r.ManagedResourceStorage Reading _rest_managed.json using ZooKeeperStorageIO:path=/configs/conf1
    [junit4] 2> 3011433 INFO (qtp758827352-43771) [n:127.0.0.1:52237_solr c:testschemaapi s:shard1 r:core_node1 x:testschemaapi_shard1_replica1] o.a.s.r.ManagedResourceStorage Configured ZooKeeperStorageIO with znodeBase: /configs/conf1
    [junit4] 2> 3011433 INFO (qtp758827352-43771) [n:127.0.0.1:52237_solr c:testschemaapi s:shard1 r:core_node1 x:testschemaapi_shard1_replica1] o.a.s.r.RestManager Initializing RestManager with initArgs: {}
    [junit4] 2> 3011433 INFO (qtp758827352-43771) [n:127.0.0.1:52237_solr c:testschemaapi s:shard1 r:core_node1 x:testschemaapi_shard1_replica1] o.a.s.r.ManagedResourceStorage Reading _rest_managed.json using ZooKeeperStorageIO:path=/configs/conf1
    [junit4] 2> 3011433 INFO (qtp758827352-43771) [n:127.0.0.1:52237_solr c:testschemaapi s:shard1 r:core_node1 x:testschemaapi_shard1_replica1] o.a.s.r.ManagedResourceStorage No data found for znode /configs/conf1/_rest_managed.json
    [junit4] 2> 3011434 INFO (qtp758827352-43771) [n:127.0.0.1:52237_solr c:testschemaapi s:shard1 r:core_node1 x:testschemaapi_shard1_replica1] o.a.s.r.ManagedResourceStorage Loaded null at path _rest_managed.json using ZooKeeperStorageIO:path=/configs/conf1
    [junit4] 2> 3011434 INFO (qtp1679878003-43760) [n:127.0.0.1:52240_solr c:testschemaapi s:shard1 r:core_node2 x:testschemaapi_shard1_replica2] o.a.s.r.ManagedResourceStorage No data found for znode /configs/conf1/_rest_managed.json
    [junit4] 2> 3011434 INFO (qtp758827352-43771) [n:127.0.0.1:52237_solr c:testschemaapi s:shard1 r:core_node1 x:testschemaapi_shard1_replica1] o.a.s.r.RestManager Initializing 0 registered ManagedResources
    [junit4] 2> 3011434 INFO (qtp1679878003-43760) [n:127.0.0.1:52240_solr c:testschemaapi s:shard1 r:core_node2 x:testschemaapi_shard1_replica2] o.a.s.r.ManagedResourceStorage Loaded null at path _rest_managed.json using ZooKeeperStorageIO:path=/configs/conf1
    [junit4] 2> 3011434 INFO (qtp758827352-43771) [n:127.0.0.1:52237_solr c:testschemaapi s:shard1 r:core_node1 x:testschemaapi_shard1_replica1] o.a.s.s.ZkIndexSchemaReader Creating ZooKeeper watch for the managed schema at /configs/conf1/managed-schema
    [junit4] 2> 3011434 INFO (qtp1679878003-43760) [n:127.0.0.1:52240_solr c:testschemaapi s:shard1 r:core_node2 x:testschemaapi_shard1_replica2] o.a.s.r.RestManager Initializing 0 registered ManagedResources
    [junit4] 2> 3011434 INFO (qtp1679878003-43760) [n:127.0.0.1:52240_solr c:testschemaapi s:shard1 r:core_node2 x:testschemaapi_shard1_replica2] o.a.s.s.ZkIndexSchemaReader Creating ZooKeeper watch for the managed schema at /configs/conf1/managed-schema
    [junit4] 2> 3011435 INFO (qtp1679878003-43760) [n:127.0.0.1:52240_solr c:testschemaapi s:shard1 r:core_node2 x:testschemaapi_shard1_replica2] o.a.s.c.ZkController Added new OnReconnect listener ZkIndexSchemaReader: /configs/conf1/managed-schema, uniqueCoreId: testschemaapi_shard1_replica2:1193263430838982
    [junit4] 2> 3011435 INFO (qtp1679878003-43760) [n:127.0.0.1:52240_solr c:testschemaapi s:shard1 r:core_node2 x:testschemaapi_shard1_replica2] o.a.s.h.ReplicationHandler Commits will be reserved for 10000
    [junit4] 2> 3011435 INFO (searcherExecutor-11195-thread-1-processing-n:127.0.0.1:52240_solr x:testschemaapi_shard1_replica2 s:shard1 c:testschemaapi r:core_node2) [n:127.0.0.1:52240_solr c:testschemaapi s:shard1 r:core_node2 x:testschemaapi_shard1_replica2] o.a.s.c.SolrCore [testschemaapi_shard1_replica2] Registered new searcher Searcher@3470cfb9[testschemaapi_shard1_replica2] main{ExitableDirectoryReader(UninvertingDirectoryReader())}
    [junit4] 2> 3011436 INFO (qtp1679878003-43760) [n:127.0.0.1:52240_solr c:testschemaapi s:shard1 r:core_node2 x:testschemaapi_shard1_replica2] o.a.s.u.UpdateLog Looking up max value of version field to seed version buckets
    [junit4] 2> 3011436 INFO (qtp1679878003-43760) [n:127.0.0.1:52240_solr c:testschemaapi s:shard1 r:core_node2 x:testschemaapi_shard1_replica2] o.a.s.u.VersionInfo Refreshing highest value of _version_ for 65536 version buckets from index
    [junit4] 2> 3011436 INFO (qtp1679878003-43760) [n:127.0.0.1:52240_solr c:testschemaapi s:shard1 r:core_node2 x:testschemaapi_shard1_replica2] o.a.s.u.VersionInfo No terms found for _version_, cannot seed version bucket highest value from index
    [junit4] 2> 3011436 INFO (qtp1679878003-43760) [n:127.0.0.1:52240_solr c:testschemaapi s:shard1 r:core_node2 x:testschemaapi_shard1_replica2] o.a.s.u.UpdateLog Could not find max version in index or recent updates, using new clock 1536858073614778368
    [junit4] 2> 3011437 INFO (qtp758827352-43771) [n:127.0.0.1:52237_solr c:testschemaapi s:shard1 r:core_node1 x:testschemaapi_shard1_replica1] o.a.s.c.ZkController Added new OnReconnect listener ZkIndexSchemaReader: /configs/conf1/managed-schema, uniqueCoreId: testschemaapi_shard1_replica1:1193263430962859
    [junit4] 2> 3011437 INFO (qtp758827352-43771) [n:127.0.0.1:52237_solr c:testschemaapi s:shard1 r:core_node1 x:testschemaapi_shard1_replica1] o.a.s.h.ReplicationHandler Commits will be reserved for 10000
    [junit4] 2> 3011437 INFO (searcherExecutor-11196-thread-1-processing-n:127.0.0.1:52237_solr x:testschemaapi_shard1_replica1 s:shard1 c:testschemaapi r:core_node1) [n:127.0.0.1:52237_solr c:testschemaapi s:shard1 r:core_node1 x:testschemaapi_shard1_replica1] o.a.s.c.SolrCore [testschemaapi_shard1_replica1] Registered new searcher Searcher@2b52578[testschemaapi_shard1_replica1] main{ExitableDirectoryReader(UninvertingDirectoryReader())}
    [junit4] 2> 3011437 INFO (qtp758827352-43771) [n:127.0.0.1:52237_solr c:testschemaapi s:shard1 r:core_node1 x:testschemaapi_shard1_replica1] o.a.s.u.UpdateLog Looking up max value of version field to seed version buckets
    [junit4] 2> 3011437 INFO (qtp758827352-43771) [n:127.0.0.1:52237_solr c:testschemaapi s:shard1 r:core_node1 x:testschemaapi_shard1_replica1] o.a.s.u.VersionInfo Refreshing highest value of _version_ for 65536 version buckets from index
    [junit4] 2> 3011438 INFO (qtp758827352-43771) [n:127.0.0.1:52237_solr c:testschemaapi s:shard1 r:core_node1 x:testschemaapi_shard1_replica1] o.a.s.u.VersionInfo No terms found for _version_, cannot seed version bucket highest value from index
    [junit4] 2> 3011438 INFO (qtp1679878003-43760) [n:127.0.0.1:52240_solr c:testschemaapi s:shard1 r:core_node2 x:testschemaapi_shard1_replica2] o.a.s.u.UpdateLog Took 2.0ms to seed version buckets with highest version 1536858073614778368
    [junit4] 2> 3011438 INFO (qtp1679878003-43760) [n:127.0.0.1:52240_solr c:testschemaapi s:shard1 r:core_node2 x:testschemaapi_shard1_replica2] o.a.s.c.ZkController watch zkdir /configs/conf1
    [junit4] 2> 3011438 INFO (qtp758827352-43771) [n:127.0.0.1:52237_solr c:testschemaapi s:shard1 r:core_node1 x:testschemaapi_shard1_replica1] o.a.s.u.UpdateLog Could not find max version in index or recent updates, using new clock 1536858073616875520
    [junit4] 2> 3011439 INFO (qtp1679878003-43760) [n:127.0.0.1:52240_solr c:testschemaapi s:shard1 r:core_node2 x:testschemaapi_shard1_replica2] o.a.s.c.CoreContainer registering core: testschemaapi_shard1_replica2
    [junit4] 2> 3011440 INFO (qtp1679878003-43760) [n:127.0.0.1:52240_solr c:testschemaapi s:shard1 r:core_node2 x:testschemaapi_shard1_replica2] o.a.s.c.ZkController Register replica - core:testschemaapi_shard1_replica2 address:https://127.0.0.1:52240/solr collection:testschemaapi shard:shard1
    [junit4] 2> 3011440 INFO (qtp758827352-43771) [n:127.0.0.1:52237_solr c:testschemaapi s:shard1 r:core_node1 x:testschemaapi_shard1_replica1] o.a.s.u.UpdateLog Took 3.0ms to seed version buckets with highest version 1536858073616875520
    [junit4] 2> 3011441 INFO (qtp758827352-43771) [n:127.0.0.1:52237_solr c:testschemaapi s:shard1 r:core_node1 x:testschemaapi_shard1_replica1] o.a.s.c.ZkController watch zkdir /configs/conf1
    [junit4] 2> 3011442 INFO (qtp758827352-43771) [n:127.0.0.1:52237_solr c:testschemaapi s:shard1 r:core_node1 x:testschemaapi_shard1_replica1] o.a.s.c.CoreContainer registering core: testschemaapi_shard1_replica1
    [junit4] 2> 3011442 INFO (qtp758827352-43771) [n:127.0.0.1:52237_solr c:testschemaapi s:shard1 r:core_node1 x:testschemaapi_shard1_replica1] o.a.s.c.ZkController Register replica - core:testschemaapi_shard1_replica1 address:https://127.0.0.1:52237/solr collection:testschemaapi shard:shard1
    [junit4] 2> 3011444 INFO (qtp758827352-43771) [n:127.0.0.1:52237_solr c:testschemaapi s:shard1 r:core_node1 x:testschemaapi_shard1_replica1] o.a.s.c.c.SolrZkClient makePath: /collections/testschemaapi/leader_elect/shard1/election
    [junit4] 2> 3011444 INFO (qtp1679878003-43760) [n:127.0.0.1:52240_solr c:testschemaapi s:shard1 r:core_node2 x:testschemaapi_shard1_replica2] o.a.s.c.c.SolrZkClient makePath: /collections/testschemaapi/leader_elect/shard1/election
    [junit4] 2> 3011454 INFO (qtp1679878003-43760) [n:127.0.0.1:52240_solr c:testschemaapi s:shard1 r:core_node2 x:testschemaapi_shard1_replica2] o.a.s.c.LeaderElector Joined leadership election with path: /collections/testschemaapi/leader_elect/shard1/election/96053629422010373-core_node2-n_0000000001
    [junit4] 2> 3011454 INFO (qtp758827352-43771) [n:127.0.0.1:52237_solr c:testschemaapi s:shard1 r:core_node1 x:testschemaapi_shard1_replica1] o.a.s.c.LeaderElector Joined leadership election with path: /collections/testschemaapi/leader_elect/shard1/election/96053629422010374-core_node1-n_0000000000
    [junit4] 2> 3011456 INFO (qtp758827352-43771) [n:127.0.0.1:52237_solr c:testschemaapi s:shard1 r:core_node1 x:testschemaapi_shard1_replica1] o.a.s.c.ShardLeaderElectionContext Running the leader process for shard=shard1 and weAreReplacement=false and leaderVoteWait=10000
    [junit4] 2> 3011457 INFO (qtp1679878003-43760) [n:127.0.0.1:52240_solr c:testschemaapi s:shard1 r:core_node2 x:testschemaapi_shard1_replica2] o.a.s.c.LeaderElector Watching path /collections/testschemaapi/leader_elect/shard1/election/96053629422010374-core_node1-n_0000000000 to know if I could be the leader
    [junit4] 2> 3011461 INFO (qtp758827352-43771) [n:127.0.0.1:52237_solr c:testschemaapi s:shard1 r:core_node1 x:testschemaapi_shard1_replica1] o.a.s.c.ShardLeaderElectionContext Enough replicas found to continue.
    [junit4] 2> 3011461 INFO (qtp758827352-43771) [n:127.0.0.1:52237_solr c:testschemaapi s:shard1 r:core_node1 x:testschemaapi_shard1_replica1] o.a.s.c.ShardLeaderElectionContext I may be the new leader - try and sync
    [junit4] 2> 3011461 INFO (qtp758827352-43771) [n:127.0.0.1:52237_solr c:testschemaapi s:shard1 r:core_node1 x:testschemaapi_shard1_replica1] o.a.s.c.SyncStrategy Sync replicas to https://127.0.0.1:52237/solr/testschemaapi_shard1_replica1/
    [junit4] 2> 3011461 INFO (qtp758827352-43771) [n:127.0.0.1:52237_solr c:testschemaapi s:shard1 r:core_node1 x:testschemaapi_shard1_replica1] o.a.s.u.PeerSync PeerSync: core=testschemaapi_shard1_replica1 url=https://127.0.0.1:52237/solr START replicas=[https://127.0.0.1:52240/solr/testschemaapi_shard1_replica2/] nUpdates=100
    [junit4] 2> 3011462 INFO (qtp758827352-43771) [n:127.0.0.1:52237_solr c:testschemaapi s:shard1 r:core_node1 x:testschemaapi_shard1_replica1] o.a.s.u.PeerSync PeerSync: core=testschemaapi_shard1_replica1 url=https://127.0.0.1:52237/solr DONE. We have no versions. sync failed.
    [junit4] 2> 3011462 INFO (qtp758827352-43771) [n:127.0.0.1:52237_solr c:testschemaapi s:shard1 r:core_node1 x:testschemaapi_shard1_replica1] o.a.s.c.SyncStrategy Leader's attempt to sync with shard failed, moving to the next candidate
    [junit4] 2> 3011462 INFO (qtp758827352-43771) [n:127.0.0.1:52237_solr c:testschemaapi s:shard1 r:core_node1 x:testschemaapi_shard1_replica1] o.a.s.c.ShardLeaderElectionContext We failed sync, but we have no versions - we can't sync in that case - we were active before, so become leader anyway
    [junit4] 2> 3011463 INFO (OverseerStateUpdate-96053629422010374-127.0.0.1:52237_solr-n_0000000000) [n:127.0.0.1:52237_solr ] o.a.s.c.Overseer processMessage: queueSize: 1, message = {
    [junit4] 2> "operation":"leader",
    [junit4] 2> "shard":"shard1",
    [junit4] 2> "collection":"testschemaapi"} current state version: 0
    [junit4] 2> 3011468 INFO (qtp758827352-43771) [n:127.0.0.1:52237_solr c:testschemaapi s:shard1 r:core_node1 x:testschemaapi_shard1_replica1] o.a.s.c.c.SolrZkClient makePath: /collections/testschemaapi/leaders/shard1
    [junit4] 2> 3011470 INFO (qtp1679878003-43773) [n:127.0.0.1:52240_solr c:testschemaapi s:shard1 r:core_node2 x:testsch

[...truncated too long message...]

equests, TestDocSet, TestPartialUpdateDeduplication, TestSearchPerf, HdfsDirectoryFactoryTest, BJQParserTest, TestSchemaResource, HttpPartitionTest, SystemInfoHandlerTest, TestGeoJSONResponseWriter, DirectoryFactoryTest, TestCollectionAPI, ReturnFieldsTest, HdfsLockFactoryTest, TestGraphTermsQParserPlugin, TestReplicationHandler, SimplePostToolTest, TestMiniSolrCloudClusterSSL, SchemaVersionSpecificBehaviorTest, WrapperMergePolicyFactoryTest, ActionThrottleTest, TestJmxMonitoredMap, SegmentsInfoRequestHandlerTest, TestLazyCores, HdfsCollectionsAPIDistributedZkTest, TestReqParamsAPI, TestStressReorder, UnloadDistributedZkTest, SimpleCollectionCreateDeleteTest, TestCloudBackupRestore, TimeZoneUtilsTest, TestLeaderElectionZkExpiry, TestDynamicFieldResource, TestUpdate, PolyFieldTest, TestBlendedInfixSuggestions, MergeStrategyTest, PreAnalyzedUpdateProcessorTest, TestSweetSpotSimilarityFactory, CursorPagingTest, TestRawResponseWriter, TestRestManager, ZkControllerTest, SolrIndexConfigTest, TestSchemaManager, ConcurrentDeleteAndCreateCollectionTest, FastVectorHighlighterTest, TestTolerantSearch, TestLFUCache, TestQuerySenderNoQuery, StressHdfsTest, TestRandomRequestDistribution, TestFieldCacheWithThreads, TestIBSimilarityFactory, InfoHandlerTest, CustomCollectionTest, TestSimpleQParserPlugin, TestDFRSimilarityFactory, BigEndianAscendingWordSerializerTest, TestPKIAuthenticationPlugin, TestManagedSynonymFilterFactory, DocValuesMissingTest, TestWordDelimiterFilterFactory, TestPerFieldSimilarityWithDefaultOverride, TestNumericTerms32, SampleTest, SuggestComponentTest, TestLMDirichletSimilarityFactory, DistributedQueryComponentCustomSortTest, RegexBoostProcessorTest, TestFieldResource, SuggesterFSTTest, TestTolerantUpdateProcessorRandomCloud, OverseerTest, HdfsBasicDistributedZk2Test, TestReloadDeadlock, HighlighterMaxOffsetTest, ClusterStateTest, TestDocumentBuilder, StandardRequestHandlerTest, HdfsChaosMonkeyNothingIsSafeTest, AnalysisErrorHandlingTest, BasicDistributedZkTest, PreAnalyzedFieldTest, CdcrRequestHandlerTest, TestEmbeddedSolrServerConstructors, ScriptEngineTest, RequestLoggingTest, MoreLikeThisHandlerTest, TestConfig, HdfsRestartWhileUpdatingTest, TestSolrDeletionPolicy1, CdcrReplicationDistributedZkTest, CloudMLTQParserTest, ChaosMonkeySafeLeaderTest, BasicDistributedZk2Test, SyncSliceTest, FullSolrCloudDistribCmdsTest, ZkSolrClientTest, ZkCLITest, TestDistributedSearch, SuggesterTSTTest, TestStressLucene, WordBreakSolrSpellCheckerTest, SolrCoreCheckLockOnStartupTest, TestPseudoReturnFields, FieldMutatingUpdateProcessorTest, TestAtomicUpdateErrorCases, StatelessScriptUpdateProcessorFactoryTest, DocValuesMultiTest, SolrInfoMBeanTest, LukeRequestHandlerTest, DirectSolrSpellCheckerTest, FileBasedSpellCheckerTest, XmlUpdateRequestHandlerTest, TestValueSourceCache, RequiredFieldsTest, TestArbitraryIndexDir, TestJmxIntegration, QueryParsingTest, PingRequestHandlerTest, TestBinaryResponseWriter, SOLR749Test, UpdateParamsTest, BadComponentTest, TestSolrDeletionPolicy2, MultiTermTest, MinimalSchemaTest, OutputWriterTest, ExternalFileFieldSortTest, TestPostingsSolrHighlighter, TestLuceneMatchVersion, SpellPossibilityIteratorTest, TestCodecSupport, TestFastOutputStream, URLClassifyProcessorTest, TestSuggestSpellingConverter, DateFieldTest, SpellingQueryConverterTest, RAMDirectoryFactoryTest, TestLRUCache, SliceStateTest, TestRTGBase, DistributedIntervalFacetingTest, SolrTestCaseJ4Test, TestCursorMarkWithoutUniqueKey, TestDistributedMissingSort, TestHighlightDedupGrouping, TestSimpleTrackingShardHandler, TestJettySolrRunner, AssignTest, AsyncMigrateRouteKeyTest, CollectionsAPIAsyncDistributedZkTest, DeleteShardTest, DeleteStatusTest, DistributedQueueTest, DistributedVersionInfoTest, LeaderFailoverAfterPartitionTest, LeaderInitiatedRecoveryOnCommitTest, OutOfBoxZkACLAndCredentialsProvidersTest, OverseerCollectionConfigSetProcessorTest, RemoteQueryErrorTest, SSLMigrationTest, SharedFSAutoReplicaFailoverTest, SharedFSAutoReplicaFailoverUtilsTest, SolrCloudExampleTest, TestCloudInspectUtil, TestCloudPivotFacet, TestConfigSetsAPIExclusivity, TestConfigSetsAPIZkFailure, TestCryptoKeys, TestDistribDocBasedVersion, TestExclusionRuleCollectionAccess, TestReplicaProperties, TestStressLiveNodes, VMParamsZkACLAndCredentialsProvidersTest, HdfsRecoverLeaseTest, HdfsSyncSliceTest, HdfsThreadLeakTest, HdfsUnloadDistributedZkTest, HdfsWriteToMultipleCollectionsTest, TestClusterStateMutator, ZkStateReaderTest, RuleEngineTest, RulesTest, CoreAdminCreateDiscoverTest, CoreAdminRequestStatusTest, DistributedExpandComponentTest, DistributedFacetPivotLargeTest, DistributedFacetPivotSmallTest, DistributedQueryComponentOptimizationTest, TestDistributedStatsComponentCardinality, TestUniqueKeyFieldResource, SpatialRPTFieldTypeTest, TestCloudSchemaless, TestCollationFieldDocValues, TestManagedSchema, TestManagedSchemaAPI]
    [junit4] 2> NOTE: reproduce with: ant test -Dtestcase=TestManagedSchemaAPI -Dtests.seed=9450F0C458A7F7C9 -Dtests.slow=true -Dtests.locale=en-IN -Dtests.timezone=Etc/GMT-2 -Dtests.asserts=true -Dtests.file.encoding=Cp1252
    [junit4] ERROR 0.00s J0 | TestManagedSchemaAPI (suite) <<<
    [junit4] > Throwable #1: java.lang.AssertionError: ObjectTracker found 8 object(s) that were not released!!! [TransactionLog, MockDirectoryWrapper, MockDirectoryWrapper, MockDirectoryWrapper, MDCAwareThreadPoolExecutor, MDCAwareThreadPoolExecutor, TransactionLog, MockDirectoryWrapper]
    [junit4] > at __randomizedtesting.SeedInfo.seed([9450F0C458A7F7C9]:0)
    [junit4] > at org.apache.solr.SolrTestCaseJ4.teardownTestCases(SolrTestCaseJ4.java:257)
    [junit4] > at java.lang.Thread.run(Thread.java:745)Throwable #2: java.io.IOException: Could not remove the following files (in the order of attempts):
    [junit4] > C:\Users\jenkins\workspace\Lucene-Solr-6.1-Windows\solr\build\solr-core\test\J0\temp\solr.schema.TestManagedSchemaAPI_9450F0C458A7F7C9-001\tempDir-001\node1\testschemaapi_shard1_replica1\data\tlog\tlog.0000000000000000001: java.nio.file.FileSystemException: C:\Users\jenkins\workspace\Lucene-Solr-6.1-Windows\solr\build\solr-core\test\J0\temp\solr.schema.TestManagedSchemaAPI_9450F0C458A7F7C9-001\tempDir-001\node1\testschemaapi_shard1_replica1\data\tlog\tlog.0000000000000000001: The process cannot access the file because it is being used by another process.
    [junit4] > C:\Users\jenkins\workspace\Lucene-Solr-6.1-Windows\solr\build\solr-core\test\J0\temp\solr.schema.TestManagedSchemaAPI_9450F0C458A7F7C9-001\tempDir-001\node1\testschemaapi_shard1_replica1\data\tlog: java.nio.file.DirectoryNotEmptyException: C:\Users\jenkins\workspace\Lucene-Solr-6.1-Windows\solr\build\solr-core\test\J0\temp\solr.schema.TestManagedSchemaAPI_9450F0C458A7F7C9-001\tempDir-001\node1\testschemaapi_shard1_replica1\data\tlog
    [junit4] > C:\Users\jenkins\workspace\Lucene-Solr-6.1-Windows\solr\build\solr-core\test\J0\temp\solr.schema.TestManagedSchemaAPI_9450F0C458A7F7C9-001\tempDir-001\node1\testschemaapi_shard1_replica1\data: java.nio.file.DirectoryNotEmptyException: C:\Users\jenkins\workspace\Lucene-Solr-6.1-Windows\solr\build\solr-core\test\J0\temp\solr.schema.TestManagedSchemaAPI_9450F0C458A7F7C9-001\tempDir-001\node1\testschemaapi_shard1_replica1\data
    [junit4] > C:\Users\jenkins\workspace\Lucene-Solr-6.1-Windows\solr\build\solr-core\test\J0\temp\solr.schema.TestManagedSchemaAPI_9450F0C458A7F7C9-001\tempDir-001\node1\testschemaapi_shard1_replica1: java.nio.file.DirectoryNotEmptyException: C:\Users\jenkins\workspace\Lucene-Solr-6.1-Windows\solr\build\solr-core\test\J0\temp\solr.schema.TestManagedSchemaAPI_9450F0C458A7F7C9-001\tempDir-001\node1\testschemaapi_shard1_replica1
    [junit4] > C:\Users\jenkins\workspace\Lucene-Solr-6.1-Windows\solr\build\solr-core\test\J0\temp\solr.schema.TestManagedSchemaAPI_9450F0C458A7F7C9-001\tempDir-001\node1: java.nio.file.DirectoryNotEmptyException: C:\Users\jenkins\workspace\Lucene-Solr-6.1-Windows\solr\build\solr-core\test\J0\temp\solr.schema.TestManagedSchemaAPI_9450F0C458A7F7C9-001\tempDir-001\node1
    [junit4] > C:\Users\jenkins\workspace\Lucene-Solr-6.1-Windows\solr\build\solr-core\test\J0\temp\solr.schema.TestManagedSchemaAPI_9450F0C458A7F7C9-001\tempDir-001: java.nio.file.DirectoryNotEmptyException: C:\Users\jenkins\workspace\Lucene-Solr-6.1-Windows\solr\build\solr-core\test\J0\temp\solr.schema.TestManagedSchemaAPI_9450F0C458A7F7C9-001\tempDir-001
    [junit4] > at org.apache.lucene.util.IOUtils.rm(IOUtils.java:323)
    [junit4] > at java.lang.Thread.run(Thread.java:745)
    [junit4] Completed [548/614 (1!)] on J0 in 14.04s, 1 test, 1 failure, 1 error <<< FAILURES!

[...truncated 227 lines...]
BUILD FAILED
C:\Users\jenkins\workspace\Lucene-Solr-6.1-Windows\build.xml:740: The following error occurred while executing this line:
C:\Users\jenkins\workspace\Lucene-Solr-6.1-Windows\build.xml:684: The following error occurred while executing this line:
C:\Users\jenkins\workspace\Lucene-Solr-6.1-Windows\build.xml:59: The following error occurred while executing this line:
C:\Users\jenkins\workspace\Lucene-Solr-6.1-Windows\solr\build.xml:233: The following error occurred while executing this line:
C:\Users\jenkins\workspace\Lucene-Solr-6.1-Windows\solr\common-build.xml:531: The following error occurred while executing this line:
C:\Users\jenkins\workspace\Lucene-Solr-6.1-Windows\lucene\common-build.xml:1427: The following error occurred while executing this line:
C:\Users\jenkins\workspace\Lucene-Solr-6.1-Windows\lucene\common-build.xml:984: There were test failures: 614 suites (10 ignored), 2580 tests, 2 suite-level errors, 126 ignored (82 assumptions) [seed: 9450F0C458A7F7C9]

Total time: 79 minutes 20 seconds
Build step 'Invoke Ant' marked build as failure
Archiving artifacts
[WARNINGS] Skipping publisher since build result is FAILURE
Recording test results
Email was triggered for: Failure - Any
Sending email for trigger: Failure - Any

Search Discussions

Discussion Posts

Previous

Related Discussions

Discussion Navigation
viewthread | post
posts ‹ prev | 2 of 2 | next ›
Discussion Overview
groupdev @
categorieslucene
postedJun 11, '16 at 5:44a
activeJun 11, '16 at 4:31p
posts2
users1
websitelucene.apache.org

1 user in discussion

Policeman Jenkins Server: 2 posts

People

Translate

site design / logo © 2021 Grokbase