Grokbase Groups Lucene dev June 2016
FAQ
Build: http://jenkins.thetaphi.de/job/Lucene-Solr-6.1-Windows/4/
Java: 32bit/jdk1.8.0_92 -client -XX:+UseConcMarkSweepGC

1 tests failed.
FAILED: org.apache.solr.core.TestDynamicLoading.testDynamicLoading

Error Message:
Could not get expected value 'X val changed' for path 'x' full output: { "responseHeader":{ "status":0, "QTime":0}, "params":{"wt":"json"}, "context":{ "webapp":"/t_nds/jx", "path":"/test1", "httpMethod":"GET"}, "class":"org.apache.solr.core.BlobStoreTestRequestHandler", "x":null}, from server: null

Stack Trace:
java.lang.AssertionError: Could not get expected value 'X val changed' for path 'x' full output: {
   "responseHeader":{
     "status":0,
     "QTime":0},
   "params":{"wt":"json"},
   "context":{
     "webapp":"/t_nds/jx",
     "path":"/test1",
     "httpMethod":"GET"},
   "class":"org.apache.solr.core.BlobStoreTestRequestHandler",
   "x":null}, from server: null
  at __randomizedtesting.SeedInfo.seed([4DE6E0798DF9C798:95ABCD2E7A246238]:0)
  at org.junit.Assert.fail(Assert.java:93)
  at org.junit.Assert.assertTrue(Assert.java:43)
  at org.apache.solr.core.TestSolrConfigHandler.testForResponseElement(TestSolrConfigHandler.java:481)
  at org.apache.solr.core.TestDynamicLoading.testDynamicLoading(TestDynamicLoading.java:250)
  at sun.reflect.NativeMethodAccessorImpl.invoke0(Native Method)
  at sun.reflect.NativeMethodAccessorImpl.invoke(NativeMethodAccessorImpl.java:62)
  at sun.reflect.DelegatingMethodAccessorImpl.invoke(DelegatingMethodAccessorImpl.java:43)
  at java.lang.reflect.Method.invoke(Method.java:498)
  at com.carrotsearch.randomizedtesting.RandomizedRunner.invoke(RandomizedRunner.java:1764)
  at com.carrotsearch.randomizedtesting.RandomizedRunner$8.evaluate(RandomizedRunner.java:871)
  at com.carrotsearch.randomizedtesting.RandomizedRunner$9.evaluate(RandomizedRunner.java:907)
  at com.carrotsearch.randomizedtesting.RandomizedRunner$10.evaluate(RandomizedRunner.java:921)
  at org.apache.solr.BaseDistributedSearchTestCase$ShardsRepeatRule$ShardsFixedStatement.callStatement(BaseDistributedSearchTestCase.java:992)
  at org.apache.solr.BaseDistributedSearchTestCase$ShardsRepeatRule$ShardsStatement.evaluate(BaseDistributedSearchTestCase.java:967)
  at com.carrotsearch.randomizedtesting.rules.SystemPropertiesRestoreRule$1.evaluate(SystemPropertiesRestoreRule.java:57)
  at org.apache.lucene.util.TestRuleSetupTeardownChained$1.evaluate(TestRuleSetupTeardownChained.java:49)
  at org.apache.lucene.util.AbstractBeforeAfterRule$1.evaluate(AbstractBeforeAfterRule.java:45)
  at org.apache.lucene.util.TestRuleThreadAndTestName$1.evaluate(TestRuleThreadAndTestName.java:48)
  at org.apache.lucene.util.TestRuleIgnoreAfterMaxFailures$1.evaluate(TestRuleIgnoreAfterMaxFailures.java:64)
  at org.apache.lucene.util.TestRuleMarkFailure$1.evaluate(TestRuleMarkFailure.java:47)
  at com.carrotsearch.randomizedtesting.rules.StatementAdapter.evaluate(StatementAdapter.java:36)
  at com.carrotsearch.randomizedtesting.ThreadLeakControl$StatementRunner.run(ThreadLeakControl.java:367)
  at com.carrotsearch.randomizedtesting.ThreadLeakControl.forkTimeoutingTask(ThreadLeakControl.java:809)
  at com.carrotsearch.randomizedtesting.ThreadLeakControl$3.evaluate(ThreadLeakControl.java:460)
  at com.carrotsearch.randomizedtesting.RandomizedRunner.runSingleTest(RandomizedRunner.java:880)
  at com.carrotsearch.randomizedtesting.RandomizedRunner$5.evaluate(RandomizedRunner.java:781)
  at com.carrotsearch.randomizedtesting.RandomizedRunner$6.evaluate(RandomizedRunner.java:816)
  at com.carrotsearch.randomizedtesting.RandomizedRunner$7.evaluate(RandomizedRunner.java:827)
  at com.carrotsearch.randomizedtesting.rules.StatementAdapter.evaluate(StatementAdapter.java:36)
  at com.carrotsearch.randomizedtesting.rules.SystemPropertiesRestoreRule$1.evaluate(SystemPropertiesRestoreRule.java:57)
  at org.apache.lucene.util.AbstractBeforeAfterRule$1.evaluate(AbstractBeforeAfterRule.java:45)
  at com.carrotsearch.randomizedtesting.rules.StatementAdapter.evaluate(StatementAdapter.java:36)
  at org.apache.lucene.util.TestRuleStoreClassName$1.evaluate(TestRuleStoreClassName.java:41)
  at com.carrotsearch.randomizedtesting.rules.NoShadowingOrOverridesOnMethodsRule$1.evaluate(NoShadowingOrOverridesOnMethodsRule.java:40)
  at com.carrotsearch.randomizedtesting.rules.NoShadowingOrOverridesOnMethodsRule$1.evaluate(NoShadowingOrOverridesOnMethodsRule.java:40)
  at com.carrotsearch.randomizedtesting.rules.StatementAdapter.evaluate(StatementAdapter.java:36)
  at com.carrotsearch.randomizedtesting.rules.StatementAdapter.evaluate(StatementAdapter.java:36)
  at com.carrotsearch.randomizedtesting.rules.StatementAdapter.evaluate(StatementAdapter.java:36)
  at org.apache.lucene.util.TestRuleAssertionsRequired$1.evaluate(TestRuleAssertionsRequired.java:53)
  at org.apache.lucene.util.TestRuleMarkFailure$1.evaluate(TestRuleMarkFailure.java:47)
  at org.apache.lucene.util.TestRuleIgnoreAfterMaxFailures$1.evaluate(TestRuleIgnoreAfterMaxFailures.java:64)
  at org.apache.lucene.util.TestRuleIgnoreTestSuites$1.evaluate(TestRuleIgnoreTestSuites.java:54)
  at com.carrotsearch.randomizedtesting.rules.StatementAdapter.evaluate(StatementAdapter.java:36)
  at com.carrotsearch.randomizedtesting.ThreadLeakControl$StatementRunner.run(ThreadLeakControl.java:367)
  at java.lang.Thread.run(Thread.java:745)




Build Log:
[...truncated 12156 lines...]
    [junit4] Suite: org.apache.solr.core.TestDynamicLoading
    [junit4] 2> Creating dataDir: C:\Users\jenkins\workspace\Lucene-Solr-6.1-Windows\solr\build\solr-core\test\J1\temp\solr.core.TestDynamicLoading_4DE6E0798DF9C798-001\init-core-data-001
    [junit4] 2> 2984409 INFO (SUITE-TestDynamicLoading-seed#[4DE6E0798DF9C798]-worker) [ ] o.a.s.SolrTestCaseJ4 Randomized ssl (false) and clientAuth (false) via: @org.apache.solr.util.RandomizeSSL(reason=, value=NaN, ssl=NaN, clientAuth=NaN)
    [junit4] 2> 2984410 INFO (SUITE-TestDynamicLoading-seed#[4DE6E0798DF9C798]-worker) [ ] o.a.s.BaseDistributedSearchTestCase Setting hostContext system property: /t_nds/jx
    [junit4] 2> 2984414 INFO (TEST-TestDynamicLoading.testDynamicLoading-seed#[4DE6E0798DF9C798]) [ ] o.a.s.c.ZkTestServer STARTING ZK TEST SERVER
    [junit4] 2> 2984414 INFO (Thread-6921) [ ] o.a.s.c.ZkTestServer client port:0.0.0.0/0.0.0.0:0
    [junit4] 2> 2984415 INFO (Thread-6921) [ ] o.a.s.c.ZkTestServer Starting server
    [junit4] 2> 2984515 INFO (TEST-TestDynamicLoading.testDynamicLoading-seed#[4DE6E0798DF9C798]) [ ] o.a.s.c.ZkTestServer start zk server on port:54337
    [junit4] 2> 2984515 INFO (TEST-TestDynamicLoading.testDynamicLoading-seed#[4DE6E0798DF9C798]) [ ] o.a.s.c.c.SolrZkClient Using default ZkCredentialsProvider
    [junit4] 2> 2984516 INFO (TEST-TestDynamicLoading.testDynamicLoading-seed#[4DE6E0798DF9C798]) [ ] o.a.s.c.c.ConnectionManager Waiting for client to connect to ZooKeeper
    [junit4] 2> 2984521 INFO (zkCallback-9765-thread-1) [ ] o.a.s.c.c.ConnectionManager Watcher org.apache.solr.common.cloud.ConnectionManager@11adde7 name:ZooKeeperConnection Watcher:127.0.0.1:54337 got event WatchedEvent state:SyncConnected type:None path:null path:null type:None
    [junit4] 2> 2984521 INFO (TEST-TestDynamicLoading.testDynamicLoading-seed#[4DE6E0798DF9C798]) [ ] o.a.s.c.c.ConnectionManager Client is connected to ZooKeeper
    [junit4] 2> 2984521 INFO (TEST-TestDynamicLoading.testDynamicLoading-seed#[4DE6E0798DF9C798]) [ ] o.a.s.c.c.SolrZkClient Using default ZkACLProvider
    [junit4] 2> 2984521 INFO (TEST-TestDynamicLoading.testDynamicLoading-seed#[4DE6E0798DF9C798]) [ ] o.a.s.c.c.SolrZkClient makePath: /solr
    [junit4] 2> 2984524 WARN (NIOServerCxn.Factory:0.0.0.0/0.0.0.0:0) [ ] o.a.z.s.NIOServerCnxn caught end of stream exception
    [junit4] 2> EndOfStreamException: Unable to read additional data from client sessionid 0x1553df642740000, likely client has closed socket
    [junit4] 2> at org.apache.zookeeper.server.NIOServerCnxn.doIO(NIOServerCnxn.java:228)
    [junit4] 2> at org.apache.zookeeper.server.NIOServerCnxnFactory.run(NIOServerCnxnFactory.java:208)
    [junit4] 2> at java.lang.Thread.run(Thread.java:745)
    [junit4] 2> 2984525 INFO (TEST-TestDynamicLoading.testDynamicLoading-seed#[4DE6E0798DF9C798]) [ ] o.a.s.c.c.SolrZkClient Using default ZkCredentialsProvider
    [junit4] 2> 2984529 INFO (TEST-TestDynamicLoading.testDynamicLoading-seed#[4DE6E0798DF9C798]) [ ] o.a.s.c.c.ConnectionManager Waiting for client to connect to ZooKeeper
    [junit4] 2> 2984531 INFO (zkCallback-9766-thread-1) [ ] o.a.s.c.c.ConnectionManager Watcher org.apache.solr.common.cloud.ConnectionManager@11dc267 name:ZooKeeperConnection Watcher:127.0.0.1:54337/solr got event WatchedEvent state:SyncConnected type:None path:null path:null type:None
    [junit4] 2> 2984531 INFO (TEST-TestDynamicLoading.testDynamicLoading-seed#[4DE6E0798DF9C798]) [ ] o.a.s.c.c.ConnectionManager Client is connected to ZooKeeper
    [junit4] 2> 2984531 INFO (TEST-TestDynamicLoading.testDynamicLoading-seed#[4DE6E0798DF9C798]) [ ] o.a.s.c.c.SolrZkClient Using default ZkACLProvider
    [junit4] 2> 2984531 INFO (TEST-TestDynamicLoading.testDynamicLoading-seed#[4DE6E0798DF9C798]) [ ] o.a.s.c.c.SolrZkClient makePath: /collections/collection1
    [junit4] 2> 2984533 INFO (TEST-TestDynamicLoading.testDynamicLoading-seed#[4DE6E0798DF9C798]) [ ] o.a.s.c.c.SolrZkClient makePath: /collections/collection1/shards
    [junit4] 2> 2984535 INFO (TEST-TestDynamicLoading.testDynamicLoading-seed#[4DE6E0798DF9C798]) [ ] o.a.s.c.c.SolrZkClient makePath: /collections/control_collection
    [junit4] 2> 2984537 INFO (TEST-TestDynamicLoading.testDynamicLoading-seed#[4DE6E0798DF9C798]) [ ] o.a.s.c.c.SolrZkClient makePath: /collections/control_collection/shards
    [junit4] 2> 2984540 INFO (TEST-TestDynamicLoading.testDynamicLoading-seed#[4DE6E0798DF9C798]) [ ] o.a.s.c.AbstractZkTestCase put C:\Users\jenkins\workspace\Lucene-Solr-6.1-Windows\solr\core\src\test-files\solr\collection1\conf\solrconfig-tlog.xml to /configs/conf1/solrconfig.xml
    [junit4] 2> 2984541 INFO (TEST-TestDynamicLoading.testDynamicLoading-seed#[4DE6E0798DF9C798]) [ ] o.a.s.c.c.SolrZkClient makePath: /configs/conf1/solrconfig.xml
    [junit4] 2> 2984544 INFO (TEST-TestDynamicLoading.testDynamicLoading-seed#[4DE6E0798DF9C798]) [ ] o.a.s.c.AbstractZkTestCase put C:\Users\jenkins\workspace\Lucene-Solr-6.1-Windows\solr\core\src\test-files\solr\collection1\conf\schema.xml to /configs/conf1/schema.xml
    [junit4] 2> 2984545 INFO (TEST-TestDynamicLoading.testDynamicLoading-seed#[4DE6E0798DF9C798]) [ ] o.a.s.c.c.SolrZkClient makePath: /configs/conf1/schema.xml
    [junit4] 2> 2984547 INFO (TEST-TestDynamicLoading.testDynamicLoading-seed#[4DE6E0798DF9C798]) [ ] o.a.s.c.AbstractZkTestCase put C:\Users\jenkins\workspace\Lucene-Solr-6.1-Windows\solr\core\src\test-files\solr\collection1\conf\solrconfig.snippet.randomindexconfig.xml to /configs/conf1/solrconfig.snippet.randomindexconfig.xml
    [junit4] 2> 2984548 INFO (TEST-TestDynamicLoading.testDynamicLoading-seed#[4DE6E0798DF9C798]) [ ] o.a.s.c.c.SolrZkClient makePath: /configs/conf1/solrconfig.snippet.randomindexconfig.xml
    [junit4] 2> 2984551 INFO (TEST-TestDynamicLoading.testDynamicLoading-seed#[4DE6E0798DF9C798]) [ ] o.a.s.c.AbstractZkTestCase put C:\Users\jenkins\workspace\Lucene-Solr-6.1-Windows\solr\core\src\test-files\solr\collection1\conf\stopwords.txt to /configs/conf1/stopwords.txt
    [junit4] 2> 2984551 INFO (TEST-TestDynamicLoading.testDynamicLoading-seed#[4DE6E0798DF9C798]) [ ] o.a.s.c.c.SolrZkClient makePath: /configs/conf1/stopwords.txt
    [junit4] 2> 2984554 INFO (TEST-TestDynamicLoading.testDynamicLoading-seed#[4DE6E0798DF9C798]) [ ] o.a.s.c.AbstractZkTestCase put C:\Users\jenkins\workspace\Lucene-Solr-6.1-Windows\solr\core\src\test-files\solr\collection1\conf\protwords.txt to /configs/conf1/protwords.txt
    [junit4] 2> 2984554 INFO (TEST-TestDynamicLoading.testDynamicLoading-seed#[4DE6E0798DF9C798]) [ ] o.a.s.c.c.SolrZkClient makePath: /configs/conf1/protwords.txt
    [junit4] 2> 2984556 INFO (TEST-TestDynamicLoading.testDynamicLoading-seed#[4DE6E0798DF9C798]) [ ] o.a.s.c.AbstractZkTestCase put C:\Users\jenkins\workspace\Lucene-Solr-6.1-Windows\solr\core\src\test-files\solr\collection1\conf\currency.xml to /configs/conf1/currency.xml
    [junit4] 2> 2984556 INFO (TEST-TestDynamicLoading.testDynamicLoading-seed#[4DE6E0798DF9C798]) [ ] o.a.s.c.c.SolrZkClient makePath: /configs/conf1/currency.xml
    [junit4] 2> 2984559 INFO (TEST-TestDynamicLoading.testDynamicLoading-seed#[4DE6E0798DF9C798]) [ ] o.a.s.c.AbstractZkTestCase put C:\Users\jenkins\workspace\Lucene-Solr-6.1-Windows\solr\core\src\test-files\solr\collection1\conf\enumsConfig.xml to /configs/conf1/enumsConfig.xml
    [junit4] 2> 2984559 INFO (TEST-TestDynamicLoading.testDynamicLoading-seed#[4DE6E0798DF9C798]) [ ] o.a.s.c.c.SolrZkClient makePath: /configs/conf1/enumsConfig.xml
    [junit4] 2> 2984562 INFO (TEST-TestDynamicLoading.testDynamicLoading-seed#[4DE6E0798DF9C798]) [ ] o.a.s.c.AbstractZkTestCase put C:\Users\jenkins\workspace\Lucene-Solr-6.1-Windows\solr\core\src\test-files\solr\collection1\conf\open-exchange-rates.json to /configs/conf1/open-exchange-rates.json
    [junit4] 2> 2984562 INFO (TEST-TestDynamicLoading.testDynamicLoading-seed#[4DE6E0798DF9C798]) [ ] o.a.s.c.c.SolrZkClient makePath: /configs/conf1/open-exchange-rates.json
    [junit4] 2> 2984565 INFO (TEST-TestDynamicLoading.testDynamicLoading-seed#[4DE6E0798DF9C798]) [ ] o.a.s.c.AbstractZkTestCase put C:\Users\jenkins\workspace\Lucene-Solr-6.1-Windows\solr\core\src\test-files\solr\collection1\conf\mapping-ISOLatin1Accent.txt to /configs/conf1/mapping-ISOLatin1Accent.txt
    [junit4] 2> 2984565 INFO (TEST-TestDynamicLoading.testDynamicLoading-seed#[4DE6E0798DF9C798]) [ ] o.a.s.c.c.SolrZkClient makePath: /configs/conf1/mapping-ISOLatin1Accent.txt
    [junit4] 2> 2984567 INFO (TEST-TestDynamicLoading.testDynamicLoading-seed#[4DE6E0798DF9C798]) [ ] o.a.s.c.AbstractZkTestCase put C:\Users\jenkins\workspace\Lucene-Solr-6.1-Windows\solr\core\src\test-files\solr\collection1\conf\old_synonyms.txt to /configs/conf1/old_synonyms.txt
    [junit4] 2> 2984568 INFO (TEST-TestDynamicLoading.testDynamicLoading-seed#[4DE6E0798DF9C798]) [ ] o.a.s.c.c.SolrZkClient makePath: /configs/conf1/old_synonyms.txt
    [junit4] 2> 2984570 INFO (TEST-TestDynamicLoading.testDynamicLoading-seed#[4DE6E0798DF9C798]) [ ] o.a.s.c.AbstractZkTestCase put C:\Users\jenkins\workspace\Lucene-Solr-6.1-Windows\solr\core\src\test-files\solr\collection1\conf\synonyms.txt to /configs/conf1/synonyms.txt
    [junit4] 2> 2984570 INFO (TEST-TestDynamicLoading.testDynamicLoading-seed#[4DE6E0798DF9C798]) [ ] o.a.s.c.c.SolrZkClient makePath: /configs/conf1/synonyms.txt
    [junit4] 2> 2985698 INFO (TEST-TestDynamicLoading.testDynamicLoading-seed#[4DE6E0798DF9C798]) [ ] o.a.s.SolrTestCaseJ4 Writing core.properties file to C:\Users\jenkins\workspace\Lucene-Solr-6.1-Windows\solr\build\solr-core\test\J1\temp\solr.core.TestDynamicLoading_4DE6E0798DF9C798-001\control-001\cores\collection1
    [junit4] 2> 2985705 INFO (TEST-TestDynamicLoading.testDynamicLoading-seed#[4DE6E0798DF9C798]) [ ] o.e.j.s.Server jetty-9.3.8.v20160314
    [junit4] 2> 2985707 INFO (TEST-TestDynamicLoading.testDynamicLoading-seed#[4DE6E0798DF9C798]) [ ] o.e.j.s.h.ContextHandler Started o.e.j.s.ServletContextHandler@c2eea7{/t_nds/jx,null,AVAILABLE}
    [junit4] 2> 2985708 INFO (TEST-TestDynamicLoading.testDynamicLoading-seed#[4DE6E0798DF9C798]) [ ] o.e.j.s.ServerConnector Started ServerConnector@1fa824f{HTTP/1.1,[http/1.1]}{127.0.0.1:54346}
    [junit4] 2> 2985713 INFO (TEST-TestDynamicLoading.testDynamicLoading-seed#[4DE6E0798DF9C798]) [ ] o.e.j.s.Server Started @2991229ms
    [junit4] 2> 2985713 INFO (TEST-TestDynamicLoading.testDynamicLoading-seed#[4DE6E0798DF9C798]) [ ] o.a.s.c.s.e.JettySolrRunner Jetty properties: {solr.data.dir=C:\Users\jenkins\workspace\Lucene-Solr-6.1-Windows\solr\build\solr-core\test\J1\temp\solr.core.TestDynamicLoading_4DE6E0798DF9C798-001\tempDir-001/control/data, hostContext=/t_nds/jx, hostPort=54346, coreRootDirectory=C:\Users\jenkins\workspace\Lucene-Solr-6.1-Windows\solr\build\solr-core\test\J1\..\..\..\..\..\..\..\..\..\Users\jenkins\workspace\Lucene-Solr-6.1-Windows\solr\build\solr-core\test\J1\temp\solr.core.TestDynamicLoading_4DE6E0798DF9C798-001\control-001\cores}
    [junit4] 2> 2985714 INFO (TEST-TestDynamicLoading.testDynamicLoading-seed#[4DE6E0798DF9C798]) [ ] o.a.s.s.SolrDispatchFilter SolrDispatchFilter.init(): sun.misc.Launcher$AppClassLoader@1d16e93
    [junit4] 2> 2985714 INFO (TEST-TestDynamicLoading.testDynamicLoading-seed#[4DE6E0798DF9C798]) [ ] o.a.s.c.SolrResourceLoader new SolrResourceLoader for directory: 'C:\Users\jenkins\workspace\Lucene-Solr-6.1-Windows\solr\build\solr-core\test\J1\temp\solr.core.TestDynamicLoading_4DE6E0798DF9C798-001\control-001'
    [junit4] 2> 2985714 INFO (TEST-TestDynamicLoading.testDynamicLoading-seed#[4DE6E0798DF9C798]) [ ] o.a.s.c.SolrResourceLoader JNDI not configured for solr (NoInitialContextEx)
    [junit4] 2> 2985715 INFO (TEST-TestDynamicLoading.testDynamicLoading-seed#[4DE6E0798DF9C798]) [ ] o.a.s.c.SolrResourceLoader solr home defaulted to 'solr/' (could not find system property or JNDI)
    [junit4] 2> 2985716 INFO (TEST-TestDynamicLoading.testDynamicLoading-seed#[4DE6E0798DF9C798]) [ ] o.a.s.c.c.SolrZkClient Using default ZkCredentialsProvider
    [junit4] 2> 2985717 INFO (TEST-TestDynamicLoading.testDynamicLoading-seed#[4DE6E0798DF9C798]) [ ] o.a.s.c.c.ConnectionManager Waiting for client to connect to ZooKeeper
    [junit4] 2> 2985720 INFO (zkCallback-9767-thread-1) [ ] o.a.s.c.c.ConnectionManager Watcher org.apache.solr.common.cloud.ConnectionManager@18dbc07 name:ZooKeeperConnection Watcher:127.0.0.1:54337/solr got event WatchedEvent state:SyncConnected type:None path:null path:null type:None
    [junit4] 2> 2985720 INFO (TEST-TestDynamicLoading.testDynamicLoading-seed#[4DE6E0798DF9C798]) [ ] o.a.s.c.c.ConnectionManager Client is connected to ZooKeeper
    [junit4] 2> 2985721 INFO (TEST-TestDynamicLoading.testDynamicLoading-seed#[4DE6E0798DF9C798]) [ ] o.a.s.c.c.SolrZkClient Using default ZkACLProvider
    [junit4] 2> 2985722 INFO (TEST-TestDynamicLoading.testDynamicLoading-seed#[4DE6E0798DF9C798]) [ ] o.a.s.s.SolrDispatchFilter Loading solr.xml from SolrHome (not found in ZooKeeper)
    [junit4] 2> 2985722 INFO (TEST-TestDynamicLoading.testDynamicLoading-seed#[4DE6E0798DF9C798]) [ ] o.a.s.c.SolrXmlConfig Loading container configuration from C:\Users\jenkins\workspace\Lucene-Solr-6.1-Windows\solr\build\solr-core\test\J1\temp\solr.core.TestDynamicLoading_4DE6E0798DF9C798-001\control-001\solr.xml
    [junit4] 2> 2985751 INFO (TEST-TestDynamicLoading.testDynamicLoading-seed#[4DE6E0798DF9C798]) [ ] o.a.s.c.CorePropertiesLocator Config-defined core root directory: C:\Users\jenkins\workspace\Lucene-Solr-6.1-Windows\solr\build\solr-core\test\J1\..\..\..\..\..\..\..\..\..\Users\jenkins\workspace\Lucene-Solr-6.1-Windows\solr\build\solr-core\test\J1\temp\solr.core.TestDynamicLoading_4DE6E0798DF9C798-001\control-001\cores
    [junit4] 2> 2985751 INFO (TEST-TestDynamicLoading.testDynamicLoading-seed#[4DE6E0798DF9C798]) [ ] o.a.s.c.CoreContainer New CoreContainer 2024722
    [junit4] 2> 2985752 INFO (TEST-TestDynamicLoading.testDynamicLoading-seed#[4DE6E0798DF9C798]) [ ] o.a.s.c.CoreContainer Loading cores into CoreContainer [instanceDir=C:\Users\jenkins\workspace\Lucene-Solr-6.1-Windows\solr\build\solr-core\test\J1\temp\solr.core.TestDynamicLoading_4DE6E0798DF9C798-001\control-001]
    [junit4] 2> 2985752 WARN (TEST-TestDynamicLoading.testDynamicLoading-seed#[4DE6E0798DF9C798]) [ ] o.a.s.c.CoreContainer Couldn't add files from C:\Users\jenkins\workspace\Lucene-Solr-6.1-Windows\solr\build\solr-core\test\J1\temp\solr.core.TestDynamicLoading_4DE6E0798DF9C798-001\control-001\lib to classpath: C:\Users\jenkins\workspace\Lucene-Solr-6.1-Windows\solr\build\solr-core\test\J1\temp\solr.core.TestDynamicLoading_4DE6E0798DF9C798-001\control-001\lib
    [junit4] 2> 2985754 INFO (TEST-TestDynamicLoading.testDynamicLoading-seed#[4DE6E0798DF9C798]) [ ] o.a.s.h.c.HttpShardHandlerFactory created with socketTimeout : 90000,urlScheme : ,connTimeout : 15000,maxConnectionsPerHost : 20,maxConnections : 10000,corePoolSize : 0,maximumPoolSize : 2147483647,maxThreadIdleTime : 5,sizeOfQueue : -1,fairnessPolicy : false,useRetries : false,
    [junit4] 2> 2985759 INFO (TEST-TestDynamicLoading.testDynamicLoading-seed#[4DE6E0798DF9C798]) [ ] o.a.s.u.UpdateShardHandler Creating UpdateShardHandler HTTP client with params: socketTimeout=340000&connTimeout=45000&retry=true
    [junit4] 2> 2985760 INFO (TEST-TestDynamicLoading.testDynamicLoading-seed#[4DE6E0798DF9C798]) [ ] o.a.s.l.LogWatcher SLF4J impl is org.slf4j.impl.Log4jLoggerFactory
    [junit4] 2> 2985760 INFO (TEST-TestDynamicLoading.testDynamicLoading-seed#[4DE6E0798DF9C798]) [ ] o.a.s.l.LogWatcher Registering Log Listener [Log4j (org.slf4j.impl.Log4jLoggerFactory)]
    [junit4] 2> 2985761 INFO (TEST-TestDynamicLoading.testDynamicLoading-seed#[4DE6E0798DF9C798]) [ ] o.a.s.c.ZkContainer Zookeeper client=127.0.0.1:54337/solr
    [junit4] 2> 2985761 INFO (TEST-TestDynamicLoading.testDynamicLoading-seed#[4DE6E0798DF9C798]) [ ] o.a.s.c.ZkController zkHost includes chroot
    [junit4] 2> 2985761 INFO (TEST-TestDynamicLoading.testDynamicLoading-seed#[4DE6E0798DF9C798]) [ ] o.a.s.c.c.SolrZkClient Using default ZkCredentialsProvider
    [junit4] 2> 2985762 INFO (TEST-TestDynamicLoading.testDynamicLoading-seed#[4DE6E0798DF9C798]) [ ] o.a.s.c.c.ConnectionManager Waiting for client to connect to ZooKeeper
    [junit4] 2> 2985765 INFO (zkCallback-9770-thread-1) [ ] o.a.s.c.c.ConnectionManager Watcher org.apache.solr.common.cloud.ConnectionManager@1678c01 name:ZooKeeperConnection Watcher:127.0.0.1:54337 got event WatchedEvent state:SyncConnected type:None path:null path:null type:None
    [junit4] 2> 2985766 INFO (TEST-TestDynamicLoading.testDynamicLoading-seed#[4DE6E0798DF9C798]) [ ] o.a.s.c.c.ConnectionManager Client is connected to ZooKeeper
    [junit4] 2> 2985766 INFO (TEST-TestDynamicLoading.testDynamicLoading-seed#[4DE6E0798DF9C798]) [ ] o.a.s.c.c.SolrZkClient Using default ZkACLProvider
    [junit4] 2> 2985768 INFO (TEST-TestDynamicLoading.testDynamicLoading-seed#[4DE6E0798DF9C798]) [n:127.0.0.1:54346_t_nds%2Fjx ] o.a.s.c.ZkController Added new OnReconnect listener org.apache.solr.cloud.ZkController$$Lambda$53/18614643@13adc2e
    [junit4] 2> 2985770 INFO (TEST-TestDynamicLoading.testDynamicLoading-seed#[4DE6E0798DF9C798]) [n:127.0.0.1:54346_t_nds%2Fjx ] o.a.s.c.c.ConnectionManager Waiting for client to connect to ZooKeeper
    [junit4] 2> 2985773 INFO (zkCallback-9771-thread-1-processing-n:127.0.0.1:54346_t_nds%2Fjx) [n:127.0.0.1:54346_t_nds%2Fjx ] o.a.s.c.c.ConnectionManager Watcher org.apache.solr.common.cloud.ConnectionManager@b342f9 name:ZooKeeperConnection Watcher:127.0.0.1:54337/solr got event WatchedEvent state:SyncConnected type:None path:null path:null type:None
    [junit4] 2> 2985773 INFO (TEST-TestDynamicLoading.testDynamicLoading-seed#[4DE6E0798DF9C798]) [n:127.0.0.1:54346_t_nds%2Fjx ] o.a.s.c.c.ConnectionManager Client is connected to ZooKeeper
    [junit4] 2> 2985780 INFO (TEST-TestDynamicLoading.testDynamicLoading-seed#[4DE6E0798DF9C798]) [n:127.0.0.1:54346_t_nds%2Fjx ] o.a.s.c.c.SolrZkClient makePath: /overseer/queue
    [junit4] 2> 2985798 INFO (TEST-TestDynamicLoading.testDynamicLoading-seed#[4DE6E0798DF9C798]) [n:127.0.0.1:54346_t_nds%2Fjx ] o.a.s.c.c.SolrZkClient makePath: /overseer/collection-queue-work
    [junit4] 2> 2985824 INFO (TEST-TestDynamicLoading.testDynamicLoading-seed#[4DE6E0798DF9C798]) [n:127.0.0.1:54346_t_nds%2Fjx ] o.a.s.c.c.SolrZkClient makePath: /overseer/collection-map-running
    [junit4] 2> 2985841 INFO (TEST-TestDynamicLoading.testDynamicLoading-seed#[4DE6E0798DF9C798]) [n:127.0.0.1:54346_t_nds%2Fjx ] o.a.s.c.c.SolrZkClient makePath: /overseer/collection-map-completed
    [junit4] 2> 2985861 INFO (TEST-TestDynamicLoading.testDynamicLoading-seed#[4DE6E0798DF9C798]) [n:127.0.0.1:54346_t_nds%2Fjx ] o.a.s.c.c.SolrZkClient makePath: /overseer/collection-map-failure
    [junit4] 2> 2985891 INFO (TEST-TestDynamicLoading.testDynamicLoading-seed#[4DE6E0798DF9C798]) [n:127.0.0.1:54346_t_nds%2Fjx ] o.a.s.c.c.SolrZkClient makePath: /live_nodes
    [junit4] 2> 2985898 INFO (TEST-TestDynamicLoading.testDynamicLoading-seed#[4DE6E0798DF9C798]) [n:127.0.0.1:54346_t_nds%2Fjx ] o.a.s.c.c.SolrZkClient makePath: /aliases.json
    [junit4] 2> 2985925 INFO (TEST-TestDynamicLoading.testDynamicLoading-seed#[4DE6E0798DF9C798]) [n:127.0.0.1:54346_t_nds%2Fjx ] o.a.s.c.c.SolrZkClient makePath: /clusterstate.json
    [junit4] 2> 2985928 INFO (TEST-TestDynamicLoading.testDynamicLoading-seed#[4DE6E0798DF9C798]) [n:127.0.0.1:54346_t_nds%2Fjx ] o.a.s.c.c.SolrZkClient makePath: /security.json
    [junit4] 2> 2985931 INFO (TEST-TestDynamicLoading.testDynamicLoading-seed#[4DE6E0798DF9C798]) [n:127.0.0.1:54346_t_nds%2Fjx ] o.a.s.c.c.ZkStateReader Updating cluster state from ZooKeeper...
    [junit4] 2> 2985934 INFO (TEST-TestDynamicLoading.testDynamicLoading-seed#[4DE6E0798DF9C798]) [n:127.0.0.1:54346_t_nds%2Fjx ] o.a.s.c.c.ZkStateReader Loaded empty cluster properties
    [junit4] 2> 2985936 INFO (TEST-TestDynamicLoading.testDynamicLoading-seed#[4DE6E0798DF9C798]) [n:127.0.0.1:54346_t_nds%2Fjx ] o.a.s.c.c.ZkStateReader Updated live nodes from ZooKeeper... (0) -> (0)
    [junit4] 2> 2985943 INFO (TEST-TestDynamicLoading.testDynamicLoading-seed#[4DE6E0798DF9C798]) [n:127.0.0.1:54346_t_nds%2Fjx ] o.a.s.c.c.SolrZkClient makePath: /overseer_elect
    [junit4] 2> 2985945 INFO (TEST-TestDynamicLoading.testDynamicLoading-seed#[4DE6E0798DF9C798]) [n:127.0.0.1:54346_t_nds%2Fjx ] o.a.s.c.c.SolrZkClient makePath: /overseer_elect/election
    [junit4] 2> 2985961 INFO (TEST-TestDynamicLoading.testDynamicLoading-seed#[4DE6E0798DF9C798]) [n:127.0.0.1:54346_t_nds%2Fjx ] o.a.s.c.Overseer Overseer (id=null) closing
    [junit4] 2> 2985962 INFO (TEST-TestDynamicLoading.testDynamicLoading-seed#[4DE6E0798DF9C798]) [n:127.0.0.1:54346_t_nds%2Fjx ] o.a.s.c.LeaderElector Joined leadership election with path: /overseer_elect/election/96051094944481284-127.0.0.1:54346_t_nds%2Fjx-n_0000000000
    [junit4] 2> 2985963 INFO (TEST-TestDynamicLoading.testDynamicLoading-seed#[4DE6E0798DF9C798]) [n:127.0.0.1:54346_t_nds%2Fjx ] o.a.s.c.OverseerElectionContext I am going to be the leader 127.0.0.1:54346_t_nds%2Fjx
    [junit4] 2> 2985963 INFO (TEST-TestDynamicLoading.testDynamicLoading-seed#[4DE6E0798DF9C798]) [n:127.0.0.1:54346_t_nds%2Fjx ] o.a.s.c.c.SolrZkClient makePath: /overseer_elect/leader
    [junit4] 2> 2985966 INFO (TEST-TestDynamicLoading.testDynamicLoading-seed#[4DE6E0798DF9C798]) [n:127.0.0.1:54346_t_nds%2Fjx ] o.a.s.c.Overseer Overseer (id=96051094944481284-127.0.0.1:54346_t_nds%2Fjx-n_0000000000) starting
    [junit4] 2> 2985970 INFO (TEST-TestDynamicLoading.testDynamicLoading-seed#[4DE6E0798DF9C798]) [n:127.0.0.1:54346_t_nds%2Fjx ] o.a.s.c.c.SolrZkClient makePath: /overseer/queue-work
    [junit4] 2> 2986007 INFO (TEST-TestDynamicLoading.testDynamicLoading-seed#[4DE6E0798DF9C798]) [n:127.0.0.1:54346_t_nds%2Fjx ] o.a.s.c.OverseerAutoReplicaFailoverThread Starting OverseerAutoReplicaFailoverThread autoReplicaFailoverWorkLoopDelay=10000 autoReplicaFailoverWaitAfterExpiration=30000 autoReplicaFailoverBadNodeExpiration=60000
    [junit4] 2> 2986008 INFO (OverseerCollectionConfigSetProcessor-96051094944481284-127.0.0.1:54346_t_nds%2Fjx-n_0000000000) [n:127.0.0.1:54346_t_nds%2Fjx ] o.a.s.c.OverseerTaskProcessor Process current queue of overseer operations
    [junit4] 2> 2986008 INFO (TEST-TestDynamicLoading.testDynamicLoading-seed#[4DE6E0798DF9C798]) [n:127.0.0.1:54346_t_nds%2Fjx ] o.a.s.c.ZkController Register node as live in ZooKeeper:/live_nodes/127.0.0.1:54346_t_nds%2Fjx
    [junit4] 2> 2986008 INFO (OverseerStateUpdate-96051094944481284-127.0.0.1:54346_t_nds%2Fjx-n_0000000000) [n:127.0.0.1:54346_t_nds%2Fjx ] o.a.s.c.Overseer Starting to work on the main queue
    [junit4] 2> 2986010 INFO (TEST-TestDynamicLoading.testDynamicLoading-seed#[4DE6E0798DF9C798]) [n:127.0.0.1:54346_t_nds%2Fjx ] o.a.s.c.c.SolrZkClient makePath: /live_nodes/127.0.0.1:54346_t_nds%2Fjx
    [junit4] 2> 2986015 INFO (zkCallback-9771-thread-1-processing-n:127.0.0.1:54346_t_nds%2Fjx) [n:127.0.0.1:54346_t_nds%2Fjx ] o.a.s.c.c.ZkStateReader A live node change: [WatchedEvent state:SyncConnected type:NodeChildrenChanged path:/live_nodes], has occurred - updating... (live nodes size: [0])
    [junit4] 2> 2986015 INFO (OverseerStateUpdate-96051094944481284-127.0.0.1:54346_t_nds%2Fjx-n_0000000000) [n:127.0.0.1:54346_t_nds%2Fjx ] o.a.s.c.c.ZkStateReader Updated live nodes from ZooKeeper... (0) -> (1)
    [junit4] 2> 2986017 INFO (zkCallback-9771-thread-1-processing-n:127.0.0.1:54346_t_nds%2Fjx) [n:127.0.0.1:54346_t_nds%2Fjx ] o.a.s.c.c.ZkStateReader Updated live nodes from ZooKeeper... (1) -> (1)
    [junit4] 2> 2986191 INFO (TEST-TestDynamicLoading.testDynamicLoading-seed#[4DE6E0798DF9C798]) [n:127.0.0.1:54346_t_nds%2Fjx ] o.a.s.c.CoreContainer Security conf doesn't exist. Skipping setup for authorization module.
    [junit4] 2> 2986192 INFO (TEST-TestDynamicLoading.testDynamicLoading-seed#[4DE6E0798DF9C798]) [n:127.0.0.1:54346_t_nds%2Fjx ] o.a.s.c.CoreContainer No authentication plugin used.
    [junit4] 2> 2986193 INFO (TEST-TestDynamicLoading.testDynamicLoading-seed#[4DE6E0798DF9C798]) [n:127.0.0.1:54346_t_nds%2Fjx ] o.a.s.c.CorePropertiesLocator Looking for core definitions underneath C:\Users\jenkins\workspace\Lucene-Solr-6.1-Windows\solr\build\solr-core\test\J1\..\..\..\..\..\..\..\..\..\Users\jenkins\workspace\Lucene-Solr-6.1-Windows\solr\build\solr-core\test\J1\temp\solr.core.TestDynamicLoading_4DE6E0798DF9C798-001\control-001\cores
    [junit4] 2> 2986201 INFO (TEST-TestDynamicLoading.testDynamicLoading-seed#[4DE6E0798DF9C798]) [n:127.0.0.1:54346_t_nds%2Fjx ] o.a.s.c.CoreDescriptor Created CoreDescriptor: {name=collection1, config=solrconfig.xml, transient=false, schema=schema.xml, loadOnStartup=true, configSetProperties=configsetprops.json, collection=control_collection, coreNodeName=, dataDir=data\, shard=}
    [junit4] 2> 2986201 INFO (TEST-TestDynamicLoading.testDynamicLoading-seed#[4DE6E0798DF9C798]) [n:127.0.0.1:54346_t_nds%2Fjx ] o.a.s.c.CorePropertiesLocator Found core collection1 in C:\Users\jenkins\workspace\Lucene-Solr-6.1-Windows\solr\build\solr-core\test\J1\..\..\..\..\..\..\..\..\..\Users\jenkins\workspace\Lucene-Solr-6.1-Windows\solr\build\solr-core\test\J1\temp\solr.core.TestDynamicLoading_4DE6E0798DF9C798-001\control-001\cores\collection1
    [junit4] 2> 2986201 INFO (TEST-TestDynamicLoading.testDynamicLoading-seed#[4DE6E0798DF9C798]) [n:127.0.0.1:54346_t_nds%2Fjx ] o.a.s.c.CorePropertiesLocator Found 1 core definitions
    [junit4] 2> 2986207 INFO (TEST-TestDynamicLoading.testDynamicLoading-seed#[4DE6E0798DF9C798]) [n:127.0.0.1:54346_t_nds%2Fjx ] o.a.s.s.SolrDispatchFilter user.dir=C:\Users\jenkins\workspace\Lucene-Solr-6.1-Windows\solr\build\solr-core\test\J1
    [junit4] 2> 2986207 INFO (TEST-TestDynamicLoading.testDynamicLoading-seed#[4DE6E0798DF9C798]) [n:127.0.0.1:54346_t_nds%2Fjx ] o.a.s.s.SolrDispatchFilter SolrDispatchFilter.init() done
    [junit4] 2> 2986212 INFO (coreLoadExecutor-10522-thread-1-processing-n:127.0.0.1:54346_t_nds%2Fjx) [n:127.0.0.1:54346_t_nds%2Fjx c:control_collection x:collection1] o.a.s.c.ZkController publishing state=down
    [junit4] 2> 2986216 INFO (coreLoadExecutor-10522-thread-1-processing-n:127.0.0.1:54346_t_nds%2Fjx) [n:127.0.0.1:54346_t_nds%2Fjx c:control_collection x:collection1] o.a.s.c.ZkController numShards not found on descriptor - reading it from system property
    [junit4] 2> 2986226 INFO (coreLoadExecutor-10522-thread-1-processing-n:127.0.0.1:54346_t_nds%2Fjx) [n:127.0.0.1:54346_t_nds%2Fjx c:control_collection x:collection1] o.a.s.c.ZkController Collection control_collection not visible yet, but flagging it so a watch is registered when it becomes visible
    [junit4] 2> 2986227 INFO (OverseerStateUpdate-96051094944481284-127.0.0.1:54346_t_nds%2Fjx-n_0000000000) [n:127.0.0.1:54346_t_nds%2Fjx ] o.a.s.c.Overseer processMessage: queueSize: 1, message = {
    [junit4] 2> "core":"collection1",
    [junit4] 2> "roles":null,
    [junit4] 2> "base_url":"http://127.0.0.1:54346/t_nds/jx",
    [junit4] 2> "node_name":"127.0.0.1:54346_t_nds%2Fjx",
    [junit4] 2> "numShards":"1",
    [junit4] 2> "state":"down",
    [junit4] 2> "shard":null,
    [junit4] 2> "collection":"control_collection",
    [junit4] 2> "operation":"state"} current state version: 0
    [junit4] 2> 2986227 INFO (OverseerStateUpdate-96051094944481284-127.0.0.1:54346_t_nds%2Fjx-n_0000000000) [n:127.0.0.1:54346_t_nds%2Fjx ] o.a.s.c.o.ReplicaMutator Update state numShards=1 message={
    [junit4] 2> "core":"collection1",
    [junit4] 2> "roles":null,
    [junit4] 2> "base_url":"http://127.0.0.1:54346/t_nds/jx",
    [junit4] 2> "node_name":"127.0.0.1:54346_t_nds%2Fjx",
    [junit4] 2> "numShards":"1",
    [junit4] 2> "state":"down",
    [junit4] 2> "shard":null,
    [junit4] 2> "collection":"control_collection",
    [junit4] 2> "operation":"state"}
    [junit4] 2> 2986228 INFO (coreLoadExecutor-10522-thread-1-processing-n:127.0.0.1:54346_t_nds%2Fjx) [n:127.0.0.1:54346_t_nds%2Fjx c:control_collection x:collection1] o.a.s.c.c.ZkStateReader Deleting data for [control_collection]
    [junit4] 2> 2986229 INFO (OverseerStateUpdate-96051094944481284-127.0.0.1:54346_t_nds%2Fjx-n_0000000000) [n:127.0.0.1:54346_t_nds%2Fjx ] o.a.s.c.o.ClusterStateMutator building a new cName: control_collection
    [junit4] 2> 2986230 INFO (OverseerStateUpdate-96051094944481284-127.0.0.1:54346_t_nds%2Fjx-n_0000000000) [n:127.0.0.1:54346_t_nds%2Fjx ] o.a.s.c.o.ReplicaMutator Assigning new node to shard shard=shard1
    [junit4] 2> 2986231 INFO (coreLoadExecutor-10522-thread-1-processing-n:127.0.0.1:54346_t_nds%2Fjx) [n:127.0.0.1:54346_t_nds%2Fjx c:control_collection x:collection1] o.a.s.c.ZkController look for our core node name
    [junit4] 2> 2986234 INFO (zkCallback-9771-thread-1-processing-n:127.0.0.1:54346_t_nds%2Fjx) [n:127.0.0.1:54346_t_nds%2Fjx ] o.a.s.c.c.ZkStateReader A cluster state change: [WatchedEvent state:SyncConnected type:NodeDataChanged path:/clusterstate.json], has occurred - updating... (live nodes size: [1])
    [junit4] 2> 2987233 INFO (coreLoadExecutor-10522-thread-1-processing-n:127.0.0.1:54346_t_nds%2Fjx) [n:127.0.0.1:54346_t_nds%2Fjx c:control_collection x:collection1] o.a.s.c.ZkController waiting to find shard id in clusterstate for collection1
    [junit4] 2> 2987233 INFO (coreLoadExecutor-10522-thread-1-processing-n:127.0.0.1:54346_t_nds%2Fjx) [n:127.0.0.1:54346_t_nds%2Fjx c:control_collection x:collection1] o.a.s.c.ZkController Check for collection zkNode:control_collection
    [junit4] 2> 2987233 INFO (coreLoadExecutor-10522-thread-1-processing-n:127.0.0.1:54346_t_nds%2Fjx) [n:127.0.0.1:54346_t_nds%2Fjx c:control_collection x:collection1] o.a.s.c.ZkController Collection zkNode exists
    [junit4] 2> 2987233 INFO (coreLoadExecutor-10522-thread-1-processing-n:127.0.0.1:54346_t_nds%2Fjx) [n:127.0.0.1:54346_t_nds%2Fjx c:control_collection x:collection1] o.a.s.c.c.ZkStateReader Load collection config from: [/collections/control_collection]
    [junit4] 2> 2987235 INFO (coreLoadExecutor-10522-thread-1-processing-n:127.0.0.1:54346_t_nds%2Fjx) [n:127.0.0.1:54346_t_nds%2Fjx c:control_collection x:collection1] o.a.s.c.c.ZkStateReader path=[/collections/control_collection] [configName]=[conf1] specified config exists in ZooKeeper
    [junit4] 2> 2987235 INFO (coreLoadExecutor-10522-thread-1-processing-n:127.0.0.1:54346_t_nds%2Fjx) [n:127.0.0.1:54346_t_nds%2Fjx c:control_collection x:collection1] o.a.s.c.SolrResourceLoader new SolrResourceLoader for directory: 'C:\Users\jenkins\workspace\Lucene-Solr-6.1-Windows\solr\build\solr-core\test\J1\temp\solr.core.TestDynamicLoading_4DE6E0798DF9C798-001\control-001\cores\collection1'
    [junit4] 2> 2987235 INFO (coreLoadExecutor-10522-thread-1-processing-n:127.0.0.1:54346_t_nds%2Fjx) [n:127.0.0.1:54346_t_nds%2Fjx c:control_collection x:collection1] o.a.s.c.SolrResourceLoader JNDI not configured for solr (NoInitialContextEx)
    [junit4] 2> 2987235 INFO (coreLoadExecutor-10522-thread-1-processing-n:127.0.0.1:54346_t_nds%2Fjx) [n:127.0.0.1:54346_t_nds%2Fjx c:control_collection x:collection1] o.a.s.c.SolrResourceLoader solr home defaulted to 'solr/' (could not find system property or JNDI)
    [junit4] 2> 2987239 INFO (coreLoadExecutor-10522-thread-1-processing-n:127.0.0.1:54346_t_nds%2Fjx) [n:127.0.0.1:54346_t_nds%2Fjx c:control_collection x:collection1] o.a.s.c.Config loaded config solrconfig.xml with version 0
    [junit4] 2> 2987259 INFO (coreLoadExecutor-10522-thread-1-processing-n:127.0.0.1:54346_t_nds%2Fjx) [n:127.0.0.1:54346_t_nds%2Fjx c:control_collection x:collection1] o.a.s.c.SolrConfig current version of requestparams : -1
    [junit4] 2> 2987265 WARN (coreLoadExecutor-10522-thread-1-processing-n:127.0.0.1:54346_t_nds%2Fjx) [n:127.0.0.1:54346_t_nds%2Fjx c:control_collection x:collection1] o.a.s.c.Config Beginning with Solr 5.5, <mergePolicy> is deprecated, use <mergePolicyFactory> instead.
    [junit4] 2> 2987267 INFO (coreLoadExecutor-10522-thread-1-processing-n:127.0.0.1:54346_t_nds%2Fjx) [n:127.0.0.1:54346_t_nds%2Fjx c:control_collection x:collection1] o.a.s.c.SolrConfig Using Lucene MatchVersion: 6.1.0
    [junit4] 2> 2987281 INFO (coreLoadExecutor-10522-thread-1-processing-n:127.0.0.1:54346_t_nds%2Fjx) [n:127.0.0.1:54346_t_nds%2Fjx c:control_collection x:collection1] o.a.s.c.SolrConfig Loaded SolrConfig: solrconfig.xml
    [junit4] 2> 2987297 INFO (coreLoadExecutor-10522-thread-1-processing-n:127.0.0.1:54346_t_nds%2Fjx) [n:127.0.0.1:54346_t_nds%2Fjx c:control_collection x:collection1] o.a.s.s.IndexSchema [collection1] Schema name=test
    [junit4] 2> 2987457 INFO (coreLoadExecutor-10522-thread-1-processing-n:127.0.0.1:54346_t_nds%2Fjx) [n:127.0.0.1:54346_t_nds%2Fjx c:control_collection x:collection1] o.a.s.s.OpenExchangeRatesOrgProvider Initialized with rates=open-exchange-rates.json, refreshInterval=1440.
    [junit4] 2> 2987471 INFO (coreLoadExecutor-10522-thread-1-processing-n:127.0.0.1:54346_t_nds%2Fjx) [n:127.0.0.1:54346_t_nds%2Fjx c:control_collection x:collection1] o.a.s.s.IndexSchema default search field in schema is text
    [junit4] 2> 2987472 INFO (coreLoadExecutor-10522-thread-1-processing-n:127.0.0.1:54346_t_nds%2Fjx) [n:127.0.0.1:54346_t_nds%2Fjx c:control_collection x:collection1] o.a.s.s.IndexSchema unique key field: id
    [junit4] 2> 2987501 INFO (coreLoadExecutor-10522-thread-1-processing-n:127.0.0.1:54346_t_nds%2Fjx) [n:127.0.0.1:54346_t_nds%2Fjx c:control_collection x:collection1] o.a.s.s.FileExchangeRateProvider Reloading exchange rates from file currency.xml
    [junit4] 2> 2987507 INFO (coreLoadExecutor-10522-thread-1-processing-n:127.0.0.1:54346_t_nds%2Fjx) [n:127.0.0.1:54346_t_nds%2Fjx c:control_collection x:collection1] o.a.s.s.FileExchangeRateProvider Reloading exchange rates from file currency.xml
    [junit4] 2> 2987512 INFO (coreLoadExecutor-10522-thread-1-processing-n:127.0.0.1:54346_t_nds%2Fjx) [n:127.0.0.1:54346_t_nds%2Fjx c:control_collection x:collection1] o.a.s.s.OpenExchangeRatesOrgProvider Reloading exchange rates from open-exchange-rates.json
    [junit4] 2> 2987513 INFO (coreLoadExecutor-10522-thread-1-processing-n:127.0.0.1:54346_t_nds%2Fjx) [n:127.0.0.1:54346_t_nds%2Fjx c:control_collection x:collection1] o.a.s.s.OpenExchangeRatesOrgProvider Reloading exchange rates from open-exchange-rates.json
    [junit4] 2> 2987519 INFO (coreLoadExecutor-10522-thread-1-processing-n:127.0.0.1:54346_t_nds%2Fjx) [n:127.0.0.1:54346_t_nds%2Fjx c:control_collection x:collection1] o.a.s.c.ConfigSetProperties Did not find ConfigSet properties, assuming default properties: Can't find resource 'configsetprops.json' in classpath or '/configs/conf1', cwd=C:\Users\jenkins\workspace\Lucene-Solr-6.1-Windows\solr\build\solr-core\test\J1
    [junit4] 2> 2987519 INFO (coreLoadExecutor-10522-thread-1-processing-n:127.0.0.1:54346_t_nds%2Fjx) [n:127.0.0.1:54346_t_nds%2Fjx c:control_collection x:collection1] o.a.s.c.CoreContainer Creating SolrCore 'collection1' using configuration from collection control_collection
    [junit4] 2> 2987519 INFO (coreLoadExecutor-10522-thread-1-processing-n:127.0.0.1:54346_t_nds%2Fjx) [n:127.0.0.1:54346_t_nds%2Fjx c:control_collection s:shard1 r:core_node1 x:collection1] o.a.s.c.SolrCore org.apache.solr.core.MockDirectoryFactory
    [junit4] 2> 2987519 INFO (coreLoadExecutor-10522-thread-1-processing-n:127.0.0.1:54346_t_nds%2Fjx) [n:127.0.0.1:54346_t_nds%2Fjx c:control_collection s:shard1 r:core_node1 x:collection1] o.a.s.c.SolrCore [[collection1] ] Opening new SolrCore at [C:\Users\jenkins\workspace\Lucene-Solr-6.1-Windows\solr\build\solr-core\test\J1\temp\solr.core.TestDynamicLoading_4DE6E0798DF9C798-001\control-001\cores\collection1], dataDir=[C:\Users\jenkins\workspace\Lucene-Solr-6.1-Windows\solr\build\solr-core\test\J1\..\..\..\..\..\..\..\..\..\Users\jenkins\workspace\Lucene-Solr-6.1-Windows\solr\build\solr-core\test\J1\temp\solr.core.TestDynamicLoading_4DE6E0798DF9C798-001\control-001\cores\collection1\data\]
    [junit4] 2> 2987519 INFO (coreLoadExecutor-10522-thread-1-processing-n:127.0.0.1:54346_t_nds%2Fjx) [n:127.0.0.1:54346_t_nds%2Fjx c:control_collection s:shard1 r:core_node1 x:collection1] o.a.s.c.JmxMonitoredMap JMX monitoring is enabled. Adding Solr mbeans to JMX Server: com.sun.jmx.mbeanserver.JmxMBeanServer@1e75264
    [junit4] 2> 2987521 INFO (coreLoadExecutor-10522-thread-1-processing-n:127.0.0.1:54346_t_nds%2Fjx) [n:127.0.0.1:54346_t_nds%2Fjx c:control_collection s:shard1 r:core_node1 x:collection1] o.a.s.c.CachingDirectoryFactory return new directory for C:\Users\jenkins\workspace\Lucene-Solr-6.1-Windows\solr\build\solr-core\test\J1\..\..\..\..\..\..\..\..\..\Users\jenkins\workspace\Lucene-Solr-6.1-Windows\solr\build\solr-core\test\J1\temp\solr.core.TestDynamicLoading_4DE6E0798DF9C798-001\control-001\cores\collection1\data\
    [junit4] 2> 2987521 INFO (coreLoadExecutor-10522-thread-1-processing-n:127.0.0.1:54346_t_nds%2Fjx) [n:127.0.0.1:54346_t_nds%2Fjx c:control_collection s:shard1 r:core_node1 x:collection1] o.a.s.c.SolrCore New index directory detected: old=null new=C:\Users\jenkins\workspace\Lucene-Solr-6.1-Windows\solr\build\solr-core\test\J1\..\..\..\..\..\..\..\..\..\Users\jenkins\workspace\Lucene-Solr-6.1-Windows\solr\build\solr-core\test\J1\temp\solr.core.TestDynamicLoading_4DE6E0798DF9C798-001\control-001\cores\collection1\data\index/
    [junit4] 2> 2987521 WARN (coreLoadExecutor-10522-thread-1-processing-n:127.0.0.1:54346_t_nds%2Fjx) [n:127.0.0.1:54346_t_nds%2Fjx c:control_collection s:shard1 r:core_node1 x:collection1] o.a.s.c.SolrCore [collection1] Solr index directory 'C:\Users\jenkins\workspace\Lucene-Solr-6.1-Windows\solr\build\solr-core\test\J1\..\..\..\..\..\..\..\..\..\Users\jenkins\workspace\Lucene-Solr-6.1-Windows\solr\build\solr-core\test\J1\temp\solr.core.TestDynamicLoading_4DE6E0798DF9C798-001\control-001\cores\collection1\data\index' doesn't exist. Creating new index...
    [junit4] 2> 2987522 INFO (coreLoadExecutor-10522-thread-1-processing-n:127.0.0.1:54346_t_nds%2Fjx) [n:127.0.0.1:54346_t_nds%2Fjx c:control_collection s:shard1 r:core_node1 x:collection1] o.a.s.c.CachingDirectoryFactory return new directory for C:\Users\jenkins\workspace\Lucene-Solr-6.1-Windows\solr\build\solr-core\test\J1\..\..\..\..\..\..\..\..\..\Users\jenkins\workspace\Lucene-Solr-6.1-Windows\solr\build\solr-core\test\J1\temp\solr.core.TestDynamicLoading_4DE6E0798DF9C798-001\control-001\cores\collection1\data\index
    [junit4] 2> 2987522 INFO (coreLoadExecutor-10522-thread-1-processing-n:127.0.0.1:54346_t_nds%2Fjx) [n:127.0.0.1:54346_t_nds%2Fjx c:control_collection s:shard1 r:core_node1 x:collection1] o.a.s.u.RandomMergePolicy RandomMergePolicy wrapping class org.apache.lucene.index.LogByteSizeMergePolicy: [LogByteSizeMergePolicy: minMergeSize=1677721, mergeFactor=35, maxMergeSize=2147483648, maxMergeSizeForForcedMerge=9223372036854775807, calibrateSizeByDeletes=true, maxMergeDocs=2147483647, maxCFSSegmentSizeMB=8.796093022207999E12, noCFSRatio=1.0]
    [junit4] 2> 2987523 INFO (coreLoadExecutor-10522-thread-1-processing-n:127.0.0.1:54346_t_nds%2Fjx) [n:127.0.0.1:54346_t_nds%2Fjx c:control_collection s:shard1 r:core_node1 x:collection1] o.a.s.c.SolrDeletionPolicy SolrDeletionPolicy.onCommit: commits: num=1
    [junit4] 2> commit{dir=MockDirectoryWrapper(RAMDirectory@9c07cd lockFactory=org.apache.lucene.store.SingleInstanceLockFactory@9db854),segFN=segments_1,generation=1}
    [junit4] 2> 2987523 INFO (coreLoadExecutor-10522-thread-1-processing-n:127.0.0.1:54346_t_nds%2Fjx) [n:127.0.0.1:54346_t_nds%2Fjx c:control_collection s:shard1 r:core_node1 x:collection1] o.a.s.c.SolrDeletionPolicy newest commit generation = 1
    [junit4] 2> 2987523 INFO (OldIndexDirectoryCleanupThreadForCore-collection1) [n:127.0.0.1:54346_t_nds%2Fjx c:control_collection s:shard1 r:core_node1 x:collection1] o.a.s.c.SolrCore Looking for old index directories to cleanup for core collection1 in C:\Users\jenkins\workspace\Lucene-Solr-6.1-Windows\solr\build\solr-core\test\J1\..\..\..\..\..\..\..\..\..\Users\jenkins\workspace\Lucene-Solr-6.1-Windows\solr\build\solr-core\test\J1\temp\solr.core.TestDynamicLoading_4DE6E0798DF9C798-001\control-001\cores\collection1\data\
    [junit4] 2> 2987525 WARN (OldIndexDirectoryCleanupThreadForCore-collection1) [n:127.0.0.1:54346_t_nds%2Fjx c:control_collection s:shard1 r:core_node1 x:collection1] o.a.s.c.DirectoryFactory C:\Users\jenkins\workspace\Lucene-Solr-6.1-Windows\solr\build\solr-core\test\J1\..\..\..\..\..\..\..\..\..\Users\jenkins\workspace\Lucene-Solr-6.1-Windows\solr\build\solr-core\test\J1\temp\solr.core.TestDynamicLoading_4DE6E0798DF9C798-001\control-001\cores\collection1\data\ does not point to a valid data directory; skipping clean-up of old index directories.
    [junit4] 2> 2987530 INFO (coreLoadExecutor-10522-thread-1-processing-n:127.0.0.1:54346_t_nds%2Fjx) [n:127.0.0.1:54346_t_nds%2Fjx c:control_collection s:shard1 r:core_node1 x:collection1] o.a.s.u.p.UpdateRequestProcessorChain creating updateRequestProcessorChain "nodistrib"
    [junit4] 2> 2987530 INFO (coreLoadExecutor-10522-thread-1-processing-n:127.0.0.1:54346_t_nds%2Fjx) [n:127.0.0.1:54346_t_nds%2Fjx c:control_collection s:shard1 r:core_node1 x:collection1] o.a.s.u.p.UpdateRequestProcessorChain creating updateRequestProcessorChain "dedupe"
    [junit4] 2> 2987531 INFO (coreLoadExecutor-10522-thread-1-processing-n:127.0.0.1:54346_t_nds%2Fjx) [n:127.0.0.1:54346_t_nds%2Fjx c:control_collection s:shard1 r:core_node1 x:collection1] o.a.s.u.p.UpdateRequestProcessorChain inserting DistributedUpdateProcessorFactory into updateRequestProcessorChain "dedupe"
    [junit4] 2> 2987531 INFO (coreLoadExecutor-10522-thread-1-processing-n:127.0.0.1:54346_t_nds%2Fjx) [n:127.0.0.1:54346_t_nds%2Fjx c:control_collection s:shard1 r:core_node1 x:collection1] o.a.s.u.p.UpdateRequestProcessorChain creating updateRequestProcessorChain "stored_sig"
    [junit4] 2> 2987531 INFO (coreLoadExecutor-10522-thread-1-processing-n:127.0.0.1:54346_t_nds%2Fjx) [n:127.0.0.1:54346_t_nds%2Fjx c:control_collection s:shard1 r:core_node1 x:collection1] o.a.s.u.p.UpdateRequestProcessorChain inserting DistributedUpdateProcessorFactory into updateRequestProcessorChain "stored_sig"
    [junit4] 2> 2987531 INFO (coreLoadExecutor-10522-thread-1-processing-n:127.0.0.1:54346_t_nds%2Fjx) [n:127.0.0.1:54346_t_nds%2Fjx c:control_collection s:shard1 r:core_node1 x:collection1] o.a.s.u.p.UpdateRequestProcessorChain creating updateRequestProcessorChain "distrib-dup-test-chain-explicit"
    [junit4] 2> 2987532 INFO (coreLoadExecutor-10522-thread-1-processing-n:127.0.0.1:54346_t_nds%2Fjx) [n:127.0.0.1:54346_t_nds%2Fjx c:control_collection s:shard1 r:core_node1 x:collection1] o.a.s.u.p.UpdateRequestProcessorChain creating updateRequestProcessorChain "distrib-dup-test-chain-implicit"
    [junit4] 2> 2987532 INFO (coreLoadExecutor-10522-thread-1-processing-n:127.0.0.1:54346_t_nds%2Fjx) [n:127.0.0.1:54346_t_nds%2Fjx c:control_collection s:shard1 r:core_node1 x:collection1] o.a.s.u.p.UpdateRequestProcessorChain inserting DistributedUpdateProcessorFactory into updateRequestProcessorChain "distrib-dup-test-chain-implicit"
    [junit4] 2> 2987532 INFO (coreLoadExecutor-10522-thread-1-processing-n:127.0.0.1:54346_t_nds%2Fjx) [n:127.0.0.1:54346_t_nds%2Fjx c:control_collection s:shard1 r:core_node1 x:collection1] o.a.s.c.SolrCore no updateRequestProcessorChain defined as default, creating implicit default
    [junit4] 2> 2987533 WARN (coreLoadExecutor-10522-thread-1-processing-n:127.0.0.1:54346_t_nds%2Fjx) [n:127.0.0.1:54346_t_nds%2Fjx c:control_collection s:shard1 r:core_node1 x:collection1] o.a.s.c.RequestHandlers INVALID paramSet a in requestHandler {type = requestHandler,name = /dump,class = DumpRequestHandler,args = {defaults={a=A,b=B}}}
    [junit4] 2> 2987539 INFO (coreLoadExecutor-10522-thread-1-processing-n:127.0.0.1:54346_t_nds%2Fjx) [n:127.0.0.1:54346_t_nds%2Fjx c:control_collection s:shard1 r:core_node1 x:collection1] o.a.s.h.l.XMLLoader xsltCacheLifetimeSeconds=60
    [junit4] 2> 2987542 INFO (coreLoadExecutor-10522-thread-1-processing-n:127.0.0.1:54346_t_nds%2Fjx) [n:127.0.0.1:54346_t_nds%2Fjx c:control_collection s:shard1 r:core_node1 x:collection1] o.a.s.h.l.XMLLoader xsltCacheLifetimeSeconds=60
    [junit4] 2> 2987544 INFO (coreLoadExecutor-10522-thread-1-processing-n:127.0.0.1:54346_t_nds%2Fjx) [n:127.0.0.1:54346_t_nds%2Fjx c:control_collection s:shard1 r:core_node1 x:collection1] o.a.s.h.l.XMLLoader xsltCacheLifetimeSeconds=60
    [junit4] 2> 2987547 INFO (coreLoadExecutor-10522-thread-1-processing-n:127.0.0.1:54346_t_nds%2Fjx) [n:127.0.0.1:54346_t_nds%2Fjx c:control_collection s:shard1 r:core_node1 x:collection1] o.a.s.h.l.XMLLoader xsltCacheLifetimeSeconds=60
    [junit4] 2> 2987560 INFO (coreLoadExecutor-10522-thread-1-processing-n:127.0.0.1:54346_t_nds%2Fjx) [n:127.0.0.1:54346_t_nds%2Fjx c:control_collection s:shard1 r:core_node1 x:collection1] o.a.s.c.RequestHandlers Registered paths: /admin/mbeans,standard,/update/json/docs,/admin/luke,/export,/get,/admin/properties,/update/json,/admin/threads,/dump,/update/csv,/sql,/graph,/admin/segments,/admin/system,/replication,/config,/stream,/schema,/admin/plugins,/admin/logging,/admin/ping,/update,/admin/file
    [junit4] 2> 2987560 INFO (coreLoadExecutor-10522-thread-1-processing-n:127.0.0.1:54346_t_nds%2Fjx) [n:127.0.0.1:54346_t_nds%2Fjx c:control_collection s:shard1 r:core_node1 x:collection1] o.a.s.c.SolrCore Using default statsCache cache: org.apache.solr.search.stats.LocalStatsCache
    [junit4] 2> 2987562 INFO (coreLoadExecutor-10522-thread-1-processing-n:127.0.0.1:54346_t_nds%2Fjx) [n:127.0.0.1:54346_t_nds%2Fjx c:control_collection s:shard1 r:core_node1 x:collection1] o.a.s.u.UpdateHandler Using UpdateLog implementation: org.apache.solr.update.UpdateLog
    [junit4] 2> 2987562 INFO (coreLoadExecutor-10522-thread-1-processing-n:127.0.0.1:54346_t_nds%2Fjx) [n:127.0.0.1:54346_t_nds%2Fjx c:control_collection s:shard1 r:core_node1 x:collection1] o.a.s.u.UpdateLog Initializing UpdateLog: dataDir= defaultSyncLevel=FLUSH numRecordsToKeep=100 maxNumLogsToKeep=10 numVersionBuckets=65536
    [junit4] 2> 2987566 INFO (coreLoadExecutor-10522-thread-1-processing-n:127.0.0.1:54346_t_nds%2Fjx) [n:127.0.0.1:54346_t_nds%2Fjx c:control_collection s:shard1 r:core_node1 x:collection1] o.a.s.u.CommitTracker Hard AutoCommit: disabled
    [junit4] 2> 2987566 INFO (coreLoadExecutor-10522-thread-1-processing-n:127.0.0.1:54346_t_nds%2Fjx) [n:127.0.0.1:54346_t_nds%2Fjx c:control_collection s:shard1 r:core_node1 x:collection1] o.a.s.u.CommitTracker Soft AutoCommit: disabled
    [junit4] 2> 2987567 INFO (coreLoadExecutor-10522-thread-1-processing-n:127.0.0.1:54346_t_nds%2Fjx) [n:127.0.0.1:54346_t_nds%2Fjx c:control_collection s:shard1 r:core_node1 x:collection1] o.a.s.u.RandomMergePolicy RandomMergePolicy wrapping class org.apache.lucene.index.LogByteSizeMergePolicy: [LogByteSizeMergePolicy: minMergeSize=1677721, mergeFactor=28, maxMergeSize=2147483648, maxMergeSizeForForcedMerge=9223372036854775807, calibrateSizeByDeletes=false, maxMergeDocs=2147483647, maxCFSSegmentSizeMB=8.796093022207999E12, noCFSRatio=0.0]
    [junit4] 2> 2987568 INFO (coreLoadExecutor-10522-thread-1-processing-n:127.0.0.1:54346_t_nds%2Fjx) [n:127.0.0.1:54346_t_nds%2Fjx c:control_collection s:shard1 r:core_node1 x:collection1] o.a.s.c.SolrDeletionPolicy SolrDeletionPolicy.onInit: commits: num=1
    [junit4] 2> commit{dir=MockDirectoryWrapper(RAMDirectory@9c07cd lockFactory=org.apache.lucene.store.SingleInstanceLockFactory@9db854),segFN=segments_1,generation=1}
    [junit4] 2> 2987568 INFO (coreLoadExecutor-10522-thread-1-processing-n:127.0.0.1:54346_t_nds%2Fjx) [n:127.0.0.1:54346_t_nds%2Fjx c:control_collection s:shard1 r:core_node1 x:collection1] o.a.s.c.SolrDeletionPolicy newest commit generation = 1
    [junit4] 2> 2987568 INFO (coreLoadExecutor-10522-thread-1-processing-n:127.0.0.1:54346_t_nds%2Fjx) [n:127.0.0.1:54346_t_nds%2Fjx c:control_collection s:shard1 r:core_node1 x:collection1] o.a.s.s.SolrIndexSearcher Opening [Searcher@1f6e3eb[collection1] main]
    [junit4] 2> 2987568 INFO (coreLoadExecutor-10522-thread-1-processing-n:127.0.0.1:54346_t_nds%2Fjx) [n:127.0.0.1:54346_t_nds%2Fjx c:control_collection s:shard1 r:core_node1 x:collection1] o.a.s.c.c.ZkStateReader Load collection config from: [/collections/control_collection]
    [junit4] 2> 2987570 INFO (coreLoadExecutor-10522-thread-1-processing-n:127.0.0.1:54346_t_nds%2Fjx) [n:127.0.0.1:54346_t_nds%2Fjx c:control_collection s:shard1 r:core_node1 x:collection1] o.a.s.c.c.ZkStateReader path=[/collections/control_collection] [configName]=[conf1] specified config exists in ZooKeeper
    [junit4] 2> 2987570 INFO (coreLoadExecutor-10522-thread-1-processing-n:127.0.0.1:54346_t_nds%2Fjx) [n:127.0.0.1:54346_t_nds%2Fjx c:control_collection s:shard1 r:core_node1 x:collection1] o.a.s.r.ManagedResourceStorage Setting up ZooKeeper-based storage for the RestManager with znodeBase: /configs/conf1
    [junit4] 2> 2987571 INFO (coreLoadExecutor-10522-thread-1-processing-n:127.0.0.1:54346_t_nds%2Fjx) [n:127.0.0.1:54346_t_nds%2Fjx c:control_collection s:shard1 r:core_node1 x:collection1] o.a.s.r.ManagedResourceStorage Configured ZooKeeperStorageIO with znodeBase: /configs/conf1
    [junit4] 2> 2987571 INFO (coreLoadExecutor-10522-thread-1-processing-n:127.0.0.1:54346_t_nds%2Fjx) [n:127.0.0.1:54346_t_nds%2Fjx c:control_collection s:shard1 r:core_node1 x:collection1] o.a.s.r.RestManager Initializing RestManager with initArgs: {}
    [junit4] 2> 2987571 INFO (coreLoadExecutor-10522-thread-1-processing-n:127.0.0.1:54346_t_nds%2Fjx) [n:127.0.0.1:54346_t_nds%2Fjx c:control_collection s:shard1 r:core_node1 x:collection1] o.a.s.r.ManagedResourceStorage Reading _rest_managed.json using ZooKeeperStorageIO:path=/configs/conf1
    [junit4] 2> 2987573 INFO (coreLoadExecutor-10522-thread-1-processing-n:127.0.0.1:54346_t_nds%2Fjx) [n:127.0.0.1:54346_t_nds%2Fjx c:control_collection s:shard1 r:core_node1 x:collection1] o.a.s.r.ManagedResourceStorage No data found for znode /configs/conf1/_rest_managed.json
    [junit4] 2> 2987573 INFO (coreLoadExecutor-10522-thread-1-processing-n:127.0.0.1:54346_t_nds%2Fjx) [n:127.0.0.1:54346_t_nds%2Fjx c:control_collection s:shard1 r:core_node1 x:collection1] o.a.s.r.ManagedResourceStorage Loaded null at path _rest_managed.json using ZooKeeperStorageIO:path=/configs/conf1
    [junit4] 2> 2987573 INFO (coreLoadExecutor-10522-thread-1-processing-n:127.0.0.1:54346_t_nds%2Fjx) [n:127.0.0.1:54346_t_nds%2Fjx c:control_collection s:shard1 r:core_node1 x:collection1] o.a.s.r.RestManager Initializing 0 registered ManagedResources
    [junit4] 2> 2987573 INFO (coreLoadExecutor-10522-thread-1-processing-n:127.0.0.1:54346_t_nds%2Fjx) [n:127.0.0.1:54346_t_nds%2Fjx c:control_collection s:shard1 r:core_node1 x:collection1] o.a.s.h.ReplicationHandler Commits will be reserved for 10000
    [junit4] 2> 2987576 INFO (searcherExecutor-10523-thread-1-processing-n:127.0.0.1:54346_t_nds%2Fjx x:collection1 s:shard1 c:control_collection r:core_node1) [n:127.0.0.1:54346_t_nds%2Fjx c:control_collection s:shard1 r:core_node1 x:collection1] o.a.s.c.SolrCore [collection1] Registered new searcher Searcher@1f6e3eb[collection1] main{ExitableDirectoryReader(UninvertingDirectoryReader())}
    [junit4] 2> 2987578 INFO (coreLoadExecutor-10522-thread-1-processing-n:127.0.0.1:54346_t_nds%2Fjx) [n:127.0.0.1:54346_t_nds%2Fjx c:control_collection s:shard1 r:core_node1 x:collection1] o.a.s.u.UpdateLog Looking up max value of version field to seed version buckets
    [junit4] 2> 2987579 INFO (coreLoadExecutor-10522-thread-1-processing-n:127.0.0.1:54346_t_nds%2Fjx) [n:127.0.0.1:54346_t_nds%2Fjx c:control_collection s:shard1 r:core_node1 x:collection1] o.a.s.u.VersionInfo Refreshing highest value of _version_ for 65536 version buckets from index
    [junit4] 2> 2987579 INFO (coreLoadExecutor-10522-thread-1-processing-n:127.0.0.1:54346_t_nds%2Fjx) [n:127.0.0.1:54346_t_nds%2Fjx c:control_collection s:shard1 r:core_node1 x:collection1] o.a.s.u.VersionInfo No terms found for _version_, cannot seed version bucket highest value from index
    [junit4] 2> 2987579 INFO (coreLoadExecutor-10522-thread-1-processing-n:127.0.0.1:54346_t_nds%2Fjx) [n:127.0.0.1:54346_t_nds%2Fjx c:control_collection s:shard1 r:core_node1 x:collection1] o.a.s.u.UpdateLog Could not find max version in index or recent updates, using new clock 1536817522422054912
    [junit4] 2> 2987581 INFO (coreLoadExecutor-10522-thread-1-processing-n:127.0.0.1:54346_t_nds%2Fjx) [n:127.0.0.1:54346_t_nds%2Fjx c:control_collection s:shard1 r:core_node1 x:collection1] o.a.s.u.UpdateLog Took 3.0ms to seed version buckets with highest version 1536817522422054912
    [junit4] 2> 2987581 INFO (coreLoadExecutor-10522-thread-1-processing-n:127.0.0.1:54346_t_nds%2Fjx) [n:127.0.0.1:54346_t_nds%2Fjx c:control_collection s:shard1 r:core_node1 x:collection1] o.a.s.c.ZkController watch zkdir /configs/conf1
    [junit4] 2> 2987583 INFO (coreLoadExecutor-10522-thread-1-processing-n:127.0.0.1:54346_t_nds%2Fjx) [n:127.0.0.1:54346_t_nds%2Fjx c:control_collection s:shard1 r:core_node1 x:collection1] o.a.s.c.CoreContainer registering core: collection1
    [junit4] 2> 2987584 INFO (coreZkRegister-10516-thread-1-processing-n:127.0.0.1:54346_t_nds%2Fjx x:collection1 s:shard1 c:control_collection r:core_node1) [n:127.0.0.1:54346_t_nds%2Fjx c:control_collection s:shard1 r:core_node1 x:collection1] o.a.s.c.ZkController Register replica - core:collection1 address:http://127.0.0.1:54346/t_nds/jx collection:control_collection shard:shard1
    [junit4] 2> 2987585 INFO (coreZkRegister-10516-thread-1-processing-n:127.0.0.1:54346_t_nds%2Fjx x:collection1 s:shard1 c:control_collection r:core_node1) [n:127.0.0.1:54346_t_nds%2Fjx c:control_collection s:shard1 r:core_node1 x:collection1] o.a.s.c.c.SolrZkClient makePath: /collections/control_collection/leader_elect/shard1/election
    [junit4] 2> 2987593 INFO (coreZkRegister-10516-thread-1-processing-n:127.0.0.1:54346_t_nds%2Fjx x:collection1 s:shard1 c:control_collection r:core_node1) [n:127.0.0.1:54346_t_nds%2Fjx c:control_collection s:shard1 r:core_node1 x:collection1] o.a.s.c.LeaderElector Joined leadership election with path: /collections/control_collection/leader_elect/shard1/election/96051094944481284-core_node1-n_0000000000
    [junit4] 2> 2987594 INFO (coreZkRegister-10516-thread-1-processing-n:127.0.0.1:54346_t_nds%2Fjx x:collection1 s:shard1 c:control_collection r:core_node1) [n:127.0.0.1:54346_t_nds%2Fjx c:control_collection s:shard1 r:core_node1 x:collection1] o.a.s.c.ShardLeaderElectionContext Running the leader process for shard=shard1 and weAreReplacement=false and leaderVoteWait=10000
    [junit4] 2> 2987598 INFO (coreZkRegister-10516-thread-1-processing-n:127.0.0.1:54346_t_nds%2Fjx x:collection1 s:shard1 c:control_collection r:core_node1) [n:127.0.0.1:54346_t_nds%2Fjx c:control_collection s:shard1 r:core_node1 x:collection1] o.a.s.c.ShardLeaderElectionContext Enough replicas found to continue.
    [junit4] 2> 2987598 INFO (coreZkRegister-10516-thread-1-processing-n:127.0.0.1:54346_t_nds%2Fjx x:collection1 s:shard1 c:control_collection r:core_node1) [n:127.0.0.1:54346_t_nds%2Fjx c:control_collection s:shard1 r:core_node1 x:collection1] o.a.s.c.ShardLeaderElectionContext I may be the new leader - try and sync
    [junit4] 2> 2987598 INFO (coreZkRegister-10516-thread-1-processing-n:127.0.0.1:54346_t_nds%2Fjx x:collection1 s:shard1 c:control_collection r:core_node1) [n:127.0.0.1:54346_t_nds%2Fjx c:control_collection s:shard1 r:core_node1 x:collection1] o.a.s.c.SyncStrategy Sync replicas to http://127.0.0.1:54346/t_nds/jx/collection1/
    [junit4] 2> 2987600 INFO (coreZkRegister-10516-thread-1-processing-n:127.0.0.1:54346_t_nds%2Fjx x:collection1 s:shard1 c:control_collection r:core_node1) [n:127.0.0.1:54346_t_nds%2Fjx c:control_collection s:shard1 r:core_node1 x:collection1] o.a.s.c.SyncStrategy Sync Success - now sync replicas to me
    [junit4] 2> 2987600 INFO (coreZkRegister-10516-thread-1-processing-n:127.0.0.1:54346_t_nds%2Fjx x:collection1 s:shard1 c:control_collection r:core_node1) [n:127.0.0.1:54346_t_nds%2Fjx c:control_collection s:shard1 r:core_node1 x:collection1] o.a.s.c.SyncStrategy http://127.0.0.1:54346/t_nds/jx/collection1/ has no replicas
    [junit4] 2> 2987600 INFO (OverseerStateUpdate-96051094944481284-127.0.0.1:54346_t_nds%2Fjx-n_0000000000) [n:127.0.0.1:54346_t_nds%2Fjx ] o.a.s.c.Overseer processMessage: queueSize: 1, message = {
    [junit4] 2> "operation":"leader",
    [junit4] 2> "shard":"shard1",
    [junit4] 2> "collection":"control_collection"} current state version: 1
    [junit4] 2> 2987603 INFO (coreZkRegister-10516-thread-1-processing-n:127.0.0.1:54346_t_nds%2Fjx x:collection1 s:shard1 c:control_collection r:core_node1) [n:127.0.0.1:54346_t_nds%2Fjx c:control_collection s:shard1 r:core_node1 x:collection1] o.a.s.c.c.SolrZkClient makePath: /collections/control_collection/leaders/shard1
    [junit4] 2> 2987608 INFO (coreZkRegister-10516-thread-1-processing-n:127.0.0.1:54346_t_nds%2Fjx x:collection1 s:shard1 c:control_collection r:core_node1) [n:127.0.0.1:54346_t_nds%2Fjx c:control_collection s:shard1 r:core_node1 x:collection1] o.a.s.c.ShardLeaderElectionContextBase Creating leader registration node /collections/control_collection/leaders/shard1/leader after winning as /collections/control_collection/leader_elect/shard1/election/96051094944481284-core_node1-n_0000000000
    [junit4] 2> 2987613 INFO (coreZkRegister-10516-thread-1-processing-n:127.0.0.1:54346_t_nds%2Fjx x:collection1 s:shard1 c:control_collection r:core_node1) [n:127.0.0.1:54346_t_nds%2Fjx c:control_collection s:shard1 r:core_node1 x:collection1] o.a.s.c.ShardLeaderElectionContext I am the new leader: http://127.0.0.1:54346/t_nds/jx/collection1/ shard1
    [junit4] 2> 2987615 INFO (OverseerStateUpdate-96051094944481284-127.0.0.1:54346_t_nds%2Fjx-n_0000000000) [n:127.0.0.1:54346_t_nds%2Fjx ] o.a.s.c.Overseer processMessage: queueSize: 1, message = {
    [junit4] 2> "operation":"leader",
    [junit4] 2> "shard":"shard1",
    [junit4] 2> "collection":"control_collection",
    [junit4] 2> "base_url":"http://127.0.0.1:54346/t_nds/jx",
    [junit4] 2> "core":"collection1",
    [junit4] 2> "state":"active"} current state version: 1
    [junit4] 2> 2987715 INFO (TEST-TestDynamicLoading.testDynamicLoading-seed#[4DE6E0798DF9C798]) [ ] o.a.s.c.s.i.CloudSolrClient Final constructed zkHost string: 127.0.0.1:54337/solr
    [junit4] 2> 2987716 INFO (TEST-TestDynamicLoading.testDynamicLoading-seed#[4DE6E0798DF9C798]) [ ] o.a.s.c.c.SolrZkClient Using default ZkCredentialsProvider
    [junit4] 2> 2987718 INFO (TEST-TestDynamicLoading.testDynamicLoading-seed#[4DE6E0798DF9C798]) [ ] o.a.s.c.c.ConnectionManager Waiting for client to connect to ZooKeeper
    [junit4] 2> 2987719 INFO (zkCallback-9771-thread-2-processing-n:127.0.0.1:54346_t_nds%2Fjx) [n:127.0.0.1:54346_t_nds%2Fjx ] o.a.s.c.c.ZkStateReader A cluster state change: [WatchedEvent state:SyncConnected type:NodeDataChanged path:/clusterstate.json], has occurred - updating... (live nodes size: [1])
    [junit4] 2> 2987721 INFO (zkCallback-9775-thread-1) [ ] o.a.s.c.c.ConnectionManager Watcher org.apache.solr.common.cloud.ConnectionManager@1c345d7 name:ZooKeeperConnection Watcher:127.0.0.1:54337/solr got event WatchedEvent state:SyncConnected type:None path:null path:null type:None
    [junit4] 2> 2987721 INFO (TEST-TestDynamicLoading.testDynamicLoading-seed#[4DE6E0798DF9C798]) [ ] o.a.s.c.c.ConnectionManager Client is connected to ZooKeeper
    [junit4] 2> 2987721 INFO (TEST-TestDynamicLoading.testDynamicLoading-seed#[4DE6E0798DF9C798]) [ ] o.a.s.c.c.SolrZkClient Using default ZkACLProvider
    [junit4] 2> 2987721 INFO (TEST-TestDynamicLoading.testDynamicLoading-seed#[4DE6E0798DF9C798]) [ ] o.a.s.c.c.ZkStateReader Updating cluster state from ZooKeeper...
    [junit4] 2> 2987722 INFO (TEST-TestDynamicLoading.testDynamicLoading-seed#[4DE6E0798DF9C798]) [ ] o.a.s.c.c.ZkStateReader Loaded empty cluster properties
    [junit4] 2> 2987724 INFO (TEST-TestDynamicLoading.testDynamicLoading-seed#[4DE6E0798DF9C798]) [ ] o.a.s.c.c.ZkStateReader Updated live nodes from ZooKeeper... (0) -> (1)
    [junit4] 2> 2987727 INFO (TEST-TestDynamicLoading.testDynamicLoading-seed#[4DE6E0798DF9C798]) [ ] o.a.s.c.ChaosMonkey monkey: init - expire sessions:false cause connection loss:false
    [junit4] 2> 2987727 INFO (TEST-TestDynamicLoading.testDynamicLoading-seed#[4DE6E0798DF9C798]) [ ] o.a.s.c.AbstractFullDistribZkTestBase Creating collection1 with stateFormat=2
    [junit4] 2> 2987727 INFO (TEST-TestDynamicLoading.testDynamicLoading-seed#[4DE6E0798DF9C798]) [ ] o.a.s.c.c.SolrZkClient Using default ZkCredentialsProvider
    [junit4] 2> 2987728 INFO (TEST-TestDynamicLoading.testDynamicLoading-seed#[4DE6E0798DF9C798]) [ ] o.a.s.c.c.ConnectionManager Waiting for client to connect to ZooKeeper
    [junit4] 2> 2987730 INFO (zkCallback-9776-thread-1) [ ] o.a.s.c.c.ConnectionManager Watcher org.apache.solr.common.cloud.ConnectionManager@11bf71c name:ZooKeeperConnection Watcher:127.0.0.1:54337/solr got event WatchedEvent state:SyncConnected type:None path:null path:null type:None
    [junit4] 2> 2987730 INFO (TEST-TestDynamicLoading.testDynamicLoading-seed#[4DE6E0798DF9C798]) [ ] o.a.s.c.c.ConnectionManager Client is connected to ZooKeeper
    [junit4] 2> 2987730 INFO (TEST-TestDynamicLoading.testDynamicLoading-seed#[4DE6E0798DF9C798]) [ ] o.a.s.c.c.SolrZkClient Using default ZkACLProvider
    [junit4] 2> 2987734 WARN (NIOServerCxn.Factory:0.0.0.0/0.0.0.0:0) [ ] o.a.z.s.NIOServerCnxn caught end of stream exception
    [junit4] 2> EndOfStreamException: Unable to read additional data from client sessionid 0x1553df642740006, likely client has closed socket
    [junit4] 2> at org.apache.zookeeper.server.NIOServerCnxn.doIO(NIOServerCnxn.java:228)
    [junit4] 2> at org.apache.zookeeper.server.NIOServerCnxnFactory.run(NIOServerCnxnFactory.java:208)
    [junit4] 2> at java.lang.Thread.run(Thread.java:745)
    [junit4] 2> 2987739 INFO (OverseerStateUpdate-96051094944481284-127.0.0.1:54346_t_nds%2Fjx-n_0000000000) [n:127.0.0.1:54346_t_nds%2Fjx ] o.a.s.c.Overseer processMessage: queueSize: 1, message = {
    [junit4] 2> "operation":"create",
    [junit4] 2> "name":"collection1",
    [junit4] 2> "numShards":"2",
    [junit4] 2> "stateFormat":"2"} current state version: 2
    [junit4] 2> 2987739 INFO (OverseerStateUpdate-96051094944481284-127.0.0.1:54346_t_nds%2Fjx-n_0000000000) [n:127.0.0.1:54346_t_nds%2Fjx ] o.a.s.c.o.ClusterStateMutator building a new cName: collection1
    [junit4] 2> 2987767 INFO (coreZkRegister-10516-thread-1-processing-n:127.0.0.1:54346_t_nds%2Fjx x:collection1 s:shard1 c:control_collection r:core_node1) [n:127.0.0.1:54346_t_nds%2Fjx c:control_collection s:shard1 r:core_node1 x:collection1] o.a.s.c.ZkController We are http://127.0.0.1:54346/t_nds/jx/collection1/ and leader is http://127.0.0.1:54346/t_nds/jx/collection1/
    [junit4] 2> 2987767 INFO (coreZkRegister-10516-thread-1-processing-n:127.0.0.1:54346_t_nds%2Fjx x:collection1 s:shard1 c:control_collection r:core_node1) [n:127.0.0.1:54346_t_nds%2Fjx c:control_collection s:shard1 r:core_node1 x:collection1] o.a.s.c.ZkController No LogReplay needed for core=collection1 baseURL=http://127.0.0.1:54346/t_nds/jx
    [junit4] 2> 2987767 INFO (coreZkRegister-10516-thread-1-processing-n:127.0.0.1:54346_t_nds%2Fjx x:collection1 s:shard1 c:control_collection r:core_node1) [n:127.0.0.1:54346_t_nds%2Fjx c:control_collection s:shard1 r:core_node1 x:collection1] o.a.s.c.ZkController I am the leader, no recovery necessary
    [junit4] 2> 2987767 INFO (coreZkRegister-10516-thread-1-processing-n:127.0.0.1:54346_t_nds%2Fjx x:collection1 s:shard1 c:control_collection r:core_node1) [n:127.0.0.1:54346_t_nds%2Fjx c:control_collection s:shard1 r:core_node1 x:collection1] o.a.s.c.ZkController publishing state=active
    [junit4] 2> 2987769 INFO (coreZkRegister-10516-thread-1-processing-n:127.0.0.1:54346_t_nds%2Fjx x:collection1 s:shard1 c:control_collection r:core_node1) [n:127.0.0.1:54346_t_nds%2Fjx c:control_collection s:shard1 r:core_node1 x:collection1] o.a.s.c.ZkController numShards not found on descriptor - reading it from system property
    [junit4] 2> 2987774 INFO (OverseerStateUpdate-96051094944481284-127.0.0.1:54346_t_nds%2Fjx-n_0000000000) [n:127.0.0.1:54346_t_nds%2Fjx ] o.a.s.c.Overseer processMessage: queueSize: 1, message = {
    [junit4] 2> "core":"collection1",
    [junit4] 2> "core_node_name":"core_node1",
    [junit4] 2> "roles":null,
    [junit4] 2> "base_url":"http://127.0.0.1:54346/t_nds/jx",
    [junit4] 2> "node_name":"127.0.0.1:54346_t_nds%2Fjx",
    [junit4] 2> "numShards":"2",
    [junit4] 2> "state":"active",
    [junit4] 2> "shard":"shard1",
    [junit4] 2> "collection":"control_collection",
    [junit4] 2> "operation":"state"} current state version: 2
    [junit4] 2> 2987775 INFO (OverseerStateUpdate-96051094944481284-127.0.0.1:54346_t_nds%2Fjx-n_0000000000) [n:127.0.0.1:54346_t_nds%2Fjx ] o.a.s.c.o.ReplicaMutator Update state numShards=2 message={
    [junit4] 2> "core":"collection1",
    [junit4] 2> "core_node_name":"core_node1",
    [junit4] 2> "roles":null,
    [junit4] 2> "base_url":"http://127.0.0.1:54346/t_nds/jx",
    [junit4] 2> "node_name":"127.0.0.1:54346_t_nds%2Fjx",
    [junit4] 2> "numShards":"2",
    [junit4] 2> "state":"active",
    [junit4] 2> "shard":"shard1",
    [junit4] 2> "collection":"control_collection",
    [junit4] 2> "operation":"state"}
    [junit4] 2> 2987776 INFO (OverseerStateUpdate-96051094944481284-127.0.0.1:54346_t_nds%2Fjx-n_0000000000) [n:127.0.0.1:54346_t_nds%2Fjx ] o.a.s.c.o.ZkStateWriter going to create_collection /collections/collection1/state.json
    [junit4] 2> 2987886 INFO (zkCallback-9771-thread-1-processing-n:127.0.0.1:54346_t_nds%2Fjx) [n:127.0.0.1:54346_t_nds%2Fjx ] o.a.s.c.c.ZkStateReader A cluster state change: [WatchedEvent state:SyncConnected type:NodeDataChanged path:/clusterstate.json], has occurred - updating... (live nodes size: [1])
    [junit4] 2> 2987886 INFO (zkCallback-9775-thread-1) [ ] o.a.s.c.c.ZkStateReader A cluster state change: [WatchedEvent state:SyncConnected type:NodeDataChanged path:/clusterstate.json], has occurred - updating... (live nodes size: [1])
    [junit4] 2> 2988379 INFO (TEST-TestDynamicLoading.testDynamicLoading-seed#[4DE6E0798DF9C798]) [ ] o.a.s.SolrTestCaseJ4 Writing core.properties file to C:\Users\jenkins\workspace\Lucene-Solr-6.1-Windows\solr\build\solr-core\test\J1\temp\solr.core.TestDynamicLoading_4DE6E0798DF9C798-001\shard-1-001\cores\collection1
    [junit4] 2> 2988382 INFO (TEST-TestDynamicLoading.testDynamicLoading-seed#[4DE6E0798DF9C798]) [ ] o.a.s.c.AbstractFullDistribZkTestBase create jetty 1 in directory C:\Users\jenkins\workspace\Lucene-Solr-6.1-Windows\solr\build\solr-core\test\J1\temp\solr.core.TestDynamicLoading_4DE6E0798DF9C798-001\shard-1-001
    [junit4] 2> 2988383 INFO (TEST-TestDynamicLoading.testDynamicLoading-seed#[4DE6E0798DF9C798]) [ ] o.e.j.s.Server jetty-9.3.8.v20160314
    [junit4] 2> 2988384 INFO (TEST-TestDynamicLoading.testDynamicLoading-seed#[4DE6E0798DF9C798]) [ ] o.e.j.s.h.ContextHandler Started o.e.j.s.ServletContextHandler@dc77da{/t_nds/jx,null,AVAILABLE}
    [junit4] 2> 2988386 INFO (TEST-TestDynamicLoading.testDynamicLoading-seed#[4DE6E0798DF9C798]) [ ] o.e.j.s.ServerConnector Started ServerConnector@c1627c{HTTP/1.1,[http/1.1]}{127.0.0.1:54370}
    [junit4] 2> 2988386 INFO (TEST-TestDynamicLoading.testDynamicLoading-seed#[4DE6E0798DF9C798]) [ ] o.e.j.s.Server Started @2993902ms
    [junit4] 2> 2988386 INFO (TEST-TestDynamicLoading.testDynamicLoading-seed#[4DE6E0798DF9C798]) [ ] o.a.s.c.s.e.JettySolrRunner Jetty properties: {solr.data.dir=C:\Users\jenkins\workspace\Lucene-Solr-6.1-Windows\solr\build\solr-core\test\J1\temp\solr.core.TestDynamicLoading_4DE6E0798DF9C798-001\tempDir-001/jetty1, solrconfig=solrconfig.xml, hostContext=/t_nds/jx, hostPort=54370, coreRootDirectory=C:\Users\jenkins\workspace\Lucene-Solr-6.1-Windows\solr\build\solr-core\test\J1\temp\solr.core.TestDynamicLoading_4DE6E0798DF9C798-001\shard-1-001\cores}
    [junit4] 2> 2988387 INFO (TEST-TestDynamicLoading.testDynamicLoading-seed#[4DE6E0798DF9C798]) [ ] o.a.s.s.SolrDispatchFilter SolrDispatchFilter.init(): sun.misc.Launcher$AppClassLoader@1d16e93
    [junit4] 2> 2988387 INFO (TEST-TestDynamicLoading.testDynamicLoading-seed#[4DE6E0798DF9C798]) [ ] o.a.s.c.SolrResourceLoader new SolrResourceLoader for directory: 'C:\Users\jenkins\workspace\Lucene-Solr-6.1-Windows\solr\build\solr-core\test\J1\temp\solr.core.TestDynamicLoading_4DE6E0798DF9C798-001\shard-1-001'
    [junit4] 2> 2988387 INFO (TEST-TestDynamicLoading.testDynamicLoading-seed#[4DE6E0798DF9C798]) [ ] o.a.s.c.SolrResourceLoader JNDI not configured for solr (NoInitialContextEx)
    [junit4] 2> 2988387 INFO (TEST-TestDynamicLoading.testDynamicLoading-seed#[4DE6E0798DF9C798]) [ ] o.a.s.c.SolrResourceLoader solr home defaulted to 'solr/' (could not find system property or JNDI)
    [junit4] 2> 2988388 INFO (TEST-TestDynamicLoading.testDynamicLoading-seed#[4DE6E0798DF9C798]) [ ] o.a.s.c.c.SolrZkClient Using default ZkCredentialsProvider
    [junit4] 2> 2988389 INFO (TEST-TestDynamicLoading.testDynamicLoading-seed#[4DE6E0798DF9C798]) [ ] o.a.s.c.c.ConnectionManager Waiting for client to connect to ZooKeeper
    [junit4] 2> 2988391 INFO (zkCallback-9777-thread-1) [ ] o.a.s.c.c.ConnectionManager Watcher org.apache.solr.common.cloud.ConnectionManager@1f0a0bb name:ZooKeeperConnection Watcher:127.0.0.1:54337/solr got event WatchedEvent state:SyncConnected type:None path:null path:null type:None
    [junit4] 2> 2988391 INFO (TEST-TestDynamicLoading.testDynamicLoading-seed#[4DE6E0798DF9C798]) [ ] o.a.s.c.c.ConnectionManager Client is connected to ZooKeeper
    [junit4] 2> 2988393 INFO (TEST-TestDynamicLoading.testDynamicLoading-seed#[4DE6E0798DF9C798]) [ ] o.a.s.c.c.SolrZkClient Using default ZkACLProvider
    [junit4] 2> 2988394 INFO (TEST-TestDynamicLoading.testDynamicLoading-seed#[4DE6E0798DF9C798]) [ ] o.a.s.s.SolrDispatchFilter Loading solr.xml from SolrHome (not found in ZooKeeper)
    [junit4] 2> 2988394 INFO (TEST-TestDynamicLoading.testDynamicLoading-seed#[4DE6E0798DF9C798]) [ ] o.a.s.c.SolrXmlConfig Loading container configuration from C:\Users\jenkins\workspace\Lucene-Solr-6.1-Windows\solr\build\solr-core\test\J1\temp\solr.core.TestDynamicLoading_4DE6E0798DF9C798-001\shard-1-001\solr.xml
    [junit4] 2> 2988395 WARN (NIOServerCxn.Factory:0.0.0.0/0.0.0.0:0) [ ] o.a.z.s.NIOServerCnxn caught end of stream exception
    [junit4] 2> EndOfStreamException: Unable to read additional data from client sessionid 0x1553df642740007, likely client has closed socket
    [junit4] 2> at org.apache.zookeeper.server.NIOServerCnxn.doIO(NIOServerCnxn.java:228)
    [junit4] 2> at org.apache.zookeeper.server.NIOServerCnxnFactory.run(NIOServerCnxnFactory.java:208)
    [junit4] 2> at java.lang.Thread.run(Thread.java:745)
    [junit4] 2> 2988409 INFO (TEST-TestDynamicLoading.testDynamicLoading-seed#[4DE6E0798DF9C798]) [ ] o.a.s.c.CorePropertiesLocator Config-defined core root directory: C:\Users\jenkins\workspace\Lucene-Solr-6.1-Windows\solr\build\solr-core\test\J1\temp\solr.core.TestDynamicLoading_4DE6E0798DF9C798-001\shard-1-001\cores
    [junit4] 2> 2988409 INFO (TEST-TestDynamicLoading.testDynamicLoading-seed#[4DE6E0798DF9C798]) [ ] o.a.s.c.CoreContainer New CoreContainer 7477362
    [junit4] 2> 2988409 INFO (TEST-TestDynamicLoading.testDynamicLoading-seed#[4DE6E0798DF9C798]) [ ] o.a.s.c.CoreContainer Loading cores into CoreContainer [instanceDir=C:\Users\jenkins\workspace\Lucene-Solr-6.1-Windows\solr\build\solr-core\test\J1\temp\solr.core.TestDynamicLoading_4DE6E0798DF9C798-001\shard-1-001]
    [junit4] 2> 2988409 WARN (TEST-TestDynamicLoading.testDynamicLoading-seed#[4DE6E0798DF9C798]) [ ] o.a.s.c.CoreContainer Couldn't add files from C:\Users\jenkins\workspace\Lucene-Solr-6.1-Windows\solr\build\solr-core\test\J1\temp\solr.core.TestDynamicLoading_4DE6E0798DF9C798-001\shard-1-001\lib to classpath: C:\Users\jenkins\workspace\Lucene-Solr-6.1-Windows\solr\build\solr-core\test\J1\temp\solr.core.TestDynamicLoading_4DE6E0798DF9C798-001\shard-1-001\lib
    [junit4] 2> 2988410 INFO (TEST-TestDynamicLoading.testDynamicLoading-seed#[4DE6E0798DF9C798]) [ ] o.a.s.h.c.HttpShardHandlerFactory created with socketTimeout : 90000,urlScheme : ,connTimeout : 15000,maxConnectionsPerHost : 20,maxConnections : 10000,corePoolSize : 0,maximumPoolSize : 2147483647,maxThreadIdleTime : 5,sizeOfQueue : -1,fairnessPolicy : false,useRetries : false,
    [junit4] 2> 2988414 INFO (TEST-TestDynamicLoading.testDynamicLoading-seed#[4DE6E0798DF9C798]) [ ] o.a.s.u.UpdateShardHandler Creating UpdateShardHandler HTTP client with params: socketTimeout=340000&connTimeout=45000&retry=true
    [junit4] 2> 2988416 INFO (TEST-TestDynamicLoading.testDynamicLoading-seed#[4DE6E0798DF9C798]) [ ] o.a.s.l.LogWatcher SLF4J impl is org.slf4j.impl.Log4jLoggerFactory
    [junit4] 2> 2988417 INFO (TEST-TestDynamicLoading.testDynamicLoading-seed#[4DE6E0798DF9C798]) [ ] o.a.s.l.LogWatcher Registering Log Listener [Log4j (org.slf4j.impl.Log4jLoggerFactory)]
    [junit4] 2> 2988417 INFO (TEST-TestDynamicLoading.testDynamicLoading-seed#[4DE6E0798DF9C798]) [ ] o.a.s.c.ZkContainer Zookeeper client=127.0.0.1:54337/solr
    [junit4] 2> 2988417 INFO (TEST-TestDynamicLoading.testDynamicLoading-seed#[4DE6E0798DF9C798]) [ ] o.a.s.c.ZkController zkHost includes chroot
    [junit4] 2> 2988417 INFO (TEST-TestDynamicLoading.testDynamicLoading-seed#[4DE6E0798DF9C798]) [ ] o.a.s.c.c.SolrZkClient Using default ZkCredentialsProvider
    [junit4] 2> 2988418 INFO (TEST-TestDynamicLoading.testDynamicLoading-seed#[4DE6E0798DF9C798]) [ ] o.a.s.c.c.ConnectionManager Waiting for client to connect to ZooKeeper
    [junit4] 2> 2988421 INFO (zkCallback-9780-thread-1) [ ] o.a.s.c.c.ConnectionManager Watcher org.apache.solr.common.cloud.ConnectionManager@9fc4d6 name:ZooKeeperConnection Watcher:127.0.0.1:54337 got event WatchedEvent state:SyncConnected type:None path:null path:null type:None
    [junit4] 2> 2988421 INFO (TEST-TestDynamicLoading.testDynamicLoading-seed#[4DE6E0798DF9C798]) [ ] o.a.s.c.c.ConnectionManager Client is connected to ZooKeeper
    [junit4] 2> 2988421 INFO (TEST-TestDynamicLoading.testDynamicLoading-seed#[4DE6E0798DF9C798]) [ ] o.a.s.c.c.SolrZkClient Using default ZkACLProvider
    [junit4] 2> 2988423 INFO (TEST-TestDynamicLoading.testDynamicLoading-seed#[4DE6E0798DF9C798]) [n:127.0.0.1:54370_t_nds%2Fjx ] o.a.s.c.ZkController Added new OnReconnect listener org.apache.solr.cloud.ZkController$$Lambda$53/18614643@2302f8
    [junit4] 2> 2988425 INFO (TEST-TestDynamicLoading.testDynamicLoading-seed#[4DE6E0798DF9C798]) [n:127.0.0.1:54370_t_nds%2Fjx ] o.a.s.c.c.ConnectionManager Waiting for client to connect to ZooKeeper
    [junit4] 2> 2988427 INFO (zkCallback-9781-thread-1-processing-n:127.0.0.1:54370_t_nds%2Fjx) [n:127.0.0.1:54370_t_nds%2Fjx ] o.a.s.c.c.ConnectionManager Watcher org.apache.solr.common.cloud.ConnectionManager@1f4d1d6 name:ZooKeeperConnection Watcher:127.0.0.1:54337/solr got event WatchedEvent state:SyncConnected type:None path:null path:null type:None
    [junit4] 2> 2988427 INFO (TEST-TestDynamicLoading.testDynamicLoading-seed#[4DE6E0798DF9C798]) [n:127.0.0.1:54370_t_nds%2Fjx ] o.a.s.c.c.ConnectionManager Client is connected to ZooKeeper
    [junit4] 2> 2988442 INFO (TEST-TestDynamicLoading.testDynamicLoading-seed#[4DE6E0798DF9C798]) [n:127.0.0.1:54370_t_nds%2Fjx ] o.a.s.c.c.ZkStateReader Updating cluster state from ZooKeeper...
    [junit4] 2> 2988443 INFO (TEST-TestDynamicLoading.testDynamicLoading-seed#[4DE6E0798DF9C798]) [n:127.0.0.1:54370_t_nds%2Fjx ] o.a.s.c.c.ZkStateReader Loaded empty cluster properties
    [junit4] 2> 2988445 INFO (TEST-TestDynamicLoading.testDynamicLoading-seed#[4DE6E0798DF9C798]) [n:127.0.0.1:54370_t_nds%2Fjx ] o.a.s.c.c.ZkStateReader Updated live nodes from ZooKeeper... (0) -> (1)
    [junit4] 2> 2988450 INFO (TEST-TestDynamicLoading.testDynamicLoading-seed#[4DE6E0798DF9C798]) [n:127.0.0.1:54370_t_nds%2Fjx ] o.a.s.c.Overseer Overseer (id=null) closing
    [junit4] 2> 2988451 INFO (TEST-TestDynamicLoading.testDynamicLoading-seed#[4DE6E0798DF9C798]) [n:127.0.0.1:54370_t_nds%2Fjx ] o.a.s.c.LeaderElector Joined leadership election with path: /overseer_elect/election/96051094944481289-127.0.0.1:54370_t_nds%2Fjx-n_0000000001
    [junit4] 2> 2988454 INFO (TEST-TestDynamicLoading.testDynamicLoading-seed#[4DE6E0798DF9C798]) [n:127.0.0.1:54370_t_nds%2Fjx ] o.a.s.c.LeaderElector Watching path /overseer_elect/election/96051094944481284-127.0.0.1:54346_t_nds%2Fjx-n_0000000000 to know if I could be the leader
    [junit4] 2> 2988455 INFO (TEST-TestDynamicLoading.testDynamicLoading-seed#[4DE6E0798DF9C798]) [n:127.0.0.1:54370_t_nds%2Fjx ] o.a.s.c.ZkController Publish node=127.0.0.1:54370_t_nds%2Fjx as DOWN
    [junit4] 2> 2988459 INFO (OverseerStateUpdate-96051094944481284-127.0.0.1:54346_t_nds%2Fjx-n_0000000000) [n:127.0.0.1:54346_t_nds%2Fjx ] o.a.s.c.Overseer processMessage: queueSize: 1, message = {
    [junit4] 2> "operation":"downnode",
    [junit4] 2> "node_name":"127.0.0.1:54370_t_nds%2Fjx"} current state version: 3
    [junit4] 2> 2988459 INFO (OverseerStateUpdate-96051094944481284-127.0.0.1:54346_t_nds%2Fjx-n_0000000000) [n:127.0.0.1:54346_t_nds%2Fjx ] o.a.s.c.o.NodeMutator DownNode state invoked for node: 127.0.0.1:54370_t_nds%2Fjx
    [junit4] 2> 2988461 INFO (zkCallback-9771-thread-3-processing-n:127.0.0.1:54346_t_nds%2Fjx) [n:127.0.0.1:54346_t_nds%2Fjx ] o.a.s.c.c.ZkStateReader A cluster state change: [WatchedEvent state:SyncConnected type:NodeDataChanged path:/clusterstate.json], has occurred - updating... (live nodes size: [1])
    [junit4] 2> 2988461 INFO (zkCallback-9775-thread-1) [ ] o.a.s.c.c.ZkStateReader A cluster state change: [WatchedEvent state:SyncConnected type:NodeDataChanged path:/clusterstate.json], has occurred - updating... (live nodes size: [1])
    [junit4] 2> 2988461 INFO (zkCallback-9781-thread-1-processing-n:127.0.0.1:54370_t_nds%2Fjx) [n:127.0.0.1:54370_t_nds%2Fjx ] o.a.s.c.c.ZkStateReader A cluster state change: [WatchedEvent state:SyncConnected type:NodeDataChanged path:/clusterstate.json], has occurred - updating... (live nodes size: [1])
    [junit4] 2> 2988570 INFO (OverseerStateUpdate-96051094944481284-127.0.0.1:54346_t_nds%2Fjx-n_0000000000) [n:127.0.0.1:54346_t_nds%2Fjx ] o.a.s.c.o.ZkStateWriter going to update_collection /collections/collection1/state.json version: 0
    [junit4] 2> 2989459 INFO (TEST-TestDynamicLoading.testDynamicLoading-seed#[4DE6E0798DF9C798]) [n:127.0.0.1:54370_t_nds%2Fjx ] o.a.s.c.ZkController Register node as live in ZooKeeper:/live_nodes/127.0.0.1:54370_t_nds%2Fjx
    [junit4] 2> 2989461 INFO (TEST-TestDynamicLoading.testDynamicLoading-seed#[4DE6E0798DF9C798]) [n:127.0.0.1:54370_t_nds%2Fjx ] o.a.s.c.c.SolrZkClient makePath: /live_nodes/127.0.0.1:54370_t_nds%2Fjx
    [junit4] 2> 2989463 INFO (zkCallback-9771-thread-3-processing-n:127.0.0.1:54346_t_nds%2Fjx) [n:127.0.0.1:54346_t_nds%2Fjx ] o.a.s.c.c.ZkStateReader A live node change: [WatchedEvent state:SyncConnected type:NodeChildrenChanged path:/live_nodes], has occurred - updating... (live nodes size: [1])
    [junit4] 2> 2989463 INFO (zkCallback-9775-thread-1) [ ] o.a.s.c.c.ZkStateReader A live node change: [WatchedEvent state:SyncConnected type:NodeChildrenChanged path:/live_nodes], has occurred - updating... (live nodes size: [1])
    [junit4] 2> 2989463 INFO (zkCallback-9781-thread-1-processing-n:127.0.0.1:54370_t_nds%2Fjx) [n:127.0.0.1:54370_t_nds%2Fjx ] o.a.s.c.c.ZkStateReader A live node change: [WatchedEvent state:SyncConnected type:NodeChildrenChanged path:/live_nodes], has occurred - updating... (live nodes size: [1])
    [junit4] 2> 2989465 INFO (zkCallback-9771-thread-3-processing-n:127.0.0.1:54346_t_nds%2Fjx) [n:127.0.0.1:54346_t_nds%2Fjx ] o.a.s.c.c.ZkStateReader Updated live nodes from ZooKeeper... (1) -> (2)
    [junit4] 2> 2989466 INFO (zkCallback-9775-thread-1) [ ] o.a.s.c.c.ZkStateReader Updated live nodes from ZooKeeper... (1) -> (2)
    [junit4] 2> 2989466 INFO (zkCallback-9781-thread-1-processing-n:127.0.0.1:54370_t_nds%2Fjx) [n:127.0.0.1:54370_t_nds%2Fjx ] o.a.s.c.c.ZkStateReader Updated live nodes from ZooKeeper... (1) -> (2)
    [junit4] 2> 2989491 INFO (TEST-TestDynamicLoading.testDynamicLoading-seed#[4DE6E0798DF9C798]) [n:127.0.0.1:54370_t_nds%2Fjx ] o.a.s.c.CoreContainer Security conf doesn't exist. Skipping setup for authorization module.
    [junit4] 2> 2989491 INFO (TEST-TestDynamicLoading.testDynamicLoading-seed#[4DE6E0798DF9C798]) [n:127.0.0.1:54370_t_nds%2Fjx ] o.a.s.c.CoreContainer No authentication plugin used.
    [junit4] 2> 2989493 INFO (TEST-TestDynamicLoading.testDynamicLoading-seed#[4DE6E0798DF9C798]) [n:127.0.0.1:54370_t_nds%2Fjx ] o.a.s.c.CorePropertiesLocator Looking for core definitions underneath C:\Users\jenkins\workspace\Lucene-Solr-6.1-Windows\solr\build\solr-core\test\J1\temp\solr.core.TestDynamicLoading_4DE6E0798DF9C798-001\shard-1-001\cores
    [junit4] 2> 2989495 INFO (TEST-TestDynamicLoading.testDynamicLoading-seed#[4DE6E0798DF9C798]) [n:127.0.0.1:54370_t_nds%2Fjx ] o.a.s.c.CoreDescriptor Created CoreDescriptor: {name=collection1, config=solrconfig.xml, transient=false, schema=schema.xml, loadOnStartup=true, configSetProperties=configsetprops.json, collection=collection1, coreNodeName=, dataDir=data\, shard=}
    [junit4] 2> 2989495 INFO (TEST-TestDynamicLoading.testDynamicLoading-seed#[4DE6E0798DF9C798]) [n:127.0.0.1:54370_t_nds%2Fjx ] o.a.s.c.CorePropertiesLocator Found core collection1 in C:\Users\jenkins\workspace\Lucene-Solr-6.1-Windows\solr\build\solr-core\test\J1\temp\solr.core.TestDynamicLoading_4DE6E0798DF9C798-001\shard-1-001\cores\collection1
    [junit4] 2> 2989495 INFO (TEST-TestDynamicLoading.testDynamicLoading-seed#[4DE6E0798DF9C798]) [n:127.0.0.1:54370_t_nds%2Fjx ] o.a.s.c.CorePropertiesLocator Found 1 core definitions
    [junit4] 2> 2989497 INFO (TEST-TestDynamicLoading.testDynamicLoading-seed#[4DE6E0798DF9C798]) [n:127.0.0.1:54370_t_nds%2Fjx ] o.a.s.s.SolrDispatchFilter user.dir=C:\Users\jenkins\workspace\Lucene-Solr-6.1-Windows\solr\build\solr-core\test\J1
    [junit4] 2> 2989497 INFO (TEST-TestDynamicLoading.testDynamicLoading-seed#[4DE6E0798DF9C798]) [n:127.0.0.1:54370_t_nds%2Fjx ] o.a.s.s.SolrDispatchFilter SolrDispatchFilter.init() done
    [junit4] 2> 2989500 INFO (coreLoadExecu

[...truncated too long message...]

RE 63.8s J1 | TestDynamicLoading.testDynamicLoading <<<
    [junit4] > Throwable #1: java.lang.AssertionError: Could not get expected value 'X val changed' for path 'x' full output: {
    [junit4] > "responseHeader":{
    [junit4] > "status":0,
    [junit4] > "QTime":0},
    [junit4] > "params":{"wt":"json"},
    [junit4] > "context":{
    [junit4] > "webapp":"/t_nds/jx",
    [junit4] > "path":"/test1",
    [junit4] > "httpMethod":"GET"},
    [junit4] > "class":"org.apache.solr.core.BlobStoreTestRequestHandler",
    [junit4] > "x":null}, from server: null
    [junit4] > at __randomizedtesting.SeedInfo.seed([4DE6E0798DF9C798:95ABCD2E7A246238]:0)
    [junit4] > at org.apache.solr.core.TestSolrConfigHandler.testForResponseElement(TestSolrConfigHandler.java:481)
    [junit4] > at org.apache.solr.core.TestDynamicLoading.testDynamicLoading(TestDynamicLoading.java:250)
    [junit4] > at org.apache.solr.BaseDistributedSearchTestCase$ShardsRepeatRule$ShardsFixedStatement.callStatement(BaseDistributedSearchTestCase.java:992)
    [junit4] > at org.apache.solr.BaseDistributedSearchTestCase$ShardsRepeatRule$ShardsStatement.evaluate(BaseDistributedSearchTestCase.java:967)
    [junit4] > at java.lang.Thread.run(Thread.java:745)
    [junit4] 2> 3048207 INFO (SUITE-TestDynamicLoading-seed#[4DE6E0798DF9C798]-worker) [ ] o.a.s.SolrTestCaseJ4 ###deleteCore
    [junit4] 2> NOTE: leaving temporary files on disk at: C:\Users\jenkins\workspace\Lucene-Solr-6.1-Windows\solr\build\solr-core\test\J1\temp\solr.core.TestDynamicLoading_4DE6E0798DF9C798-001
    [junit4] 2> Jun 11, 2016 5:37:40 AM com.carrotsearch.randomizedtesting.ThreadLeakControl checkThreadLeaks
    [junit4] 2> WARNING: Will linger awaiting termination of 1 leaked thread(s).
    [junit4] 2> NOTE: test params are: codec=Asserting(Lucene60): {blobName=PostingsFormat(name=MockRandom), size=PostingsFormat(name=LuceneVarGapDocFreqInterval), _version_=FST50, id=FSTOrd50, version=PostingsFormat(name=MockRandom), md5=FST50, timestamp=FST50}, docValues:{}, maxPointsInLeafNode=1930, maxMBSortInHeap=5.9405813238458, sim=ClassicSimilarity, locale=tr-TR, timezone=Pacific/Pago_Pago
    [junit4] 2> NOTE: Windows 10 10.0 x86/Oracle Corporation 1.8.0_92 (32-bit)/cpus=3,threads=1,free=120292928,total=372006912
    [junit4] 2> NOTE: All tests run in this JVM: [CheckHdfsIndexTest, DistributedFacetPivotLargeTest, SuggesterWFSTTest, TestSimpleTrackingShardHandler, SpellingQueryConverterTest, MultiTermTest, PluginInfoTest, SortByFunctionTest, TestQueryWrapperFilter, FullHLLTest, LoggingHandlerTest, TestFiltering, TestReversedWildcardFilterFactory, TestRebalanceLeaders, WordBreakSolrSpellCheckerTest, LeaderInitiatedRecoveryOnShardRestartTest, DirectUpdateHandlerOptimizeTest, DirectSolrConnectionTest, ForceLeaderTest, CoreMergeIndexesAdminHandlerTest, TlogReplayBufferedWhileIndexingTest, DateFieldTest, BlobRepositoryCloudTest, TestFieldCacheVsDocValues, TestFastWriter, AsyncCallRequestStatusResponseTest, DistributedTermsComponentTest, ConfigSetsAPITest, TestDistribIDF, OverriddenZkACLAndCredentialsProvidersTest, FileUtilsTest, SynonymTokenizerTest, TestIndexingPerformance, SuggestComponentContextFilterQueryTest, TestExclusionRuleCollectionAccess, DistributedFacetPivotSmallAdvancedTest, SolrInfoMBeanTest, CoreAdminHandlerTest, TestDistributedStatsComponentCardinality, ZkSolrClientTest, TestQuerySenderListener, TestRequestForwarding, SolrIndexSplitterTest, ConvertedLegacyTest, BasicDistributedZk2Test, TestConfigSetImmutable, SecurityConfHandlerTest, TestCharFilters, TestSolrFieldCacheMBean, NotRequiredUniqueKeyTest, HdfsWriteToMultipleCollectionsTest, DistribDocExpirationUpdateProcessorTest, TestInitParams, SpellCheckComponentTest, TestIndexSearcher, CdcrReplicationHandlerTest, HdfsSyncSliceTest, TestPerFieldSimilarityClassic, TestSolrQueryParserResource, TestCollationField, CleanupOldIndexTest, CollectionsAPIDistributedZkTest, BigEndianAscendingWordDeserializerTest, SolrCoreCheckLockOnStartupTest, TestAddFieldRealTimeGet, TestDocBasedVersionConstraints, DebugComponentTest, BlockDirectoryTest, TestConfigSetsAPI, CollectionsAPISolrJTest, MultiThreadedOCPTest, DeleteStatusTest, LeaderFailoverAfterPartitionTest, CoreAdminCreateDiscoverTest, CreateCollectionCleanupTest, TestTolerantUpdateProcessorCloud, TestWriterPerf, OpenCloseCoreStressTest, TestSizeLimitedDistributedMap, HdfsDirectoryTest, TestDistribDocBasedVersion, AutoCommitTest, TestSolrIndexConfig, CurrencyFieldOpenExchangeTest, TestSmileRequest, TestRawTransformer, TestSolrCLIRunExample, TestSortingResponseWriter, TestLeaderInitiatedRecoveryThread, BadCopyFieldTest, TestAnalyzeInfixSuggestions, ZkNodePropsTest, UpdateRequestProcessorFactoryTest, TestScoreJoinQPNoScore, BlockJoinFacetDistribTest, TestManagedSchemaAPI, ResponseLogComponentTest, BaseCdcrDistributedZkTest, TestRecoveryHdfs, CSVRequestHandlerTest, TestJoin, TestReloadAndDeleteDocs, TestExactStatsCache, TestSuggestSpellingConverter, CollectionReloadTest, TestCloudDeleteByQuery, BinaryUpdateRequestHandlerTest, TestPerFieldSimilarity, TestSystemIdResolver, TestDFISimilarityFactory, HdfsRecoveryZkTest, TestPHPSerializedResponseWriter, TestSchemaNameResource, TestSolrXml, TestCSVResponseWriter, CopyFieldTest, HdfsBasicDistributedZkTest, DistributedQueryComponentOptimizationTest, TestCopyFieldCollectionResource, TestPivotHelperCode, FieldAnalysisRequestHandlerTest, SpellCheckCollatorTest, CachingDirectoryFactoryTest, CdcrVersionReplicationTest, DeleteReplicaTest, TestBulkSchemaConcurrent, TestFuzzyAnalyzedSuggestions, TestSSLRandomization, TestRealTimeGet, TestRuleBasedAuthorizationPlugin, QueryParsingTest, TestFastOutputStream, TestOnReconnectListenerSupport, TestSolrConfigHandlerCloud, TestConfigSets, OutputWriterTest, TestSortByMinMaxFunction, TestFileDictionaryLookup, TestBadConfig, DistanceFunctionTest, TestQueryUtils, NoCacheHeaderTest, DefaultValueUpdateProcessorTest, SolrCmdDistributorTest, ZkStateWriterTest, RestartWhileUpdatingTest, TestManagedStopFilterFactory, StatsComponentTest, OpenExchangeRatesOrgProviderTest, TestStressRecovery, BasicDistributedZkTest, ChaosMonkeySafeLeaderTest, SyncSliceTest, LeaderElectionIntegrationTest, ShardRoutingTest, BasicZkTest, RecoveryZkTest, ClusterStateUpdateTest, TestRandomFaceting, LeaderElectionTest, ShardRoutingCustomTest, TestFaceting, TestRecovery, TermVectorComponentDistributedTest, TestCoreContainer, TestSolr4Spatial, TestGroupingSearch, TestSort, TestLazyCores, SimplePostToolTest, TestCoreDiscovery, AnalysisAfterCoreReloadTest, TestExtendedDismaxParser, TestFoldingMultitermQuery, SuggesterTest, SchemaVersionSpecificBehaviorTest, FieldMutatingUpdateProcessorTest, TestWordDelimiterFilterFactory, TestRemoteStreaming, CacheHeaderTest, LukeRequestHandlerTest, TestQueryTypes, FileBasedSpellCheckerTest, RequestHandlersTest, TermVectorComponentTest, TestArbitraryIndexDir, RegexBoostProcessorTest, ReturnFieldsTest, JsonLoaderTest, TestComponentsName, TestBinaryResponseWriter, HighlighterConfigTest, SOLR749Test, UpdateParamsTest, AlternateDirectoryTest, TestMergePolicyConfig, TestSolrDeletionPolicy2, SampleTest, TestBinaryField, NumericFieldsTest, MinimalSchemaTest, ExternalFileFieldSortTest, TestSolrCoreProperties, TestLuceneMatchVersion, SpellPossibilityIteratorTest, TestXIncludeConfig, EchoParamsTest, TestSweetSpotSimilarityFactory, TestLMDirichletSimilarityFactory, TestLMJelinekMercerSimilarityFactory, TestBM25SimilarityFactory, TimeZoneUtilsTest, ResourceLoaderTest, ScriptEngineTest, URLClassifyProcessorTest, TestRTGBase, DistributedIntervalFacetingTest, TestTolerantSearch, ConnectionReuseTest, AssignTest, AsyncMigrateRouteKeyTest, ConcurrentDeleteAndCreateCollectionTest, DeleteInactiveReplicaTest, DistribCursorPagingTest, OutOfBoxZkACLAndCredentialsProvidersTest, OverseerRolesTest, ReplicationFactorTest, RollingRestartTest, SharedFSAutoReplicaFailoverTest, SharedFSAutoReplicaFailoverUtilsTest, SimpleCollectionCreateDeleteTest, SolrCloudExampleTest, SolrXmlInZkTest, TestAuthenticationFramework, TestShortCircuitedRequests, TestStressCloudBlindAtomicUpdates, TestStressLiveNodes, VMParamsZkACLAndCredentialsProvidersTest, HdfsBasicDistributedZk2Test, HdfsChaosMonkeyNothingIsSafeTest, HdfsChaosMonkeySafeLeaderTest, HdfsNNFailoverTest, HdfsRestartWhileUpdatingTest, HdfsTlogReplayBufferedWhileIndexingTest, HdfsUnloadDistributedZkTest, TestClusterStateMutator, ZkStateReaderTest, RuleEngineTest, ExitableDirectoryReaderTest, HdfsDirectoryFactoryTest, QueryResultKeyTest, TestDynamicLoading]
    [junit4] Completed [491/614 (1!)] on J1 in 64.11s, 1 test, 1 failure <<< FAILURES!

[...truncated 409 lines...]
BUILD FAILED
C:\Users\jenkins\workspace\Lucene-Solr-6.1-Windows\build.xml:740: The following error occurred while executing this line:
C:\Users\jenkins\workspace\Lucene-Solr-6.1-Windows\build.xml:684: The following error occurred while executing this line:
C:\Users\jenkins\workspace\Lucene-Solr-6.1-Windows\build.xml:59: The following error occurred while executing this line:
C:\Users\jenkins\workspace\Lucene-Solr-6.1-Windows\solr\build.xml:233: The following error occurred while executing this line:
C:\Users\jenkins\workspace\Lucene-Solr-6.1-Windows\solr\common-build.xml:531: The following error occurred while executing this line:
C:\Users\jenkins\workspace\Lucene-Solr-6.1-Windows\lucene\common-build.xml:1427: The following error occurred while executing this line:
C:\Users\jenkins\workspace\Lucene-Solr-6.1-Windows\lucene\common-build.xml:984: There were test failures: 614 suites (10 ignored), 2580 tests, 1 failure, 126 ignored (82 assumptions) [seed: 4DE6E0798DF9C798]

Total time: 80 minutes 33 seconds
Build step 'Invoke Ant' marked build as failure
Archiving artifacts
[WARNINGS] Skipping publisher since build result is FAILURE
Recording test results
Email was triggered for: Failure - Any
Sending email for trigger: Failure - Any

Search Discussions

Discussion Posts

Follow ups

Related Discussions

Discussion Navigation
viewthread | post
posts ‹ prev | 1 of 2 | next ›
Discussion Overview
groupdev @
categorieslucene
postedJun 11, '16 at 5:44a
activeJun 11, '16 at 4:31p
posts2
users1
websitelucene.apache.org

1 user in discussion

Policeman Jenkins Server: 2 posts

People

Translate

site design / logo © 2021 Grokbase