FAQ
Strange. I tried thats first. But now it can be build. Thanks. Johannes

Am 17.12.2014 um 19:14 schrieb Andrus Adamchik:
Don't use '-Dmaven.test.skip=true', as this prevents shared test modules from being built.

HTH,
Andrus

On Dec 17, 2014, at 6:28 PM, Johannes wrote:

new try.


-------- Weitergeleitete Nachricht --------
Betreff: build failure with fresh clone
Datum: Wed, 17 Dec 2014 10:54:22 +0100
Von: Johannes <jotpe.osm@gmail.com>
An: dev@cayenne.apache.org

Hello, I cloned the current sources via github and tried to run a maven
build with `mvn clean package -Dmaven.test.skip=true`. This leads to
following error. So what can I do?

[INFO] Building Cayenne ROP Client 4.0.M2-SNAPSHOT
[INFO]
------------------------------------------------------------------------
[INFO]
------------------------------------------------------------------------
[INFO] Reactor Summary:
[INFO]
[INFO] Cayenne ........................................... SUCCESS [0.849s]
[INFO] Cayenne Build Tools Parent ........................ SUCCESS [0.011s]
[INFO] Cayenne License and Notice Bundle ................. SUCCESS [14.258s]
[INFO] Common Unit Test Utilities ........................ SUCCESS [0.998s]
[INFO] Cayenne Code Checkers ............................. SUCCESS [0.084s]
[INFO] Cayenne Dependency Injection Container ............ SUCCESS [26.299s]
[INFO] Cayenne Server .................................... SUCCESS [32.835s]
[INFO] Cayenne ROP Client ................................ FAILURE [0.026s]
[INFO] Cayenne Project ................................... SKIPPED
[INFO] Cayenne Tools ..................................... SKIPPED
[INFO] Cayenne Lifecycle Utilities ....................... SKIPPED
[INFO] Cayenne Maven Plugins ............................. SKIPPED
[INFO] Cayenne Maven Plugin .............................. SKIPPED
[INFO] Cayenne Cryptography Extensions ................... SKIPPED
[INFO] Cayenne Integration Tests Parent .................. SKIPPED
[INFO] Integration Tests - Cayenne Tools ................. SKIPPED
[INFO] Cayenne Modeler Parent ............................ SKIPPED
[INFO] Cayenne WebObjects Compatibility Library .......... SKIPPED
[INFO] Cayenne Modeler ................................... SKIPPED
[INFO] Cayenne Modeler Generic and Windows Extensions .... SKIPPED
[INFO] Cayenne Modeler Generic ........................... SKIPPED
[INFO] Cayenne Modeler Mac OS X Extensions ............... SKIPPED
[INFO] Cayenne Modeler Mac OS X .......................... SKIPPED
[INFO] Cayenne Modeler Mac OS X - Old Apple Java ......... SKIPPED
[INFO] Cayenne Modeler Windows ........................... SKIPPED
[INFO] Cayenne Modeler Maven Plugin ...................... SKIPPED
[INFO] Cayenne Tutorials ................................. SKIPPED
[INFO] Cayenne Tutorial .................................. SKIPPED
[INFO] Cayenne ROP Server Tutorial ....................... SKIPPED
[INFO] Cayenne ROP Client Tutorial ....................... SKIPPED
[INFO] Cayenne Documenation Parent ....................... SKIPPED
[INFO] Cayenne Documentation ............................. SKIPPED
[INFO] Cayenne Docbook Documentation ..................... SKIPPED
[INFO] Docbook: Cayenne Stylesheets ...................... SKIPPED
[INFO] Docbook: Cayenne Guide ............................ SKIPPED
[INFO] Docbook: Getting Started with Cayenne ............. SKIPPED
[INFO] Docbook: Getting Started with Cayenne ROP ......... SKIPPED
[INFO] Docbook: Cayenne New Features and Upgrade Guide ... SKIPPED
[INFO] Cayenne Release Assembly .......................... SKIPPED
[INFO]
------------------------------------------------------------------------
[INFO] BUILD FAILURE
[INFO]
------------------------------------------------------------------------
[INFO] Total time: 1:17.010s
[INFO] Finished at: Tue Dec 16 23:05:07 CET 2014
[INFO] Final Memory: 61M/489M
[INFO]
------------------------------------------------------------------------
[ERROR] Failed to execute goal on project cayenne-client: Could not
resolve dependencies for project
org.apache.cayenne:cayenne-client:jar:4.0.M2-SNAPSHOT: Could not find
artifact org.apache.cayenne:cayenne-server:jar:tests:4.0.M2-SNAPSHOT ->
[Help 1]



Search Discussions

Discussion Posts

Previous

Related Discussions

Discussion Navigation
viewthread | post
posts ‹ prev | 3 of 3 | next ›
Discussion Overview
groupdev @
categoriescayenne
postedDec 17, '14 at 3:26p
activeDec 17, '14 at 9:32p
posts3
users2
websitecayenne.apache.org

2 users in discussion

Johannes: 2 posts Andrus Adamchik: 1 post

People

Translate

site design / logo © 2021 Grokbase